##TITLE=1H_SR76x
 CDCl3, 8 sc, 
 23.08.2021
##JCAMPDX= 6.0         $$ Bruker NMR JCAMP-DX V2.0
##DATA TYPE= NMR FID
##DATA CLASS= NTUPLES
##ORIGIN= UXNMR, Bruker Analytische Messtechnik GmbH
##OWNER= root
$$ XWIN-NMR		Version 3.5
$$ Mon Aug 23 12:45:28 2021 Russian Standard Time (UT+4h)  she@DPX200
##.OBSERVE FREQUENCY= 200.131506
##.OBSERVE NUCLEUS= ^1H
##.DELAY= (6, 6)
##.ACQUISITION MODE= SIMULTANEOUS
##.ACQUISITION SCHEME= undefined
##.AVERAGES= 8
##.DIGITISER RES= 18
##SPECTROMETER/DATA SYSTEM= spect
##.PULSE SEQUENCE= zg30
##.SOLVENT NAME= CDCl3
##.SHIFT REFERENCE= (INTERNAL, CDCl3, 0, 15.7039)
##AUDIT TRAIL= $$ (NUMBER, WHEN, WHO, WHERE, WHAT)
$$ ##TITLE= Audit trail, XWIN-NMR		Version 3.5
$$ ##JCAMPDX= 5.01
$$ ##ORIGIN= Bruker BioSpin GmbH
$$ ##OWNER= she
$$ F:/spectra/data/she/nmr/H-F/1/audita.txt
$$ ##AUDIT TRAIL=  $$ (NUMBER, WHEN, WHO, WHERE, WHAT)
(   1,<2021-08-23 12:44:31.79 +0400>,<she>,<DPX200>,
      <created by zg, POWCHK disabled, PULCHK disabled
       configuration hash MD5:
       00 E9 B6 7A A2 85 ED C7 34 08 36 98 17 FE 4E 26
       data hash MD5: 16K
       D0 0A 26 42 53 3F 70 B5 6E C4 C8 76 09 34 84 75>)
$$ ##END=
$$ 
$$ hash MD5
$$ A6 C4 00 92 33 B9 0E CB 6E 2D A2 AD 18 F5 FE D5
##$RELAX= 
##$RELAX= 
##$RELAX= 
##$RELAX= 
##$RELAX= 
##$RELAX= 
$$ Bruker specific parameters
$$ --------------------------
##$DU= <F:/spectra>
##$EXPNO= 1
##$NAME= <H-F>
##$PROCNO= 1
##$TYPE= <nmr>
##$USER= <she>
##$AMP= (0..31)
100 100 100 100 100 100 100 100 100 100 100 100 100 100 100 100 100 100 
100 100 100 100 100 100 100 100 100 100 100 100 100 100 
##$AQSEQ= 0
##$AQ_mod= 1
##$AUNM= <au_zg>
##$AUTOPOS= <>
##$BF1= 200.13
##$BF2= 200.13
##$BF3= 200.13
##$BF4= 200.13
##$BF5= 200.13
##$BF6= 200.13
##$BF7= 200.13
##$BF8= 200.13
##$BYTORDA= 1
##$CFDGTYP= 0
##$CFRGTYP= 5
##$CHEMSTR= <none>
##$CNST= (0..31)
1 1 145 1 1 1 1 1 1 1 1 1 1 1 1 1 1 1 1 1 1 1 1 1 1 1 1 1 1 1 1 1 
##$CPDPRG= <>
##$CPDPRG1= <>
##$CPDPRG2= <>
##$CPDPRG3= <>
##$CPDPRG4= <mlev>
##$CPDPRG5= <mlev>
##$CPDPRG6= <mlev>
##$CPDPRG7= <mlev>
##$CPDPRG8= <mlev>
##$CPDPRGB= <>
##$CPDPRGT= <>
##$D= (0..31)
0 1.2 0 0 0 0 0 0 0 0.06 0 0.03 0 0 0 0 0.0002 0 0 0 0 0 0 0 0 0 0 0 0 
0 0 0 
##$DATE= 1629708271
##$DBL= (0..7)
120 120 120 120 120 120 120 120 
##$DBP= (0..7)
150 150 150 150 150 150 150 150 
##$DBP07= 0
##$DBPNAM0= <>
##$DBPNAM1= <>
##$DBPNAM2= <>
##$DBPNAM3= <>
##$DBPNAM4= <>
##$DBPNAM5= <>
##$DBPNAM6= <>
##$DBPNAM7= <>
##$DBPOAL= (0..7)
0.5 0.5 0.5 0.5 0.5 0.5 0.5 0.5 
##$DBPOFFS= (0..7)
0 0 0 0 0 0 0 0 
##$DE= 6
##$DECBNUC= <off>
##$DECIM= 32
##$DECNUC= <off>
##$DECSTAT= 4
##$DIGMOD= 1
##$DIGTYP= 9
##$DL= (0..7)
0 120 120 120 120 120 120 120 
##$DP= (0..7)
150 150 150 150 150 150 150 150 
##$DP07= 0
##$DPNAME0= <>
##$DPNAME1= <>
##$DPNAME2= <>
##$DPNAME3= <>
##$DPNAME4= <>
##$DPNAME5= <>
##$DPNAME6= <>
##$DPNAME7= <>
##$DPOAL= (0..7)
0.5 0.5 0.5 0.5 0.5 0.5 0.5 0.5 
##$DPOFFS= (0..7)
0 0 0 0 0 0 0 0 
##$DQDMODE= 0
##$DR= 18
##$DS= 0
##$DSLIST= <SSSSSSSSSSSSSSS>
$$ [...]
##$SUBNAM2= <"">
##$SUBNAM3= <"">
##$SUBNAM4= <"">
##$SUBNAM5= <"">
##$SUBNAM6= <"">
##$SUBNAM7= <"">
##$SUBNAM8= <"">
##$SUBNAM9= <"">
##$SW= 20.0188882624521
##$SWIBOX= (0..15)
0 0 2 0 0 0 0 0 0 0 0 0 0 0 0 0 
##$SW_h= 4006.41025641026
##$TD= 16384
##$TD0= 1
##$TE= 0
##$TE2= 300
##$TE3= 300
##$TEG= 300
##$TL= (0..7)
0 120 120 120 120 120 120 120 
##$TP= (0..7)
150 150 150 150 150 150 150 150 
##$TP07= 0
##$TPNAME0= <>
##$TPNAME1= <>
##$TPNAME2= <>
##$TPNAME3= <>
##$TPNAME4= <>
##$TPNAME5= <>
##$TPNAME6= <>
##$TPNAME7= <>
##$TPOAL= (0..7)
0.5 0.5 0.5 0.5 0.5 0.5 0.5 0.5 
##$TPOFFS= (0..7)
0 0 0 0 0 0 0 0 
##$TUNHIN= 0
##$TUNHOUT= 0
##$TUNXOUT= 0
##$USERA1= <user>
##$USERA2= <user>
##$USERA3= <user>
##$USERA4= <user>
##$USERA5= <user>
##$V9= 5
##$VALIST= <valist>
##$VCLIST= <CCCCCCCCCCCCCCC>
##$VD= 0
##$VDLIST= <DDDDDDDDDDDDDDD>
##$VPLIST= <PPPPPPPPPPPPPPP>
##$VTLIST= <TTTTTTTTTTTTTTT>
##$WBST= 1024
##$WBSW= 4
##$XGAIN= (0..3)
0 0 0 0 
##$XL= 0
##$YL= 0
##$YMAX_a= 124093
##$YMIN_a= -99692
##$ZGOPTNS= <>
##$ZL1= 120
##$ZL2= 120
##$ZL3= 120
##$ZL4= 120
##$ABSF1= 10
##$ABSF2= 0
##$ABSG= 5
##$ABSL= 3
##$ALPHA= 0
##$AQORDER= 0
##$ASSFAC= 0
##$ASSFACI= 0
##$ASSFACX= 0
##$ASSWID= 0
##$AUNMP= <proc_1d>
##$AZFE= 0.1
##$AZFW= 0.1
##$BCFW= 1
##$BC_mod= 2
##$BYTORDP= 1
##$COROFFS= 0
##$CY= 11.3945322036743
##$DATMOD= 1
##$DC= 2
##$DFILT= <>
##$DTYPP= 0
##$F1P= 2.36226072786647
##$F2P= -0.459571619588291
##$FCOR= 0.5
##$FTSIZE= 0
##$FT_mod= 4
##$GAMMA= 1
##$GB= 0.15
##$INTBC= 1
##$INTSCL= 1
##$ISEN= 128
##$LB= 0.24
##$LEV0= 0
##$LPBIN= 0
##$MAXI= 10000
##$MC2= 0
##$MEAN= 0
##$ME_mod= 0
##$MI= 1.114404
##$NCOEF= 0
##$NC_proc= 0
##$NLEV= 6
##$NOISF1= 3.799351
##$NOISF2= 2.8
##$NSP= 1
##$NTH_PI= 0
##$NZP= 0
##$OFFSET= 15.70392
##$PC= 1
##$PHC0= -13365.15
##$PHC1= 29.201
##$PH_mod= 1
##$PKNL= yes
##$PPARMOD= 0
##$PSCAL= 0
##$PSIGN= 0
##$REVERSE= no
##$SF= 200.130013532006
##$SI= 16384
##$SIGF1= 3
##$SIGF2= 2
##$SINO= 400
##$SIOLD= 16384
##$SREGLST= <1H.CDCl3>
##$SSB= 0
##$STSI= 0
##$STSR= 0
##$SW_p= 3612.71676300578
##$SYMM= 0
##$S_DEV= 0
##$TDeff= 0
##$TDoff= 0
##$TI= <>
##$TILT= no
##$TM1= 0
##$TM2= 0
##$TOPLEV= 0
##$USERP1= <user>
##$USERP2= <user>
##$USERP3= <user>
##$USERP4= <user>
##$USERP5= <user>
##$WDW= 1
##$XDIM= 8192
##$YMAX_p= 0
##$YMIN_p= 0
$$ End of Bruker specific parameters
$$ ---------------------------------
##NTUPLES= NMR FID
##VAR_NAME=  TIME,          FID/REAL,        FID/IMAG
##SYMBOL=    X,             R,               I
##VAR_TYPE=  INDEPENDENT,   DEPENDENT,       DEPENDENT
##VAR_FORM=  AFFN,          ASDF,            ASDF
##VAR_DIM=   8192,          8192,            8192
##UNITS=     SECONDS,       ARBITRARY UNITS, ARBITRARY UNITS
##FACTOR=    0.0002496,     1,               1
##FIRST=     0,             0,               0
##LAST=      2.0444736,     0,               0
##MIN=       0,             -99692,          0
##MAX=       2.0444736,     124093,          0
$$ Real data points
##PAGE= N=1
##DATA TABLE= (X++(R..R)), XYDATA
$$ [...]
2273f7K71j77k88M91%j72L4k07K19o5R5k23rJ85m5J93k22J07n48O25l3O7j52r2
$$ -67 204 27 -261 230 230 58 92 -115 104 39 134 -89 -98 87 42 235 13 120 -428 197 164 231 79 -13
2297a3O7n91R06m95J48k6j95L30k31k27N20N05n8o57J079n47J05n96m74K75n5
$$ -13 54 -537 369 -126 22 -4 -199 131 -100 -327 193 698 640 -17 1062 515 620 24 -450 -175 -230
2318b30N5j59K90l22K17m9J12M57p4l21m96J44P63l69j24L57r1q0J04p5l01P4
$$ -230 -175 -334 -44 -366 -149 -198 -86 371 297 -24 -520 -376 387 18 -106 251 160 80 184 109 -192 -118
2340a18n02N82k09J92l76L27k19M18j2o0M58p36n2M24k38L4j06L00m65L04K82
$$ -118 -620 -38 -247 -55 -431 -104 -323 95 83 23 481 -255 -307 117 -121 -87 -193 107 -358 -54 228
2361B28j07k24m09M63k75j27j27P87q09N30K61j75M49j103P07j9J32k26m4lK75
$$ 228 121 -103 -512 -49 -324 -451 -578 209 -600 -70 191 16 465 -638 69 50 182 -44 -88 -91 184
2382A84j80J24o43J99k98J033n21J74R1m50O05Q9l64r4K9j81l13N25K46o8n50
$$ 184 4 128 -515 -316 -614 419 -102 72 163 -287 318 407 43 -51 -22 -203 -516 9 255 187 -363
2403c63L47PK52o6O4o3p31Q13n2m10O5n93P37l7J32m34j74N47k36K71L84q24L68
$$ -363 -16 -9 243 177 241 178 -553 260 208 -202 -137 -730 7 -30 102 -332 -506 41 -195 76 460 -364 4
2426DJ56n05K09O68j508Q91K24n28K02pO03l16O39l66m45m51Q69k44K16m20k66
$$ 4 160 -345 -136 532 -976 -85 139 -389 -187 -194 409 93 732 366 -79 -530 339 95 311 -109 -375
2447c75O18l96P73p33q08J012j06m24J298k99m69J8p99J51P68J79p92M79K11J71
$$ -375 243 -153 620 -113 -921 91 -15 -439 859 560 91 109 -690 -539 229 408 -384 95 306 477
2467D77m86j6k47K83K63l54R21l31K94p39K67Q2j011Q04J53j17m27O87J82K6o73
$$ 477 -9 -25 -272 11 274 -80 841 510 804 65 332 414 -597 207 360 243 -184 503 685 711 38
2488C8p3L6K0j61N38r90L38j4N38L4l13p1R26q88N7l17L96l36N11m18R57n87J27
$$ 38 -35 1 21 -140 398 -592 -254 -268 270 304 -9 -80 846 -42 15 -302 94 -242 269 -149 808 221 348
2511C48O43r56O87p20K93j68j21Pn9k32J039m41o8o87O24l44J45m69O4R4O32k24
$$ 348 991 35 722 2 295 127 6 13 -46 -278 761 320 252 -435 189 -155 -10 -479 -415 -321 311 87
2533H7J40k56l9M76l62m2k07L13r5j15j08N75o34N97j88j20J63k19j00qJ90k30
$$ 87 227 -29 -68 408 46 4 -203 110 15 -100 -208 367 -267 330 142 22 185 -34 -134 -142 48 -182
2555a82k84J835j878O34L6P0m70K2J73k08O27O5l96k18J11K73k92M5l6J13K42
$$ -182 -466 1369 -509 125 161 231 -239 -217 -44 -252 375 440 44 -174 -63 210 -82 -37 -73 40 282
2576B82qj14R6r8j96J68q8Kk42M19j82k07L14k72L29k39J17j85o1J37k36O1J52
$$ 282 274 160 256 158 -38 130 42 44 -198 221 39 -168 146 -126 203 -36 81 -104 -165 -28 -264 -203 -51
2599e1K52m32K54L3J11j84P4j27q5K58j65p1Q8M4j46K03k14L6jJ29j65K96P0l93
$$ -51 201 -231 23 56 167 -17 57 -70 -155 103 -62 -133 -45 -1 -147 56 -158 -122 -123 6 -159 137 207 -186
2623a86J28j25lK8K60p2K9j61J26r3J0K21l36K32o4J50n9R0L9k89J2J88J3Q2p9
$$ -186 -58 -183 -186 -158 102 30 59 -102 24 -69 -59 162 -174 58 -6 144 85 175 214 -75 -63 125 138 220 141
2648A41k71L54l46n0L03k22J09K51l69m2J94K10m90N2K94j29K04k98L11p1k1j8
$$ 141 -130 224 -122 -172 131 -91 18 269 -100 -142 52 262 -228 -176 118 -11 193 -105 206 135 114 96
2670I6j36J39J19r5o5J51m3k36jJ70j85J21K12l24mN3j29J41J10k32K00l1k62
$$ 96 -40 99 218 123 58 209 166 -70 -71 99 -86 35 247 -77 -81 -28 -157 -16 94 -138 62 31 -231
2693b31O0J58K11l14r2J83p7r3R3j0N1J23N4r5M2j06k81kL23M1O3j5j89J88j93
$$ -231 -171 -13 198 -116 -208 -25 -102 -195 -102 -112 -61 62 116 21 63 -43 -324 -326 -3 38 101 86 -103 85 -108
2718a08J21j45j9J29k34O53m91K45m56M22j59J89o0PLn6j76J48P7j83N7j31L75
$$ -108 13 -132 -151 -22 -256 397 -94 151 -305 117 -42 147 87 94 97 41 -135 13 90 -93 -36 -167 208
2741B08l31J75rl3J80j41j94L53K0o2M4n8j51O7J85k49l3J66m8Q0j43K0r9J63
$$ 208 -123 52 43 10 190 49 -145 208 228 166 210 152 1 68 253 4 -29 137 89 169 26 46 -53 110
2765A10q2M6p4K80l69K11k42R3j14K06j29J50m8J53k00k50K48k02Q2L86k69j36
$$ 110 28 74 0 280 -89 122 -120 -27 -141 65 -64 86 38 191 -9 -259 -11 -213 -131 255 -14 -150
2787a50R4k24L49k43K40l59K51L35j71j79j76j48L33J71j51ql14N22j42k14K51
$$ -150 -56 -280 69 -174 66 -293 -42 293 122 -57 -233 -381 -48 123 -28 -36 -350 172 30 -184 67
2808F7k24J59n8j70K17P1J20k96J1%J40Q8j05J1K9j71j34M92k33J71J44m62L80
$$ 67 -157 2 -56 -226 -9 62 182 -114 -103 -103 37 125 20 31 60 -111 -245 247 14 185 329 -133 247
2831B47l19j23L34K0p0k54R3P0M40m10L60l18k47l5R3R0J17j54N4N62l25l38J7
$$ 247 -72 -195 139 159 89 -165 -72 -2 438 28 388 70 -177 -212 -119 -29 88 -66 -12 550 225 -113 -96
2854i6J9O49o06N45j93j07j52L81r6m63L31M3m21M00n9K8J23l24l85K90K86K10
$$ -96 -77 572 -34 511 318 211 59 440 344 -119 212 255 -166 234 175 203 326 2 -383 -93 193 403
2876D03n50n84O83M3O1K99m39p3r7J52l7j37o7L19r2J93j08j56N16l20k68o5O67
$$ 403 -147 -731 -48 -5 56 355 -84 -157 -254 -102 -139 -276 -343 -24 -116 77 -31 -187 329 9 -259 -324 343
2899C43n45L73j3l12O3J78j11n1m37Q90n13R7L15j58j23l75N84q7L19m70J38n0
$$ 343 -202 171 158 -154 -91 87 -24 -75 -512 378 -135 -38 277 119 -4 -379 205 118 437 -33 105 55
2921E5J8k2J43k74M0J49j20j4J27J89l71o9L87j49j%k2k40L30R6m96L86j01k8
$$ 55 73 51 194 -80 -40 109 -11 -25 102 291 -80 -149 238 89 88 88 66 -174 156 252 -244 142 41 13
2945A3M4R4k90J76j99j20O29l89K85l64J31j06L28j64N3l04J78r3J79l14K60r1
$$ 13 57 151 -139 37 -162 -282 347 -42 243 -121 10 -96 232 68 121 -183 -5 -98 81 -233 27 -64
2967f4j5K23k63j3K11L0r6l16k20N16k74L66n61N63o21L83Mj2M97j99M59k83J3
$$ -64 -79 144 -119 -132 79 109 13 -303 -523 -7 -281 85 -476 87 -534 -151 -147 -159 338 139 598 315 328
2990C28N47q95J61o18J95m18J258m23o65k21Q58j93K83n12O33r56N10J173j688
$$ 328 875 -20 141 -477 -282 -700 558 135 -530 -751 107 -86 197 -315 318 -638 -128 1045 -643
3009f43J115L16o86k64J55q00O27J23n35J291q99N66m1K67q68K57J056j038M56
$$ -643 472 788 102 -162 -7 -807 -180 -57 -592 699 -200 366 325 592 -276 -19 1037 -1 455
3028D55K1l14jn30q44J555N56j134M19P3l42J62l81J77N74r0r2j131O42N54Q4
$$ 455 476 162 161 -369 -1213 342 898 -236 183 256 -86 76 -305 -128 446 356 264 -867 -225 329 413
3049D13j65K76m05k32J46j61o24J296l49lk0M69n07L02r14j68K42p8k65J197j121
$$ 413 248 524 119 -113 33 -128 -752 544 195 192 172 641 134 436 -478 -646 -404 -482 -747 450 -671
3070f71O36K72j71k74L83L57o00R9L11n27M2K7j33P01n29N23k26l44k46K67n8
$$ -671 -35 237 66 -208 175 532 -68 31 342 -185 -143 -116 -249 452 -77 446 220 -124 -370 -103 -161
3091a61l9O14k42J67k80l20N67R0l27J50k16k92L45n01O73p2o59N08l0m5N67m82
$$ -161 -200 414 172 339 59 -261 306 396 69 219 3 -289 56 -445 228 156 -503 5 -25 -70 497 15
3113A5q2k07M95r1L37j37o9k61L71o70j17K18L67k44Lr2M80N1q60L16M22m30M99
$$ 15 -67 -274 221 130 467 330 261 0 371 -299 -416 -198 169 -75 -72 -164 316 367 -493 -177 245 -185 314
3136C14r17J002l07m97L51N08k62l76l15J66p9O57l30J87o80L23O53j021K38O81
$$ 314 -603 399 92 -405 -54 454 192 -184 -499 -333 -412 245 -85 102 -578 -255 398 -623 -385 296
3156B96p5m06N66r33R08m20k84N19j16k54l5M69k85K20k20J26m49K49M44m49M73
$$ 296 221 -185 381 -552 356 -64 -348 171 55 -199 -234 235 -50 170 -50 76 -373 -124 320 -129 344
3177C44p21N19l33J18j5lK5k5L85o19L85j4K11J37o49l2K11L15k3O6j72k3j91
$$ 344 -377 142 -191 -73 -88 -91 -66 -91 294 -325 60 46 257 394 -255 -287 -76 239 216 282 110 87 -104
3200a04L26l27j83L23j76j36N50M15m53o4J15k36o4j00j31J80k38J53J10J40k72
$$ -104 222 -105 -288 35 -141 -277 273 688 235 171 286 50 -14 -114 -245 -65 -303 -150 -40 100 -172
3221a72J40k48L22p43K77L41r40O49j63N85O0J15m02J39k18Q6N61l71k24J33K92
$$ -172 -32 -280 42 -701 -424 -83 -1023 -374 -537 48 108 223 -179 -40 -258 -172 389 18 -206 -73 219
3242B19q88M05K51m0M39n35N37l62m72N05L26k54J06N96m04j45K26j586R77j1
$$ 219 -669 -264 -13 -53 386 -149 388 26 -446 59 385 131 237 833 429 284 510 -1076 -99 -110
3262a10K37o89O76J24P66q53k47k06K34L12j67J88k90J93j88N3J33j11j10J30
$$ -110 127 -562 114 238 1004 151 -96 -302 -68 244 77 265 -25 168 -20 33 166 55 -55 75
3282G5l52L39j7L5j22J75j91K22k12qK78j8l40K68l05J90q2K48J13l72J55L45
$$ 75 -277 62 45 80 -42 133 -58 164 -48 -56 222 204 -136 132 -173 17 -65 183 296 -76 79 424
3304D24j358P7J058M87m83m37J25l04P40m27L23J084j810O29L89n20J24n21k91
$$ 424 -934 -857 201 688 205 -232 -107 -411 329 -98 225 1309 -501 128 517 -3 121 -400 -691
3323f91L96L69L52o92O96q2m45o5L14j9k91K35J78m04J57k24N10k28J26l16K43
$$ -691 -295 74 426 -266 430 348 -97 -162 152 133 -158 77 255 -149 8 -216 294 66 192 -124 119
3344A19P0J38q17J97M43M75l86k22n84N07J20m12k0R49o52J047q02l83R50j060
$$ 119 189 327 -490 -293 150 625 239 17 -567 -60 60 -352 -372 577 -75 972 170 -213 737 -323
3364c23r7J084q71k21M31L42n02L15q9m28L21n67P23j76K33r0m15j51R92n30j79
$$ -323 -420 664 -207 -428 3 345 -157 158 69 -359 -38 -605 118 -58 175 85 -330 -481 511 -19 -198
3385a98n35O89L99P4l07J44K10n42j52L78M8R5m60K79N64j7j053K88L84m12Q93
$$ -198 -733 -44 355 429 122 266 476 -66 -218 160 208 303 -157 122 686 669 -384 -96 288 -124 769
3406G69j184O94L3o13J77K33M08k47l39n39M87J38L13j128M43M27o54J71R34j193
$$ 769 -415 279 312 -301 -124 109 517 270 -69 -608 -121 17 330 -798 -355 72 -582 -411 523 -670
3426f70N33P5J64K54k21O16j077p08J037p9K53m45k15J031m90J86p88N45K73l32
$$ -670 -137 -62 102 356 135 751 -326 -1034 3 -76 177 -268 -483 548 58 244 -544 1 274 -58
3446e8M2n2O5N66r46k80J194l50q65J272j223M41k11O31K91j001L02l50Q24n23
$$ -58 -16 -68 -3 563 -383 -663 531 181 -684 588 -635 -194 -405 226 517 -484 -182 -532 292 -231
3466b31M44k65R97j399Q7PN19o50L40Q30j63o10J122q25L23j89n43o02J083J078
$$ -231 213 -52 945 -454 -367 -360 159 -491 -151 679 516 -94 1028 203 526 337 -206 -808 275 1353
3486A353n96p65o08J204p99P49j166J017m61Q6K25p83M73J24K3K5K93n14k3o98
$$ 1353 757 -8 -616 588 -211 538 -628 389 -72 14 239 -544 -71 53 76 101 394 -120 -143 -841
3506h41R93R27j493J76k60N55j518J192K4N63L59j167J102r69N30o44M37K30L46
$$ -841 152 1079 -414 -238 -498 57 -1461 -269 -245 318 677 -490 612 -357 173 -471 -34 196 542
3525E42r36P35j54R3R08k159R45Q90l60l86J209j306R48q14l58o6J390r73R69
$$ 542 -394 341 187 280 1188 -971 -26 864 504 118 1327 21 969 155 -203 -269 1121 148 1117
3544A117k602L64N34J40P49j514J813j552O51L58P09j060n69Q10l45Q58n65M90
$$ 1117 -1485 -1121 -587 -447 302 -1212 601 -951 -300 58 767 -293 -862 -52 -397 461 -104 386
3562C86j068L91k50P93L4k65J74o15N4L59N80m31r73R51o95P63o46l8J05Q38p13
$$ 386 -682 -291 -541 252 286 21 195 -420 -366 -7 573 142 -831 120 -575 188 -458 -496 -391 447 -266
3583b66J10J62j05M02M7o32l5N57j30Ol17m04J3P13j35r9K49m02j29M58q7k35
$$ -266 -156 6 -99 303 350 -282 -317 240 110 116 -201 -605 -592 121 -14 -113 136 -266 -395 63 -24 -259
3605b59K24l48K28l6L37J5j89k5L15l16J27Q5j05j52M35m90o38N38J25j12O41
$$ -259 -35 -383 -155 -191 146 161 -28 -53 262 -54 73 158 53 -99 336 -154 -792 -254 -129 -241 400
3626D00l64r50Q09k10L82j66j40Q30m44K06j82o45P17L37l08m0k43N18j64l62
$$ 400 36 -914 -105 -315 67 -99 -239 591 147 353 171 -474 243 580 272 232 -11 507 343 -19
3646a9k54m16J27K53P55j41k5om73j85M03k36K30m53J082j195M03p2J47L34o94
$$ -19 -273 -689 -562 -309 446 305 280 274 -199 -384 19 -217 13 -440 642 -553 -150 -222 -75 259 -435
3667d35L51J14L50o34P3k89N28K74m01j77N15J22M9p54L48r99K77Q39p09N01l7
$$ -435 -84 30 380 -254 -181 -470 58 332 -69 -246 269 391 440 -314 34 -965 -688 151 -558 -57 -94
3688i4j04j58O52j91m83J95l37L06RJ46L1N19n34n41L39J07k12K90L73p06J71
$$ -94 -198 -356 296 105 -378 -183 -520 -214 -205 -59 -28 491 -43 -584 -245 -138 -350 -60 313 -393 -222
3709b22n88L17k31P99o57O96n02Q62o93j59j86K01k26O76n2r06K92J031k6r3p53
$$ -222 -810 -493 -724 75 -582 114 -388 474 -219 -378 -564 -363 -589 87 35 -871 -579 452 426 333 -420
3730d20N22j75Po20O98L68p58O09m31L99l56l0L82k12O1r6L53l77K42o9j43J05
$$ -420 102 -73 -66 -686 12 380 -378 231 -200 199 -157 -187 195 -17 44 -52 301 -76 166 97 -46 59
3752E9j11M01m87L21l80P4K08l12M04k43M8K54j68J97k80j03J63o6K70l22J23
$$ 59 -52 349 -138 183 -197 -123 85 -227 177 -66 -18 236 68 265 -15 -118 45 -21 249 -73 50
3773E0j51q6%L12j95J17l13K69J19j65o9J19p5k1K28j62r0K1o5J21M0j16R3q1
$$ 50 -101 -187 -187 125 -70 47 -266 3 122 -43 -112 7 -68 -89 139 -23 -113 -92 -157 -36 4 -112 -19 -100
3797a00O2P7K1P5p2n8J33Pj32N1M28l31k67q9J13P7J37r6k18K60J69l85q0M11
$$ -100 -38 39 60 135 63 5 138 145 13 64 492 161 -106 -195 -82 -5 132 36 -182 78 247 -138 -218 193
3821A93q9P4J33j6k8L8J14o88k83J087L14j212N6M57j083J394j053J152l51J06
$$ 193 104 178 311 295 267 305 419 -269 -552 535 849 -363 -307 150 -933 461 -592 560 209 315
3841C15l78N73l06l34N19q59M12P8J36m99L82J10R6o73J21J43L76n15J01J70l5
$$ 315 -63 510 204 -130 389 -470 -58 20 156 -343 39 149 245 -428 -307 -164 212 -303 -202 -32 -67
3862f7J09j64j32K08N6j13L75k00j51j79K85J37r1n0m9J0O1m8j42R1m2K9P7O6
$$ -67 42 -122 -254 -46 10 -103 272 72 -79 -258 27 164 73 23 -26 -16 45 -3 -145 -54 -96 -67 10 76
3886G6j12R3L5L4l47K60j59K76j73J82j66K6k51L64j70j5P1J87r5o2Q1r8o0k43
$$ 76 -36 57 92 126 -221 39 -120 156 -17 165 -1 25 -226 138 -32 -47 24 211 116 54 135 37 -23 -266
3910b66N08j73j12L4J72K8k46J13j3o7J90k34L91k30j50j64J16J89Q2l49Q4M9
$$ -266 242 69 -43 -9 163 191 -55 58 45 -22 168 -66 325 95 -55 -219 -103 86 168 -181 -97 -48
3932d8K4O3Nj39k39J84K40m2k57J75J24k29J78O5l7j8j51mK11k71R3K09Rj58j00
$$ -48 -24 39 44 -95 -334 -150 90 48 -209 -34 90 -139 39 104 67 49 -102 -106 105 -166 -73 136 145 -13 -113
3957a13M9k22M92j32oK3M5j56j57k6M3J69m6J8k8j14ML63k95J57O1j34l73N12
$$ -113 -64 -286 206 74 68 91 136 -20 -177 -203 -160 9 -37 -19 -47 -161 -157 206 -89 68 129 -5 -378 134
3981A34Q8k30K66k04k3J5k29M3M10j64q9K42m02Q5Q6m5N6R3k69K16R3j65j29O5
$$ 134 222 -8 258 54 31 46 -183 -140 270 106 17 259 -143 -58 28 -17 39 132 -137 79 172 7 -122 -57
4005e7J45k8Q4j68j28K07k01j42K42J36k12K53m6J03j32j54N17p44O70k49k03
$$ -57 88 60 144 -24 -152 55 -146 -288 -46 90 -122 131 85 188 56 -98 419 -325 345 96 -107
4026a07j69p0L33o4N54n27L19k93j1K3k02L02J07O5l69J64Q8j63j88Q4J23Jo0
$$ -107 -276 -346 -13 -77 477 -50 269 -24 -35 -12 -214 88 195 260 -109 55 143 -20 -208 -124 -1 0 -60
4049f0J35K79j38j79n9j50J44J9M20m44jJ43l44J98j04J29L4p1J22l20PJ46L9
$$ -60 75 354 216 37 -22 -172 -28 -9 411 -33 -34 109 -235 -37 -141 -12 22 -49 73 -247 -240 -94 -55
4072e5j10J00J38k10K34q1%J01q3Oj17K02j80QM0J73k70K46r7J63k71n8J36K24
$$ -55 -165 -65 73 -137 97 16 16 117 34 40 -77 125 -55 -47 -7 166 -104 142 45 208 -63 -121 15 239
4096B39j04k16J77j70J1J95M8j75PN7%j28k8J10J66j15n5J25l09K37p7r7L44j91
$$ 239 135 -81 96 -74 -63 132 180 5 12 69 69 -59 -87 23 189 74 19 144 -165 72 -5 -102 242 51
4120E1%k37K87J85k67J73j97k67L46k25O6L79o3j20k23J76j70l7K2K25Q0l84Q1
$$ 51 51 -186 101 286 19 192 -5 -272 74 -151 -85 294 231 111 -112 64 -106 -143 -121 104 184 -200 -119
4143a19L54l20P3R0M5k77K76k2k05J33l64K76r0L09m9l17J9L90j84k06J07R4j5
$$ -119 235 -85 -12 78 123 -154 122 100 -105 28 -336 -60 -150 159 110 -207 -188 202 18 -188 -81 13 -2
4166bK68n54J68L82k20Kl10J51J69L4k27Q3J48Mq2Q6Q5m04K24l8M8q6L5l9J63
$$ -2 266 -288 -120 262 42 44 -266 -115 54 88 -139 -56 92 96 14 100 185 -219 5 -33 15 -71 -36 -75 88
4191H8k74M5M83l77K10k91J32L6K05p4k52K14j28j0N8J20k68K43j3J2mK7k01J49
$$ 88 -186 -141 342 -35 175 -116 16 52 257 183 -69 145 17 7 65 185 -83 160 147 159 155 182 -19 130
4215A30q4N3j48O7j79N38l51j13J05k08K96l25J51j01J46k19J72r2K24K36k02
$$ 130 46 99 -49 18 -161 377 26 -87 18 -190 106 -219 -68 -169 -23 -242 -70 -162 62 298 96
4236I6R7m77J61L11l70j56N38n7j51R1Qj5k5J00l0k62K54k55J21N7K7j20K57j18
$$ 96 193 -284 -123 188 -182 -338 200 143 -8 83 91 76 51 151 121 -141 113 -142 -21 36 63 -57 200 82
4260H2j46R6k32k28M84j62K57k27j60M02n79J88K00O2o5M8k00q8L6J83k9L22j13
$$ 82 -64 32 -200 -428 56 -106 151 -76 -236 166 -413 -225 -25 37 -28 20 -180 -268 -232 -49 -78 244 131
4283A31n61M34l46n29J767l70j289J108L77k67l91O78j433L53J31O4m5j92j03
$$ 131 -430 4 -342 -871 896 526 -763 345 722 455 64 742 -691 -338 -207 -143 -188 -380 -483
4302d83j91J283K58j238K35L19R7r33L68j8J73M54n28L44J52k17O2K5j26K23m23
$$ -483 -674 609 867 -371 -136 183 280 -653 -285 -303 -130 324 -204 140 292 75 137 162 36 259 -164
4323a64j01M58o49P73q91J696j242M38l25L85o9n74K89j00j31L45k77j9m9j22
$$ -164 -265 193 -456 317 -574 1122 -120 318 -7 378 309 -265 24 -76 -207 138 -139 -158 -207 -329
4343c29P15m51k35N68j88m43J489j382m40J249O19q53o82K00Q71r72M72O85l18
$$ -329 386 -65 -300 268 80 -363 1126 -256 -696 553 1172 319 -363 -163 708 -264 208 893 575
4362E75j444R40L36m89O98l9m37M82q57j1q0Q38jl10n89j45K75K21l21N22K40
$$ 575 -869 71 407 -82 616 577 140 622 -235 -246 -326 512 511 201 -388 -533 -258 -37 -358 164 404
4383D04j097J269J28j073j44K52l10J078P2q74Q59p09J28J31l5K14j5p66O51l09
$$ 404 -693 576 704 -369 -513 -261 -571 507 579 -295 564 -145 -17 114 79 293 278 -488 163 -146
4403a46O58k2n20M89l39j357P51R76J67o27o56M31L75Q85r58L76q62J582p20o41
$$ -146 512 490 -30 459 120 -1237 -486 490 657 30 -626 -195 180 1065 107 483 -379 1203 483 -158
4423a58N8o5J049Pj156J25O11k30n4M28j448J171o21Q95j598J435N75p26j330
$$ -158 -100 -165 884 891 -265 -140 471 241 187 615 -833 338 -283 612 -986 449 1024 298 -1032
4442a032J235l15L1N10k61O01j183L10O39j641J684j430K37O30M93j278P52n39
$$ -1032 203 -112 -81 429 168 769 -414 -104 535 -1106 578 -852 -615 15 508 -770 -18 -557
4460e57n64R88l01M87N26O4J79n06k28n74J105j379P84p2N10j259M31o1J135k02
$$ -557 -1121 -133 -434 53 579 643 822 316 88 -486 619 -760 24 -48 462 -797 -366 -427 708 506
4480E06m07k86k88P20M51r7j614J142o78K013j355K60R65k939R35J067j750J432
$$ 506 99 -187 -475 245 696 599 -1015 127 -551 1462 107 367 1332 -1607 -672 395 -1355 77
4498G7P53j078K58o47P29p38L26L13l64P87j47K20k63J723k543k36K052k139P89
$$ 77 830 -248 10 -637 92 -646 -320 -7 -371 416 269 489 226 1949 -594 -830 1222 -917 -128
4517a28P74L84q33j250K455n15r21J32P06R73k155P66j534J661N72j303J11P9
$$ -128 646 1030 197 -1053 1402 887 -34 98 804 1777 -378 388 -1146 515 1087 -216 -105 -26
4535b6j00p31P55k01K74n79J093q48R77M37n14m46q3L07o26n51K101n34r9q98
$$ -26 -126 -857 -102 -303 -29 -608 485 -363 614 1051 537 91 8 315 -311 -862 1239 705 606 -292
4555b92K96K82J1q61J19N71M1m82m49J001oN95r25N43r53Q51N0J59l94k98l54
$$ -292 4 286 297 -564 -445 126 167 -315 -764 237 231 826 -99 444 -509 342 392 551 157 -141 -495
4576d95M47k94k86Q42l28o20J163m70J017p58l45J54m27J20L42j97k32M34j44
$$ -495 -48 -342 -628 214 -114 -734 429 -41 976 218 -127 27 -400 -280 62 -135 -367 67 -77
4595g7O48pl38O65l86q12J276p67L98l3o19m4q7R87j440J88M78o45m4j57N73J238
$$ -77 571 564 226 891 505 -307 969 202 600 567 -52 -96 -183 804 -636 -448 30 -615 -659 -816 -243 995
4617I95j114n55L11P62j98n98O73k117Q19J734j098p98J531l90j26P83p99p04
$$ 995 -119 -674 -363 399 201 -397 276 -1841 -1022 712 -386 -1184 347 -43 -169 614 -185 -889
4635h89J422j077J046Q78j535N47j26l32J404j092m6K93o46J44O22J81l94k41
$$ -889 533 -544 502 1380 -155 392 266 -66 1338 246 200 493 -153 -9 613 794 400 159
4653A59O11l969K848J374N3q37p71K58M87m48j14J106j946K273p93O49N63j963
$$ 159 770 -3199 -351 1023 1076 239 -532 -274 213 -235 -349 757 -1189 1084 291 940 1503 -460
4671d60Q76k114J334J841j32j602J479p69J60J9j144J268j47j301P72L25o13M87
$$ -460 416 -1698 -364 1477 1345 -257 1222 453 613 632 -512 756 609 -692 80 405 -208 279
4689B79m27J145j596Q19k62K033k880J905q61p01J87K48k33Q13j09j993J233J558
$$ 279 -148 997 -599 220 -42 1991 -889 1016 155 -546 -359 -111 -344 469 360 -1633 -400 1158
4707A158j134M40j280M49Q64N1n02P74j2M80j440k40L12o21P99l86O95m14L00
$$ 1158 24 464 -816 -367 497 548 46 820 808 1288 -152 -392 -80 -701 98 -288 407 -7 293
4726B93k190J872J28L20m36Q54p3j012J59N85l71J234j463q75J290o40k10K08
$$ 293 -1897 -25 103 423 -13 841 768 -244 -85 500 129 1363 -100 -975 315 -325 -535 -327
4744c27O41q50j99J06J20J113q08k0K16K95l01L15N63M53r32p16R82m81m36j32
$$ -327 314 -536 -735 -629 -509 604 -204 -224 -8 287 -14 301 864 1317 385 -331 651 170 -266 -398
4764c98J71J394j407j84P2J02P80l8m39j188N49O80J90p17n08J217p66N74m04
$$ -398 -227 1167 -240 -424 -352 -250 530 492 53 -1135 -586 94 284 -433 -941 276 -490 84 -320
4783c20M90q07R48l76L60m79j53O12j20L9p00L12J98J57j34j94J20J66J28o53
$$ -320 170 -637 311 -65 295 -184 -337 275 155 194 -506 -194 4 161 27 -167 -47 119 247 -406
4803d06J050j088k34J047J17K25k001J477M27p32K75l87P15p11K71r15P12N15
$$ -406 644 -444 -678 369 486 711 -1290 187 614 -118 157 -230 485 -226 45 -870 -158 357
4821C57m62k19J44M08m73L10n94K51Q57o87o87N00L59m83L99K98l97J13R6K17
$$ 357 -105 -324 -180 228 -245 65 -529 -278 579 -108 -795 -295 64 -419 -20 278 -119 -6 90 307
4841C07j49o5n6L02p05K65k4k07K78K29j15r9O0k34L02J00j45j15O9j55L14o2
$$ 307 158 93 37 339 -366 -101 -125 -332 -54 175 60 -39 21 -213 89 189 44 -71 -2 -157 157 95
4863I5k49M82n87n8R3r4K66L65q50O28q4K09M00p61L14l85j57P42O5l88l78K19
$$ 95 -154 328 -259 -317 -224 -318 -52 313 -537 91 7 216 616 -145 169 -216 -373 369 434 46 -332 -113
4885a13R30p06L92k11P60j094k29j74O52no52L78L34o97P39l74Q43J28M9j363
$$ -113 817 111 503 292 1052 -42 -271 -445 207 202 -450 -72 262 -435 304 -70 773 901 950 -413
4905d13K38K58q54M15N56K49l40q1l92K07m42K80P65P5o58k89K83j56N03J89p1
$$ -413 -175 83 -771 -356 200 449 109 28 -364 -157 -599 -319 446 521 -137 -426 -143 -299 204 393 322
4926C22Q5J6p18J07R29o60r75P62k91L82p68L56N16m34K70J85N6p14J42J47N0
$$ 322 407 423 -295 -188 741 81 -894 -132 -423 -41 -809 -453 63 -371 -101 84 140 -574 -432 -285 -235
4947b35N89k09l65P74j051L54o4M8M54m2j27L1K39m27M67j079J089m26n14O29
$$ -235 354 145 -220 554 -497 -143 -207 -159 295 253 126 157 396 -31 436 -643 446 20 -494 135
4967A35J62m55M24o37K95K69m93M20k63k0M67n89J76L35q99P91j35j57k71J89
$$ 135 297 -158 266 -371 -76 193 -300 120 -143 -163 304 -285 -109 226 -673 118 -17 -174 -445 -256
4987b56J76J85l04L93k19j89O62m41K73j24l91P92l95K69L84j116R44j3M7m77
$$ -256 -80 105 -199 194 -25 -214 448 7 280 156 -235 557 162 431 815 -301 643 630 677 200
5007B00j45n2K94o71O64n70M21q5k10K65K84l06k4L25k80k83M03k90J15p6P2m5
$$ 200 55 3 297 -374 290 -280 141 56 -154 111 395 89 65 390 110 -173 230 -60 55 -21 51 6
5029FJ98N4m67K8J34k6j09K07O2J5k81O9M2J81K4l3p4m6p3m2J05j10K67k49J86
$$ 6 204 258 -209 -181 -47 -73 -182 25 87 102 -179 -110 -68 113 137 104 30 -16 -89 -131 -26 -136 131 -118 68
5054F8k87r9K63L3nM1k03J50K49j72M1Q9k22M9M6j35K6R1K23lk36n1N9k02N8M27
$$ 68 -219 -318 -55 -22 -27 14 -189 -39 210 38 79 168 -54 -5 41 -94 -68 23 246 243 7 -44 15 -187 -129 298
5080B98n37L74j59J89k9k41j40L61Qk32p4J64R9Q3k21Oo9kL85k36rJ4l1J54m8
$$ 298 -239 135 -24 165 136 -105 -245 116 124 -108 -182 -18 81 164 -57 -51 -120 -122 263 27 18 32 1 155 107
5105A07k27K35o7J60m26k4L75K5j14j48P7j20K71k93Q8p7P4J73n2P3j46R2Q0r7
$$ 107 -120 115 48 208 -218 -242 133 158 44 -104 -27 -147 124 -169 -81 -158 -84 89 37 110 -36 56 136 39
5129C9J42j88j44o1J2K0J92k8J9j35J0K89m4n80L12J66K0o9K15Rk16m9J91l92
$$ 39 181 -7 -151 -212 -200 -180 12 -16 3 -132 -122 167 123 -457 -145 21 41 -28 187 196 -20 -69 122 -270
5153b70J87N4K3k79L18j00J6M17n82L83j80L8k1p0J68J51j70P1j42P9K53m10J86
$$ -270 -83 -29 -6 -285 33 -67 -51 366 -216 167 -13 25 4 -66 102 253 83 154 12 91 344 -66 120
5176A20k07J75k4J53l97j1J11K08jj39j47K5K30r9J20m1j28J36Q5l95L16j13J61
$$ 120 -87 88 64 217 -180 -191 -80 128 127 -12 -159 -134 96 -3 117 76 -52 84 169 -226 90 -23 138
5199A38k03j63J64p6L85j09j71J07Jj38j83J38O8o4NJ25J61j44l02R6J01l1K09
$$ 138 -65 -228 -64 -140 245 136 -35 72 73 -65 -248 -110 -42 -106 -101 24 185 41 -261 -165 -64 -95 114
5222A14o3j64O1M5j3j96K07p0nJ45J38l09l35M56k3K32k29R7m4p8p1J22j62M45
$$ 114 51 -113 -52 -7 -20 -216 -9 -79 -84 61 199 -110 -445 11 -12 220 -9 88 44 -34 -105 17 -145 300
5246C00k29j03l5j59J38L71j65j53j56J77O8k33J4J59k92J43L25j4k39qm7J70
$$ 300 71 -32 -67 -226 -88 283 118 -35 -191 -14 54 -179 -165 -6 -298 -155 170 156 -83 -91 -138 32
5268C2Pr8K75j62n2O3O9R1k40P8p9J34k23j0K53j75K81j26P2l74J95p7OOK14j59
$$ 32 39 -59 216 54 2 65 134 225 -15 63 -16 118 -105 -115 138 -37 244 118 190 -184 11 -66 -60 -54 160 1
5294AK05o9j35O2O2j88J92q3Nj27J09K16j08j04O4k09j13J75P7r5P8J64k85j93
$$ 1 206 137 2 64 126 -62 130 47 52 -75 34 250 142 38 102 -107 -220 -45 32 -63 15 179 -106 -299
5318b99K40k8L18l85M9L8J29M8j94K3J50J46m18J88j33J08J01n8j20K10j61K36
$$ -299 -59 -87 231 -154 -105 -67 62 110 -84 -61 89 235 -183 5 -128 -20 81 23 -97 113 -48 188
5340A88j70Q4N0k23mL55l42K89j65J0m3J91j82J2K34j80k04K20k16q0K49o3q4
$$ 188 18 102 152 -71 -75 280 -62 227 62 72 29 220 38 50 284 104 -100 120 -96 -176 73 10 -74
5363g4K95k89K17j78q8K33j34JO8l13M4J17K90j73l21N54l84O1J32k8N1J5r8o5
$$ -74 221 -68 149 -29 -117 116 -18 -17 51 -262 -218 -101 189 16 -305 249 -135 -74 58 30 81 96 -2 -67
5387f7Q9j49mJ74j70N4k3J4O8j73K14l0k4J93K35l73J45k42j06K79o0K2m4n4K3
$$ -67 22 -127 -131 43 -127 -73 -96 -82 -14 -187 27 -3 -27 166 401 28 173 -69 -175 104 44 66 22 -32 -9
5412iJ30r2N5m2j23P7m5j27L01K3R9l64L25l31L22k1k91P1L52k38M0Q2m9l34K73
$$ -9 121 29 84 42 -81 -4 -49 -176 125 148 247 -117 208 -123 199 178 -113 -42 310 72 112 194 145 -189 84
5437H4k7k48M39J27m8l00O6o2l2J50k42R8M2K1O4j83K70o5k4j21m9K9J93j07R9
$$ 84 57 -191 248 375 327 27 93 31 -1 149 -93 5 47 68 132 -51 219 154 130 9 -40 -11 182 75 174
5462A74k57R6K6k42J71J64J4l54P0K17J7k71J74L09n71K22r7K40J80j93o2K2l60
$$ 174 -83 13 39 -203 -32 132 146 -208 -138 79 96 -175 -1 308 -263 -41 -138 102 282 89 27 49 -311
5485c11R4L6J65OL1J52k87K53j57J95J18k0l11m6J25j3j36J30Q3K31l69k78K07
$$ -311 -217 -181 -16 -10 21 173 -114 139 -18 177 295 275 -36 -82 43 30 -106 24 107 338 -31 -309 -102
5508a02N0M4j73K91j8n8j35J05n9K39K8q6j8k86N63o19j4L08K89j91n2m5m37O46
$$ -102 -52 -8 -181 110 92 34 -101 4 -55 184 212 126 108 -178 385 -234 -248 60 349 158 106 61 -376 270
5532B70n05N01j47QRo1O4j44q7L0K83m18L08J77Qk74q8k7m5j00L2M89n08L87k08
$$ 270 -235 266 119 127 136 75 139 -5 -92 -62 221 -197 111 288 296 22 -66 -93 -138 -238 -206 283 -225 162 -46
5557d6L01o85N75l7k4n32N41n3N10j45j156J009L14m20n9qL9j03J39K17l64K87
$$ -46 255 -430 145 108 84 -448 93 40 550 405 -751 258 572 152 93 85 124 21 160 377 13 300
5579C00M29r26P03n18q7O0P3R5O9R5n74M50k1p50K84N17o18N66R5k44K91r54Q28
$$ 300 729 -197 506 -12 -99 -39 34 129 198 293 -281 169 148 -602 -318 199 -419 147 242 -2 289 -665 163
5602A63l87K69J017p17o75J81P07n50n72L09N13L7r4L38j383J155k26O0J62j85
$$ 163 -224 45 1062 345 -330 -149 558 8 -564 -255 258 295 201 539 -844 311 85 145 307 122
5622A22Q90l24n84L87m21k67n03J180k94n67N47Q3L14n21K79j36k64L16l71O06
$$ 122 1012 688 104 491 70 -197 -700 480 186 -381 166 249 563 42 321 185 -79 237 -134 472
5642D72j16M24Jj087J72L28R0L2n1k33N27p88J46l0j21mN54m52r7P18p51L83J43
$$ 472 356 780 781 -306 -134 194 284 316 265 32 559 -229 -83 -113 -234 -238 316 -136 -233 485 -266 117 260
5665B60k84J35l87N00J93j10l47l6K38j37p8j76M40l55J45o3K40m86L49N2Pj34
$$ 260 -24 111 -276 224 417 307 -40 -76 162 25 -53 -229 211 -144 1 -62 178 -308 41 93 100 -34
5687c4J09M5Q4m99J71j63K32J3L01k39q0N9k51L00m00O88M15l64m57R6J09K86
$$ -34 75 120 204 -295 -124 -287 -55 -42 259 20 -60 -1 -252 48 -352 336 751 387 -70 26 135 421
5709D21K0l35QP89j350Q25j73M19j025O06L5rn77N96l3m54Q07k63N29n79o7M88
$$ 421 441 106 114 903 -447 378 205 624 -401 205 240 231 -346 250 217 -237 570 307 836 257 190 678
5731F78j284K11L72k30P60p48J01O50r15K87J78J0m41K0K08N9l44P92P9o54K27
$$ 678 -606 -395 -23 -253 507 -241 -140 510 -405 -118 60 70 -371 -351 -143 -84 -428 364 443 -211 16
5752A6M49j463J97M98j74M80n31J117m88j70J186j668M97n9K3J11J39L36q30J30
$$ 16 465 -998 -801 -303 -477 3 -528 589 101 -69 1117 -551 -54 -113 -90 21 160 496 -334 -204
5772b04M12k54l72L51J6N94j05jm2J49L88m12q35R35n05o45J502j100J17L07n3
$$ -204 208 -46 -418 -67 -51 543 438 437 395 544 932 520 -315 620 115 -530 972 -128 -11 296 243
5793B43j71P32p04O21K18q56O08L26j650O69l14O02L71q90L5J445o44m20l41Q83
$$ 243 72 804 100 721 939 83 691 1017 -633 36 -278 324 695 -195 -160 1285 641 221 -120 763
5813G63j210M44j52j01M21l54J223j007k99K07Q09n92J83j86M22j065R42M36q20
$$ 763 -447 -3 -155 -256 165 -189 1034 27 -272 -65 744 152 335 149 571 -494 448 884 64
5832F4m29K97K99L22l69L96p8j27o05k47J012p35Q5j71Q34m90J18m53L03K24o52
$$ 64 -365 -68 231 553 184 580 502 375 -230 -477 535 -200 -115 -286 548 58 176 -277 26 250 -402
5853d02K31k68M97l4N64j4q41J30O93j37k70J64j4j05l75Q4r0K39k26O4%J67p4
$$ -402 -171 -439 58 24 588 574 -267 -137 556 419 149 313 299 194 -181 -97 -187 52 -174 -110 -110 57 -17
5876a7R1J4kl59K42Q9j98J52k15K38J0o9rJ90j35L5k32L78q34R41n24N25J09r85
$$ -17 74 88 86 -273 -31 58 -140 12 -203 35 45 -24 -33 157 22 57 -175 203 -631 310 -214 311 420 -565
5900e65O57M15o53k16M42k42J20J52K63l74Rm72ll47O82M12K3q28k5M75l03l30
$$ -565 92 507 -146 -362 80 -162 -42 110 373 -1 8 -464 -467 -814 -132 280 303 -525 -550 -75 -378 -708
5922g08JR18M11r51R79m66K9k16m57oj72M39M52m48%P7M22o95P5O67j164J017
$$ -708 -707 211 622 -329 650 184 213 -3 -460 -466 -638 -199 253 -195 -195 -118 304 -391 -316 351 -813 204
5944B04k00M40m78K07j046J028J27J021j479P23j052J046nr94O22j84k86q0k15
$$ 204 4 444 -34 173 -873 155 282 1303 -176 547 -505 541 536 -458 164 -20 -306 -386 -601
5963f01P42L69n9m91l43J230q39J10j57o31J008m31o8l97L89j1N02m93L2O83n66
$$ -601 141 510 451 -40 -383 847 8 118 -39 -670 338 -93 -161 -558 -169 -180 322 -171 -139 544 -22
5984b2o9n62N58L73l55j08o7q5Q57m62m18K29j23Q18q24N87o09l32J016p1j43
$$ -22 -91 -653 -95 278 -77 -185 -252 -337 520 58 -360 -131 -254 564 -260 327 -282 -614 402 331 188
6005A88o43L30M47L12m08K39n31k36O07r5k58J68l16m5M35n35M01o6j37L97j02
$$ 188 -455 -125 322 634 226 465 -66 -302 305 210 -48 120 -196 -241 194 -341 60 -6 -143 254 152
6026A52J29j20k84J17n2j7j8O1PKJ3q8p2L09ln9M05p58q3K30j86M92n16O17l30
$$ 152 281 161 -123 -6 -58 -75 -93 -32 -25 -23 -10 -98 -170 139 136 77 482 -276 -359 -129 -315 177 -339 278 -52
6051e2o18R41l48K37k53m30M78J32p47M71k96J406p72j130P53K54k9j25K61k63
$$ -52 -670 271 -77 160 -93 -523 -45 87 -660 -189 -485 921 149 -981 -228 26 -3 -128 133 -130
6071a30J12J60n8m44J114k04j220R05m77O18p6r9n66O21j004P81M16o67O19m82
$$ -130 -18 142 84 -360 754 550 -670 235 -242 376 300 201 -365 256 -748 33 449 -218 401 -81
6091h1k90M69k20j95L66O0l54K31l41m85L62J137r16O01l97Q5n19M04l69K95o24
$$ -81 -371 98 -122 -317 49 109 -245 -14 -355 -840 -478 659 -257 344 -53 32 -487 -83 -452 -157 -781
6112g81J366o56o56J123k35o01O86k66m75J001r56O12l44k45j34J801o90j04q23
$$ -781 585 -71 -727 396 161 -440 246 -20 -495 506 -450 162 -182 -427 -561 1240 550 446 -377
6131c77P10K23l21k08l40P32q03M13R1J55J69n50K9j1J96m28l23P86q25N75pO23
$$ -377 333 556 235 27 -313 419 -384 29 120 275 444 -106 -77 -88 108 -320 -643 143 -682 -107 -114 509
6153E09N2o04m2j1N60l81l69L48J88m19K74M28j69Pj112J663l69q07m41L37L27
$$ 509 561 -43 -85 -96 464 83 -286 62 250 -169 105 533 364 371 -741 922 553 -254 -695 -358 -31
6174c1l32O59l12j66O19k72K90M38q39k97Q77m09k56O45k47j017M16L20q6j065
$$ -31 -363 296 -16 -182 437 165 455 893 54 -243 634 225 -31 614 367 -650 -234 86 0 -1065
6194a065R03K5K33n81P58l6r57J043m73M25j83l45J04o5L47N6l39j08J50k55O57
$$ -1065 -162 -137 96 -485 273 237 -720 323 -150 275 92 -253 -149 -214 133 189 -150 -258 -108 -363 294
6215B94k03m83P80q1l51l13Q00k72j43L57n11L66m81N31m57L33k42Q7M96j299
$$ 294 91 -392 388 307 -44 -357 443 171 28 385 -126 240 -241 290 -167 166 -76 11 507 -792
6235g92J147q9k89r17J181o19Q8J61L71o31J226p40j6J77p29P92j015K32M03P8
$$ -792 355 266 -23 -940 241 -378 -290 -129 242 -389 837 97 81 258 -471 321 -694 -462 -59 19
6255A9m93k88Q04j168P05M14L55n50L18J1n61J23J42k21O96n25P5J24j53k58N04
$$ 19 -474 -762 42 -1126 -421 -7 348 -202 116 127 -434 -311 -169 -390 306 -219 -144 -20 -173 -431 73
6276G3r3K04o26L45L43q21M64M5J17P7J43j34l96K93M16m84M66o24K98R2j36j80
$$ 73 -20 184 -442 -97 246 -575 -111 -66 51 128 271 137 -259 34 450 -34 432 -192 106 198 62 -118
6298a18j11K62l08J8O0M58k69J56n3j16m2Q1K35J01l59k3p7j06J36M73R0m29k46
$$ -118 -229 33 -275 -257 -197 261 -8 148 95 -21 -63 18 253 354 -5 -28 -105 -211 -75 398 488 59 -187
6321a87J29k99M42j8l30M46k27J1J06n61N18j28K77j63N9n36N07P6R1n71N26j03
$$ -187 -58 -357 85 67 -263 183 -44 -33 73 -488 30 -98 179 16 75 -461 46 122 213 -358 168 65
6343F5k78K57p1n9J60j13k7L01j35o1o95L40K80J84l86K58J27j93m36N45o42O78
$$ 65 -213 44 -27 -86 74 -39 -66 235 100 39 -656 -316 -36 148 -238 20 147 -46 -482 63 -579 99
6365I9m0k03L39n4l49J25j35K61j06q6R9j17J24O1j91j15M81j70L81k56j31j29
$$ 99 59 -144 195 141 -208 -83 -218 43 -63 -149 -50 -167 -43 18 -173 -288 193 23 404 148 17 -112
6387a12j73K11k37J36O13l82Q6m2j99k37L17j74J24L17K32l96J63j65M5m0J91
$$ -112 -285 -74 -311 -175 438 56 142 100 -99 -336 -19 -193 -69 248 480 84 247 82 127 87 278
6408B78J31k68k85J18K89r74J007n52o6L04R08o85o34O90n45O26K65r29Q65l73
$$ 278 409 141 -144 -26 263 -711 296 -256 -322 -18 890 205 -429 261 -284 342 607 -322 543 170
6428A70K97k02n51o7L39N6m11M68m70J77K8Q80k0n13n11P3N58j047O37k39N92
$$ 170 467 265 -286 -353 -14 42 -369 99 -371 -194 -166 714 694 181 -330 -257 301 -746 -109 -348 244
6449B44j48k82M82K82j30r45O58j58J93K72l59Q4J09rk06R2l94K13l44P55m3j84
$$ 244 96 -186 296 578 448 -497 161 3 196 468 109 193 302 293 87 179 -215 -2 -346 409 366 182
6471A82l54j33O04r41P42j61Q7J42l22k43M18J70l85L4J4K78j56n8J14r3L75k13
$$ 182 -172 -305 299 -642 100 -61 26 168 -154 -397 21 191 -194 -160 -146 132 -24 -82 32 -61 314 101
6493A01m05P6K64P20o90K37J22j38K50p09J56j40K12n37J93J297j312j57Q54l42
$$ 101 -304 -228 36 756 66 303 425 287 537 -172 -16 -156 56 -481 -288 1009 -303 -460 394 52
6513E2r18J016J13J1n62L25n5K21J8n97j14P10m21k00M24p58N20K10p54Q11k2
$$ 52 -866 150 263 274 -288 37 -18 203 221 -376 -490 220 -201 -401 23 -735 -215 -5 -759 52 30
6534C0q11O24l29P70k46k65M52m45P26l44J11Q6j93Q1n99K0P07l82N9k52k03L67
$$ 30 -781 -157 -486 284 38 -227 225 -220 506 162 273 359 166 247 -352 -332 375 -7 52 -200 -403 -36
6556c6L80j171M66L45l62O45J22m33J34K74n38J80l27R11k70j025J092j77P2r83
$$ -36 344 -827 -361 -16 -378 267 389 -44 90 364 -174 6 -321 590 320 -705 387 210 282 -701
6576g01J734j312k89J21N98j49r8K42j30k0j07K63M1j098N16J03jK01j06n1l2
$$ -701 1033 -279 -568 -447 151 2 -96 146 16 -4 -111 152 193 -905 -389 -286 -287 -86 -192 -243 -275
6597b75J46j74L44O7J44l46j43J22K28j98l82O13l36k09M63l7j01k56N12o04Q17
$$ -275 -129 -303 41 108 252 -94 -237 -115 113 -85 -467 146 -190 -399 64 27 -74 -330 182 -422 395
6618C95o28J15K16N32p80J67K33n53N38k59k97L83K62q12J38M51p2l17L03m75
$$ 395 -233 -118 98 630 -150 17 250 -303 235 -24 -321 62 324 -488 -350 101 29 -288 15 -460
6638d60N63n7M83r83L7J23j0J3L83m56q5Q77j302P11J98m43M8Q13K7j10o26J69
$$ -460 103 46 529 -454 -417 -294 -304 -291 92 -364 -449 428 -874 -163 35 -408 -360 453 480 370 -256 -87
6660h7l32O87K82q11J047o83M73J16m06p41M07L00n19O25J38Jn05L14j59k88J95
$$ -87 -419 268 550 -261 786 103 576 692 286 -455 -48 252 -267 358 496 497 -8 306 147 -141 54
6681E4O08j297J036j9l39K24j257L94N14J144j203R02j114p8Q88p73J215r98j34
$$ 54 662 -635 401 382 43 267 -990 -596 -82 1062 -141 761 -353 -431 457 -316 899 -99 -233
6700b33n82j17J607o09q7J61q08o88J139J105m50l84M1J34mp33K47J418j627j55
$$ -233 -815 -932 675 66 -21 140 -668 -1356 -217 888 438 54 95 229 225 -508 -261 1157 -470 -625
6720f25M21o28J430L18j178O67k3Q7k69Q6K15l98K90n82J47k45M00k83k63L13
$$ -625 -204 -832 598 916 -262 405 382 469 200 286 501 103 393 -189 -42 -287 113 -170 -433 -120
6740a20J23L98m99N98o99R9L5O44j064N99r63J067l86K19K96J11p20K73m40P20
$$ -120 3 401 -98 500 -199 -100 -65 579 -485 114 -849 218 -168 51 347 458 -262 11 -429 291
6760B91j07J59n03j28J122j171N23r6R5k16O20q60N94q8l15l0l83N79p30P63O8
$$ 291 184 343 -160 -288 834 -337 186 90 185 -31 589 -271 323 235 -80 -110 -493 86 -644 119 187
6781A87r6k73m09R27o74J80L89J66n08J83j84J95o06J105k86j272P27O23j021
$$ 187 91 -182 -591 336 -338 -158 231 397 -111 72 -112 83 -523 582 296 -976 -249 374 -647
6800f47Q5J68M95K71k56m08Q50n40n95P03p20O63o43Q91k09j05p8O70j188N20
$$ -647 -562 -394 101 372 116 -292 558 18 -577 126 -594 69 -574 317 108 3 -75 595 -593 -73
6820g3Q19q98M90j032L08L39O35k57q7J44k20L78N17j180p97N09k4K02M81J30
$$ -73 746 -152 338 -694 -386 -47 588 331 244 388 168 546 1063 -117 -914 -405 -429 -227 254 384
6840C84n61n27Q77J165j309k65j32M08j7k68l66J21Q49K51l66r97k03N13k38K40
$$ 384 -177 -704 173 1338 29 -236 -368 40 23 -245 -611 -490 359 610 244 -753 -956 -443 -681 -441
6860d41k58l40Q19K26K7L43n16r6J97J14r8l60M68o0K3p61P34J65o26L70r1j56
$$ -441 -699 -1039 -220 6 33 376 -140 -236 -39 75 -23 -383 85 25 48 -713 21 186 -440 -70 -161 -317
6882c17p53J749n24l44j31m33J520j023K01m29L87k87N37k25J63oK31o5l54m24
$$ -317 -1070 679 155 -189 -320 -753 767 -256 -55 -484 -97 -384 153 -72 91 85 316 251 -103 -527
6902e27P04m73O50o66Q07j198J083q01K83N09r73O50r14J621j319N73p9k3OM08
$$ -527 177 -296 354 -312 495 -703 380 -421 -138 371 -602 48 -866 755 -564 9 -70 -93 -87 321
6922C21p99K19K70l0L28q92O81n39M89n14M17m57K10m7l61K61P38%J72r52L34
$$ 321 -478 -259 11 -19 309 -583 98 -441 48 -466 -49 -506 -296 -343 -704 -443 295 295 467 -485 -151
6943a51K0L24j39R5l18L18n4k13j23J7M80j38m81J91j00J07J97K2m6k50o8K82
$$ -151 -131 193 54 149 -169 149 95 -118 -241 -224 256 118 -363 -172 -272 -165 32 54 8 -242 -310 -28
6965b8N1L43j91m2k32j79J92K03k17k48L55M76o16j23K97r2J07o3o6N28J88p02
$$ -28 23 366 175 133 -99 -278 -86 117 -100 -348 7 483 -133 -256 41 -51 56 -7 -73 455 643 -59
6987e9j28J86K19j72P8L39n64m8J27k20L68po99O58k50K94n1j01k9N8j43O38q02
$$ -59 -187 -1 218 46 124 463 -101 -149 -22 -242 126 119 -580 78 -172 122 71 -30 -59 -1 -144 494 -308
7010c08L12k84J79P2O6j33mJ70m1L9Rk86L27j66Np8PJ85j98K28j73J60p5K1M1
$$ -308 4 -280 -101 -29 37 -96 -100 70 29 68 77 -209 118 -48 -43 -121 -114 71 -127 101 -72 88 13 34 75
7035G5n9k11J43J63Q2j81o5L85l04r2PL0k14M51j21k07j9K11k42K22l7J12j62
$$ 75 16 -195 -52 111 193 12 -53 332 28 -64 -57 -27 -241 210 89 -118 -137 74 -168 54 17 129 -33
7058c3J70o5o2O6JK01m13J34J54M9k23L2m91L33K68j68N61m78N90j058k14L69
$$ -33 137 72 10 76 77 278 -135 -1 153 202 -21 11 -480 -147 121 -47 514 36 626 -432 -646 -277
7080b77Q38j16j252O47K94O61m53p93Q9N73l00k84L52M7j28m3J04K1k04K7K71
$$ -277 561 445 -807 -160 134 795 342 -451 -362 211 -89 -373 -21 26 -102 -145 -41 -20 -224 -197 74
7101G4j00m5M9K2l0J32n2n7l29K00J20L1K3k65N5M0J8j74K53j97K74j80J33k42
$$ 74 -26 -71 -22 0 -30 102 50 -7 -336 -136 -16 15 38 -227 -172 -132 -114 -288 -35 -232 42 -138 -5 -247
7125b47N61k87l41K91J08M6n1j5p5j08K53l8j52j60J79r1q5O9O8K81k67J11j65
$$ -247 314 27 -314 -23 85 131 80 65 -10 -118 135 97 -55 -215 -36 -127 -212 -143 -75 206 -61 50 -115
7148a15K09K85l60O0j77K87l07M7K6N2j70J1K04j62R5K94k43J04k69M02l18P2
$$ -115 94 379 19 79 -98 189 -118 -71 -45 7 -163 -152 52 -110 -15 279 36 140 -129 273 -45 27
7170B7R7k59L18m25k1J95J34J33k10M9O7l27K71j66N3KJ70J8j02J8J58l35J44
$$ 27 124 -135 183 -242 -263 -68 66 199 -11 38 105 -222 49 -117 -64 -62 108 126 24 42 200 -135 9
7193Ij7L24l06P0j44J30p2M3Q3J0k19r3O9k1J80l6J40j91J42j05K35j97l12L33
$$ 9 -8 316 10 80 -64 66 -6 37 120 130 -89 -182 -113 -134 46 10 150 -41 101 -4 231 34 -278 55
7217E5j5l30L50k02J77oL5k31J06J11m7K58k77j36K20j99n7L56j42K40m95N3M9
$$ 55 40 -290 60 -142 35 29 64 -167 -61 50 3 261 -16 -152 68 -131 -188 168 26 266 -229 -176 -127
7240a27L91j04j79k87L29M3J58j03k0j33K07r9J26k11R7n1m5j57lM73j89j05n5
$$ -127 264 160 -19 -306 23 66 224 121 101 -32 175 76 202 -9 88 37 -8 -165 -168 305 116 11 -44
7263d4P7J23k1j22J52j61K32k24p5n4J21J62J3k46K26l07J02L8m2J91k68O85n88
$$ -44 33 156 135 13 165 4 236 12 -63 -117 4 166 179 -67 159 -148 -46 -8 -50 141 -127 558 -30
7286c0q48R8J184o08p2O42o79P8N01j135N78k9N91l21K95o03L25o58j91Q30K64
$$ -30 -878 -780 404 -204 -276 366 -313 -235 266 -869 -291 -320 271 -50 245 -358 -33 -691 -882 -52 212
7307B12J99n76n2M58l74K97K67m59l4j68L31M8m28L06j63J93Q6j87J15J09j33
$$ 212 411 -165 -217 241 -133 164 431 -28 -62 -230 101 149 -279 27 -136 57 143 -44 71 180 47
7328D7mr8m5k4J21k03K77q2j3o6J1Q4J30k55K16k02ml44N87L19p54q9O2L16j37
$$ 47 43 -55 -100 -124 -3 -206 71 -11 -24 -90 -79 5 135 -120 96 -106 -110 -454 133 452 -302 -391 -329 -13 -150
7353a50O97n75J83k18L83j14K1r6k34O3L8p3M7J37j53L54j20k31L1q2R6q2m7K68
$$ -150 547 -28 155 -63 320 206 227 131 -103 -40 -2 -75 -28 109 -44 310 190 -41 -10 -92 4 -78 -125 143
7377A43k45j72N30O5K4k76m58M29J6m73M64O71j38l31p02M80n18J007n59P28p16
$$ 143 -102 -274 256 321 345 69 -389 40 56 -417 47 718 580 249 -453 27 -491 516 -43 685 -31
7398c1L09K79m52M32p74L60kj86j73Q6J37R6K00j88m42J011o35N60N5j26o09J89
$$ -31 278 557 105 537 -237 123 121 -65 -238 -152 -15 81 281 93 -349 662 27 587 642 516 -93 96
7420I6L89n29O62q34M26J86k07p79L69J125j512Q35r4n66O7Q2J28K20l17L97r7
$$ 96 485 -44 618 -216 210 396 189 -590 -221 904 -608 227 133 -433 -366 -284 -156 64 -253 144 47
7441D7J46l51L92j58m4j25K47k25J96n4j7k76K36J32m7j95J40j15K45L3j85K9
$$ 47 193 -158 234 76 32 -93 154 -71 125 71 54 -222 14 146 99 -96 44 -71 174 207 22 51
7463E1K01k99q2L15j32p8r9M1J4L6j27J63O8n6P0j9j50o4J97L2N0l35rL99k73
$$ 51 252 -47 -129 186 54 -24 -123 -82 -68 -32 -159 4 72 16 86 67 -83 -147 50 82 132 -203 -212 187 -86
7488h6J89j32j16R7J03j49J79q7Nj56M01l06j10L85k46J5R0j38j36R0J67J54j44
$$ -86 103 -29 -145 -48 55 -94 85 -2 3 -153 248 -58 -168 217 -29 -14 76 -62 -198 -108 59 213 69
7511F9l36K73O1j79J22j22J75J78j61m38J25K74J81k63MK60Pk59K0l00P1J36N2
$$ 69 -267 6 67 -112 10 -112 63 241 80 -358 -233 41 222 -41 -37 223 230 -29 -9 -309 -238 -102 -50
7534e0K22j35p7P0k37L60p1m11L63J91k33jP8j36J16n8L01l49K37m29K51Jj8N3
$$ -50 172 37 -40 30 -207 153 82 -329 34 225 -8 -9 69 -67 49 -9 292 -57 180 -249 2 3 -15 38
7558C8j87N2J74j02R3N1K3q1l78M77m23L38j22j90M17l12K56j13o7J67l58K88
$$ 38 -149 -97 77 -25 68 119 142 61 -317 160 -263 75 -47 -237 180 -132 124 11 -56 111 -247 41
7580D1q5ON3K32k37j95J49j28J50K63l48L8n1J0J09N7M0l4j07n8K05r6J29p3L4
$$ 41 -44 -38 15 247 10 -185 -36 -164 -14 249 -99 -61 -112 -102 7 64 104 70 -37 -95 110 14 143 70 104
7605A04j06j9j67R3K87j80K08l37N5m7K40j89P0j14J6K92l33K53j99q9J54O8l2
$$ 104 -2 -21 -188 -95 192 12 220 -117 -62 -109 131 -58 12 -102 -86 206 -127 126 -73 -162 -8 60 28
7628B8j27J32k06O1r2M4M00k27k29Q2k9j6J15J43O7k46j39L92k88K83k03K61l52
$$ 28 -99 33 -173 -112 -204 -160 240 13 -216 -134 -163 -179 -64 79 146 -100 -239 153 -135 148 -55 206 -146
7651a46Q9J47j63J22K00k02K0j0m1j22Q7o3KP2K2M7k79L73l67L63j2l08K00r3
$$ -146 -57 90 -73 49 249 47 67 57 16 -106 -19 -82 -80 -8 14 61 -218 155 -212 151 139 -169 31 -62
7675f2K1k41j19N03k03K36k75K30r0k02L49l37J97j91J08O2K42l11J45J6n9k13
$$ -62 -41 -282 -401 102 -101 135 -140 90 0 -202 147 -190 7 -184 -76 -14 228 -83 62 78 19 -194
7697a94J96J55j77L4l9R2k7j3lJ6j3N6l7j90q2J73J12j80K43N2l22J43K8M9j56
$$ -194 2 157 -20 14 -25 67 40 27 24 40 27 83 46 -144 -226 -53 59 -121 122 174 -148 -5 23 72 -84
7722h4L65j87r9j03N2r5M06q9P36j505M57L24j256J564n93j43m9O07m30o2J5K99
$$ -84 281 94 -5 -108 -56 -151 255 166 902 -603 -146 178 -1078 486 -107 -250 -299 308 -122 -184 -169 130
7744A30j17j30k05M74r0J46K6L31o38L01r6n55P37l18m38J097p13j99L78k8L07
$$ 130 13 -117 -322 152 62 208 234 565 -73 228 132 -423 314 -4 -442 655 -58 -257 121 93 400
7765D00l18n70J75L70Nj04L08m01J70j30R8j08j6R5j77l54O53l19K68M6o01M11
$$ 400 82 -488 -313 57 62 -42 266 -135 35 -95 3 -105 -121 -26 -203 -557 96 -223 45 91 -510 -99
7787i9K86l50j39O10o29J84O13J87q05N09k89P8N7Q0p17OL09j38k91L37M48j62
$$ -99 187 -163 -302 308 -321 -137 476 663 -142 367 78 156 213 293 -424 -418 -109 -247 -538 -201 247 85
7809H5k08k04L23k72J81m32M44M2j98K42K78o11N70l41J15M99k84Nm4K77K2m27
$$ 85 -123 -327 -4 -276 -95 -527 -83 -41 -239 3 281 -330 240 -101 14 513 229 234 190 467 489 62
7831F2L46o23K35Q4l10oJ5J042r73k79K74l85J033k98o78N22m54k09J004j071
$$ 62 408 -215 20 104 -206 -212 -197 845 -128 -407 -133 -518 515 217 -461 61 -393 -602 402 -669
7851f69J722j764O53L69q84J028n11m2o42M11J54k61J78N65k06m95Q11K16p29
$$ -669 1053 -711 -58 311 -573 455 -56 -98 -740 -329 -175 -436 -258 307 101 -394 417 633 -96
7870i6K41m02O91m18J70m11O24M1n64j41K23K15k52j60K32j32l6l20N26j61j5
$$ -96 145 -257 434 16 186 -225 399 440 -124 -265 -42 173 -79 -239 -7 -139 -175 -495 31 -130 -145
7891a45J68j02m2K85k3j07K34m43O3o05M68J12j85Q08l62M71q76K32M15n50L54
$$ -145 23 -79 -121 164 141 34 268 -175 -112 -717 -249 -137 -322 486 124 595 -281 -49 366 -184 170
7912A70m49M65JM20p27j92K12O69p2n75n28P87k88J54j63l28J22p4M00P78m03
$$ 170 -279 186 187 607 -120 -312 -100 569 497 -78 -606 181 -107 47 -116 -444 -322 -396 4 782 379
7933C79o76M65p59O44O8M5n38K79j42K45K12k06jL10o78M86r9J82j33l83L79k03
$$ 379 -297 168 -591 53 121 166 -372 -93 -235 10 222 16 15 325 -353 133 34 216 83 -300 79 -124
7955a24K70r6j93o8J09Q4k5n6J98k48K28j38rJ07P0r2k34K11o7N6J27l55M38k76
$$ -124 146 50 -143 -211 -102 -18 -43 -99 99 -149 79 -59 -68 39 109 17 -217 -6 -73 -17 110 -245 193 -83
7979h3r9P3L2J63k02lJ46m0j38Q6p9K89J11o2j23k29J79J06k35Q7k9L07j29j31
$$ -83 -182 -109 -77 86 -116 -119 27 -13 -151 -65 -144 145 256 194 71 -158 21 127 -108 -21 -50 257 128 -3
8003cj0k00Q5K57Oo3j63J54j48j2J2K47j4j35K06m30K42O7k45J02l7j60L68j95
$$ -3 -13 -213 -128 129 135 72 -91 63 -85 -97 -85 162 148 13 219 -211 31 98 -147 -45 -82 -242 126 -69
8027f9L57l28J9J3nj08M48n90K75k97P3o7J63R8K00J04k02k26L10k44L63j83n01
$$ -69 288 -40 -21 -8 -13 -121 327 -263 12 -285 -212 -279 -116 -18 182 286 84 -142 168 -76 287 104 -397
8050c97Q78r23J109j355J115n60Q31n14k50L97j31l16O48l36O72Om80m31o8M11
$$ -397 481 -442 667 -688 427 -133 698 184 -66 331 200 -116 532 196 868 874 394 -37 -105 306
8070C06M63m73K1q66L64m7M71k70j16K92o99Q13m11L18On8m16K6j26K97LJ70N2
$$ 306 769 296 317 -549 -185 -232 239 -31 -147 145 -554 259 -152 166 172 114 -302 -276 -402 -105 -102 68 120
8093A20k45J00J53M6N3j91j51J7K67k57R7k01J22K39n39L19J64j61J11j16J6J16
$$ 120 -125 -25 128 174 227 36 -115 -98 169 -88 9 -192 -70 169 -370 -51 113 -48 63 -53 -37 79
8115G9k33J90j95K44J91n30J08k3J35k0oP6MK4j74Q0K1l04J83L18j09J0k40K11
$$ 79 -154 36 -159 85 276 -254 -146 -169 -34 -54 -60 16 20 44 -130 -50 -29 -333 -150 168 59 69 -171 40
8139D0m0k50O7M09k07j47J00P6k1J18j9j46J1O7J7j28j1Q8M5J02j03k85L30r5
$$ 40 0 -250 -183 226 19 -128 -28 48 27 145 126 -20 -9 58 75 -53 -64 24 69 171 68 -217 113 18
8163A8J78q4P0j25N6n6J25J7l68N54m34J68j52J65j75K92k49o5J62k16J1J63m7
$$ 18 196 112 182 57 113 57 182 199 -169 385 -49 119 -33 132 -43 249 0 -65 97 -119 -108 55 8
8186Hk17J90J63j46J73
$$ 8 -209 -19 144 -2 171
8191A71
$$ Imaginary data points
##PAGE= N=2
##DATA TABLE= (X++(I..I)), XYDATA
0@%%%%%%%%%%%%%%%%%qJ6j6J6j6J7k5L2l2M0m8N5o3P1q0Q9j04J19j34J50j66J85
$$ 0 0 0 0 0 0 0 0 0 0 0 0 0 0 0 0 0 0 -8 8 -8 8 -8 9 -16 16 -16 24 -24 31 -32 39 -41 48 -56 63 -71 79 -87 98
39I8k06K29k56K84l14L48l85M24m67N15n67O25o90P60q36R25j025J136j265J413
$$ 98 -108 121 -135 149 -165 183 -202 222 -245 270 -297 328 -362 398 -438 487 -538 598 -667 746
59G46j586J793k046K363k771L319m102N316p474J2446m4929n24J04058R477m5240
$$ 746 -840 953 -1093 1270 -1501 1818 -2284 3032 -4442 8004 -36925 -37449 66609 76086 30846
74C0846n5349m5830k9359K8919M9904M9932K8244j7230n7130l9880j7606k278
$$ 30846 -24503 -70333 -99692 -70773 -20869 29063 57307 40077 -17053 -56933 -74539 -76817
86g6817L2616N7551K5240n228k5557m9815l9021R804L4246L0585K1828J4029j8617
$$ -76817 -44201 13350 38590 33362 7805 -42010 -81031 -71227 -36981 -6396 15432 29461 10844
99A0844m0027k9038m873J6718L1692K5116J2199j292l3332m1061m018K1200J6773
$$ 10844 -29183 -58221 -63094 -46376 -14684 10432 22631 21339 -11993 -53054 -57072 -35872 -19099
112a9099K0473K2136m212k4888k0170j5621m438K3671K7376J2097N036j2700l2113
$$ -19099 1374 23510 19298 -5590 -25760 -41381 -45819 -22148 5228 17325 22361 9661 -22452
125b2452j4070N272R517K4574K0104l787j1845q432j7765j4099J3242K3184J3122
$$ -22452 -36522 -31250 -21733 2841 22945 19158 7313 -1119 -18884 -32983 -19741 3443 16565
138A6565Q319m753j8822j5476n600K981J5788J8224M684l004n109j5621j6302
$$ 16565 24884 20131 1309 -14167 -19767 -16786 -998 17226 21910 18906 13797 -1824 -18126
151a8126J115J4723J3434J2965M178j4039j6027o422k474N112J6607J0326K670
$$ -18126 -17011 -2288 11146 24111 28289 14250 -1777 -8199 -10673 -5561 11046 21372 24042
164B4042k908j1539j5390m211N215R817J3990J0251p555j4010o223p378o12J2084
$$ 24042 21134 9595 -5795 -10006 -4791 5026 19016 29267 21712 7702 1479 -5899 -6511 5573
178E573R334M224L854o489j2362p696p75M367J0589J0983J08o588o521r041n402
$$ 5573 14907 19131 22985 16496 4134 -3562 -4337 30 10619 21602 21710 15122 8601 -440 -5842
193e842N586P897N808P328Lj0182r717m338j088P050J1291M242l221l569o956
$$ -5842 -256 7641 13449 20777 20780 10598 881 -3457 -4545 2505 13796 18038 14817 11248 4292
208D292q149N22L635N087P599K696n200n672n640n555K156Q821M305J191q53l629
$$ 4292 -3857 -3335 300 5387 12986 15682 10482 4810 -830 -6385 -4229 4592 8897 10088 9235 5606
224E606q670k477J139o99P763O241r95l504n808o420j113L484M626L766K620k274
$$ 5606 -3064 -5541 -4402 -5101 2662 8903 7908 4404 -1404 -7824 -8937 -5453 -827 2939 5559 3285
240C285n689l933j727l167M948O111K682j262k455p111l803K747J327K417M226
$$ 3285 -2404 -6337 -8064 -11231 -6283 -172 2510 1248 -1207 -8318 -12121 -9374 -8047 -5630 -1404
255a404J870l888k809k085m054J743L828K771J342J310m586l423j030p39J682
$$ -1404 466 -3422 -6231 -8316 -12370 -10627 -6799 -4028 -2686 -1376 -5962 -9385 -10415 -11154 -9472
270i472M850K462j527J96j236n151m18K770J380K164M094k603l615m16o80m89
$$ -9472 -4622 -2160 -3687 -3491 -4727 -9878 -10296 -7526 -6146 -3982 112 -2491 -6106 -6522 -7202 -7691
286g691K840K063J057R62j310k968l99J034L14J033L265J96j873J017j858r98
$$ -7691 -4851 -2788 -1731 -769 -2079 -5047 -5446 -4412 -4098 -3065 200 396 -1477 -460 -2318 -3316
302c316L88J752j47K444J766j948j931J191j834Q25J849Q95m96L55M1k145%J546
$$ -3316 -2928 -1176 -1323 1121 2887 939 -992 199 -1635 -810 1039 1934 1438 1793 1834 -311 -311 1235
320A235j490J025K350q04l76R16j317j449J696O00o22M96J056q43q09J389k493
$$ 1235 -255 770 3120 2316 1940 2856 1539 90 1786 2386 1764 2260 3316 2473 1664 3053 560
337E60J146L88n9p01K447j137k73l09o2j720R52J265q88R58R00j749o25K317k063
$$ 560 1706 2094 2035 1334 3781 2644 2371 2062 2000 280 1232 2497 1609 2567 3467 1718 1093 3410 1347
356A347p4P44M85j189J661q6j512J9r8n90N82J866o23Q4J392j692q81K81J79j272
$$ 1347 1273 2017 2502 1313 2974 2888 1376 1395 1297 707 1289 3155 2532 2616 4008 2316 1435 1716 1895 623
376F23L115j00j514M84q37l57m97J600l35KJ410n54j289k25j040N92K089J064
$$ 623 3738 3638 2124 2608 1771 1414 917 2517 2182 2184 3594 3040 1751 1526 486 1078 3167 4231
394D231j580l1P09k011p58l11J519r42J712K40j817m00P17k308J464Q45o47N58
$$ 4231 2651 2620 3329 1318 560 249 1768 826 2538 2778 961 561 1278 -1030 434 1279 632 1190
412A190J396k911j388J026n73q51K239O20j842J410o91j754K7M05p0Q74J698j472
$$ 1190 2586 -325 -1713 -687 -1260 -2111 128 748 -1094 316 -375 -2129 -2102 -1697 -1767 -893 805 -667
430f67r02j94p62r38J682O62n32J358j586n69n06L10j311J942k28J841j731m84
$$ -667 -1569 -1763 -2525 -3463 -1781 -1119 -1651 -293 -1879 -2448 -2954 -2644 -3955 -2013 -2241 -400 -2131 -2615
448b615P61j596R37O92o96P84J569k046o25O68O1j021K706j138M94J52N05j915
$$ -2615 -1854 -3450 -2513 -1821 -2517 -1733 -164 -2210 -2835 -2167 -2106 -3127 -421 -1559 -1065 -913 -408 -2323
466b323J242j041J68J308K63O14l14l37j31j109J045J49j91J334J212j798P8k26
$$ -2323 -1081 -2122 -1954 -646 -383 231 -83 -420 -551 -1660 -615 -466 -657 677 1889 91 169 -57
484e7j385m2L003p57k36J054o51j034N43l97l17J789k80n31J079j81j275p53j19
$$ -57 -1442 -1484 1519 762 526 1580 929 -105 438 41 -276 1513 1233 702 1781 1600 325 -428 -547
503e47J994o04K112k022L81q32l30m33R17M05q78J063L71j615o69K118j650N19
$$ -547 1447 843 2955 933 1314 482 152 -281 636 1041 163 1226 1597 -18 -687 1431 -219 300
521C00K44k36k80R03q56q23J018O54j832J485O75j63o99N70p89j502J514J288
$$ 300 544 308 28 931 75 -748 270 924 -908 577 1252 1089 390 960 171 -1331 183 1471
539A471j770K146k50k587O17O92j786J510J711m67r67N75o57q50P97Q74j631J911
$$ 1471 -299 1847 1597 -990 -373 319 -1467 43 1754 1287 320 895 238 -612 185 1059 -572 1339
557A339P60l27k56n14j466K94J323Q81n07R12j95q56l47L19j765J594M17q02L59
$$ 1339 2099 1772 1516 1002 -464 -170 1153 2034 1527 2439 2244 1388 1041 1360 -405 1189 1606 804 1163
576A163J230j192k147K141j57L51n6J98m70K00m75k156P14J371m6L59L27O79j464
$$ 1163 2393 1201 -946 1195 1038 1389 1333 1531 1061 1261 786 -1370 -656 715 669 1028 1355 2034 570
595E70l96n68o02J076L11K05r44J125p19p06m89k57J227j48J182j051o00N09j242
$$ 570 174 -394 -996 80 391 596 -348 777 58 -648 -1137 -1394 -167 -315 867 -184 -784 -275 -1517
614a517J168N98p91K12O72q86m70J12l24JL58K8n44J495r78p38L42K27j69M50
$$ -1517 -349 249 -542 -330 342 -544 -1014 -902 -1226 -1225 -867 -839 -1383 112 -866 -1604 -1262 -1035 -1204 -754
634g54R90p2n09K76p80j054P12L78m85P72J046j305Q41j209J18k88J050j20J87
$$ -754 236 164 -345 -69 -849 -1903 -1191 -813 -1298 -526 520 -785 56 -1153 -1035 -1323 -273 -393 -206
653b06J158q73j049P11Q6o42N35L87l45K33R57j519o40J391p00K76J340L43j335
$$ -206 952 79 -970 -259 -173 -815 -280 107 -238 -5 952 -567 -1207 184 -516 -240 1100 1443 108
672A08l54r3p43M24P87P4P15m40n36p20Q82l9j252J295K16n00O83l71o61K4K62
$$ 108 -246 -339 -1082 -658 129 203 918 478 -58 -778 104 65 -1187 108 324 -176 507 136 -525 -501 -239
693b39p38J332P8k13l75j5o30o04R43M10k71j9M16p07j59j41l93K95R02J87M8
$$ -239 -977 355 433 220 -155 -170 -800 -1404 -461 -51 -322 -341 75 -632 -791 -932 -1325 -1030 -128 59 107
714A07l62M39j035J98M49q20J220N36m81m57J10n45q6Q85j39J06J04N65o85J26
$$ 107 -255 184 -851 -653 -204 -1024 196 732 251 -206 -96 -641 -727 158 19 125 229 794 109 235
734B35J97m59M34O14j84K48m70l70L48l30L16L22O3M37n9k22k5n02L77J27j34
$$ 235 432 -27 407 1021 837 1085 615 245 593 263 579 901 964 1401 1342 1120 1095 593 970 1097 963
755I63N07M15q58J38l01j93j66N39L68j38L45j22j189n5M99n48L39P89o15l3L06
$$ 963 1470 1885 1027 1165 864 671 505 1044 1412 1274 1619 1497 308 253 752 204 543 1332 717 684 990
776I90k82r48K67O47J3N5j80M56j195L26l40k59L60L54M59r96M96n72J73l45n83
$$ 990 708 -240 27 674 687 742 562 1018 -177 149 -191 -450 -90 264 723 -273 223 -349 -176 -521 -1104
797a104P90j9L93j28r0r71M09K23k08m21J017k87j61j8n4j128J373J18M19j77
$$ -1104 -314 -333 60 -68 -158 -1129 -720 -497 -705 -1126 -109 -396 -557 -575 -629 -1757 -384 -266 153 -24
817b4K16o63k44N24o64O57K85k06o09Q80K91j263m53J062r5k51J251l74p62K76
$$ -24 192 -471 -715 -191 -855 -198 87 -119 -728 152 443 -820 -1273 -211 -306 -557 694 320 -442 -166
837a66J41p05K73J131o97P47j65o13m20j75K9P51n99O19m18Q09m96l39m72L39
$$ -166 -25 -730 -457 674 -23 724 559 -54 -474 -649 -620 131 -468 151 -267 542 46 -293 -765 -426
857d26JK10O65R6p80J14l57j20O55K87o37Q73k59j118M92m56n65L58J540n33o9
$$ -426 -425 -215 450 546 -234 -120 -477 -597 58 345 -292 581 322 -796 -304 -760 -1325 -967 573 40 -29
878b9p8n39k30O00J16j100J041P64r28K18O2l01P6j69Q79l80M50k46o26L39o08
$$ -29 -107 -646 -876 -276 -160 -1260 -219 545 -383 -165 -103 -404 -328 -497 382 2 452 206 -420 -81 -689
899f89p4P19J016j216pQ69r44q22J495p18M27Q48j25p61L81r5o8j23L09M25J58
$$ -689 -763 -44 972 -244 -251 618 -326 -1148 347 -371 56 904 779 18 399 304 236 113 422 847 1005
920A005k02kl49N5O0l77R06K04j51L05j81q01L4M8K20J80O52l76k90R9M0q08N29
$$ 1005 803 801 452 507 567 190 1096 1300 1149 1454 1273 472 506 554 774 954 1606 1230 940 1039 1079 271 800
943H00K85M2J63K79o68P5k64p8l49K85P58l96N8k76o56Q6p2J00L89J60k79J4j31
$$ 800 1085 1127 1290 1569 901 976 712 634 285 570 1328 932 990 714 58 144 72 172 561 721 442 456 325
966C25m57k11K48K79o6J75j15l96K3m13J88R6K89o2K27n90Mm3p5n8j9O25j04j86
$$ 325 -132 -343 -95 184 118 293 178 -218 -195 -608 -420 -324 -35 -97 130 -460 -456 -499 -574 -632 -651 -26 -130 -316
990c16K2j52o18O76k83L09O4M78j63n44J0k93j82Q30P6K37l29j71n8n4J00l78
$$ -316 -294 -446 -1064 -388 -671 -362 -298 180 17 -527 -517 -810 -992 -162 -86 151 -178 -349 -407 -461 -361 -739
1012g39J95M06J76m04L75j6l29r1J86p4K03M63l81p6j35n3l79M13L27j38J13q4
$$ -739 -544 -138 38 -366 9 -7 -336 -427 -241 -315 -112 351 -30 -106 -241 -294 -673 -260 67 -71 42 -42
1034d2m84J27J79J58k9j09N4K66j22l63k73J55J57K66K76Lo18L54L3o57J59K30
$$ -42 -526 -399 -220 -62 -91 -200 -146 120 -2 -365 -638 -483 -326 -60 216 219 -399 -45 -12 -669 -510 -280
1056b80L24l56O28m83k61J04l11K52M37j48k4k50K16j72R0m76L03L88p3J85l55
$$ -280 44 -312 316 -167 -428 -324 -635 -383 54 -94 -118 -368 -152 -324 -234 -710 -407 -19 -92 93 -262
1077b62k0j92M14n60Q26o67R99j99m05J52j13J49r5M27n04J60K23N14r74K06L42
$$ -262 -282 -474 -60 -620 206 -461 538 339 -66 86 -27 122 27 454 -50 110 333 847 -127 79 421
1098D21R3K1J32o6J6K30m26q8j0O27K03o21K85m18J64j3J10J3k9J57P2j77K34
$$ 421 514 535 667 601 617 847 421 333 323 950 1153 532 817 399 563 550 660 673 644 801 873 696 930
1121I30p11j1o2K01N46p11O19l87N48q34J30l42Q21l71O82n54J64k71k55k46N32
$$ 930 219 208 146 347 893 182 801 414 962 128 258 -84 737 366 1048 494 658 387 132 -114 418
1142D18p4J38k59M42K6m34J12q43O21N71n16M79l0j249J090r75j41J1L42M78o95
$$ 418 344 482 223 665 691 257 369 -474 147 718 202 681 651 -598 492 -483 -624 -613 -271 207 -488
1163d88K75K09l90p28N48Q5Q6J24m5J92K69o04k51K30O57J75o53J93j63q49Q43
$$ -488 -213 -4 -394 -1122 -574 -489 -403 -279 -324 -132 137 -467 -718 -488 169 344 -309 -116 -279 -1128 -285
1184b85l07L49J93j97l4J12J74ql82Q24l79L21n87o7J55J91M89o36P0M24j12o83
$$ -285 -592 -243 -50 -247 -281 -169 5 -3 -385 439 60 381 -206 -273 -118 73 562 -74 -4 420 308 -375
1206c75K36j85M04m25K69qL37l49L55P5l6o00L40j61O51K73j429J363j174p6L00
$$ -375 -139 -324 80 -345 -76 -84 253 -96 259 334 298 -302 38 -123 528 801 -628 735 -439 -515 -215
1227b15N20o96P4r9J017p43r96N95p2m00P20J135m39k164R23O96m34m12R05k83
$$ -215 305 -391 -317 -416 601 -142 -1138 -543 -615 -1015 -295 840 401 -1763 -840 -144 -578 -990 -85 -368
1247c68q1J15n01P2K60J13j07M37J56k02q5k29L40j5l49K70K85M0l82J74N4m22
$$ -368 -449 -334 -835 -763 -503 -390 -497 -60 96 -106 -191 -420 -80 -95 -444 -174 111 151 -231 -57 -3 -425
1269d25K46j01M86K82l76N56j023J07K00k7J79O71j94J69m68K03k01j3K60J51
$$ -425 -179 -280 206 488 112 668 -355 -248 -48 -75 104 775 581 750 282 485 284 271 531 682
1289F82j75J08O0J67j54m15L89K49j56l20L14j72p9K22j76N4K65j47j61j11Q0
$$ 682 507 615 675 842 688 273 662 911 755 435 749 577 498 720 544 598 863 716 555 444 524
1310E24m09J16J7j34L65K21k31L0l65J51k03J09K47n43K79O4J29m23J41J90k06
$$ 524 115 231 248 114 479 700 469 499 134 285 82 191 438 -105 174 238 367 -56 85 275 69
1331F9J5l56N54l16j2m91O11O5l72K49l06L10J4n73M21l51M18l44K99K77J63n33
$$ 69 84 -272 282 -34 -46 -537 74 139 -233 16 -290 20 34 -539 -118 -469 -51 -395 -96 181 344 -189
1353a89J72l00J38J68k02J18j59m7r6N92n0l54J15O0K93l89p2K17Lj29K8M68l68
$$ -189 -17 -317 -179 -11 -213 -95 -254 -301 -397 195 145 -209 -94 -34 259 -130 -202 15 18 -111 -83 385 17
1376A7L78o61K91K25k29r4J74J94k01k41O0J10n9J8J47m44L32k71N78M59k69l85
$$ 17 395 -266 25 250 21 -73 101 295 94 -147 -87 23 -36 -18 129 -315 17 -254 324 783 514 129
1398A29j207M41P13N03m52j4l97J86l33l96L35j34L00K36k13m21j92P40q85L73
$$ 129 -1078 -637 76 579 127 113 -284 -98 -431 -827 -492 -626 -326 -90 -303 -724 -916 -176 -1061 -688
1418f88J056n41L09k58l06M43n83P90m46K23m59J50J34m68k05Q31p96N50P6M62
$$ -688 368 -173 136 -122 -428 15 -568 222 -224 -1 -460 -310 -176 -644 -849 -18 -814 -264 -188 274
1438B74M18p19l97N99n03M54k65M50j41k2k69l47K85L41N6q9L5J98k41k76p7L82
$$ 274 692 -27 -424 175 -328 126 -139 311 170 148 -121 -468 -183 158 214 125 160 358 117 -159 -236 146
1460A46J73k24K79q8J68l29k96K66L15M8J30J92J54m45k82m88O47l38K35P47p85
$$ 146 319 95 374 286 454 125 -171 95 410 458 588 780 934 489 207 -281 366 28 263 1010 225
1481B25K3Q3L25M20q12k13P91p3j15o92M30o4M40j317J420o02L81l80L1J90k80
$$ 225 248 331 656 1076 264 51 842 769 654 -38 392 328 768 -549 871 269 650 270 301 491 211
1502B11J39n04J57L07j15J96l30Q8m88k8O13J65j01J81n17k21Q1j56L78No4j88
$$ 211 350 -154 3 310 195 391 61 149 -339 -367 246 411 310 491 -26 -247 -166 -322 56 61 -3 -191
1524a91M76n78N5m3J08k4M97n55j0K01J02K59p90L48P5L56p1p6l28L75m47J13
$$ -191 285 -293 -238 -281 -173 -197 300 -255 -265 -64 38 297 -493 -145 -70 286 215 139 -189 186 -261 -148
1546a48l6K41j33LL68m39j06O2K16%L44k90j1r0K82j94j97M97m34L04j33j35J67
$$ -148 -184 57 -76 -73 295 -144 -250 -188 28 28 372 82 71 -19 263 69 -128 369 -65 239 106 -29 138
1569A38j33Lj28K19r2Q9K61l13R7k25j46N14k59J40k38J46j8k92k9o9j50O62k28
$$ 138 5 8 -120 99 7 96 357 44 141 -84 -230 284 25 165 -73 73 55 -237 -266 -335 -485 177 -51
1592e1N9l07j78L37j81p4K57r1l2K24k10q3j15K62j74MK13l53K04J26j52q5J75
$$ -51 8 -299 -477 -140 -321 -395 -138 -229 -261 -37 -247 -330 -445 -183 -357 -353 -140 -493 -289 -163 -315 -400 -225
1615b25m6J56k05J18P1j54L8l0R3J13j56K80n1o5m20L83K33k58K41J23p2l16K89
$$ -225 -271 -115 -320 -202 -131 -285 -247 -277 -184 -71 -227 53 2 -63 -483 -100 133 -125 116 239 167 -149 140
1638A40j32n3J83j34R1K12j52L0j91R5N9R1j59K16m8j10J45n1k33J2M52L0j51
$$ 140 8 -45 138 4 95 307 155 185 -6 89 148 239 80 296 248 138 283 232 -1 11 463 493 342
1661C42l40M12j83j03j79L23n2n2J84j9j9m7j77j80K7K20K21m95K06j26P1M4p9
$$ 342 2 414 231 128 -51 272 220 168 352 333 314 267 90 -90 -63 157 378 -117 89 -37 34 78 -1
1684aJ73Qj19n9k58J35j81m8K32j5N0J80O1n0k03j00j17P2oq4J36qK97k89%j02
$$ -1 172 180 61 2 -256 -121 -302 -350 -118 -133 -83 97 158 108 -95 -195 -312 -240 -246 -330 -194 -202 95 -194 -194 -296
1710b96J04J80l1K51k99RN4k58M29l03R0Q2J40l45J28k30N2K58J36J6M54p28K44
$$ -296 -192 -12 -43 208 -91 -82 -28 -286 143 -160 -70 12 152 -193 -65 -295 -243 15 151 167 621 -107 137
1733A37l09J83l25N10j4k9Njk46J00j5n5M74k33Ol04M61p50J72j12Q83o87K63
$$ 137 -172 11 -314 196 182 153 158 157 -89 11 -4 -59 415 182 188 -116 345 -405 -233 -345 538 -149 114
1756A14n8Q9J78m32J36j61k89O55k79p0K3j82n4Kq7J10K37n06J244q79k95N75
$$ 114 56 145 323 -109 27 -134 -423 232 -47 -117 -94 -276 -330 -328 -415 -305 -68 -574 670 -209 -504 71
1778G1q9K30o01J45k01R4l45Q18o81K03M00N1j11J85k60q3J78j35k53M01p81M31
$$ 71 -18 212 -389 -244 -445 -351 -696 122 -559 -356 44 95 -16 169 -91 -174 4 -131 -384 17 -764 -333
1800c33j3j63N20n82Q99r44O81k4m11L34l08L77k27l77J83L42R2l18O46m93N4
$$ -333 -346 -509 11 -571 328 -616 65 41 -370 -36 -344 33 -194 -571 -388 -46 46 -272 374 -119 -65
1821f5o3O18n92K42N7O39j065M54K40o66K28M43J76j36j99k09l59K75L27J5N2
$$ -65 -128 490 -102 140 197 836 -229 225 465 -201 27 470 646 510 311 102 -257 18 345 360 412
1842D12l23m6L83p39L25k85Q37l99K55k83J85k70q7K01l36N31L38o67j005J621
$$ 412 89 43 426 -313 12 -273 564 165 420 137 322 52 -35 166 -170 361 699 32 -973 648
1862F48o59p69R69m43n94M91O1o65Q73j34q30P30M49P48q04Q53j135q45N85j18
$$ 648 -11 -780 189 -254 -848 -357 -296 -961 -88 -222 -1052 -322 127 875 71 924 -211 -1056 -471 -589
1882e89L70M77m50q7L90jp52l35J213r25L8P46j63Q2O02o68O5l14l25O29k25P92
$$ -589 -219 258 -192 -279 111 110 -642 -977 236 -689 -651 95 -68 14 616 -52 13 -301 -626 3 -222 570
1904E70j12l0k71k92M8L9k02j8J25L58M9p62M12P40k91J81m26K86j70K22l30n55
$$ 570 458 428 157 -135 -87 -48 -250 -268 -143 215 264 -498 -86 654 363 544 118 404 234 456 126 -429
1926d29M12l0O26p72M97Rk11k01j41k27j5K74O32l30j66j47O06On14m10O60l79
$$ -429 -17 -47 579 -193 304 313 102 -99 -240 -467 -482 -208 424 94 -72 -219 387 393 -121 -531 129 -250
1948b50J59k18K34q54J75J142o22L16k41L51j21l3q90J127r66M39m65l05O91M10
$$ -250 -91 -309 -75 -929 -754 388 -234 82 -159 192 71 38 -852 275 -691 -252 -717 -1022 -331 79
1968G9o57J75l8K34J1R9j06n73J62J67N35q6o59L42K22L26p39m19O53K96j87n31
$$ 79 -578 -403 -441 -207 -196 -97 -203 -776 -614 -447 88 2 -657 -315 -93 233 -506 -925 -272 24 -163 -694
1990f94L29M63k88k56M40k32K42k73M39l03M47p37O45N3K38m68M78j15l83K63
$$ -694 -365 98 -190 -446 -6 -238 4 -269 170 -133 314 -423 222 275 513 45 523 408 25 288
2010B88L6k39k3K59k39j62J97n71P01q32Q16J56k0m98k25K08K4L93J0O5J30L22
$$ 288 324 85 62 321 82 -80 117 -454 247 -585 231 387 367 -131 -356 -148 -124 269 279 344 474 796
2032G96q73J57k77O55j392J049J5J68m7p51P31J20j10p41P9Q18K38r52K70l50
$$ 796 -77 80 -197 458 -934 115 130 298 251 -500 231 351 241 -500 -421 397 635 -317 -47 -397
2052c97j3K5R47m60J38q6q71N71j40m50K59N1J148o96l9M48m57l19n2J23M36k64
$$ -397 -410 -385 562 102 240 154 -717 -146 -286 -736 -477 -426 722 26 -13 435 -22 -341 -393 -270 166 -98
2074i8N71n9l85o1J01j50R8K27J78k18k72N1J10O8q1O8L3k19L39m10L97p7O7j05
$$ -98 473 414 29 -32 69 -81 17 244 422 204 -68 -17 93 161 80 148 181 -38 301 -109 288 211 278 173
2098A73M39j51P3p86J96O93r18O34l43N5m77K58L26j51K41k34j15J83p7R7M6O3
$$ 173 612 461 534 -252 -56 637 -281 353 10 65 -412 -154 172 21 262 28 -87 96 19 116 162 225
2120B25L4l88J4J25K6k3J81q3r0k69J74p1j24M08q9l4k61L46m82K41K01m47J61
$$ 225 259 -129 -115 10 36 13 194 111 21 -248 -74 -145 -269 139 50 16 -245 101 -381 -140 61 -386 -225
2143b25J72j48k7N9k37K20J87n0M5q8J77k16j34K52r7J04K0k01N14k04m17J3L0
$$ -225 -53 -201 -228 -169 -406 -186 1 -49 -4 -92 85 -131 -265 -13 -110 -6 14 -187 327 123 -294 -281 -251
2166b51J9L3K92j09L74k86k18O60j23l08l08L69j16l93M44r23R19N58o10J79J142
$$ -251 -232 -199 93 -16 358 72 -146 514 391 83 -225 144 28 -365 79 -844 75 633 23 202 1344
2187A344r76p04P72n36L40L02j0J13o00Q56l28m63K2j45n5J97m3N1J08j05j72
$$ 1344 368 -336 436 -100 240 542 532 645 45 901 573 110 132 -13 -68 129 86 137 245 140 -32
2208c2J09l96K70LL23j35j92R1l06K78J02l90L48J25l53J07j77J39N1K15k46j53
$$ -32 77 -319 -49 -46 277 142 -50 41 -265 13 115 -275 73 198 -155 -48 -225 -86 -35 180 -66 -219
2230b19J97r8j6p7j0j07O3O58k50j94M83j86p4l77N7k44o93J262M30l74k28K3
$$ -219 -22 -120 -136 -213 -223 -330 -267 391 141 -53 430 244 170 -207 -150 -394 -1087 175 605 231 3 26
2252B6n22N76o5J04J7k21J81O8j63J62k88N5L04k99L34j24k57K46k51J61K25N8
$$ 26 -496 80 15 119 136 -85 96 164 1 163 -125 -70 234 -65 269 145 -112 134 -117 44 269 327
2274C27j83L1m93L74rl5j23N40n2k56N4j43j71j45N95k52L14q5mk23j01L2M01
$$ 327 144 175 -318 56 47 12 -111 429 377 121 175 32 -139 -284 311 59 373 288 284 61 -40 -8 393
2297C93l10N1J55p05N0P53j72M83r43R61o14ON34j048O03o8K55l86l43O95j440
$$ 393 83 134 289 -416 -366 387 215 698 -245 716 102 108 642 -406 197 129 384 -2 -345 350 -1090
2318a090J026Q02r71M70o76M12K3p8K43J96m83N4j74m6qo2M46l43N1J90J59n15
$$ -1090 -64 738 -233 237 -439 -27 -4 -82 161 357 -126 -72 -246 -292 -300 -362 84 -259 -208 -18 141 -374
2340c74P61l34J59k01j44l47O82l12J22j58J95NP0k64n1M03k84M77p38L37J24
$$ -374 387 53 212 11 -133 -480 202 -110 12 -146 49 54 124 -140 -191 212 -72 405 -333 4 128
2361A28j87K20l40lN22k85L33p9M4j55o01L93M36k55n81N79QL26n33k6j11L77
$$ 128 -59 161 -179 -182 340 55 388 309 353 198 -403 -10 426 171 -410 169 177 503 -30 -56 -167 210
2383B10k09P65o34l45K35k54O12k14l88N38l48O77l07j69l35k3J23j28k7J9k3
$$ 210 1 766 132 -213 22 -232 380 166 -222 316 -32 645 338 169 -166 -189 -66 -194 -221 -202 -225
2404b25N90m24K13k62j50M28k99M24k35J29l54j0Q1M05l41r8M8l09J97j12J42
$$ -225 365 -59 154 -108 -258 170 -129 295 60 189 -165 -175 -94 311 -30 -128 -80 -389 -192 -304 -162
2425a62k28K73L5N97J20n84L75n01k92N78m40J017o38N20m52r1j329J254q3l6
$$ -162 -390 -117 -82 515 635 51 426 -75 -367 211 -229 788 150 670 218 127 -1202 52 -31 -67
2445f7O06j44m39m85M99R74p10l61P95n37k80J160l38n93N88k68J317j271L88
$$ -67 539 395 -44 -529 -30 944 234 -127 668 131 -149 1011 673 80 668 400 1717 446 834
2464H34n61k48m80L94k42J83Q31m0k00k31j73n28L51N81l02P9N33j992J438o52
$$ 834 273 25 -455 -61 -303 -120 711 671 471 240 67 -461 -110 471 169 248 781 -1211 227 -425
2484d25N77j37j93L73k89K16K90o94J69N87m45M10k33j86j66N05l70j05Ok73K21
$$ -425 152 15 -178 195 -94 122 412 -282 -113 474 29 439 206 20 -146 359 -11 -116 -110 -383 -162
2505a62J21O4q1q7k93N06r15M94J32M25l39n0l1J52K12n68j27N59O77q1o82N00
$$ -162 -41 23 -58 -145 -438 68 -847 -353 -221 204 -135 -185 -216 -64 148 -420 -547 12 689 608 -74 426
2527D26p10L41K36m39Q7K60L62q54L76k33L65%n8m97M6L75O1l53M82n49L98k9
$$ 426 -284 57 293 -146 -59 201 563 -291 85 -148 217 217 159 -338 -292 83 144 -209 273 -276 122 93
2549I3l6L5l28L24K7Q1l10M31m04J42L03K20l29M3m17J23L43j73k83J72j26J26
$$ 93 57 92 -236 88 115 196 -114 317 -87 55 358 578 249 292 -125 -2 341 168 -115 57 -69 57
2571E7m8r7J74Q5k86L29l24nJ21P1J82k53J26l40J01k2J51o1k55M70k97j57N07
$$ 57 9 -88 86 171 -115 214 -110 -115 6 77 259 6 132 -208 -107 -129 22 -39 -294 176 -121 -278 229
2594B29k59J9m5p0o3K82R4N1o7k40l7j42L01m1k37J67P7qM8j46L8P8M8J61j36
$$ 229 -30 -11 -56 -126 -189 93 187 238 171 -69 -106 -248 53 12 -225 -58 19 11 59 -87 -49 29 77 238 102
2619A02n5l7J14k22J53J98M6l4k52l3K9O6k9J18K1j0L11k05r7j13K9j39J48j0
$$ 102 47 10 124 -98 55 253 299 265 13 -20 9 75 46 164 185 175 486 281 184 71 100 -39 109 99
2643I9p6J9J81j70j50L33k86K30k40J98O1j63K4j44K22j30J95j99k18K6K07O1
$$ 99 23 42 223 53 -97 236 -50 180 -60 138 199 36 60 -84 138 8 203 4 -214 -188 19 80
2665H0m09P8K28J66k32O8l6P5k05J45j31K15j1Q1j08k26K02j4q2j36R2Q9j00Q2
$$ 80 -329 -251 -23 143 -89 -21 -57 18 -187 -42 -173 42 31 112 4 -222 -20 -34 -116 -252 -160 -71 -171 -89
2689h9j0o7Q2j77J96L72k48j2m4Q2r7j0q5J60l78K10K93j83K5j48J83m5K76j36
$$ -89 -99 -166 -84 -261 -65 307 59 47 3 85 -12 -22 -107 53 -325 -115 178 -5 20 -128 55 10 286 150
2713A50q3p1L51k76j28Q7j4K18r7oJ29j70K49j39q2j7P9J16j92J97k9j12k6j43
$$ 150 67 -4 347 71 -57 30 16 234 137 131 260 90 339 200 118 101 180 296 104 301 272 160 134 -9
2737i%J80N2J24k06j26J26l21K71j97M12j49k90J21O5j80MJ21K33j43kn5j53J68
$$ -9 -9 171 223 347 141 15 141 -180 91 -106 306 157 -133 -12 53 -127 -123 -2 231 88 86 31 -122 46
2761D6J81m35P0K33O2j01m6j54r8ln9L85l89M06J03k28J46m66L73o4J7O3j33K24
$$ 46 227 -208 -138 95 157 56 10 -144 -242 -245 -304 81 -308 98 201 -27 119 -347 26 -38 -21 42 -91 133
2785A33k55k1l3L31j32j70O3j79O1j14L21r2M10k77K92m13J01J87m95M33l47J83
$$ 133 -122 -143 -176 155 23 -147 -84 -263 -202 -316 5 -87 323 46 338 -75 26 213 -282 151 -196 -13
2807a3k13L60M6k80N5K09o3O8j10l1j29N1J67k51K65J00k54K1j8J05rNl7o6L2
$$ -13 -226 134 180 -100 -45 164 101 169 59 28 -101 -50 117 -134 131 231 -23 -2 -20 85 76 81 44 -22 10
2832A0L60j1o93L27l06M12o1k00R8M03m97M03k7j54J67k00j93L77j94R0K31n1
$$ 10 370 359 -334 -7 -313 99 38 -162 -64 339 -158 245 218 64 231 31 -162 215 21 111 342 291
2854B91n16N85o76M95O5o3n6r3j0Q6l32j35R67m84m1N1k93L95j65l85K81k14M65
$$ 291 -225 360 -316 179 244 181 125 32 22 108 -224 -359 608 124 83 134 -159 236 71 -314 -33 -247 218
2877B18k01M1l69Q4L15K00p09J76Q6L7K56qn91N65o20M51P6l49K28K98k07L03
$$ 218 17 58 -311 -227 88 288 -421 -245 -159 -122 134 126 -465 100 -520 -69 7 -342 -114 184 -23 280
2899B80k78n7J86J16M6k07K44k82J35j09M04l54k16L22p0j52P5k01Q6J65j18Q7
$$ 280 2 -55 131 247 293 86 330 48 183 74 478 124 -92 230 160 8 83 -118 -32 133 15 102
2921A02q5N9mk82P9P8j35L7K35j35j97L51k34K91M2j77j37j0J08R1r8r4O8K5M3
$$ 102 17 76 72 -210 -131 -53 -188 -151 84 -51 -248 103 -131 160 202 25 -112 -122 -14 77 -21 -115 -47 -22 21
2946B1p4j08q2L47j5l30M07j50k0k22J97k89J65K18k03j43J27r1M54N30q76N6
$$ 21 -53 -161 -243 104 89 -241 166 16 -4 -226 -29 -318 -153 65 -138 -281 -154 -245 209 739 -137 -81
2968h1P9J06kl66l52K38L43N15k97m5J89K25l82k15l28K89k53N59j09O6l15J061
$$ -81 -2 104 102 -264 -616 -378 -35 480 183 138 327 552 170 -45 -373 -84 -337 222 113 179 -136 925
2990I25j195l61r4P67j1O3k16K86K84o5r90J678o49l29r3Q7P91j067R88o17O6
$$ 925 -270 -631 -725 42 31 94 -122 164 448 383 -607 1071 422 93 0 87 878 -189 799 182 248
3011B48j010r2O13m18R28j49m99O96l20m9j29K80p99k2J103p8p1P9K06o1K23p72
$$ 248 -762 -854 -241 -659 269 120 -379 317 -3 -52 -181 99 -700 -722 381 303 232 311 517 456 679 -93
3033i3l72K8L77L48p16M75M30n31O75m93M74j281Q19k27J68K8j77o5K99l5j70
$$ -93 -465 -437 -60 288 -428 47 477 -54 621 128 602 -679 140 -87 81 109 -68 -133 166 131 -39
3054c9J21P2K13K05M47p06j72M4k82M68l94n94J278j86p56J018n64n04L75K01
$$ -39 82 154 367 572 1019 313 141 185 -97 371 -23 -617 661 475 -281 737 173 -331 44 245
3074B45Q4m75K90N5q4J88j39k71n2N55J86j59n55L5N89k71o79M04M5M88l34m36
$$ 245 329 -146 144 199 115 303 164 -107 -159 396 582 423 -132 -97 492 221 -458 -54 -9 479 145 -291
3096b91L37m47N36M6j78k1m5J71l16K57m61L69R6J18K06o83O18j61j73J74l22
$$ -291 46 -401 135 181 3 -18 -63 108 -208 49 -412 -43 53 171 377 -306 312 151 -22 152 -170
3117a70K71J28r98Q21j17O42m52l05l6k01L76j55M54n4l7J06n42Q22p78L15o60
$$ -170 101 229 -769 52 -65 577 125 -180 -216 -417 -41 -196 258 204 167 273 -269 553 -225 90 -570
3138e70P57q3p19M21K70K40p89N45L11n20M32l94K82l98M16R6N33j003N13m51
$$ -570 187 104 -615 -194 76 316 -473 72 383 -137 295 -99 183 -215 201 297 830 -173 340 -111
3158a11J28Q7j09M0P4j77J63o3j9P82j111P37j46lk95RL5j6K30k48l57Q09n73
$$ -111 17 104 -5 35 109 -68 95 32 13 795 -316 421 275 272 -23 -14 21 5 235 -13 -370 439 -134
3181a34l24Q66p88M90l21K43J5N46o09k6j26L94o51Q45k46J1j58M2j2j5m59M14
$$ -134 -458 408 -380 110 -211 32 47 593 -16 -42 -168 226 -425 420 174 185 27 69 57 42 -417 -3
3203cP1N2J92m54K57j16j71M5o8J5K31o2L37o5o08L91r5N58l73K6l26K45k49M3
$$ -3 68 120 312 -142 115 -1 -172 -127 -195 -180 51 -11 326 261 -347 44 -51 507 134 160 -166 79 -170 -127
3227a27K04k95Q6O5j92k19N24j09J59j01k96M51Qn80P27o17lj23M27l99N15J0
$$ -127 77 -218 -132 -67 -259 -478 46 -63 96 -5 -301 150 158 -422 305 -312 -315 -438 -11 -410 105 115
3249A15n03j02N27Q39p87j31J12L1l71M05r20P67k33m8L04n4JK69m65J06q4J3
$$ 115 -388 -490 37 876 89 -42 70 101 -270 135 -785 -18 -251 -299 5 -49 -48 221 -244 -138 -222 -209
3271b09K41k05J32j4R2j00J80k81J83m8K58l8l93N2K21N5j3k47J20j3j26J46J67
$$ -209 32 -173 -41 -55 37 -63 117 -164 19 -29 229 191 -202 -150 71 126 113 -134 -14 -27 -153 -7 160
3294A60J8m57M28r1j06J47n6k00J01K98k36q30M92Q13O70j671R33o54j95O79o29
$$ 160 178 -279 149 58 -48 99 43 -157 -56 242 6 -824 -332 481 1151 -520 413 -241 -436 243 -386
3315c86Q09r14J36R88p18J8N9L28m20P00n32m42P14k74j66M5m02N57n81P75k92
$$ -386 423 -491 -355 633 -85 -67 -8 320 -100 600 68 -374 340 66 -100 -55 -457 100 -481 294 2
3336BJ81M6O1r6K34j50j00j89K29O08j186K79r2K9M93k06J23k98l35L75l54J255
$$ 2 183 229 290 194 428 278 178 -11 218 826 -360 -81 -173 -144 349 143 266 -32 -367 8 -346 909
3358I09o06j55L00n73R39j344M19o65N10kM69k95J6P6R5o82O99k86K80R9L15J57
$$ 909 303 148 448 -125 814 -530 -111 -776 -266 -268 201 -94 -78 -2 93 -589 110 -176 104 203 518 675
3380F75l24o33L94Q8J02J77l06j24p73N49Q2j79j23M43M76k27q18J070p31M15
$$ 675 351 -282 112 200 302 479 173 49 -724 -175 -93 -272 -395 48 524 297 -521 549 -182 233
3400B33q46M59k67J46R05q97L8J5M5M13L22m31r83J027km16L13m61L91k0P38j312
$$ 233 -613 -154 -421 -275 630 -267 -229 -214 -169 244 566 135 -848 179 177 -239 74 -387 4 -16 722 -590
3422e90J416j145K68n8J422q41J38j10n87M65q05O06m47M69k28Q00r58O3n23N07
$$ -590 826 -319 -51 -109 1313 472 610 500 -87 378 -427 179 -268 201 -27 773 -185 -122 -645 -138
3442a38l17N17k24j5R29l51k93lp53P68m22J044j175J1N51j06M30q11p31J265
$$ -138 -455 62 -162 -177 752 401 108 105 -648 120 -302 742 -433 -422 129 23 453 -358 -1089 176
3462A76O7l17J75j48k26J64j9j64K89L81r22L20j44N29L49q04l0j4K34M83j128
$$ 176 243 -74 101 -47 -273 -109 -128 -292 -3 378 -544 -224 -368 161 510 -294 -324 -338 -104 379 -749
3483g49P44J54K3j07n72N60J68k35l39q24J391k6n99l6Q26k35J2k77k3l57J04
$$ -749 -5 149 172 65 -507 53 221 -14 -353 -1177 214 188 -411 -447 379 144 156 -121 -144 -501 -397
3504c97o3l5J155k85L5L38r95o81J131J018m87j88k96q13l94J021Q8J06q86j45
$$ -397 -460 -495 660 375 410 748 -247 -928 203 1221 734 546 250 -563 -957 64 152 258 -628 -773
3524g73J600o28l52J0L48j306J185l69K34J47q56M18K77J170j677R05J19L11k071
$$ -773 827 199 -153 -143 205 -1101 84 -285 -51 96 -760 -342 -65 1105 -572 333 452 763 -1308
3543a308l45J299n00P96q32P91j374J838n63P51j762J701j688J586k67r5k47m02
$$ -1308 -1653 -354 -854 -58 -890 -99 -1473 365 -198 553 -1209 492 -1196 390 123 28 -219 -621
3561f21n2L16N35l22K67j242J536O68j339L70k57p90J790j392N31n16M79l69R82
$$ -621 -673 -357 178 -144 123 -1119 417 1085 -254 116 -141 -931 859 -533 -2 -518 -39 -408 574
3580E74q82L8K27L66q31M1L77J57K96r46O56L33m93L9M77j67j77lRk04n34N78
$$ 574 -308 -270 -43 323 -508 -467 -90 67 363 -583 73 406 -87 -48 429 262 85 82 91 -113 -647 -69
3602f9M82q47M6N4J94L22O9m65J43J10M8j31R1nM21n54K7J36K73n21l1J98q6K01
$$ -69 413 -434 -388 -334 -140 182 251 -214 -71 39 87 -44 47 42 463 -91 -64 72 345 -176 -207 -9 -95 106
3626A06K27R8p58O27l66K12N10p04J06k87R9j12K5K06M21o75M08k9N67p45j76
$$ 106 333 431 -327 300 -66 146 656 -48 58 -229 -130 -242 -217 -11 410 -265 143 114 681 -64 -240
3647b40J52l3J90k55M59j70L08l72M14m88P67k24j440J341k00j48o3j91J30K36
$$ -240 -88 -121 69 -186 273 103 411 39 453 -35 732 508 -932 409 209 61 -2 -193 -63 173
3667A73k31QL20l84j16P78n75j59Q8L50L95O2m90m14J46J44m72L19K59Mm66P16
$$ 173 -58 -50 270 -114 -230 548 -27 -186 -98 252 647 709 219 -195 -49 95 -377 -58 201 205 -261 455
3689D55p29R9K90O2l57k62M43O25j72l19j20L56m0o23K72k11j1L24O1l10M67o41
$$ 455 -274 -175 115 177 -180 -442 1 626 454 135 15 371 331 -292 -20 -231 -242 82 143 -167 300 -341
3711c41J57K5J45N46J56m11o18J08N33m93N67J40j177J191Mo1p50q4J019l98N8
$$ -341 -184 -159 -14 532 688 277 -341 -233 300 -193 374 514 -663 528 532 471 -279 -363 656 258 316
3732C16o82pN98n0m38L54l36M07o00L83p6O3J0j3J53l5P9j26rj3j78J58J66m61
$$ 316 -366 -373 225 175 -263 91 -245 162 -438 -55 -131 -68 -58 -71 82 47 126 0 -9 -22 -200 -42 124 -337
3756c37N00l83J44L3k40R9L34k02J12k16P4o0J97J7j14j19o9J31J12j42Q3j00
$$ -337 163 -220 -76 -43 -283 -184 150 -52 60 -156 -82 -142 55 72 -42 -161 -230 -99 13 -129 -46 -146
3778a46J31J4j7J5l2K09l22J57j35K72j04j12j8J8L3o0L37n3k53Pj45R7j58N33
$$ -146 -15 -1 -18 -3 -35 174 -148 9 -126 146 42 -70 -88 -70 -37 -97 240 187 -66 -59 -204 -107 -265 268
3802B68k27N1k21P2R8j88L49k13l2M96n01K89k08k14P8l9M40j65q7J28k52M74
$$ 268 41 92 -129 -57 41 -147 202 -11 -43 453 -48 241 33 -181 -103 -142 298 133 46 174 -78 396
3824C96l38m09M05P3M6l56j23K68M43o58M95l76K95q26K13k62N81L59k44j97K88
$$ 396 58 -351 54 127 173 -183 -306 -38 405 -253 242 -134 161 -665 -452 -714 -133 226 -18 -215 73
3845G3m72N3K96mO1K4oL4n1k3J30J1jk01r0L5J87j43K30N6j60j80RK55j79K71
$$ 73 -399 -346 -50 -54 7 31 25 59 8 -15 115 126 125 -76 -166 -131 56 -87 143 199 39 -141 -132 123 -56 215
3871B15k67p1K37k96K64j80J71J43k52j30J32Q9k08L07l43M08m1k52m9J79Q3N5
$$ 215 -52 -123 114 -182 82 -98 73 216 -36 -166 -34 55 -153 154 -189 219 178 -74 -123 56 139 194
3893A94k77K57l28J67m7J23p2k28K11J9k42R0J28p9j3K5j50K4M69k11Mk85J71
$$ 194 -83 174 -154 13 -34 89 17 -211 0 19 -223 -133 -5 -84 -97 -72 -222 -198 271 60 64 -221 -50
3916e0j9J9K74k80J78j90K36M1k75J9q4j64L30K1k46K16jk12J75Pl7k6m9N3J64
$$ -50 -69 -50 224 -56 122 -68 168 209 -66 -47 -131 -295 35 56 -190 26 25 -187 -12 -5 -42 -68 -117 -64 100
3941A00n1mjJ45L2k70K90j93Oj96J56n3r8J33j51J83j14m6K0K26j02j38l9K00
$$ 100 49 45 44 189 221 -49 241 48 54 -142 14 -39 -137 -4 -155 28 -86 -132 -112 114 12 -126 -165 35
3965C5mj76K87j32j86k0J84l75L56p1Q5k6Q6j75P1J20Ml4k6r6J2K7J83P3k70j
$$ 35 31 -145 142 10 -176 -196 -12 -387 -31 -102 -17 -43 43 -132 -61 59 63 29 3 -93 -81 -54 129 202 -68 -69
3991f9k8K24k66L1R6J90j80q4J07l19N06p9R3l01P7j62o3K10J32o0k81K45j15
$$ -69 -97 127 -139 -108 -12 178 -2 -86 21 -298 208 129 222 -79 -2 -164 -227 -17 115 55 -226 19 -96
4014i6J98m63N12r7R7j93j3J02K9r8K54m15R6o4L32m11j67J60M90k71k7PJ09p0
$$ -96 102 -361 151 54 151 -42 -55 47 76 -22 232 -183 -87 -151 181 -230 -397 -237 253 -18 -45 -38 71 1
4038AR9l70P00o98J46J12o8J0Pk63Q5N41n2k54j34L21l33J77K1m9N2l24M00l55
$$ 1 100 -270 430 -268 -122 -10 -78 -68 -61 -324 -239 302 250 -4 -138 183 -150 27 48 -1 51 -273 127 -228
4062b28K19m2j70K46k15L45q5j10K94j67j9j30K22N4k36J19o5j9M9j17K77m37
$$ -228 -9 -51 -221 25 -190 155 70 -40 254 87 68 -62 160 214 -22 97 32 13 62 -55 222 -215
4084b15J99r3K22on3k7%RJ10qq0P2j34j54L50l28J79j19J10m3M5l0j35J86m3J92
$$ -215 -16 -109 113 107 54 27 27 36 146 138 58 130 -4 -158 192 -136 43 -76 34 -9 36 6 -129 57 14 206
4110B06n5j79j30L1J09R9K87j25k30q8J11J00k17k04K37K9Nj34J31LJ02k6L1m3
$$ 206 151 -28 -158 -127 -18 81 368 243 13 -75 36 136 -81 -285 -48 -19 -14 -148 -17 -14 88 62 93 50
4134E0j41J83J35P0n1l18k2o2m0L41k52K68j48j7j63L6O2n3j3R4J55l7j72J00
$$ 50 -91 92 227 297 246 -72 -94 -156 -196 145 -107 161 13 -4 -167 -131 -69 -122 -135 -41 114 77 -95 5
4158EK4Jq1J38j90O8l35L33j60K63O7k00J73j95J71k02J40K41j49r6P7o2k68K01
$$ 5 29 30 -51 87 -103 -35 -370 -37 -197 66 133 -67 106 -89 82 -120 20 261 112 16 93 31 -237 -36
4182c6N1L0N6n9j9K09l46L94j51j03j30K99J16m00J71N1k67p4j09L86o03L04J43
$$ -36 15 45 101 42 23 232 -114 280 129 26 -104 195 311 -89 82 133 -134 -208 -317 69 -534 -230 -87
4205h7n5J10l76L09j82N20l37K56k01J70q1j69L07k79M1J05j08J88k08j01R6P2
$$ -87 -142 -32 -408 -99 -281 239 -98 158 -43 127 46 -123 184 -95 -54 51 -57 131 -77 -178 -82 -10
4227a0J72k19O3j97J62k14M25m32J70K36l29J11L25m58K98m8J37j39J60k98L67
$$ -10 162 -57 6 -191 -29 -243 182 -250 -80 156 -173 -62 263 -195 103 55 192 53 213 -85 282
4248B82l77j54M77l76K87j66O7j39J92j4J96l39J84Q7j52J71k94J79K8J26l80
$$ 282 -95 -249 228 -148 139 -27 40 -99 93 79 275 -64 120 207 55 226 -68 111 139 265 -115
4269a15K62j25j33l8L40J07k92j92L40J30j42n09J3M81k72P5Q9k87K88J8N30p72
$$ -115 147 22 -111 -149 191 298 6 -186 154 284 142 -367 -354 127 -145 -70 19 -268 20 38 568 -204
4291b04J59J73r4L57j02ql83M61J61m47k58J33kj522P31K48J360o70k64M06m8
$$ -204 -45 128 34 391 289 281 -102 359 520 73 -185 -52 -54 -1576 -845 -597 763 93 -171 235 187
4312A87j24m40N78n24M18k37L92k01Q01j148L67J94r38M92L02n50P72j50l47N82
$$ 187 63 -377 201 -323 95 -142 250 49 850 -298 69 263 -675 -183 119 -431 341 191 -156 426
4332D26M37q62o8j083J272M14p24K65O82p98k75L96L28J52K85k55J60j1l27m91
$$ 426 863 1 -67 -1150 122 536 -188 77 759 -39 -314 82 410 562 847 592 752 741 414 -77
4352g7l79Q06K38j09o86R1j51M01m3P61k285J192j63J360p1j096J135m09N22l54
$$ -77 -456 350 588 479 -207 -116 -267 134 91 852 -1433 -241 -404 956 885 -211 924 515 1037 683
4372F83k11j059M03N71r51O93k34K75m73Q00j62N68j042K39l94m70J60K93q5R30
$$ 683 472 -587 -184 387 -564 129 -105 170 -303 497 335 903 -139 100 -294 -764 -604 -311 -396 534
4392E34l83j92k29N9M72l46M55j31o29J334q56o1M20j85j74p15l08J438l29r35
$$ 534 151 -41 -270 -211 261 -85 370 239 -390 944 88 27 447 262 88 -627 -935 503 174 -761
4412g61J557p26l84M27r66J328p76j11m7J188j18j440Q52n40p6q4J57P33k44m58
$$ -761 796 70 -314 113 -853 475 -301 -412 -459 729 611 -829 23 -517 -593 -677 -520 213 -31 -489
4432d89Q69j598K30J237Q26l63K4r35j60l16R65j355J023l19R16j088M95j27M94
$$ -489 380 -1218 -988 249 1075 712 736 -199 -359 -675 290 -1065 -42 -361 555 -533 -38 -165 329
4451C29o8r39R53o90M62O75j504l22K025m30M43k79m63l22L62J22n51N61l09j60
$$ 329 261 -678 275 -415 47 722 -782 -1104 921 491 934 655 192 -130 232 354 -197 364 55 -105
4471a05j151J766L64p56J165j988Q56R59j064J67k87m36j79O4J019M79p30J12
$$ -105 -1256 510 874 118 1283 -705 151 1110 46 213 -74 -510 -689 -625 394 873 143 255
4489B55j391L80J280p8Q03n89k08Q6j073j16r48K069k28Q33K2j77j340k24m50
$$ 255 -1136 -756 524 446 1249 660 452 538 -535 -651 -1599 470 242 1075 1097 920 -420 -644 -1094
4508a094K231n00q64N5K35J623k191q82L09J581j346P02K10j11K0J342p22N09
$$ -1094 1137 637 -227 -172 63 1686 -505 -1387 -1078 503 -843 -141 69 -42 -22 1320 598 1107
4526A107j478P04N0k0l56R84k011R01K37N45J30k48j445J098k03J65K54q0j360
$$ 1107 -371 333 383 363 7 991 -1020 -119 118 663 793 545 -900 198 -5 160 414 334 -1026
4545a026N57L02L2J42j44l42k69J150l47l54k03J062J06m04L8j049R54j052J314
$$ -1026 -469 -167 -135 7 -137 -479 -748 402 55 -299 -502 560 666 262 300 -749 205 -847 467
4564D67q70O71N5k79K75q81R53K74o84n2o3p59Q57L4k24K09Q12j299O44l35O36
$$ 467 -403 268 323 44 319 -562 391 665 -19 -71 -134 -893 -36 -2 -226 -17 795 -504 140 -195 441
4585D41J26m06J11j43q09M23l39J518j301k26M52J77j034J754j660J667j2q67
$$ 441 567 161 272 129 -680 -257 -596 922 -379 -605 -153 24 -1010 744 -916 751 739 -128
4603a28L56l84L96p44J2j10K12J594j400O4k74J032n96n72L58k15R97o07R1n61
$$ -128 228 -156 240 -504 -492 -602 -390 1204 -196 -132 -406 626 30 -542 -184 -399 598 -9 82 -479
4623d79K09J002j526l4R6j69N88R46j361k30M19J297m04K27R61j208m74n2J194
$$ -479 -270 732 -794 -828 -732 -901 -313 633 -728 -958 -539 758 354 581 1542 334 -140 -192 1002
4642A002j121J961j675M74j138N73m80L83j91o21K34J064P04m83J357k519J913
$$ 1002 -119 1842 167 641 -497 76 -404 -21 -212 -833 -599 465 1169 686 2043 -476 1437
4659A437j519j06K027r07j99p02n22J462j076j4K2R51j740J487j236K88K016j347
$$ 1437 -82 -188 1839 932 733 31 -491 971 -105 -119 -97 854 -886 601 -635 -347 1669 322
4677C22k64P18j082K77Q61j043J80l27P79r83J370j229k23J306J51j792J580k371
$$ 322 58 776 -306 -29 832 -211 -31 -358 421 -562 808 -421 -644 662 813 -979 601 -1770
4695a770K534n85j295J669K96j305L00N93P86m40p30o38M36R21j196L3L04M26
$$ -1770 764 179 -1116 553 849 -456 -156 437 1223 783 53 -585 -149 772 -424 -391 -87 339
4713C39R2j70k99L03m59J54p2Q4n91N6J225q99n40J447K41p14J7k25J28r70J889
$$ 339 431 261 -38 265 -194 -40 -112 -28 -619 -563 662 -237 -777 670 911 197 214 -11 117 -853 1036
4734A036r61M73q19n30L44P07m58m41J537j648K23J559k560K576k777J769J16
$$ 1036 75 548 -271 -801 -457 250 -208 -649 888 -760 -537 1022 -1538 1038 -1739 30 146
4751A46R38j018k71J2j98J09n55J405m48L07j728K089j141K46m26Q29L00l27J71
$$ 146 1084 66 -205 -193 -391 -282 -837 568 120 427 -1301 788 -353 -107 -533 296 596 269 440
4770D40j098P53O97j076k08M48P16q59k26P16j09J08L85p11K81m97J90l10J80
$$ 440 -658 95 792 -284 -492 -44 672 -187 -413 303 194 302 687 -24 257 -240 -50 -360 -180
4789a80O79l05j26j88L14J2k99l39J48M86k7L81o03j02k30L52J76Q38p62m75O10
$$ -180 499 194 68 -120 194 206 -93 -432 -284 202 175 556 -47 -149 -379 -27 149 987 225 -250 360
4810C60m88J38n88R22j33J41q39P81k64l42m7O3k92J139q97R1Q43k20j66p8J59
$$ 360 -128 10 -578 344 211 352 -487 294 30 -312 -359 -296 -588 551 -346 -255 588 368 202 124 283
4831B83M93n74l47K08K6n94N09N7n1j89P2l71O23N93p15m04K40L9j21L90k83R1
$$ 283 776 202 -145 63 89 -505 4 61 10 -179 -107 -478 145 738 23 -381 -141 -102 -223 167 -116 -25
4853b5J36j10p5R4q1J85r8J61j52K98m15R9N65o31K89k82M3M6k44J87n75Q32o40
$$ -25 111 1 -74 20 -61 124 26 187 35 333 -82 17 582 -49 240 -42 1 47 -197 -10 -585 247 -393
4876c93K62Q27p96J91k48j01J22N07j16m09j52P36J37m50m4m20M27l96N25k36
$$ -393 -131 696 -100 91 -157 -258 -136 371 255 -154 -306 430 567 117 73 -347 80 -316 209 -27
4896b7P9l45Q66k10o0J22k75K0j33N50q91J103p78M39J0l99j5J3O5j45l25k94
$$ -27 52 -293 573 363 303 425 150 170 37 587 -304 799 21 460 470 71 56 69 134 -11 -336 -630
4918f30Q86k61m12Q03q07j86k21J369K4o64o8J1K76K60k96j89L96q5k10m9L36
$$ -630 256 -5 -417 386 -421 -607 -828 541 565 -99 -167 -156 120 380 84 -105 291 206 -4 -53 283
4939B83L20p24Q3J97L21l60n0rL63k24k47QK64j56O4j50L64n50L45l70M70j88
$$ 283 603 -121 -38 159 480 120 70 61 424 200 -47 -39 225 69 133 -17 347 -203 142 -228 242 54
4961E4J2K55k91J6k2m4k12J99m98O77M23o48j16P07m30j12k16O67o57P09m11J00
$$ 54 66 321 30 46 24 -20 -232 -33 -531 146 569 -79 -195 512 82 -30 -246 421 -236 473 62 162
4983A62q8K78p6j56p03n35J426k59l15L12L77K18j035J245r01L10p6j065J241
$$ 162 74 352 276 120 -583 -1118 308 49 -266 46 423 641 -394 851 -50 260 184 -881 360
5002C60o24K06n57O93O78l06j50p45Q79l79O30o82n49P10m3J54k13J6l36L80q8
$$ 360 -264 -58 -615 78 756 450 300 -445 434 55 685 3 -546 164 121 275 62 78 -258 122 34
5023C4j16M8O7J85k68J52l59M0K40q4K40j09N7k73L76j46l01L1j48J90K26k52
$$ 34 -82 -34 33 218 -50 102 -257 -217 23 -61 179 70 127 -146 230 84 -217 -186 -334 -144 82 -170
5045a70L0j05K81M9j74m4J15n6PK89m30K00J38l6jk08K13l53J81Lq1m8J94k07
$$ -170 -140 -245 36 85 -89 -133 -18 -74 -67 222 -208 -8 130 94 93 -115 98 -255 -74 -71 -152 -200 -6 -213
5069b13K85r0k11L19R1j68J50j80M0l71J70P1O4J81k85K14l31L01N8N1k57M2O0
$$ -213 72 -18 -229 90 181 13 163 -17 23 -348 -178 -107 -43 138 -147 67 -264 37 95 146 -111 -69 -9
5092ij09l1L2r7K5L46l38M09m41K14N9J2m8R3k52jJ81q0J94O8j74k24m8J73o0
$$ -9 -118 -149 -117 -214 -189 157 -181 228 -213 1 60 72 24 117 -135 -136 45 -35 159 227 53 -171 -219 -46 -106
5117a06P7j3k2j92K53Q6k22J83j95J87j74R8k7j25J77q6q5J26L14l47Q5M8k94
$$ -106 -29 -42 -64 -256 -3 83 -139 44 -151 36 -138 -40 -67 -192 -15 -101 -186 -60 254 -93 -8 40 -254
5140b54K82o8m5J17k38L88l33J05M3J30Q2m38K22j50l9K19j5K9o3J61k08p4L0
$$ -254 28 -40 -85 32 -206 182 -151 -46 -3 127 209 -229 -7 -157 -196 23 8 37 -26 135 -73 -147 -117
5163a17L3k2K5K10m21M35j34o7M2j84J35q1K46k48M88l32j59K4N6L04k20M9j34
$$ -117 -84 -106 -81 129 -292 143 9 -58 -16 -200 -65 -146 100 -148 340 8 -151 -127 -71 233 13 62 -72
5186g2J58j22J63O2j22oq2k5J68k28j25K10J13j2k62L59k33J46L9J08l44N3J68
$$ -72 86 -36 127 189 67 61 -21 -46 122 -106 -231 -21 92 80 -182 177 -56 90 129 237 -107 -54 114
5209A14j42L9j3m4MJ02J7j02q4J71j02%L82j60l12N2K55k17p8J76k0j2nJ09o7
$$ 114 -28 11 -2 -46 -42 60 77 -25 -109 62 -40 -40 342 182 -130 -78 177 -40 -118 58 38 26 21 130 63
5234F3l8M2q7M4L4j60J15R1k5j76K4M4N6j47L40j5j35o9J83j91Q8Q2k50K19k22
$$ 63 25 67 -20 24 58 -102 13 104 79 -97 -73 -29 27 -120 220 205 70 1 184 -7 81 163 -87 132 -90
5259i0J92M6j0k40k5J26r8j98N51j93m8K7J9j01J27j57J07K78l06k58R3L90L0
$$ -90 102 148 138 -102 -127 -1 -99 -297 254 61 13 40 59 -42 85 -72 35 313 7 -251 -158 232 262
5282B62m7o4l3Qj74nj73m5J42N5L0k74K92M4j58J39j10N7J04k2q5n7M7j82L83
$$ 262 215 151 118 126 -48 -53 -226 -271 -129 -74 -44 -318 -26 18 -140 -1 -111 -54 50 28 -57 -114 -67 -249 134
5307A34j79p6K95j48k4o6j67L25j29L2P2m8J14j47j41K16L0k52l2K22J11j74j46
$$ 134 -45 -121 174 26 2 -64 -231 94 -35 -3 69 21 135 -12 -153 63 93 -159 -191 31 142 -32 -178
5330a78K81k33O8J56K9l77J44J38j92K05M2k48K71k00K62mq2n1J03k08q3K00j9
$$ -178 103 -130 -62 94 123 -254 -110 28 -164 41 83 -165 106 -94 168 164 82 31 134 -74 -157 43 24
5353B4l2P9K0j6o6o9l3J33OK2j65K22l69J40J18j71NL0J11J38R4p3j79n0J9L20
$$ 24 -8 71 91 75 9 -60 -93 40 46 68 -97 125 -244 -104 14 -157 -152 -122 -11 127 221 148 -31 -81 -62 258
5379B58k55jj25J36K69k93J29l06J6P7m1R9L23k8l62k9J73j22K23L1k86R0M4P4
$$ 258 3 2 -123 13 282 -11 118 -188 -172 -95 -136 -37 286 258 -104 -133 40 -82 141 172 -114 -24 20 94
5403I4j78J8J23j46K57k31R5jj8l08L79l57K56j5K1m5J05J22k30N4k28K52O1o7
$$ 94 -84 -66 57 -89 168 -63 32 31 13 -295 84 -273 -17 -32 -11 -56 49 171 -59 -5 -233 19 80 13
5427A3oO3j73j6O7m8J84j94M60j45l01q8K48m8l16K24K57j57J44l13K48J3n6l1
$$ 13 7 70 -103 -119 -52 -100 84 -110 350 205 -96 -184 64 16 -300 -76 181 24 168 -145 103 116 60 29
5451B9J85k13qJ10r8J12k73J1K53L5l66M9j49O6K95M5k56j5P8K13k48O3K38k67
$$ 29 214 1 -7 103 5 117 -156 -145 108 143 -223 -174 -323 -257 38 83 -173 -188 -110 103 -145 -82 156 -111
5475a11K88j80p1J81J09k11j66J37J29k23k2K50j49K24r4r3j59J0K56k51J01p8
$$ -111 177 -3 -74 107 216 5 -161 -24 105 -118 -140 110 -39 185 91 -2 -161 -151 105 -146 -45 -123
5497a23K0Q7p8J18k53L11R4j99q2J96M5l05J93N3q3k46Q7J12K74k55j56Q9k4L33
$$ -123 -103 -16 -94 24 -229 82 176 -23 -105 91 136 -169 24 77 -6 -252 -165 -53 221 -34 -190 -101 -125 208
5521B08L1j52k31K07J81m68L47k42k12L20k1M91m58ml8J66k46M80l15j69J68j37
$$ 208 239 87 -144 63 244 -224 123 -119 -331 -11 -32 459 1 -3 -41 125 -121 359 44 -125 43 -94
5543i4J31L76p83N64k71R4j76M22m28L30k97j36Q04n3k44j66m04M40q9l29K53
$$ -94 37 413 -370 194 -77 17 -159 263 -165 165 -132 -268 536 483 239 73 -331 109 20 -309 -56
5564e6K92l27J8J24J32k5n57J74J30k60K87K31l6J24l14R8l64N11k25M1n69Q47
$$ -56 236 -91 -73 51 183 158 -399 -225 -95 -355 -68 163 127 251 -63 35 -329 182 -43 -2 -571 276
5586B76n14L49k0m37L87j41M69p89P55l61j77O2M93j18j073K77P10j28j86P01
$$ 276 -238 111 91 -346 41 -100 369 -420 335 -26 -203 -141 352 234 -839 -562 148 20 -166 535
5606E35j59M19r25p3o3K5M51m94P97o3L73r34j78j0J11N10p57kL53o11Q39l30
$$ 535 376 795 -130 -203 -266 -241 210 -284 513 450 823 -111 -289 -299 -188 322 -435 -437 -84 -695 144 -186
5628a86L81M98k99p34k41M87k21o50Q90R9K25K99k74n64J025j303N59k8q2k7K4
$$ -186 195 693 394 -340 -581 -94 -315 -965 -75 24 249 548 274 -290 735 -568 -9 -37 -119 -146 -122
5649a22K69j6m29K12l18N53K98n60K94k33L15j62n22N90r5l73L54j62K88j40K58
$$ -122 147 131 -298 -86 -404 149 447 -113 181 -52 263 101 -421 169 74 -299 55 -107 181 41 299
5670B99m10J87j76j7L33k80O1J31k96J42K36j14N0l97K80P1j35k71L81j41Q6k39
$$ 299 -111 76 -100 -117 216 -64 -3 128 -168 -26 210 96 146 -251 29 100 -35 -306 75 -66 20 -219
5692b19J18j72J97j1L78o97K30Q2j76P93K95j165l81N52q9L8P3M62o68L55n35
$$ -219 -101 -273 -76 -87 291 -406 -176 -94 -270 523 818 -347 -728 -176 -265 -227 -154 308 -360 -5 -540
5713e40N3P13nJ63l39L1p50J344j32j03j70J97q64j67J111m70KM74o19O4L90o03
$$ -540 -487 226 221 384 45 76 -674 670 538 435 265 462 -402 -569 542 72 74 548 -71 -7 383 -220
5735b20k07O06K65j098J3N69M33N23p70j76J25p7m31M67R25r00m62n87M96P21
$$ -220 -427 179 444 -654 -641 -72 361 884 114 -62 63 -14 -445 22 947 47 -415 -1002 -506 215
5755B15j64l78j70J196j291M41j76K76N80k18l92j39J02L47l17L53n04K89o33
$$ 215 51 -327 -497 699 -592 -151 -327 -51 529 311 -81 -220 -118 229 -88 265 -239 50 -583
5774e83J000m59m52O32J70K03k69j14J91n70O54j084J013k4J91j058N2J491j302
$$ -583 417 -42 -494 138 308 511 242 128 319 -251 403 -681 332 308 499 -559 -507 984 -318
5793c18Q97L97j206l16j32Q23K72p21j36L17O78o01M74j135Q56k98N22m96K44
$$ -318 579 976 -230 -546 -678 145 417 -304 -440 -123 555 -46 428 -707 149 -149 373 -123 121
5812A21j350J312q70J507n70J5p16L72O08l26J51r6L02K88r09Q11q30O94p88O16
$$ 121 -1229 83 -787 720 150 165 -551 -179 429 103 254 158 460 748 -161 650 -180 514 -274 342
5832C42k62k76N28j8L62k98o06O42r29P04l28j53J204r55P6k00J99J26K73o58
$$ 342 80 -196 332 314 676 378 -228 414 -515 189 -139 -292 912 -43 33 -167 32 158 431 -227
5852b27J83r6J79p5k24M8k17N42q7J86L88k66k59j63o5L39K57o72j17N17j23L7
$$ -227 -44 -140 39 -36 -260 -212 -429 113 26 212 600 334 75 -88 -153 186 443 -229 -346 171 48 85
5874H5J31q6Q1l51L41j58R4K2k34P0k74M56k99q1J51p3J83k85K04J4j92J03L07
$$ 85 216 130 211 -140 201 43 137 159 -75 -5 -279 177 -122 -203 -52 -125 58 -227 -23 -9 -201 -98 209
5897B09l94K40K22q6L74n52n93M26k96P69j25k13o43N15M27o21N45l09J27p55
$$ 209 -185 55 277 191 565 13 -580 -154 -450 319 194 -19 -662 -147 280 -341 204 -105 22 -733
5917g33K005j601K09O07q73k79J321j296P94j059L99K03k74J192p16l54m23M48
$$ -733 1272 -329 -120 487 -386 -665 656 -640 154 -905 -506 -303 -577 615 -101 -455 -878 -430
5935d30J148j271N04l41J863j299q20L61n25P08N5J0p49J370o39Q97j465K75K19
$$ -430 718 -553 -49 -390 1473 174 -646 -285 -810 -102 -47 -37 -786 584 -55 842 -623 -348 -129
5954a29J785j304r91L68J16j96O29j86P8j37L48j039L36J86l3J9O88M7m04Pk41
$$ -129 1656 352 -639 -271 -155 -351 278 92 170 33 381 -658 -322 -136 -169 -150 538 585 181 188 -53
5975e3P4o07K18l59Q34q66P4O02n01O73o50Q90K81m93j88J08m93k49m1N22M14
$$ -53 21 -586 -368 -727 107 -759 -685 -83 -584 89 -561 329 610 117 -71 37 -456 -705 -746 -224 190
5996A90O02j184J0Q72o25J18L28o42J49Q9R52r23M19m29k33q6N60L0m9k82j20
$$ 190 792 -392 -382 490 -135 -17 311 -331 -182 -93 859 -64 355 -74 -307 -393 167 197 148 -134 -254
6017b54L09N18n90k44K93l89M17k5k25j42L83k15L27n22N06j2j4l40p7M02J65
$$ -254 55 573 -17 -261 32 -357 60 35 -190 -332 51 -164 163 -359 147 135 121 -219 -296 106 271
6038B71k5M9n67l54N10L60j90Q5J60p30R68l59q90P27Q24q12j96M01n3j98m27
$$ 271 246 295 -272 -626 -116 244 54 139 299 -431 537 178 -712 15 839 27 -169 232 179 -19 -446
$$ [...]
8191b5
##END NTUPLES=NMR FID
##END=
