##TITLE=1H_SR76_mat
 CDCl3, 8 sc, 
 24.08.2021
##JCAMPDX= 6.0         $$ Bruker NMR JCAMP-DX V2.0
##DATA TYPE= NMR FID
##DATA CLASS= NTUPLES
##ORIGIN= UXNMR, Bruker Analytische Messtechnik GmbH
##OWNER= root
$$ XWIN-NMR		Version 3.5
$$ Tue Aug 24 12:54:40 2021 Russian Standard Time (UT+4h)  she@DPX200
##.OBSERVE FREQUENCY= 200.131506
##.OBSERVE NUCLEUS= ^1H
##.DELAY= (6, 6)
##.ACQUISITION MODE= SIMULTANEOUS
##.ACQUISITION SCHEME= undefined
##.AVERAGES= 8
##.DIGITISER RES= 18
##SPECTROMETER/DATA SYSTEM= spect
##.PULSE SEQUENCE= zg30
##.SOLVENT NAME= D2O
##.SHIFT REFERENCE= (INTERNAL, D2O, 0, 15.7039)
##AUDIT TRAIL= $$ (NUMBER, WHEN, WHO, WHERE, WHAT)
$$ ##TITLE= Audit trail, XWIN-NMR		Version 3.5
$$ ##JCAMPDX= 5.01
$$ ##ORIGIN= Bruker BioSpin GmbH
$$ ##OWNER= she
$$ F:/spectra/data/she/nmr/H-F/1/audita.txt
$$ ##AUDIT TRAIL=  $$ (NUMBER, WHEN, WHO, WHERE, WHAT)
(   1,<2021-08-24 12:53:45.82 +0400>,<she>,<DPX200>,
      <created by zg, POWCHK disabled, PULCHK disabled
       configuration hash MD5:
       00 E9 B6 7A A2 85 ED C7 34 08 36 98 17 FE 4E 26
       data hash MD5: 16K
       E0 21 24 38 B3 9F 5F 90 FA 34 4B EE 1E 81 60 E8>)
$$ ##END=
$$ 
$$ hash MD5
$$ 3A B2 78 CD 33 39 C4 70 F1 77 93 05 F6 89 FD 1E
##$RELAX= 
##$RELAX= 
##$RELAX= 
##$RELAX= 
##$RELAX= 
##$RELAX= 
$$ Bruker specific parameters
$$ --------------------------
##$DU= <F:/spectra>
##$EXPNO= 1
##$NAME= <H-F>
##$PROCNO= 1
##$TYPE= <nmr>
##$USER= <she>
##$AMP= (0..31)
100 100 100 100 100 100 100 100 100 100 100 100 100 100 100 100 100 100 
100 100 100 100 100 100 100 100 100 100 100 100 100 100 
##$AQSEQ= 0
##$AQ_mod= 1
##$AUNM= <au_zg>
##$AUTOPOS= <>
##$BF1= 200.13
##$BF2= 200.13
##$BF3= 200.13
##$BF4= 200.13
##$BF5= 200.13
##$BF6= 200.13
##$BF7= 200.13
##$BF8= 200.13
##$BYTORDA= 1
##$CFDGTYP= 0
##$CFRGTYP= 5
##$CHEMSTR= <none>
##$CNST= (0..31)
1 1 145 1 1 1 1 1 1 1 1 1 1 1 1 1 1 1 1 1 1 1 1 1 1 1 1 1 1 1 1 1 
##$CPDPRG= <>
##$CPDPRG1= <>
##$CPDPRG2= <>
##$CPDPRG3= <>
##$CPDPRG4= <mlev>
##$CPDPRG5= <mlev>
##$CPDPRG6= <mlev>
##$CPDPRG7= <mlev>
##$CPDPRG8= <mlev>
##$CPDPRGB= <>
##$CPDPRGT= <>
##$D= (0..31)
0 1.2 0 0 0 0 0 0 0 0.06 0 0.03 0 0 0 0 0.0002 0 0 0 0 0 0 0 0 0 0 0 0 
0 0 0 
##$DATE= 1629795225
##$DBL= (0..7)
120 120 120 120 120 120 120 120 
##$DBP= (0..7)
150 150 150 150 150 150 150 150 
##$DBP07= 0
##$DBPNAM0= <>
##$DBPNAM1= <>
##$DBPNAM2= <>
##$DBPNAM3= <>
##$DBPNAM4= <>
##$DBPNAM5= <>
##$DBPNAM6= <>
##$DBPNAM7= <>
##$DBPOAL= (0..7)
0.5 0.5 0.5 0.5 0.5 0.5 0.5 0.5 
##$DBPOFFS= (0..7)
0 0 0 0 0 0 0 0 
##$DE= 6
##$DECBNUC= <off>
##$DECIM= 32
##$DECNUC= <off>
##$DECSTAT= 4
##$DIGMOD= 1
##$DIGTYP= 9
##$DL= (0..7)
0 120 120 120 120 120 120 120 
##$DP= (0..7)
150 150 150 150 150 150 150 150 
##$DP07= 0
##$DPNAME0= <>
##$DPNAME1= <>
##$DPNAME2= <>
##$DPNAME3= <>
##$DPNAME4= <>
##$DPNAME5= <>
##$DPNAME6= <>
##$DPNAME7= <>
##$DPOAL= (0..7)
0.5 0.5 0.5 0.5 0.5 0.5 0.5 0.5 
##$DPOFFS= (0..7)
0 0 0 0 0 0 0 0 
##$DQDMODE= 0
##$DR= 18
##$DS= 0
##$DSLIST= <SSSSSSSSSSSSSSS>
$$ [...]
##$SUBNAM2= <"">
##$SUBNAM3= <"">
##$SUBNAM4= <"">
##$SUBNAM5= <"">
##$SUBNAM6= <"">
##$SUBNAM7= <"">
##$SUBNAM8= <"">
##$SUBNAM9= <"">
##$SW= 20.0188882624521
##$SWIBOX= (0..15)
0 0 2 0 0 0 0 0 0 0 0 0 0 0 0 0 
##$SW_h= 4006.41025641026
##$TD= 16384
##$TD0= 1
##$TE= 0
##$TE2= 300
##$TE3= 300
##$TEG= 300
##$TL= (0..7)
0 120 120 120 120 120 120 120 
##$TP= (0..7)
150 150 150 150 150 150 150 150 
##$TP07= 0
##$TPNAME0= <>
##$TPNAME1= <>
##$TPNAME2= <>
##$TPNAME3= <>
##$TPNAME4= <>
##$TPNAME5= <>
##$TPNAME6= <>
##$TPNAME7= <>
##$TPOAL= (0..7)
0.5 0.5 0.5 0.5 0.5 0.5 0.5 0.5 
##$TPOFFS= (0..7)
0 0 0 0 0 0 0 0 
##$TUNHIN= 0
##$TUNHOUT= 0
##$TUNXOUT= 0
##$USERA1= <user>
##$USERA2= <user>
##$USERA3= <user>
##$USERA4= <user>
##$USERA5= <user>
##$V9= 5
##$VALIST= <valist>
##$VCLIST= <CCCCCCCCCCCCCCC>
##$VD= 0
##$VDLIST= <DDDDDDDDDDDDDDD>
##$VPLIST= <PPPPPPPPPPPPPPP>
##$VTLIST= <TTTTTTTTTTTTTTT>
##$WBST= 1024
##$WBSW= 4
##$XGAIN= (0..3)
0 0 0 0 
##$XL= 0
##$YL= 0
##$YMAX_a= 180367
##$YMIN_a= -144320
##$ZGOPTNS= <>
##$ZL1= 120
##$ZL2= 120
##$ZL3= 120
##$ZL4= 120
##$ABSF1= 10
##$ABSF2= 0
##$ABSG= 5
##$ABSL= 3
##$ALPHA= 0
##$AQORDER= 0
##$ASSFAC= 0
##$ASSFACI= 0
##$ASSFACX= 0
##$ASSWID= 0
##$AUNMP= <proc_1d>
##$AZFE= 0.1
##$AZFW= 0.1
##$BCFW= 1
##$BC_mod= 2
##$BYTORDP= 1
##$COROFFS= 0
##$CY= 11.3945322036743
##$DATMOD= 1
##$DC= 2
##$DFILT= <>
##$DTYPP= 0
##$F1P= 2.36226072786647
##$F2P= -0.459571619588291
##$FCOR= 0.5
##$FTSIZE= 0
##$FT_mod= 4
##$GAMMA= 1
##$GB= 0.15
##$INTBC= 1
##$INTSCL= 1
##$ISEN= 128
##$LB= 0.24
##$LEV0= 0
##$LPBIN= 0
##$MAXI= 10000
##$MC2= 0
##$MEAN= 0
##$ME_mod= 0
##$MI= 1.114404
##$NCOEF= 0
##$NC_proc= 0
##$NLEV= 6
##$NOISF1= 3.799351
##$NOISF2= 2.8
##$NSP= 1
##$NTH_PI= 0
##$NZP= 0
##$OFFSET= 15.70392
##$PC= 1
##$PHC0= -13354.11
##$PHC1= 8.801001
##$PH_mod= 1
##$PKNL= yes
##$PPARMOD= 0
##$PSCAL= 0
##$PSIGN= 0
##$REVERSE= no
##$SF= 200.130013532006
##$SI= 16384
##$SIGF1= 3
##$SIGF2= 2
##$SINO= 400
##$SIOLD= 16384
##$SREGLST= <1H.CDCl3>
##$SSB= 0
##$STSI= 0
##$STSR= 0
##$SW_p= 3612.71676300578
##$SYMM= 0
##$S_DEV= 0
##$TDeff= 0
##$TDoff= 0
##$TI= <>
##$TILT= no
##$TM1= 0
##$TM2= 0
##$TOPLEV= 0
##$USERP1= <user>
##$USERP2= <user>
##$USERP3= <user>
##$USERP4= <user>
##$USERP5= <user>
##$WDW= 1
##$XDIM= 8192
##$YMAX_p= 0
##$YMIN_p= 0
$$ End of Bruker specific parameters
$$ ---------------------------------
##NTUPLES= NMR FID
##VAR_NAME=  TIME,          FID/REAL,        FID/IMAG
##SYMBOL=    X,             R,               I
##VAR_TYPE=  INDEPENDENT,   DEPENDENT,       DEPENDENT
##VAR_FORM=  AFFN,          ASDF,            ASDF
##VAR_DIM=   8192,          8192,            8192
##UNITS=     SECONDS,       ARBITRARY UNITS, ARBITRARY UNITS
##FACTOR=    0.0002496,     1,               1
##FIRST=     0,             0,               0
##LAST=      2.0444736,     0,               0
##MIN=       0,             -144320,         0
##MAX=       2.0444736,     180367,          0
$$ Real data points
##PAGE= N=1
##DATA TABLE= (X++(R..R)), XYDATA
$$ plain form
0 0 0 0 0 0 0 0 0 0 0 0 0 0 -8 8 -8 8 -16 16 -17 24 -32 32 -40 48 -56 64 -76 88 -103 116 -133 152 -172 194
34 194 -220 249 -278 313 -350 390 -433 481 -535 592 -656 724 -797 881 -970 1068 -1179 1298
52 1298 -1430 1577 -1744 1930 -2142 2385 -2670 3004 -3405 3898 -4518 5327 -6432 8040 -10617
67 -10617 15404 -27431 128592 180367 28905 13666 -127929 -98878 55488 127844 128322 129693
79 129693 -491 -86423 -61818 -23159 44197 136123 96483 20559 -22425 -71444 -51750 45290
91 45290 63523 53777 44728 -26007 -52611 3085 -3037 887 55339 18690 -42857 -19934 -24599
104 -24599 -27958 32892 30803 -17818 -14875 -41707 -67963 -6903 25323 3699 11750 -22689 -72461
117 -72461 -37012 -19734 -36344 14120 24622 -34556 -30709 -32062 -76375 -37074 12090 -14639
$$ packed form
0@%%%%%%%%%%%%qJ6j6J6k4L2l3M1n6O4p2Q8j04J20j40J64j91K19k49K85l24L66
34A94m14M69n27N91o63P40q23R14j016J127j248J380j521J678j851K038k247K477
52A298k728L007l321L674m072M527n055N674o409P303q416R845j1759J4472j8657
67a0617K6021m2835J56023N1775j51462j5239j41595K9051J54366P2356M78J371
79A29693j30184q5932K4605L8659O7356R1926l9640p5924m2984m9019J9694R7040
91D5290J8233r746r049p0735k6604N5696o122L924N4452l6649o1547K2923m665
104b4599l359O0850k089m8621K943k6832k6256O1060L2226k1624Q051l4439m9772
117g2461L5449J7278j6610N0464J0502n9178L847j353m4313L9301M9164k6729
$$ plain form
129 -14639 -9997 -1650 -53424 -56603 -23334 -34413 -22095 -291 -30711 -32534 -11512 -39045 -40618
142 -40618 -13928 -30437 -28645 -5521 -30190 -35242 -7233 -23354 -32741 -13372 -33258 -40183 -8190
155 -8190 -12446 -20527 -3548 -23103 -42246 -19877 -19607 -25872 -2787 -5970 -18674 -6208 -20321
168 -20321 -37919 -15358 -9791 -14229 8870 848 -25403 -12518 -11619 -25884 -2921 4179 -13726
181 -13726 1081 6433 -16571 -9306 -1544 -17685 -2808 13484 -3119 -1017 8599 -7380 -4919
194 -4919 6821 -6689 -2192 14647 6342 6528 14192 -1279 -5188 8205 4548 7186 19197 10882
208 10882 7715 15532 5456 96 10876 9976 12218 24683 18104 8707 12703 7507 6440 18343
222 18343 16518 13783 23468 19240 10605 15781 11006 6223 18451 21736 17728 22723 18030 8067 14139
$$ packed form
129a4639M642Q347n1774l179L3269j1079J2318K1804l0420j823K1022k7533j573
142d0618K6690j6509J792K3124k4669n052K8009j6121r387J9369j9886o925L1993
155h190m256q081J6979j9555j9143K2369K70o265K3085l183j2704J2466j4113
168b0321j7598K2561N567m438K3099q022k6251J2885Q99j4265K2963P100j7905
181a3726J4807N352k3004P265P762j6141J4877J6292j6603K102R616j5979K461
194d919J1740j3510M497J6839q305J86P664j5471l909J3393l657K638J2011q315
208A0882l167P817j0076n360J0780r00K242J2465o579r397L996n196j067J1903
222A8343j825k735R685m228q635N176m775m783J2228L285m008M995m693r963O072
$$ plain form
237 14139 14918 8357 16860 22222 15929 19628 19394 7180 8540 13256 9942 16534 21896 13838 12607
252 12607 15022 6637 5539 10811 8759 11870 18111 13259 8325 7751 1995 1483 8696 8550 7949 11556
268 11556 8364 3379 1872 -1169 -1913 3112 5524 6532 7275 1589 -3314 -2888 -4285 -3748 702 1454
284 1454 1396 2748 -1682 -6988 -7242 -8154 -6911 -1283 119 -1795 -2426 -6440 -10657 -9448 -8986 -9002 -2908
301 -2908 -506 -3989 -5635 -7910 -13609 -12897 -8522 -7074 -4071 -2735 -5700 -8035 -10063 -13584 -12969 -7945
317 -7945 -6100 -4936 -2892 -5454 -10545 -12036 -11597 -10925 -8078 -4836 -3485 -4057 -6537 -9951 -12444 -11705
333 -11705 -9230 -6590 -3595 -2583 -4476 -7749 -9754 -11188 -10855 -7402 -4329 -2395 -1889 -4092 -7982
348 -7982 -9422 -9742 -9297 -5838 -1667 -1408 -3045 -3496 -6479 -9507 -8785 -5919 -3688 -645 182 -1339 -3764
$$ packed form
237A4139P79o561Q503N362o293L699k34j2214J360M716l314O592N362q058j231
252A2607K415q385j098N272k052L111O241m852m934n74n756n12P213j46o01L607
268A1556l192m985j507l041p44N025K412J008P43n686m903M26j397N37M450P52
284A454n8J352m430n306k54r12J243N628J402j914o31m014m217J209M62j6O094
301b908K402l483j646k275n699P12M375J448L003J336k965k335k028l521O15N024
317g945J845J164K044k562n091j491M39O72K847L242J351n72k480l414k493P39
333a1705K475K640K995J012j893l273k005j434L33L453L073J934N06k203l890
348g982j440l20M45L459M171K59j637m51k983l028P22K866K231L043Q27j521k425
$$ plain form
365 -3764 -6304 -8312 -6710 -3029 -1052 798 2221 -98 -3869 -4913 -4875 -4149 -588 2518 3378 2620
381 2620 509 -2303 -4036 -2366 -696 2053 4991 5503 3917 1764 133 -1541 -522 2852 4766
396 4766 6673 7557 5142 2181 1624 1190 2113 5787 8033 8190 8251 6242 3800 2394 2958 4413 7558
413 7558 10148 9534 7722 6191 4293 2704 4639 6758 8102 9462 10059 7786 5461 3475 3105 4550
429 4550 7471 8893 9152 8719 6108 3176 2834 3783 4313 6373 8547 8113 6195 3916 1508 1273 2606
446 2606 4382 5852 6849 5762 3361 1788 736 -306 724 3295 4625 4342 3542 1523 -1071 -1876
462 -1876 -1052 192 2227 3238 2400 1054 -148 -3178 -3943 -1677 74 845 2091 873 -1497 -2872
478 -2872 -4127 -4338 -2293 -370 -63 989 147 -3061 -4850 -4536 -4382 -2411 237 469 -809 -1424 -3656
$$ packed form
365c764k540k008J602L681J977J850J423k319l771j044L8P26L561L106Q60p58
381B620k111k812j733J670J670K749K938N12j586k153j631j674J019L374J914
396D766J907Q84k415k961n57m34R23L674K246J57O1k009k442j406N64J455L145
413G558K590o14j812j531j898j589J935K119J344J360N97k273k325j986l70J445
429D550K921J422K59m33k611k932l42R49N30K060K174m34j918k279k408k35J333
446B606J776J470R97j087k401j573j052j042J030K571J330k83q00k019k594q05
462a876Q24J244K035J011q38j346j202l030p65K266J751P71J246j218k370j375
478b872j255k11K045J923L07J052q42l208j789L14J54J971K648K32j278o15k232
$$ plain form
495 -3656 -4756 -4739 -3949 -2574 -27 342 -1100 -3282 -4929 -5633 -4689 -3111 -1435 -304 -1009 -1855 -3302
512 -3302 -5166 -5924 -4670 -3140 -885 207 -1507 -3193 -4093 -6082 -5536 -3633 -2477 -1799 -520 -1875
528 -1875 -3961 -4536 -6191 -5885 -2715 -1551 -1802 -826 -2147 -5022 -5186 -5112 -5111 -3016 -1151 -1062 -1171 -2532
546 -2532 -5395 -5763 -4255 -3760 -1746 130 -768 -1643 -2500 -4398 -4627 -3554 -2616 -405 1561 -130 -1600
563 -1600 -2368 -3829 -3666 -1583 -366 920 1943 771 -267 -998 -2796 -2158 470 1435 2523 3508 1683
580 1683 181 -120 -1157 -153 2450 3239 3499 4762 2808 274 783 927 918 3999 4730 4564 5131 3182
598 3182 834 1734 1822 1900 4832 6779 4666 4093 3180 1111 1511 2687 3313 5021 6112 4679 3616
615 3616 2945 964 919 3178 3948 5099 5667 3700 2302 1797 479 1172 2969 3092 4110 4699 2988
$$ packed form
495c656j100J7P90J375K547L69j442k182j647p04R44J578J676J131p05q46j447
512c302j864p58J254J530K255J092j714j686r00j989N46J903J156O78J279j355
528a875k086n75j655L06L170J164k51R76j321k875j64P4JK095J865Q9j09j361
546b532k863l68J508M95K014J876q98q75q57j898k29J073R38K211J966j691j470
563a600p68j461J63K083J217J286J023j172j038p31j798O38K628R65J088R85j825
580A683j502l01j037J004K603P89K60J263j954k534N09J44rL081P31j66N67j949
598C182k348R00Q8P8K932J947k113n73r13k069M00J176O26J708J091j433j063
615C616o71j981m5K259P70J151N68j967j398n05j318O93J797J23J018N89j711
$$ plain form
632 2988 1109 645 -662 759 2937 3060 3279 3339 754 27 -184 -734 -57 2387 2713 2224 2518 -191
650 -191 -1957 -550 -890 -334 2290 1983 919 1181 -558 -2621 -1552 -975 -537 2100 2322 1 -400
667 -400 -966 -3156 -1714 110 -229 1052 1584 -245 -949 -1356 -3260 -1919 316 160 546 599 -1057 -1897
685 -1897 -2535 -2887 -1804 -82 -166 487 310 -2099 -2790 -2525 -3089 -1311 -20 -423 -125 -214 -2775 -3597 -2360
704 -2360 -3118 -2221 319 -571 -1571 -1426 -3347 -4237 -2777 -2528 -2618 -282 -491 -2260 -2042 -3018 -4760 -3582
722 -3582 -1959 -1943 -100 -876 -2821 -2945 -3161 -4296 -2940 -1353 -1427 -666 -877 -2417 -3125 -3252 -3277 -2185
740 -2185 -671 -614 -75 -611 -2174 -2809 -2584 -2463 -1220 182 29 368 -207 -2120 -2294 -1302 -1122 256
758 256 1902 1253 717 670 -1142 -1372 -130 65 1235 3292 2302 1033 826 -67 -881 750 1857 2520
$$ packed form
632B988j879m64j307J421K178J23K19O0k585p27k11n50O77K444L26m89K94k709
650a91j766J407l40N56K624l07j064K62j739k063J069N77M38K637K22k321m01
667d00n66k190J442J824l39J281N32j829p04m07j904J341K235j56L86N3j656q40
685a897o38l52J083J722q4O53j77k409o91K65n64J778J291m03K98q9k561q22J237
704b360p58Q97K540q90j000J45j921q90J460K49r0K336k09j769K18r76j742J178
722c582J623J6J843p76j945j24k16j135J356J587p4P61k11j540p08j27k5J092
740b185J514N7N39n36j563o35K25J21J243J402j53L39n75j913j74R92J80J378
758B56J646o49n36m7j812k30J242J95J170K057r90j269k07q93q14J631J107O63
$$ plain form
776 2520 3334 2977 969 1443 734 179 1788 3135 3039 3246 3320 1619 1073 1429 1066 2005 3918 3345 3735
795 3735 2729 1080 536 1105 1322 2517 3135 3552 3025 1991 646 470 764 1303 2465 3268 2801 2183
813 2183 1190 -117 422 748 915 2471 3108 2183 1311 1046 -527 -461 642 1083 2214 2468 1480 548 18
832 18 -508 -503 901 1584 1325 1888 1217 -278 -948 -884 -677 684 1618 1206 1511 731 -882 -1326 -857 -302
852 -302 397 1299 1300 923 -94 -1023 -1561 -559 -147 585 1255 1048 269 -878 -1619 -1591 -1049 -587 685 945
872 945 202 -621 -1419 -1919 -1786 -1112 -394 454 183 -442 -1533 -1907 -2731 -2231 -1031 -393 -609 -263 -1324
891 -1324 -2355 -2792 -2846 -2287 -1044 -660 -762 -859 -1332 -2900 -3406 -2641 -2082 -1579 -883 -820 -1479 -2470 -3068 -2906
911 -2906 -2391 -1909 -1106 -761 -818 -1790 -2309 -2791 -2475 -2011 -1335 -428 -336 -877 -1607 -2067 -2650 -1954 -1572 -357
$$ packed form
776B520Q14l57k008M74p09n55J609J347r6K07P4j701n46L56l63R39J913n73L90
795C735j006j649n44N69K17J195O18M17n27j034j345j76K94N39J162Q03m67o18
813B183r93j307N39L26J67J556O37r25q72k65j573O6J103M41J131K54r88r32n30
832A8n26NJ404O83k59N63o71j495o70O4K07J361R34m12L05p80j613m44M69N55
852c02O99R02Jl77j017r29n38J002M12P32O70k07p79j147p41K8N42M62J272K60
872I45p43q23p98n00J33O74P18Q48k71o25j091l74q24N00J200O38k16L46j061
891a324j031m37n4N59J243L84j02r7m73j568n06P65N59N03O96O3o59r91n98J62
911b906N15M82Q03L45n7r72n19m82L16M64O76R07R2n41p30m60n83O96L82J215
$$ plain form
931 -357 185 168 -366 -895 -1873 -1931 -978 -200 426 1032 252 -35 -866 -715 -1066 -13 1078 1380 1678 1177
951 1177 431 -67 -386 529 1111 1420 2157 1888 1510 964 350 378 1255 1540 2223 2597 2144 1152 609 946
971 946 801 1310 2400 2533 2157 2151 1010 516 804 813 1498 2499 2617 2052 1760 1072 221 462 1187 1838 2232
992 2232 2248 1711 1038 390 -152 362 1118 1891 1665 1686 1263 394 -270 -39 251 1144 1533 1508 1232 528 209
1013 209 -442 -152 547 867 1337 1502 1030 27 -222 -670 -291 522 1275 1022 1328 610 -438 -235 -515
1032 -515 -333 600 1336 1135 533 7 -439 -799 -450 -308 429 743 863 288 -407 -758 -1370 -647 84 729
1052 729 642 480 -152 -928 -1414 -893 -742 -165 638 434 129 -673 -1978 -1986 -1358 -910 -273 238 -122 -900 -1430
1073 -1430 -1998 -1947 -1748 -859 -540 -90 -234 -1442 -2075 -2240 -2206 -1838 -1365 -738 -825 -1132 -1620 -1950 -2494 -2227
$$ packed form
931c57N42j7n34n29r78n8R53P78O26O06p80k87q31J51l51J053J091L02K98n01
951A177p46m98l19R15N82L09P37k69l78n46o14K8Q77K85O83L74m53r92n43L37
971I46j45N09J090J33l76oj141m94K88RO85J001J18n65k92o88q51K41P25O51L94
992B232J6n37o73o48n42N14P56P73k26K1m23q69o64K31K90Q93L89k5k76p04l19
1013B09o51K90O99L20M70J65m72j003k49m48L79Q13P53k53L06p18j048K03k80
1032e15J82R33P36k01o02n26m46l60L49J42P37L14J20n75o95l51o12P23P31O45
1052G29q7j62o32p76m86N21J51N77Q03k04l05q02j305qO28M48O37N11l60p78n30
1073a430n68N1J99Q89L19M50j44j208o33j65L4L68M73O27q7l07m88l30n44K67
$$ plain form
1093 -2227 -1643 -772 -424 -769 -1372 -1540 -2153 -2346 -1731 -1211 -531 -446 -536 -1125 -1902 -1713 -1735 -1148 -361 -65 -7
1114 -7 -357 -872 -1639 -1381 -990 -157 80 360 218 52 -326 -1155 -1005 -86 564 811 1315 597 133 -118 -199
1135 -199 -186 516 868 1097 1320 1130 381 70 214 335 1201 1769 1810 1468 1021 766 32 188 561 1329 1265
1156 1265 1642 1599 946 354 253 185 902 1183 1523 1549 1274 545 -120 405 719 962 1222 1791 1350 717 380
1177 380 -114 -187 671 979 976 1564 1173 132 89 -187 -136 545 933 1188 936 756 15 -83 52 76 724 1332
1199 1332 929 1006 750 127 -154 -59 587 886 1171 1433 746 152 -211 -289 63 522 1049 1274 994 579 78
1220 78 -372 -40 305 409 918 1347 740 -99 -41 -529 -64 177 289 643 1004 -45 -296 -601 -975 -330
1240 -330 267 244 406 286 -54 -965 -906 -944 -679 -286 -52 -91 -315 -847 -1240 -1578 -1206 -900 -410 -257 -457
$$ packed form
1093b227N84Q71L48l45o03j68o13j93O15N20O80Q5r0n89p77J89k2N87P87K96N8
1114gl50n15p67K58L91Q33K37K80j42j66l78q29J50R19O50K47N04p18m64k51q1
1135a99J3P02L52K29K23j90p49l11J44J21Q66N68M1l42m47k55p34J56L73P68o4
1156A265L77m3o53n92j01o8P17K81L40K6k75p29o65N25L14K43K60N69m41o33l37
1177C80m94p3Q58L08lN88l91j041m3k76N1O81L88K55k52j80p41r8J35K4O48O08
1199A332m03P7k56o23k81R5O46K99K85K62o87n94l63p8L52M59N27K25k80m15n01
1220G8m50L32L45J04N09M29o07q39N8m88M65K41J12L54L61j049k51l05l74O45
1240c30N97k3J62j20l40r11N9l8K65L93K34l9k24n32l93l38L72L06M90J53k00
$$ plain form
1261 -457 -853 -1285 -1702 -1655 -1404 -703 -496 -427 -513 -967 -1544 -1915 -1590 -1234 -979 -456 -321 -842 -1403 -1612 -1641
1282 -1641 -1313 -874 -493 -425 -335 -975 -1632 -1417 -1240 -920 -475 -15 119 -219 -751 -1290 -842 -1051 -543 276
1302 276 165 210 -81 -193 -1096 -855 -280 29 907 882 139 195 -27 -793 -249 171 580 647 960 623 105
1323 105 -51 -265 18 259 787 1116 1208 510 137 8 -272 13 782 1093 1068 810 395 114 17 -100 347
1344 347 1101 1187 1186 724 -52 65 -133 75 506 716 747 690 438 -2 -157 -276 214 678 1181 948 851 492
1366 492 -99 -357 107 291 834 711 1049 572 304 85 -49 296 811 927 820 777 549 149 212 99 175
1387 175 778 1144 1240 722 540 135 104 197 499 1181 1471 1274 534 -67 79 5 41 379 1221 1067 773 717
1409 717 131 -174 -146 287 833 742 745 568 140 -457 -385 -45 234 305 670 457 34 -356 -751 -697 -401 181
$$ packed form
1261d57l96m32m17M7K51P01K07O9q6m54n77l71L25L56K55N23J35n21n61k09k9
1282a641L28M39L81O8R0o40o57K15J77L20M45M60J34l38n32n39M48k09N08Q19
1302B76j11M5k91j12r03K41N75L09Q78k5p43N6k22p66N44M20M09O7L13l37n18
1323A05j56k14K83K41N28L29R2o98l73j29k80K85P69L11k5k58m15k81r7j17M47
1344C47P54Q6jm62p76J17j98K08M31K10L1n7k52m40j55j19M90M64N03k33r7l59
1366D92n91k58M64J84N43j23L38m77k68k19j34L45N15J16j07m3k28m00O3j13P6
1387A75O03L66R6n18j82m05l1R3L02O82K90j97p40o01J46p4L6L38Q42j54k94n6
1409G17n86l05K8M33N46r1Lj77m28n97P2L40K79P1L65k13m23l90l95N4K96N82
$$ plain form
1431 181 -65 212 23 -465 -623 -615 -807 -486 -21 -115 33 -555 -947 -1196 -1080 -1119 -619 -594 43 -218 -633 -1055
1453 -1055 -1399 -1262 -1062 -569 -456 -366 -789 -1070 -1003 -1095 -1181 -575 -529 -441 -385 -623 -1065 -1261 -1189 -924 -386 -171
1475 -171 148 5 -691 -885 -868 -674 -175 49 -45 -31 -27 -175 -858 -568 -312 -156 236 63 352 -181 -427 -470
1497 -470 -582 -118 393 384 646 301 221 -364 -301 -190 19 460 845 483 269 -87 -37 -175 -68 220 708 897
1519 897 663 318 -48 -451 -290 83 379 518 578 280 80 -362 -256 -127 232 513 657 850 228 -226
1539 -226 -400 -270 -133 399 666 614 605 286 -172 -126 -93 235 327 716 687 469 153 -151 -6 -186 666 759 931
1562 931 640 407 238 -25 5 238 770 911 827 744 485 -73 75 132 410 804 1299 828 644 548 105 157
1584 157 296 704 385 950 884 353 -36 -229 -217 445 583 770 615 563 -41 130 -175 -223 89 380 521
$$ packed form
1431A81k46K77j89m88j58Qj92L21M65r4J48n88l92k49J16l9N00K5O37k61m15m22
1453a055l44J37K00M93J13R0m23k81O7r2q6O06M6Q8N6k38m42j96P2K65N38K15
1475a71L19j43o96j94J7J94M99K24r4J4Mj48o83K90K56J56L92j73K89n33k46m3
1497d70j12M64N11rK62l45q0n85O3J11K09M41L85l62k14l56N0j38J07K88M88J89
1519H97k34l45l66m03J61L73K96J39O0k98k00m42J06J29L59K81J44J93o22m54
1539b26j74J30J37N32K67n2rl19m58M6L3L28R2L89k9k18l16l04J45j80Q52R3J72
1562I31k91k33j69k63L0K33N32J41q4q3k59n58J48N7K78L94M95m71j84r6m43N2
1584A57J39M08l19N65o6n31l89j93J2O62J38J87j55n2o04J71l05m8L12K91J41
$$ plain form
1605 521 285 -248 -253 -509 -434 -57 164 101 323 299 -114 -346 -806 -716 -400 -286 321 252 -88 -684 -1070 -810
1627 -810 -664 -433 -246 -130 -301 -567 -619 -1098 -1005 -594 -266 -150 -279 -281 -743 -779 -848 -828 -628 -84 165 29
1649 29 -398 -716 -706 -765 -579 -192 -156 -144 15 -493 -527 -783 -457 -194 134 125 174 24 -167 -478 -381 -193 -149 400
1673 400 249 544 314 -427 -616 -313 -311 33 170 361 426 -112 -566 -401 -393 269 69 313 533 234 91 -251
1695 -251 -366 -356 88 157 283 119 64 -68 -460 -454 -319 128 305 386 268 -217 -596 -304 -252 68 200 247 233
1718 233 -99 -183 -137 -568 -224 125 120 709 149 -142 -227 -272 -256 -123 251 436 602 724 115 -263 -389 -251
1740 -251 16 552 441 640 272 277 -1 -125 280 365 657 904 634 454 317 -16 162 271 596 824 896
1761 896 508 277 102 34 158 363 663 784 551 336 83 -222 101 333 412 694 625 588 282 335 -37 -19
$$ packed form
1605E21k36n33nk56P5L77K21o3K22k4m13k32m60R0L16J14O07o9l40n96l86K60
1627h10J46K31J87J16j71k66n2m79R3M11L28J16j29km62l6o9K0K00N44K49j36
1649B9m27l18J0n9J86L87L6J2J59n08l4k56L26K63L28rM9j50j91l11R7J88M4N49
1673D00j51K95k30p41j89L03KL44J37J91O5n38m54J65QO62k00K44K20k99j43l42
1695b51j15J0M44O9J26j64n5j32l92OJ35M47J77Q1j18m85l79K92N2L20J32M7j4
1718B33l32q4M6m31L44L49nN89n60k91q5m5J6J33L74J85J66J22o09l78j26J38
1740b51K67N36j11J99l68Nk78j24M05Q5K92K47k70j80j37l33J78J09L25K28P2
1761H96l88k31j75o8J24K05L00J21k33k15k53l05L23K32P9K82o9l7l06N3l72J8
$$ plain form
1783 -19 180 263 340 770 231 -56 50 -361 18 193 304 437 323 250 -296 -450 -448 -384 -83 293 170 -211
1805 -211 -277 -352 -750 -515 -465 -156 -112 116 36 -561 -799 -410 -555 -203 265 -257 -101 -381 -373 -664 -345 -529
1827 -529 -124 349 -106 -169 -70 -557 -385 -627 -158 54 50 178 -80 -412 -260 -407 -457 33 143 34 -12 -161
1849 -161 -415 -693 -85 -16 386 406 84 10 -71 -200 -304 85 -188 312 208 348 -13 -207 -302 -520 -186 45
1871 45 113 332 -84 -226 -502 -269 -254 -398 245 230 -22 -374 -236 -195 -591 -53 -32 132 250 105 4 -339
1893 -339 -382 -798 -260 74 279 317 219 -245 -399 -205 -477 -153 52 414 272 162 73 -329 -271 -128 -322 248
1915 248 294 297 122 -222 -109 -91 40 291 255 563 410 119 116 -35 -284 443 88 519 815 371 110 276
1937 276 227 207 566 457 709 599 214 476 60 -37 489 611 537 561 691 254 276 -116 170 384 431 413 217
$$ packed form
1783a9J99Q3P7M30n39k87J06m11L79J75J11J33j14p3n46j54KO4L01L76j23l81
1805b11o6p5l98K35N0L09M4K28q0n97k38L89j45L52M68n22J56k80Qk91L19j84
1827e29M05M73m55o3R9m87J72k42M69K12mJ28k58l32J52j47n0M90J10j09m6j49
1849a61k54k78O08O9M02K0l22p4q1j29j04L89k73N00j04J40l61j94r5k18L34K31
1871D5O8K19m16j42k76K33J5j44O43j5k52l52J38M1l96N38K1J64J18j45j01l43
1893c39m3m16N38L34K05L8r8m64j54J94k72L24K05L62j42j10q9m02N8J43j94N70
1915B48M6Lj75l44J13J8J31K51l6L08j53k91lj51k49P27l55M31K96m44k61J66
1937B76m9k0L59j09K52j10l85K62m16r7N26J22p4K4J30m37K2l92K86K14M7j8j96
$$ plain form
1960 217 550 -46 -201 -62 114 -361 22 707 403 153 -13 551 -152 228 248 112 467 -186 123 -176
1980 -176 -477 -32 366 91 211 -14 -180 8 -152 -451 -385 -149 -285 215 -202 -143 -472 -512 -48 -186 -51
2001 -51 -216 126 -118 -27 -602 -697 -207 -51 53 32 -258 -112 -555 -604 -675 -32 208 66 143 50 13 -41 -525
2024 -525 -261 -57 50 238 142 26 -84 -285 -190 -289 -147 438 185 189 -127 -91 -264 -143 97 432 267 279
2046 279 458 -126 -178 -173 -42 -84 127 221 287 142 -386 -412 -391 -30 -124 -117 165 19 -60 -276 -398 -424 -258 146
2070 146 -24 -239 45 -204 -699 -451 -368 -203 41 -117 -113 -206 -224 -387 -468 -258 -174 147 56 -51 -216 -517 65
2093 65 7 -112 273 399 203 46 -86 -237 -193 14 119 512 308 347 203 331 28 184 292 410 450 233
2115 233 212 114 344 -8 -49 177 375 823 609 243 40 95 112 337 281 394 571 256 376 -5 87 -119
$$ packed form
1960B17L33n96j55J39J76m75L83O85l04k50j66N64p03L80K0j36L55o53L09k99
1980a76l01M45L98k75J20k25j66J88j60k99O6K36j36N00m17N9l29m0M64j38J35
2001e1j65L42k44R1n75r5M90J56J04k1k90J46m43m9p1O43K40j42P7r3l7n4m84
2024e25K64K04J07J88r6j16j10k01R5r9J42N85k53Ml16L6j73J21K40L35j65J2
2046B79J79n84n2NJ31m2K11R4O6j45n28k6K1L61r4PK82j46p9k16j22k6J66M04
2070A46j70k15K84k49m95K48Q3J65K44j58Mr3j8j63q1K10Q4L21r1j07j65l01N82
2093F5n8j19L85J26j96j57j32j51M4K07J05L93k04L9j44J28l03J56J08J18M0k17
2115B33k1r8K30l52m1K26J98M48k14l66k03N5J7K25n6J13J77l15J20l81R2k06
$$ plain form
2137 -119 239 416 194 561 268 -139 107 -61 97 -5 524 264 -41 -97 -63 -389 95 12 18 204 40 190
2159 190 -4 -43 -237 -337 -21 118 86 132 -155 -255 -529 -471 -206 -56 -59 -84 16 -80 -428 -229 -561 -107 -66
2182 -66 125 56 -112 -414 -436 -212 -364 53 -95 213 -152 -176 -447 -99 -127 -43 -203 -87 117 149 -184 -248 -301
2205 -301 -268 -115 63 68 70 449 -87 -53 -41 -108 182 98 246 276 -111 -196 -53 -109 -143 18 151 76 351 -5 -247
2230 -247 -191 -87 51 166 35 194 -65 -167 -252 -224 -207 -75 7 -41 -181 -236 -36 -214 -398 -191 41 -38 -172
2253 -172 -411 -400 -362 -367 -337 -129 -164 42 -72 -120 32 -457 -244 20 44 -170 114 9 -204 16 -177 96 -86
2276 -86 122 145 335 -14 -269 61 -242 93 152 30 271 198 145 15 -99 -242 10 306 586 265 481 247
2298 247 352 217 106 257 444 294 163 -8 202 99 180 130 274 274 369 340 178 40 45 51 -143 516 272
$$ packed form
2137a19L58J77k22L67k93m07K46j68J58j02N29k60l05n6L4l26M84q3OJ86j64J50
2159A90j94l9j94j00L16J39l2M6k87j00k74N8K65J50lk5J00r6l48J99l32M54M1
2182f6J91o9j68l02k2K24j52M17j48L08l65k4k71L48k8Q4j60J16K04L2l33o4n3
2205c01L3J53J78NKL79n36L4J2o7K90q4J48L0l87q5J43n6l4J61J33p5K75l56k42
2230b47N6J04J38J15j31J59k59j02q5K8J7J32Q2m8j40n5K00j78j84K07K32p9j34
2253a72k39J1L8nL0K08l5K06j14m8J52m89K13K64K4k14K84j05k13K20j93K73j82
2276h6K08K3J90l49k55L30l03L35N9j22K41p3n3j30j14j43K52K96K80l21K16k34
2298B47J05j35j11J51J87j50j31j71K10j03Q1n0J44%R5k9j62j38NOj94O59k44
$$ plain form
2321 272 459 386 167 45 -282 -213 404 357 145 214 6 -229 164 -108 92 -185 3 180 -117 124 -8
2342 -8 -148 -149 -228 106 142 63 -127 -151 -92 -229 -360 -257 39 -251 142 -250 -55 -172 -186 -181 -146 182 194 209 -34
2367 -34 -315 -232 -89 53 8 -93 39 -66 4 -225 -229 -191 171 93 203 214 -152 -8 -243 -422 -52 210 13
2390 13 315 154 -161 -330 -443 -111 29 236 102 250 -56 267 -55 -223 71 -80 -93 437 39 -72 217
2411 217 59 -39 -204 55 119 74 -170 37 -295 -365 -146 -286 38 89 -50 -179 -271 -225 -283 -29 -117 -71 170
2434 170 -99 149 -102 -357 -151 -200 -111 57 47 -270 -377 -300 -303 -26 -423 77 -111 308 -135 -172 -313 -421
2456 -421 -262 -40 32 96 211 -30 13 -134 -237 -39 9 56 276 -173 -32 51 -10 37 182 133 -103 324 142
2479 142 71 -119 387 337 50 407 278 425 217 -36 -4 288 309 80 80 328 263 10 75 -10 117 146 380
$$ packed form
2321B72J87p3k19j22l27O9O17m7k12O9k08k35L93k72K00k77J88J77k97K41j32
2342hj40jp9L34L6p9j90k4N9j37j31J03K96k90L93l92J95j17j4NL5L28J2J5k43
2367c4k81Q3J43J42m5j01J32j05P0k29mL8L62p8J10J1l66J44k35j79L70K62j97
2390A3L02j61l15j69j13L32J40K07j34J48l06L23l22j68K94j51j3N30l98j11K89
2411B17j58r8j65K59O4m5k44K07l32p0K19j40L24N1j39j29r2M6n8K54q8M6K41
2434A70k69K48k51k55K06m9Q9J68j0l17j07P7lK77l97N00j88M19m43l7j41j08
2456d21J59K22P2O4J15k41M3j47j03J98M8M7K20m49J41Q3o1M7J45m9k36M27j82
2479A42p1j90N06n0k87L57j29J47k08k53L2K92K1k29%K48o5k53O5q5J27K9K34
$$ plain form
2502 380 96 292 136 257 -83 55 90 110 237 -30 -5 -160 16 30 -145 -110 80 276 118 -157 -107 -139
2524 -139 -187 -94 -95 -235 -41 90 -209 -54 -267 -140 -119 94 175 272 -144 -223 -124 -147 -216 -143 -44 106 -31 2 -109
2549 -109 -94 -294 -215 -159 -39 -66 104 13 -307 186 19 108 127 343 224 83 -137 -160 -314 82 144 210 84
2572 84 62 230 112 -171 174 258 -215 -72 207 228 -245 -205 49 -218 55 342 416 77 -15 80 -11 131 -184
2595 -184 37 -35 -146 79 -221 117 -65 -319 23 -87 146 101 56 -146 85 -188 -223 13 -236 67 55 -472
2617 -472 124 -247 29 -318 54 -74 43 -425 -333 -256 -179 -340 -116 51 28 85 -152 -201 -131 33 -159 -110 -13
2640 -13 -61 -57 -177 -242 60 -96 41 -97 121 -18 -233 -27 -273 -142 142 111 214 481 429 264 151 65 82
2663 82 -19 299 269 112 159 -232 94 14 237 169 182 64 94 89 378 -308 -8 220 194 176 196 57 322 46
$$ packed form
2502C80k84J96j56J21l40J38L5K0J27k67K5j55J76J4j75L5J90J96j58k75N0l2
2524a39m8R3jj40J94J31k99J55k13J27K1K13Q1R7m16p9R9k3o9P3R9J50j37L3j11
2549a09J5k00P9N6J20k7J70r1l20M93j67Q9J9K16j19j41k20k3j54L96O2O6j26
2572H4k2J68j18k83L45Q4m73J43K79K1m73M0K54k67K73K87P4l39r2R5r1J42l15
2595a84K21p2j11K25l00L38j82k54L42j10K33m5m5k02K31k73l5K36k49L03j2n27
2617d72N96l71K76l47L72j28J17m68R2P7P7j61K24J67k3N7k37m9P0J64j92M9R7
2640a3m8Mj20o5L02j56J37j38K18j39k15K06k46J31K84l1J03K67n2j65j13q6J7
2663H2j01L18l0j57M7l91L26q0K23o8J3j18L0nK89o86L00K28k6j8K0j39K65k76
$$ plain form
2687 46 -38 -2 23 262 -64 -34 242 309 27 -55 58 27 222 162 76 211 71 8 56 -241 -47 13 24 111 -93
2712 -93 -141 -174 93 -48 19 -64 41 233 -45 59 -114 -36 26 -242 -94 99 -158 60 -76 -274 -124 -68 -113
2735 -113 23 16 329 -276 -240 -120 86 395 130 -17 -75 315 127 -57 18 74 166 89 101 70 233 88 54 51
2759 51 109 140 255 -50 -246 -36 144 -157 152 -4 191 140 349 -225 27 172 -68 -74 351 101 -28 -167
2781 -167 178 -26 -449 -175 -244 -23 64 -76 13 -567 52 -293 -42 -182 -137 117 -30 -217 -182 -191 113 53 -14
2804 -14 105 -224 -249 -226 -181 -252 -152 -339 -97 235 44 1 -5 -222 -103 -37 -85 -61 -95 181 -24 -226 -190 -126 -224
2829 -224 -56 327 -9 182 -109 -111 20 -106 163 135 182 245 -135 -270 -125 -42 264 52 312 253 -44 72
2851 72 84 -191 -72 10 35 137 101 125 -270 -144 -65 -86 351 84 36 -155 198 60 -149 -114 43 11 271 205
$$ packed form
2687D6q4L6K5K39l26L0K76O7k82q2J13l1J95o0q6J35j40o3M8k97J94O0J1Q7k04
2712i3m8l3K67j41O7q3J05J92k78J04j73P8O2k68J48J93k57K18j36j98J50N6m5
2735a13J36pL13o05L6J20K06L09k65j47n8L90j88j84P5N6R2p7J2l1J63j45l4l
2759E1N8L1J15l05j96K10J80l01L09j56J95n1K09n74K52J45k40oM25k50j29j39
2781a67L45k04m23K74o9K21Q7j40Q9n80O19l45K51j40M5K54j47j87L5rL04o0o7
2804a4J19l29k5K3M5p1J00j87K42L32j91m3ok17J19O6m8K4l4K76k05k02L6O4r8
2829b24J68L83l36J91k91kJ31j26K69k8M7O3l80j35J45Q3L06k12K60n9k97J16
2851G2J2k75J19Q2K5J02l6K4l95J26P9k1M37k67m8j91L53j38k09L5J57l2K60o6
$$ plain form
2875 205 -109 101 138 49 -39 -321 -12 -70 12 -241 -184 43 -293 -61 30 201 -54 54 51 -61 -147 -243 20 53
2899 53 -50 251 68 -209 183 -90 40 171 257 212 -22 120 -196 10 133 -66 -37 50 92 7 -248 -3
2921 -3 -119 134 146 259 93 99 165 65 102 22 -119 54 73 132 50 173 110 -25 21 27 -29 49 192 68 -15 81
2947 81 170 212 -9 208 45 340 59 39 120 -171 -87 -40 105 -88 78 38 -55 69 -97 -41 -124 202 -77 129
2971 129 -125 -273 -35 -250 6 -235 162 211 -227 -249 -60 -196 117 -7 -261 -213 -334 -70 -171 61 -161
2992 -161 -91 -7 215 -68 101 -269 -90 -299 -119 43 119 60 -325 -145 -154 78 -60 205 -51 209 24 -25
3014 -25 -234 -203 170 -21 -58 118 256 -150 305 -378 145 87 -33 -71 64 -6 75 11 164 58 -200 95 -55
3037 -55 52 147 -1 -117 135 -172 -62 9 -18 45 122 201 80 -169 -326 163 -18 284 219 179 -48 22 -87
$$ packed form
2875B05l14K10L7q9q8k82L09n8Q2k53N7K27l36K32R1J71k55J08lj12q6r6K63L3
2899E3j03L01j83k77L92k73J30J31Q6m5k34J42l16K06J23j99K9Q7M2q5k55K45
2921cj16K53J2J13j66OO6j00L7q0j41J73J9N9q2J23o3j35M6On6P8J43j24q3R6
2947H1Q9M2k21K17j63K95k81k0Q1k91Q4M7J45j93J66m0r3J24j66N6q3L26k79K06
2971A29k54j48K38k15K56k41L97M9m38k2J89j36L13j24k54M8j21K64j01K32k22
2992a61P0Q4K22k83J69l70J79k09J80J62P6n9l85J80rK32j38K65k56K60j85m9
3014b5k09L1L73j91l7J76J38m06M55o83N23n8j20l8J35p0Q1o4J53j06k58K95j50
3037e5J07R5j48j16K52l07J10P1k7O3P7P9j21k49j57M89j81L02o5m0k27P0j09
$$ plain form
3060 -87 -279 -236 -86 0 35 -176 79 -117 -372 1 -102 66 -207 -282 78 -96 -125 35 -44 -223 11 -11 -118
3083 -118 -12 14 -71 -253 -240 -238 76 132 231 -151 -16 198 76 204 -84 -97 -54 -8 -30 117 -1 -62 40 176
3107 176 47 24 1 62 313 41 365 153 -114 218 -128 67 -88 -107 54 214 148 -45 227 45 282 119
3129 119 -102 121 230 133 -85 306 -153 128 -123 -38 -207 4 108 -56 -32 25 -31 146 -239 257 133 83
3151 83 -535 41 -218 50 -307 45 9 122 -117 -121 47 -64 -198 6 66 107 115 -50 -27 -91 -124 -176 76 131
3175 131 -10 81 -106 261 -144 -142 100 -32 115 -195 96 80 132 -116 -141 3 150 -8 108 -106 -15 65 175
3198 175 166 -5 -197 85 176 223 51 -45 -159 27 159 396 15 -148 152 10 -243 195 124 -82 114 267
3220 267 -15 -83 -230 27 21 13 137 137 -100 35 -197 -47 159 115 82 173 127 26 17 -134 104 -321 215 366
$$ packed form
3060h7j92M3J50Q6L5k11K55j96k55L73j03J68k73p5L60j74k9J60p9j79K34k2j07
3083a18J06K6q5j82J3KL14N6R9l82J35K14j22J28k88j3M3M6k2J47j18o1J02J36
3107A76j29k3k3O1K51k72L24k12k67L32l46J95j55j9J61J60o6j93K72j82K37j63
3129A19k21K23J09r7k18L91m59K81k51Q5j69K11J04j64K4N7n6J77l85M96j24n0
3151H3o18N76k59K68l57L52l6J13k39mJ68j11j34K04O0M1Qj65K3o4l3n2K52N5
3175A31j41R1j87L67m05KK42j32J47l10K91j6N2k48k5J44J47j58J16k14R1Q0J10
3198A75rj71j92K82R1M7j72r6j14J86J32K37l81j63L00j42k53M38p1k06J96J53
3220B67k82o8j47K57oqJ24%k37J35k32J50K06m4l3R1m6j01rj51K38m25N36J51
$$ plain form
3244 366 112 -53 51 37 220 -37 -72 -47 80 24 31 -135 -40 -273 -48 -272 -279 -146 -37 -59 17 56 -124 146
3268 146 -252 127 -223 139 -77 -89 -15 -257 -39 217 192 147 329 -52 -81 -122 143 -21 -25 296 -21 -70 174
3291 174 52 114 -78 149 -105 416 313 -90 208 48 64 -239 -37 168 217 -64 170 -189 20 -141 114
3312 114 188 139 206 -140 84 -21 142 -219 -54 84 -30 -90 49 -133 7 -216 -5 -138 -75 257 148 -108
3334 -108 -140 19 198 53 -97 81 31 -146 -86 -59 -115 -238 -19 -156 -64 -316 -20 241 97 -25 104 -166
3356 -166 -335 52 56 -47 -105 254 89 149 -123 -206 88 47 -43 -194 201 238 207 112 266 95 184 17 -221 -40
3380 -40 25 104 279 -133 -67 93 151 105 -142 160 -190 88 19 229 -86 -62 -39 -16 129 -220 250 -155 -77 286
3404 286 74 11 59 69 14 283 307 -107 109 125 -137 -237 -63 283 293 82 2 -188 119 -245 -139 -172 96
$$ packed form
3244C66k54j65J04j4J83k57l5K5J27n6Pj66R5k33K25k24pJ33J09k2P6L9j80K70
3268A46l98L79l50L62k16j2P4k42K18K56k5m5J82l81k9m1K65j64mL21l17m9K44
3291A74j22O2j92K27k54N21j03m03K98j60J6l03K02K05M9k81K34l59K09j61K55
3312A14P4m9O7l46K24j05J63l61J65J38j14o0J39j82J40k23K11j33O3L32j09k56
3334a08l2J59J79j45j50J78n0j77O0K7n6j23K19j37R2k52K96K61j44j22J29k70
3356a66j69L87Mj03n8L59j65O0k72q3K94m1r0j51L95L7l1r5J54j71Q9j67k38J81
3380d0O5P9J75m12O6J60N8m6k47L02l50K78o9K10l15K4K3K3J45l49M70m05P8L63
3404B86k12o3M8J0n5K69K4m14K16J6k62j00J74L46J0k11q0j90L07l64J06l3K68
$$ plain form
3427 96 38 107 -89 61 -144 -147 71 109 75 50 -308 -209 61 -46 13 -178 124 -16 -252 166 165 -165 -334 -61
3451 -61 -56 -142 104 -117 23 3 -91 -46 -52 92 -69 212 -108 -333 115 -72 -13 -163 -146 -304 108 91 98 -21 46
3476 46 111 81 303 186 78 127 141 -314 363 -244 275 151 46 171 230 227 -9 40 -13 -162 78 170 43 90
3500 90 102 -77 61 79 -23 182 -33 304 271 78 -148 -342 -113 -95 -97 178 67 -148 36 102 -133 -74 -190
3523 -190 123 72 -242 -123 -5 74 11 -39 -160 148 -386 226 253 -2 -222 95 -319 226 -273 -246 -185 -236 136
3546 136 -63 70 17 -72 -107 116 -108 147 155 -33 219 91 15 -221 -149 -115 -124 52 161 143 131 -158 -8 -115
3570 -115 107 306 5 183 -53 -234 151 31 -35 116 -99 -10 -27 -17 151 -215 18 -44 -21 253 332 -120
3592 -120 -136 32 223 -117 -158 46 91 185 -155 -168 -110 181 -149 -165 -182 -2 -17 -179 -234 76 -74 -50 197 29
$$ packed form
3427I6n8O9j96J50k05lK18L8l4k5l58R9K70j07N9j91L02j40k36M18jl30j69K73
3451f1Nq6K46k21J40k0r4M5oJ44j61K81l20k25M48j87N9j50J7j58M12j7Pj19O7
3476D6O5l0K22j17j08M9J4m55O77o07N19j24j05J25N9lk36M9n3j49K40R2j27M7
3500I0J2j79J38J8j02K05k15L37l3j93k26j94K29J8kK75j11k15J84O6k35N9j16
3523a90L13n1l14J19J18P9o3n0j21L08n34O12K7k55k20L17m14N45m99K7O1n1L72
3546A36j99J33n3q9l5K23k24K55Qj88K52j28p6k36P2L4rJ76J09j8j2k89J50j07
3570a15K22J99l01J78k36j81L85j20o6J51k15Q9j7J0J68l66K33o2K3K74P9m52
3592a20j6J68J91l40m1K04M5R4l40j3N8K91l30j6j7J80j5j62n5L10j50K4K47j68
$$ plain form
3616 29 84 78 -343 -83 -9 -91 -151 292 -86 -92 -22 20 23 -78 -203 20 204 -221 -86 35 61 -46 124 -116 156
3641 156 -212 291 -2 -260 95 82 -189 -63 -8 136 186 203 129 -100 82 -29 160 -198 -302 61 0 133
3663 133 48 41 -4 151 -127 160 71 -41 73 -156 204 196 -15 135 -85 172 -166 17 -220 -28 -49 34 139
3686 139 51 19 -29 -181 -85 23 12 361 252 -26 8 -60 18 42 -7 -74 8 -65 -69 -329 -151 -277 -164 -170 28 -92
3712 -92 320 150 -34 -234 -60 47 -95 147 51 15 -91 43 -3 -51 -148 141 -255 45 73 59 341 -1 95
3735 95 65 67 171 -11 10 194 -292 253 97 144 273 175 80 -71 2 -179 -83 -126 -122 -19 129 -138 248 102
3759 102 -170 -173 195 -165 -81 125 -72 121 -243 -57 -44 418 -9 236 6 85 67 -183 67 124 231 53
3781 53 171 450 232 -129 -81 -98 -217 -38 -118 158 -57 -192 -229 -42 -357 4 -62 -14 -112 -24 -51 32 -66 29
$$ packed form
3616B9N5om21K60P4q2o0M43l78oP0M2Lj01j25K23J84m25J35J21K6j07J70k40K72
3641A56l68N03k93k58L55j3k71J26N5J44N0J7p4k29J82j11J89l58j04L63o1J33
3663A33q5pm5J55k78K87q9j12J14k29L60qk11J50k20K57l38J83k37J92k1Q3J05
3686A39q8l2m8j52R6J08j1L49j09k78L4o8P8K4m9o7Q2p3mk60J78j26J13oJ98j20
3712i2M12j70j84k00J74J07j42K42r6l6j06J34m6m8r7K89l96L00K8j4K82l42R6
3735I5l0KJ04j82K1J84m86N45j56M7J29r8r5j51P3j81R6m3MJ03J48k67L86j46
3759A02k72lL68l60Q4K06j97J93l64J86J3M62m27K45k30P9j8k50K50N7J07j78
3781E3J18K79k18l61M8j7j19J79q0K76k15j35l7J87l15L61o6M8r8Q8k7Q3r8R5
$$ plain form
3805 29 86 -123 138 -184 67 -40 -14 170 61 -206 -53 -195 125 56 -382 200 -231 170 32 221 12
3826 12 -26 158 -1 -186 -156 31 126 80 15 23 -129 -345 -35 335 138 19 43 86 208 -121 56 154 306 214
3850 214 -87 -179 36 -153 -88 48 -244 -1 26 12 36 -42 -201 -17 -117 170 79 -132 -218 -39 -123 -370 358
3873 358 -122 -89 88 12 12 -260 -50 109 192 57 -36 185 94 -32 -119 -228 -79 -32 154 115 130 32 -59 66
3897 66 -247 -89 219 116 68 -140 18 80 219 -46 64 -217 107 161 -24 -60 -211 -120 -113 -89 -42 -34 1 183
3921 183 -73 225 -43 -97 5 -79 95 -119 26 21 260 163 -52 318 -88 225 114 58 -4 -191 94 -8
3943 -8 -87 89 -198 26 200 31 -16 -134 -17 -262 73 133 -41 -214 201 -35 269 95 -11 -67 -167 15
3965 15 -82 -288 38 154 73 305 -29 139 110 17 -175 141 -166 177 -120 -140 -40 59 -45 -123 -108 -80 130
$$ packed form
3805B9N7k09K61l22K51j07K6J84j09k67J53j42L20o9m38N82m31M01j38J89k09
3826A2l8J84j59j85L0J87R5m6o5Qj52k16L10L70j97j19K4M3J22l29J77R8J52r2
3850B14l01r2K15j89O5J36k92K43K7j4K4p8j59J84j00K87r1k11q6J79q4k47P28
3873C58m80L3J77p6%k72K10J59Q3j35r3K21r1j26q7j09J49M7J86l9J5r8r1J25
3897F6l13J58L08j03m8k08J58O2J39k65J10k81L24N4j85l6j51R1PK4M7QL5J82
3921A83k56K98k68n4J02q4J74k14J45nK39r7k15L70m06L13j11n6o2j87K85j02
3943hp9J76k87K24J74j69m7j18J17k45L35O0j74j73M15k36L04j74j06n6j00J82
3965A5r7k06L26J16q1K32l34J68k9r3j92L16l07L43k97k0J00R9j04p8J5K8K10
$$ plain form
3988 130 31 -170 -93 -352 75 -177 119 -70 209 24 -391 21 -124 -274 -99 -20 -42 145 234 265 185 -155
4010 -155 -5 -38 188 267 5 -133 -50 33 -183 127 -110 -192 127 19 47 -163 -248 -234 -63 -2 -16 1 24 284
4034 284 169 -182 -252 -103 162 -142 210 135 55 -110 -78 119 -102 178 120 -171 -245 -56 -5 -178 -260 100 181
4057 181 -48 -21 138 -25 -409 7 20 -78 0 105 -17 70 -54 23 -95 -31 83 -104 -232 130 39 25 18 103
4081 103 167 130 63 12 -214 -160 -226 85 -242 -1 -84 -81 -116 22 95 1 187 127 -8 55 -26 70 -55 160 -187
4106 -187 -126 40 -23 -360 185 234 -69 5 -26 -168 -195 263 157 81 -86 -202 -54 126 301 128 -11 -106 -7
4129 -7 22 -65 -37 -244 83 14 -4 -268 21 -4 -155 143 10 -67 270 -190 -131 65 -61 190 -65 -99 -51 109
4153 109 -20 -177 31 -19 257 -151 33 325 99 189 -85 -344 -227 124 -132 -49 -65 78 -22 -66 -266 50
$$ packed form
3988A30r9k01P7k59M27k52K96j89K79j85m15M12j45j50J75P9k2J87Q9L1q0l40
4010a55J50l3K26P9k62j38Q3Q3k16L10k37q2L19j08K8k10q5J4J71O1j4J7K3K60
4034B84j15l51p0J49K65l04L52p5q0j65L2J97k21K80n8k91p4J89N1j73q2L60Q1
4057A81k29K7J59j63l84M16J3r8P8J05j22Q7j24P7j18O4J14j87j28L62r1j4pQ5
4081A03O4l7o7n1k26N4o6L11l27K41q3Ll5J38P3r4J86o0j35O3q1R6j25K15l47
4106a87O1J66o3l37N45M9l03P4l1j42k7M58j06p6j67j16J48J80J75j73j39r5R9
4129gK9q7K8k07L27o9j8k64K89k5j51K98j33p7L37m60N9J96j26K51k55l4M8J60
4153A09j29j57K08n0K76m08J84K92k26R0k74k59J17L51k56Q3j6J43j00m4k00L16
$$ plain form
4175 50 -112 -248 -229 -301 -1 77 -163 171 -256 -126 -189 -283 -45 57 70 -125 -242 169 -98 189 7 21 145
4198 145 176 78 138 -130 -203 200 340 166 -9 170 195 -171 71 -142 99 -54 42 -44 -298 -95 77 -102
4220 -102 110 -95 58 -8 -108 -92 -9 12 -163 -176 -48 166 -45 -205 -140 57 52 139 -48 -186 -58 -18 -332
4243 -332 -113 -93 -77 -54 -132 148 62 16 -39 -102 -13 -82 294 -24 250 153 57 16 118 -84 60 133 -305 -82 153
4268 153 23 -17 4 -197 -302 191 50 -20 20 94 95 16 -9 30 15 117 116 153 -138 -41 -89 -64 34 14 95 35 -144
4295 -144 91 -171 -71 -64 116 -23 178 206 124 327 -265 -76 99 -249 -169 -109 4 -93 284 202 65 114 -110
4318 -110 32 -219 -178 -72 53 144 -137 -138 40 -99 -13 23 48 47 -161 134 -150 -79 -277 -14 -150 16 67 116
4342 116 95 -26 -83 -172 -134 -55 -192 270 92 -28 152 -209 -234 40 -146 156 -177 143 -16 35 -34 49 -183
$$ packed form
4175E0j62j36J9p2L00P8k40L34m27J30o3r4K38J02J3j95j17M11k67K87j82J4J24
4198A45L1r8O0k68p3M03J40j74j75J79K5l66K42k13K41j53R6q6k54K03J72j79
4220a02K12k05J53o6j00J6Q3K1j75j3J28K14k11j60O5J97nQ7j87j38J28M0l14
4243c32K19K0J6K3p8K80q6m6n5o3Q9o9L76l18K74r7r6m1J02k02J44P3m38K23K35
4268A53j30m0K1k01j05M93j41p0M0P4Jp9k5L9j5J02jL7k91R7m8K5R8k0Q1o0j79
4295a44K35k62J00PJ80j39K01K8q2K03n92J89J75l48Q0O0J13r7L77q2j37M9k24
4318a10J42k51M1J06J25R1k81jJ78j39Q6L6K5jk08K95k84P1j98K63j36J66N1M9
4342A16k1j21n7q9L8P9j37M62j78j20J80l61k5K74j86L02l33L20j59N1o9Q3k32
$$ plain form
4365 -183 -37 222 56 208 -252 -115 -145 3 -40 -1 110 -12 -236 69 -46 -241 -74 116 -12 -238 37
4386 37 -40 162 -144 -71 -27 44 -329 39 7 -68 -54 -124 178 22 42 -194 -32 23 64 -18 82 111 -67 -157 131
4411 131 -92 234 -66 -171 -226 61 36 28 37 121 -266 117 126 -129 248 -111 -136 -234 19 244 -24 131 -52 135
4435 135 -49 -114 52 -66 -217 -26 -126 -164 52 -16 117 59 9 1 -31 -20 -17 -85 79 -58 -33 -164 -182 -98 177
4460 177 204 151 209 161 -135 -6 -105 -8 -106 220 -106 -173 268 131 215 -156 -6 -10 -75 62 -33 17 94 219 249
4485 249 -188 78 -236 -190 -73 -18 129 -125 98 -12 -214 -12 -169 94 -193 -219 374 -342 -72 172 62
4506 62 59 75 33 -262 -146 -187 -155 -47 -65 -77 -50 82 -252 -150 85 32 37 21 0 -98 -68 -24 -21 -177 -196 71 -78
4533 -78 -63 -181 -149 -86 -154 177 -213 87 -162 -105 -31 25 18 181 -126 -93 -63 -233 148 51 -190 -6 -140 191
$$ packed form
4365a83J46K59j66J52m60J37l0J48m3L9J11j22k24L05j15j95J67J90j28k26K75
4386C7p7K02l06P3M4P1l73L68l2p5J4p0L02j56K0k36J62N5M1q2J00K9j78r0K88
4411A31k23L26l00j05n5K87k5qRQ4l87L83Rk55L77l59k5r8K53K25k68J55j83J87
4435A35j84o5J66j18j51J91j00l8K16o8J33n8n0ql2J1Lo8J64j37K5j31j8Q4K75
4460A77K7n3N8m8k96J29r9R7r8L26l26o7M41j37Q4l71J50mo5J37r5N0P7J25L0
4485B49m37K66l14M6J17N5J47k54K23j10k02K02j57K63k87k6N93p16K70K44j10
4506F2lJ6m2k95J16m1L2J08j8j2K7J32l34J02K35n3Nj6k1r8L0M4Lj56j9K67j49
4533g8J5j18L2O3o8L31l90L00k49N7P4N6pJ63l07L3L0j70L81r7k41J84j34L31
$$ plain form
4557 191 -210 -175 -116 -135 85 -77 -99 164 178 37 13 -61 -66 -353 158 72 -209 -45 25 -229 -180 166 -43 108
4581 108 -64 -87 -88 -120 -116 -23 -168 -381 -23 117 -264 -212 -189 -127 -127 97 -172 -52 -71 -57 -59 -49 24 167 -97 38
4607 38 -80 194 -108 170 -194 99 145 -141 -138 32 165 -12 130 119 -112 163 -102 -48 59 -29 46 79 193
4630 193 -22 108 70 87 71 -27 -21 -56 129 204 118 -80 247 79 -63 -313 -48 39 -248 -67 68 314 40
4653 40 382 78 26 127 133 -77 -316 44 110 317 -100 -28 205 116 50 -61 -8 -202 -165 46 245 245 177 20
4677 20 -157 -61 -229 -208 -205 -248 129 3 147 48 -307 38 -75 39 -209 -115 137 86 -75 -76 -343 30 -63 -165
4701 -165 142 -17 -30 25 -213 2 55 -18 -62 -129 -225 -27 87 -31 -62 -19 -70 -88 -53 -125 -2 -73 -102 -255 122
4726 122 -143 91 99 205 44 67 6 -130 -77 59 28 -27 -39 53 -101 214 15 149 7 118 -93 3 164
$$ packed form
4557A91m01L5N9j9K20j62k2K63J4j41k4p4nk87N11q6k81J64P0k54M9L46k09J51
4581A08j72k3jl2MR3j45k13L58J40l81N2K3O2%K24k69J20j9J4kJ0P3J43k64J35
4607C8j18K74l02K78l64K93M6k86LJ70J33j77J42j1k31K75k65N4J07q8P5L3J14
4630A93k15J30l8J7j6r8Ol5J85P5q6j98L27j68j42k50K65Q7k87J81J35K46k74
4653D0L42l04n2J01Ok10k39L60O6K07m17P2K33q9o6j11N3j94L7K11J99%o8j57
4677B0j77R6j68K1Lm3L77j26J44r9l55L45j13J14k48R4K52n1j61jk67L73r3j02
4701a65L07j59j3N5k38K15N3p3m4o7r6J98J14j18l1M3n1j8L5p2J23p1k9j53L77
4726A22k65K34QJ06j61K3o1j36N3J36l1n5j2R2j54L15j99J34j42J11k11R6J61
$$ plain form
4749 164 123 53 120 169 39 -31 146 7 -101 44 -49 -294 67 -117 -111 184 -10 163 -51 15 -52 -214 3
4772 3 103 155 189 116 -137 -160 -49 -3 -142 -216 -6 68 7 -57 -145 -171 125 -140 -117 127 134 -48 -18 99 -52 -27
4798 -27 61 26 156 22 -2 110 -207 -146 -72 61 -70 66 -65 238 48 140 -412 53 -245 158 128 -35 22
4821 22 147 238 184 41 -246 125 -142 45 -158 -56 -62 192 50 256 -45 14 -66 114 30 -12 297 144 258
4844 258 3 -106 -29 235 -61 55 41 8 194 10 59 161 0 -204 69 135 -73 -5 151 3 68 5 -94
4867 -94 -147 166 108 -144 166 321 30 122 195 -280 -127 214 184 -114 -34 -9 -322 -114 -73 -26 87 -89 97
4890 97 -33 -7 -142 -18 62 149 75 -79 -77 166 -9 -49 238 -27 117 212 -15 201 160 23 29 -192 -89 -108
4914 -108 145 67 -15 -32 30 50 135 29 128 251 -388 -167 -58 -270 -183 -201 126 60 97 -301 2 -190 110 104
$$ packed form
4749A64m1p0O7M9j30p0J77j39j08J45r3k45L61j84OK95j94J73k14O6o7j62K17
4772CJ00N2L4p3k53k3J11M6j39p4K10P4o1o4q8k6K96k65K3K44Pj82L0J17j51K5
4798b7Q8l5J30j34k4J12l17O1P4J33j31J36j31L03j90R2n52M65k98M03l0j63N7
4821B2J25R1n4j43k87L71k67J87k03J02oK54j42K06l01N9q0J80q4m2L09j53J14
4844B58k55j09P7K64k96J16j4l3J86j84M9J02j61k04K73O6k08O8J56j48O5o3r9
4867i4n3L13n8k52L10J55k91R2P3m75J53L41l0k98Q0K5l13K08M1M7J13j76J86
4890I7j30K6j35J24Q0Q7p4j54KK43j75m0K87k65J44R5k27K16m1j37Ok21J03j9
4914a08K53p8q2j7O2K0Q5j06R9J23o39K21J09k12Q7j8L27o6L7l98L03j92L00o
$$ plain form
4938 104 -72 37 -137 144 273 -59 -3 75 117 235 -189 -14 -174 23 -268 -111 152 -172 261 -26 145
4959 145 118 28 80 142 -23 -68 -2 13 -90 2 -211 37 -181 133 139 16 61 -201 -220 93 -118 -190 -241 137 -89
4984 -89 2 183 76 40 112 -19 206 -1 78 -126 52 -96 116 -1 146 251 -77 87 -134 73 366 -26
5006 -26 95 129 231 14 -65 164 60 -59 132 234 150 13 -126 159 -160 -69 -101 -121 116 -106 -65 -3 -180
5029 -180 250 -14 13 -35 -220 102 205 -140 11 90 -47 51 -23 74 17 39 -129 54 -84 12 280 -145 -70
5052 -70 -43 -1 206 262 -179 -24 69 -14 199 39 62 -1 -46 -4 -36 -147 102 19 -165 -292 -201 295 -194 -52
5076 -52 70 -132 121 -27 15 -134 22 137 29 122 165 152 -6 -54 146 24 65 17 -75 60 135 116 -3 -26
5100 -26 98 -180 -13 -45 103 -142 60 123 192 -56 -263 158 -236 88 -56 34 109 -66 168 -24 73 247
$$ packed form
4938A04j76J09j74K81J29l32N6P8M2J18m24J75j60J97k91J57K63l24M33k87J71
4959A45k7r0N2O2j65m5O6J5j03R2k13K48k18L14Oj23M5k62j9L13k11p2n1L78k26
4984h9R1J81j07l6P2j31K25k07P9k04J78j48K12j17J47J05l28J64k21K07K93l92
5006b6J21L4J02k17p9K29j04j19J91J02q4j37j39K85l19R1l2k0K37k22M1O2j77
5029a80M30k64K7m8j85L22J03l45J51P9j37R8p4R7n7K2j68J83j38R6K68m25P5
5052g0K7M2K07N6m41J55R3q3K13j60K3o3m5M2l2j11K49q3j84j27R1M96m89J42
5076e2J22k02K53j48M2j49J56J15j08R3M3j3j58m8K00j22M1m8r2J35P5j9j19k3
5100b6J24k78J67l2J48k45K02O3O9k48k07M21l94L24j44R0P5j75K34j92R7J74
$$ plain form
5122 247 36 160 -40 -68 -162 50 131 -129 169 -310 -75 314 -246 -71 -7 -6 97 162 13 41 9 -54 68
5145 68 -69 -46 -3 93 -10 423 -157 140 11 -65 43 33 2 103 -78 -7 -15 17 87 57 -72 69 -29 -175 -35
5170 -35 -195 -5 -43 -158 7 -26 -56 86 143 -75 108 26 230 -73 -325 -191 74 70 -63 -189 -47 13 -133
5193 -133 182 168 -3 67 125 51 182 -147 -31 213 -285 102 118 205 12 -32 -36 82 33 -77 -161 111 62 32
5217 32 18 -10 41 -257 -112 72 -22 24 127 -33 48 -54 113 -61 -40 59 168 -139 -83 8 -126 -42 401 -11
5241 -11 -69 -136 -13 54 -360 43 -119 277 -188 -72 -8 -153 100 105 -62 6 -102 -158 -73 -146 -23 -143 -131 -108
5265 -108 81 200 85 -35 181 -95 17 -111 124 201 -20 -163 98 127 120 -93 291 6 -13 170 -65 222
5287 222 218 -4 60 -34 16 163 -104 371 137 -72 -64 173 80 107 1 -77 63 -229 -46 -269 -293 -62 -13 -179
$$ packed form
5122B47k11J24k00k8r4K12Q1k60K98m79K35L89n60J75O4JJ03O5j49K8l2o3J22
5145F8j37K3M3R6j03M33n80K97j29p6J08j0l1J01j81P1qL2P0l0j29J41r8j46J40
5170c5j60J90l8j15J65l3l0J42N7k18J83q2K04l03k52J34K65mj33j26J42O0j46
5193a33L15j4j71P0N8p4J31l29J16K44m98L87J6Q7j93m4mJ18m9j10q4K72m9l0
5217C2j4k8N1k98J45J84r4M6J03j60Q1j02J67j74K1R9J09l07N6R1j34Q4M43m12
5241a1n8o7J23O7m14M03j62L96m65J16O4j45K53Nj67O8j08n6Q5p3J23j20J2K3
5265a08J89J19j15j20K16k76J12j28K35P7k21j43K61K9pk13L84k85j9J83k35K87
5287B22mk22O4r4N0J47k67M75k34k09QK37r3K7j06p8J40k92J83k23k4K31M9j66
$$ plain form
5311 -179 -220 -40 -58 89 387 201 57 -56 43 -128 96 -241 -169 106 -18 55 32 -98 -208 227 -168 -4
5333 -4 -203 -147 -92 -45 -177 -134 129 -121 88 241 168 -299 88 -55 -65 154 56 257 -79 82 -153 -70 281
5356 281 -66 -10 -77 35 191 -31 -62 135 -235 44 239 -89 62 -147 61 -183 -110 68 -121 -367 -149
5377 -149 -96 -240 248 -25 -50 -10 -117 -153 14 -77 0 16 44 -77 222 28 -55 72 40 -206 -47 97 -102
5400 -102 20 80 58 55 16 30 -208 -108 202 -142 43 -32 159 92 -148 83 -428 89 -258 61 -403 98 53
5423 53 -100 -125 100 -112 253 -127 85 -159 -23 109 -181 -3 175 223 -9 -190 -183 48 139 -31 76 -46
5445 -46 -39 93 321 -19 -171 -187 492 134 -41 176 282 -46 126 257 16 96 105 -33 -186 47 -109 245
5467 245 162 -214 -273 21 -9 -185 335 -16 -36 218 34 173 -178 147 -47 38 -162 -83 117 -163 -343 93
$$ packed form
5311a79m1J80j8J47K98j86j44j13R9j71K24l37P2K75j24P3k3j30j10M35l95J64
5333dj99N6N5M7j32M3K63k50K09J53p3m67L87j43j0K19r8K01l36J61k35Q3L51
5356B81l47N6o7J12J56k22l1J97l70K79J95l28J51k09K08k44P3J78j89k46K18
5377a49N3j44M88k73k5M0j07l6J67r1P7J6K8j21K99j94q3J27l2k46J59J44j99
5400a02J22O0k2ll9J4k38J00L10l44J85p5J91o7k40K31n11N17l47L19m64N01m5
5423E3j53k5K25k12L65l80K12k44J36J32k90J78J78M8k32j81PK31R1j70J07j22
5445d6PJ32K28l40j52j6O79l58j75K17J06l28J72J31k41Q0Rj38j53K33j56L54
5467B45q3l76n9K94l0j76N20l51k0K54j84J39l51L25j94Q5k00P9K00k80j80M36
$$ plain form
5489 93 -144 -78 -53 -164 143 -82 -86 -98 299 73 111 -72 33 -34 66 77 54 -129 -32 -87 87 -141 47 -229
5513 -229 -3 -135 199 -30 94 61 187 228 -92 -13 -96 63 53 -69 -198 40 87 67 -88 78 -196 -108 38
5536 38 61 82 -95 -71 -1 115 95 -162 140 15 192 164 -194 -204 -106 103 -55 -30 143 143 124 115 159 -98 128
5561 128 -16 62 -35 -146 176 -142 350 -161 -70 129 63 -21 -107 45 -56 122 121 106 -189 -234 -105 -174 15 8
5585 8 -107 -129 -199 -80 85 -70 -112 23 -71 -113 267 114 -65 72 -160 236 -68 289 -195 -98 -35 141 -130
5608 -130 232 40 -38 44 31 25 43 67 -274 19 153 64 -38 77 -21 45 -16 -171 31 -56 -208 142 39 -299
5632 -299 166 10 -168 17 -50 145 -34 -120 -72 -62 -148 261 137 108 188 30 44 140 -24 -91 -175 266 297 173
5656 173 198 18 106 -56 28 -26 -108 72 -140 129 -52 -198 -11 -167 -30 201 -195 23 141 -189 42 312
$$ packed form
5489I3k37O6K5j11L07k25mj2L97k26L8j83J05o7J00J1k3j83R7n5J74k28J88k76
5513b29K26j32L34k29J24l3J26M1l20P9q3J59j0j22j29K38M7k0j55J66k74Q8J46
5536C8K3K1j77K4P0J16k0k57L02j25J77k8l58j0R8K09j58K5J73%j9rM4k57K26
5561A28j44P8r7j11L22l18M92n11R1J99o6q4q6J52j01J78jj5k95m5J29o9J89p
5585Hj15k2p0J19J65j55m2J35r4m2L80j53j79J37k32L96l04L57m84R7O3J76k71
5608a30L62j92p8Q2j3oJ8K4l41K93J34q9j02J15r8O6o1j55K02q7j52L50j03l38
5632b99M65j56j78J85o7J95j79q6M8J0q6M09j24k9Q0j58J4R6j64o7q4M41L1j24
5656A73K5j80Q8j62Q4n4q2J80k12K69j81j46J87j56J37K31l96K18J18l30K31K70
$$ plain form
5678 312 -45 -206 -86 -139 -146 -62 -36 2 93 -68 -174 -34 -172 -271 -52 -122 -306 312 -25 -17 143 93 -15 -104
5702 -104 124 224 -99 55 -142 128 -41 -139 -45 8 -419 -174 113 200 133 -24 211 -49 342 -293 -45 144
5724 144 -226 -124 105 77 -118 163 122 -102 -1 -145 8 57 -162 12 -151 170 -17 -101 63 -93 60
5745 60 30 74 -114 171 63 23 -95 114 -294 -60 -99 65 -38 75 -96 -99 -52 -111 -250 -44 71 18 -19 -178
5769 -178 -64 -13 39 -219 46 -270 -101 -54 -5 100 -109 -64 -67 26 -20 -40 11 -169 -62 273 63 -121 -70 -173
5793 -173 205 23 -53 123 97 300 355 -140 -114 -35 70 -5 190 -46 -36 58 -56 28 -36 -150 -21 -85 -52 222
5817 222 108 -160 99 63 -62 -51 -21 -6 -351 -28 205 36 -101 -3 37 -15 130 85 -153 219 -69 149 81
5840 81 -236 118 96 -86 -182 -107 116 -361 246 -78 -2 40 -36 -151 -39 -45 48 -2 -121 71 21 -197 112 -65
$$ packed form
5678C12l57j61J20n3pQ4K6L8R1j61j06J40j38r9K19p0j84O18l37QJ60n0j08q9
5702a04K28J00l23J54j97K70j69r8R4N3m27K45K87Q7o7j57K35k60L91o35K48J89
5724A44l70J02K29k8j95K81m1k24J01j44J53M9k19J74j63L21j87q4J64j56J53
5745F0l0M4j88K85j08m0j18K09m08K34l9J64j03J13j71lM7n9j39K06J15n3l7j59
5769a78J14N1N2k58K65l16J69M7M9J05k09M5lR3m6k0N1j80J07L35k10j84N1j03
5793a73L78j82p6J76k6K03N5m95K6P9J05p5J95k36J0R4j14Q4o4j14J29o4L3K74
5817B22j14k68K59l6j25J1L0J5l45L23K33j69j37R8M0n2J45m5k38L72k88K18o8
5840H1l17L54k2j82r6P5K23m77O07l24P6M2p6j15J12oR3n0j19J92n0k18L09j77
$$ plain form
5864 -65 210 -70 -151 -251 -211 -151 34 -117 109 -44 -133 -39 -268 -279 -24 39 40 -192 -117 95 206 136 37 -152
5888 -152 -57 -41 -24 -37 -184 66 42 22 159 -98 -204 -11 -65 174 -37 273 60 232 -19 -31 74 254 -164
5911 -164 0 37 -323 139 125 -100 -361 413 -42 99 -116 -120 -155 53 -25 -143 -38 61 236 113 -204 -32
5933 -32 180 -102 71 125 63 -219 -84 35 187 51 74 18 -194 62 -73 -95 -4 36 -173 88 -299 -6 82
5956 82 -42 -230 -67 54 156 -189 4 11 -61 9 20 -60 -44 169 31 276 -24 83 155 -167 71 381 -175
5979 -175 7 150 -193 16 -139 -7 194 -5 171 -104 69 -82 183 -215 -7 -97 50 102 -95 11 -82
6000 -82 -55 -72 -290 84 154 -37 -11 215 -146 -79 196 157 179 -368 -5 129 82 95 -32 -155 34 80 -47 -43
6024 -43 -42 -93 136 -30 -21 -18 163 116 -104 -110 94 16 -113 -7 14 -137 3 -185 110 129 -120 259 -15 -161 -154
$$ packed form
5864f5K75k80q1j00M0O0J85j51K26j53q9R4k29j1K55O3Jk32P5K12J11p0r9j89
5888a52R5J6J7j3j47K50k4k0J37k57j06J93n4K39k11L10k13J72k51j2J05J80m18
5911a64J64L7l60M62j4k25k61P74m55J41k15ml5K08p8j18J05R9J75j23l17J72
5933c2K12k82J73N4o2k82J35J19J52j36K3n6k12K56j35k2R1M0k09K61l87K93Q8
5956H2j24j88J63J21J02l45J93Pp2P0J1q0J6K13j38K45l00J07P2l22K38L10n56
5979a75J82J43l43K09j55J32K01j99J76k75J73j51K65l98K08r0J47N2j97J06r3
6000h2K7j7k18L74P0j91K6K26l61O7K75l9K2n47L63J34m7J3j27j23J89M6j27M
6024d3Jn1K29j66RLJ81m7k20oK04p8j29J06K1j51J40j88K95J9k49L79k74j46P
$$ plain form
6049 -154 -180 -52 42 -2 138 14 -85 -5 203 -125 -6 -32 80 278 -77 162 115 -98 -37 225 151 -203 9
6072 9 -26 24 -164 -33 137 -87 55 112 -154 -162 -203 -67 -83 272 271 -107 1 38 -116 -168 -73 230 57 126 175
6097 175 167 126 125 -84 18 354 -60 52 -173 -168 -18 -178 77 -20 86 -110 185 43 -187 9 102 38 -76
6120 -76 -7 174 31 -69 237 32 -190 54 -279 -191 63 -51 108 -154 -51 97 78 -103 8 -51 -247 24
6142 24 36 -171 -231 -136 -206 71 277 68 21 -233 -108 96 87 49 -5 91 -74 -236 64 -43 176 -24 -107 148
6166 148 199 -87 83 182 -89 99 81 -117 -60 -93 -41 21 -98 43 71 157 97 5 17 -187 80 -19 -395 170
6190 170 158 -105 -115 -144 -253 -53 182 -49 84 107 158 31 28 182 45 -143 10 -64 136 121 -129 79 -235
6213 -235 -4 -49 85 56 -188 165 -182 -259 47 50 4 20 -119 69 -124 -115 -75 -90 89 -129 -224 67 -238 17
$$ packed form
6049a54k6J28R4m4J40j24r9Q0K08l28J19k6J12J98l55K39m7k13O1K62p4l54K12
6072Il5N0j88J31J70k24J42N7k66qm1J36j6L55jl78J08L7j54n2R5L03j73O9M9
6097A75qm1jk09J02L36m14J12k25NJ50j60K55r7J06j96K95j42k30J96R3o4j14
6120g6O9J81j43j00L06k05k22K44l33Q8K54j14J59k62J03J48j9j81J11n9j96K71
6142B4J2k07o0R5p0K77K06k09m7k54J25K04rl8n4R6j65j62L00j07K19k00q3K55
6166A48N1k86J70R9k71J88j8j98N7l3N2O2j19J41K8Q6o0r2J2k04K67r9l76N65
6190A70j2k63j0k9j09K00K35k31J33K3N1j27lJ54j37j88J53p4K00j5k50K08l14
6213b35K31m5J34k9k44L53l47p7L06Lm6J6j39J88j93RM0j5J79k18r5K91l05K55
$$ plain form
6237 17 121 161 -87 -87 -46 6 -95 -263 138 268 65 22 54 141 136 -25 209 41 43 -97 47 117 -25 -196 73
6262 73 -173 -48 81 12 25 -142 -109 104 9 83 108 -94 16 -189 -150 109 -40 87 204 -348 -59 -65 -97 144
6286 144 36 13 -46 73 18 235 -233 -95 -207 160 95 240 209 3 -154 -59 189 -169 -213 324 146 91 -362
6309 -362 130 -118 112 26 -168 -61 -40 -30 -73 -1 -24 -234 118 45 -166 -129 -1 22 110 -291 -213 1 -86 230
6333 230 161 54 35 -31 20 -82 -186 -313 -13 -269 -41 -107 291 76 199 185 -60 79 76 408 147 177 -19
6356 -19 59 36 -135 224 -16 -104 74 -112 6 -168 69 -5 152 -13 108 84 -66 133 -37 43 13 -60 -53 -6
6380 -6 -141 -7 1 -300 -271 -333 -199 49 -24 -78 -195 -149 167 -52 10 73 -93 41 28 166 114 -177 16 2 -69
6405 -69 -160 13 -46 168 -30 -192 -78 -105 -69 -31 -17 -104 15 -7 158 120 81 87 36 59 71 131 78 272 -15 -136
$$ packed form
6237A7J04M0k48%M1N2j01j68M01J30k03m3L2Q7nj61K34j68Kj40J44P0j42j71K69
6262G3k46J25J29o9J3j67L3K13r5P4K5k02J10k05L9K59j49J27J17n52K89ol2K41
6286A44j08k3n9J19n5K17m68J38j12L67o5J45l1k06j57R5K48l58m4N37j78n5m53
6309c62M92k48K30q6j94J07K1J0m3P2k3k10L52p3k11L7J28K3Q8m01P8K14q7L16
6333B30o9j07j9o6N1j02j04j27L00k56K28o6L98k15J23j4k45J39lL32k61L0j96
6356a9P8k3j71L59k40q8J78j86J18j74K37p4J57j65J21k4j50J99j70Q0l0p3PM7
6380fj35J34Ql01K9o2J34K48p3n4j17M6L16k19O2O3j66J34j3J38n2k91J93j4p1
6405f9r1J73n9K14j98j62J14k7L6L8J4q7J19k2J65l8l9On1K3J2O0n3J94k87j21
$$ plain form
6431 -136 115 130 -80 -151 -84 16 -74 -244 28 -252 -133 -10 -39 -97 313 223 -42 28 -226 127 -62 82 23
6454 23 7 55 -41 215 -112 -104 -169 -312 -29 96 25 94 48 -126 -233 -157 -117 -123 108 -60 29 -30 33 161 321 -104
6480 -104 59 -61 -161 -209 83 -53 -184 104 38 60 -167 21 -103 39 22 116 98 67 -125 -108 88 243 4
6503 4 141 75 73 42 80 137 -36 -99 -20 94 40 214 -171 44 -233 -86 79 -158 -65 -192 -30 35 224 6
6527 6 28 -6 75 3 69 273 -145 23 87 -52 -107 -246 -198 45 -29 149 71 -169 -332 281 -78 30 23 32 -83
6552 -83 112 251 53 5 -97 72 -279 -152 17 57 23 74 -60 22 51 2 153 112 128 27 25 -83 -128 249
6576 249 -139 -223 -179 -221 -38 66 71 194 -129 9 102 -36 99 -176 213 -242 126 9 -23 -66 133 179 -146
6599 -146 39 4 -10 58 -89 69 -105 393 -235 83 -17 80 -240 -117 9 125 -49 -84 -1 -199 180 81
$$ packed form
6431a36K51J5k10p1O7J00r0j70K72k80J19J23k9n8M10r0k65P0k54L53j89J44n9
6454B3j6M8r6K56l27Qo5j43K83J25p1O9m6j74j07P6M0oK31j68Q9n9O3J28J60m25
6480a04J63j20j00m8K92j36j31K88o6K2k27J88j24J42j7R4j8l1j92J7J96J55k39
6503DJ37o6kl1L8N7j73o3P9J14n4J74l85K15k77J47J65k37R3j27J62O5J89k18
6527FK2l4Q1p2O6K04m18J68O4j39n5j39M8K43p4J78p8k40j63O13l59J08pRj15
6552h3J95J39j98m8j02J69l51J27J69M0l4N1j34Q2K9m9J51m1J6j01kj08m5L77
6576B49l88q4M4m2J83J04NJ23l23J38R3j38J35k75L89m55L68j17l2m3J99M6l25
6599a46J85l5j4O8j47J58j74M98o28L18j00R7l20J23J26J16j74l5Q3j98L79r9
$$ plain form
6621 81 -25 200 -134 -198 178 130 164 -48 80 288 182 164 235 -3 -109 -53 -291 -40 261 -181 -9 159
6643 159 -141 -164 -142 -229 -194 145 -187 130 -44 95 -20 -21 4 -92 -240 187 -136 167 209 146 -140 270 -357
6666 -357 -16 77 -33 -7 -64 131 -9 -119 -131 123 -95 -16 -25 -148 43 221 6 65 59 -45 -32 -103 -230 -58
6690 -58 -318 -50 22 -5 -54 -279 -100 223 -33 255 -54 -178 -28 65 22 -144 -247 -23 -21 -163 -124 -117 -354 -71
6714 -71 71 275 -125 -39 109 50 133 -220 85 -20 -203 161 -136 -303 335 -304 -126 -79 -53 -6 -283 32
6736 32 -83 -80 -325 222 221 101 157 72 -32 -23 215 -48 -143 54 -24 -207 65 134 -69 83 -50 17 41 103 -52
6761 -52 -24 -101 301 48 -49 -440 104 21 -144 277 -80 148 -114 -11 -52 125 -102 44 32 36 54 139 -206 -280
6785 -280 -67 196 307 154 216 131 -45 181 177 -68 96 16 130 226 215 -155 184 16 -28 -160 -29 -13 -111
$$ packed form
6621H1j06K25l34o4L76m8L4k12J28K08j06j8P1k38j06N6k38K51L01m42J72J68
6643A59l00k3K2q7L5L39l32L17j74J39j15jK5r6j48M27l23L03M2o3k86M10o27
6666c57L41R3j10K6n7J95j40j10j2K54k18P9rj23J91J78k15N9oj04J3p1j27J72
6690e8k60K68P2k7m9k25J79L23k56K88l09j24J50R3m3j66j03K24Kj42L9Pk37K83
6714g1J42K04m00Q6J48n9Q3l53L05j05j83L64k97j67O38o39J78M7K6M7k77L15
6736C2j15Lk45N47jj20N6q5j04RK38k63r5J97p8j83K72O9k03J52j33O7K4O2j55
6761e2K8p7M02k53r7l91N44q3j65M21l57K28k62J03m1J77k27J46j2MJ8Q5l45p4
6785b80K13K63J11j53O2q5j76K26mk45J64q0J14R6j1l70L39j68m4j32J31J6r8
$$ plain form
6808 -111 -121 -96 38 -29 -162 140 -28 146 27 125 -79 -4 120 253 30 43 5 -206 -94 103 249 28
6830 28 -159 48 64 -91 -80 89 -20 -243 44 -195 275 192 245 -60 150 59 186 -115 -148 43 -39 67 -152
6853 -152 -110 -220 -219 -28 -50 99 34 328 -71 62 182 35 -69 -146 -172 25 -74 -43 -49 121 -119 218 205 -2
6877 -2 -34 53 -99 -217 -18 45 17 61 216 262 1 38 216 468 -163 -81 78 63 75 19 -33 181 40 -39 16
6902 16 -94 15 211 -11 344 0 -114 -49 -67 3 -350 101 -32 88 -114 -57 39 -21 -65 -60 -299 98 15 194
6926 194 44 33 54 -59 -195 -10 51 29 -71 250 40 -177 67 -156 137 138 -116 -132 331 -267 -341 -119 156
6949 156 67 -73 123 73 -238 -16 177 65 47 -145 -307 207 32 -93 -177 -316 285 -304 279 262 195 -214
6971 -214 60 154 -55 -102 256 -23 218 -125 162 163 -189 318 211 278 134 141 -75 40 -88 95 -247 134
$$ packed form
6808a11j0K5J34o7j33L02j68J74j19R8k04P5J24J33k23J3l8k11J12J97J46k21
6830B8j87K07J6j55J1J69j09k23K87k39M70q3N3l05K10r1J27l01l3J91q2J06k19
6853a52M2j10JJ91k2J49o5K94l99J33J20j47j04p7k6J97r9L1oJ70k40L37j3k07
6877bl2Q7j52j18J99O3k8M4J55M6k61L7J78K52o31Q2J59j5J2n6n2K14j41p9N5
6902A6j10J09J96k22L55l44j14O5j8P0l53M51j33J20k02N7R6o0m4Nk39L97q3J79
6926A94j50j1K1j13j36J85O1k2j00L21k10k17K44k23K93Jk54j6M63n98p4K22K75
6949A56q9j40J96n0l11K22J93j12j8j92j62N14j75j25q4j39O01n89N83j7o7m09
6971b14K74R4k09m7L58k79K41l43K87Jl52N07j07O7j44Pk16J15j28J83l42L81
$$ plain form
6993 134 17 33 263 -183 -200 -265 302 -108 1 -56 -136 171 -171 74 38 -18 -43 -220 58 140 196 -52 -19 -167
7017 -167 -95 31 -30 -71 -69 -23 45 -129 -235 -223 -20 -248 -262 -37 -37 -150 48 101 35 67 191 -39 143 26 -21
7042 -21 -78 49 -188 66 -47 92 4 24 86 -151 -149 -98 -158 -46 -211 218 161 -135 104 -142 -8 100 203
7065 203 -105 -113 117 -167 -21 -51 -29 -309 -148 -163 -12 273 122 437 204 253 97 83 -142 304 -10 -109 -77
7088 -77 -291 138 18 128 307 -54 -255 -276 75 -98 -69 6 292 -204 -261 -20 140 206 -56 -55 -61 241 -147
7111 -147 -56 66 20 65 -298 -115 -62 -110 -149 37 167 217 73 185 16 -166 328 140 91 16 -6 -357 65
7134 65 69 201 194 -76 -168 50 -146 189 348 -43 -126 67 -3 -162 126 -68 196 -210 203 46 319 93 -130
7157 -130 52 -138 -174 -75 185 101 92 -38 143 -103 406 19 -17 -66 2 188 -93 -128 78 -131 -242 -82 219
$$ packed form
6993A34j17J6K30m46j7o5N67m10J09n7q0L07l42K45l6n6k5j77K78Q2N6k48L3j48
7017a67P2J26o1m1KM6O8j74j06J2K03k28j4K25%j13J98N3o6L2J24k30J82j17m7
7042b1n7J27k37K54j13J39q8K0O2k37KN1o0J12j65M29n7k96K39k46J34J08J03
7065B03l08qK30k84J46l0K2k80J61j5J51K85j51L15k33M9j56j4k25M46l14r9L2
7088g7k14M29j20J10J79l61k01k1L51j73K9P5K86m96n7K41J60O6k62JoL02l88
7111a47R1J22m6M5l63J83N3m8l9J86J30N0j44J12j69j82M94j88m9p5k2l51M22
7134F5MJ32pk70r2K18j96L35J59l91q3J93p0j59K88j94K64m06M13j57K73k26k23
7157a30J82j90l6R9K60q4rj30J81k46N09l87l6m9O8J86k81l5K06k09j11J60L01
$$ plain form
7180 219 5 129 -67 137 89 255 -22 -14 -90 56 -129 56 -91 -225 -304 163 255 140 35 -119 -151 -157 95
7203 95 -21 33 73 -140 -151 -33 24 -35 164 39 75 19 -66 87 92 45 2 -13 -143 131 47 -170 92 -103 145
7228 145 42 -62 -140 -195 182 136 184 98 -144 -90 151 50 237 105 -1 15 49 43 179 182 -159 -58 198 -32
7252 -32 -7 109 18 190 106 391 35 288 201 44 111 103 -31 -64 243 -108 -131 161 -55 -94 117 221 -12 -12
7276 -12 216 -176 -83 -181 255 235 -225 323 -68 85 54 88 -84 -58 -172 89 263 -152 -124 -3 4 208 -64
7299 -64 -19 46 -3 -122 -96 -40 -51 -58 -142 132 -127 -20 291 124 220 31 -94 153 150 49 209 186 -96 -200 24
7324 24 -94 15 171 -192 152 -140 135 -20 111 38 -82 191 91 -27 31 -41 5 84 154 312 57 -149
7346 -149 -17 43 -81 2 10 50 -59 235 -90 27 -82 -94 -157 -28 -18 -299 119 -163 -120 11 -117 123 -144
$$ packed form
7180B19k14J24j96K04m8J66k77Qp6J46j85J85j47j34p9M67R2j15j05j54l2oK52
7203I5j16N4M0k13j1J18N7n9J99j25L6n6q5J53Nm7m3j5j30K74q4k17K62j95K48
7228A45j03j04p8n5L77m6M8q6k42N4K41j01J87j32j06J6L4oJ36Ll41J01K56k30
7252c2K5J16r1J72q4K85l56K53q7j57O7qj34l3L07l51k3K92k16l9K11J04k33%
7276a2K28l92R3r8M36k0m60N48l91J53l1L4j72K6j14K61J74m15K8J21PK04k72
7299f4M5O5m9j19K6N6j1pq4K74k59J07L11j67R6j89j25K47lj01J60k3k82j04K24
7324B4j18J09J56l63L44k92K75j55J31p3j20K73j00j18N8p2M6P9P0J58k55k06
7346a49J32O0j24Q3QM0j09K94l25J17j09j2o3J29J0k81M18k82M3J31j28K40k67
$$ plain form
7369 -144 298 -179 42 -108 107 13 -26 -306 39 114 -48 -247 43 50 -219 31 -156 -148 -27 -239 231 -178
7391 -178 -120 -70 18 70 -47 37 -187 -266 154 21 13 108 -139 86 -234 -171 -164 -38 -3 79 17 63 -129 97 -226
7416 -226 -306 -271 -38 226 -84 63 171 70 -79 -423 -82 -149 -66 49 -156 -169 -116 -54 -63 -173 347 31 149
7439 149 -369 -27 16 -80 80 131 132 -57 50 24 -182 145 61 279 94 130 204 -69 184 186 91 3 -1 -112 115
7464 115 94 -29 -196 4 -96 -57 -316 41 -214 -78 83 37 -26 42 -164 -44 -260 -179 5 -99 -9 -225
7486 -225 108 -91 53 42 -106 -97 -226 -114 -129 81 -96 128 13 -47 -131 -243 116 -27 -136 -189 -176 -125 18
7509 18 -202 -123 154 -29 159 -18 -301 -221 -51 -32 -247 127 160 -300 115 35 -200 12 -248 88 -296 -61
7531 -61 88 -5 -19 -160 -258 163 152 43 -30 19 38 -28 338 240 77 -116 20 98 107 86 63 69 254 85 -324 112
$$ packed form
7369a44M42m77K21j50K15r4l9k80L45P5j62j99K90Pk69K50j87QJ21k12M70m09
7391a78N8N0Q8N2j17Q4k24p9M20j33qR5k47K25l20O3PJ26L5Q2o2M6j92K26l23
7416b26q0L5K33K64l10J47J08j01j49l44L41o7Q3J15k05j3N3O2rj10N20l16J18
7439A49n18L42M3r6J60N1Jj89J07k6k06L27q4K18j85L6P4k73K53Kr5q8mj11K27
7464A15k1j23j67K00j00L9k59L57k55J36J61m6o3O8k06J20k16Q1J84j04R0k16
7486b25L33j99J44j1j48Rj29J12j5K10j77K24j15o0q4j12L59j43j09n3J3N1J43
7509A8k20P9K77j83J88j77k83Q0J70J9k15L74L3m60M15q0k35K12k60L36l84K35
7531f1J49r3j4j41r8M21j1j09p3M9J9o6L66r8j63j93J36P8Rk1k3OJ85j69m09M36
$$ plain form
7557 112 -327 -221 81 -150 -199 -93 79 39 -10 -233 -307 136 -17 -46 -92 -96 140 11 124 66 -340 268 115
7580 115 -33 -130 -114 -121 -167 -78 -136 255 -229 -214 -44 13 7 -457 36 32 300 248 -67 -12 -228 27 -50 119 -135
7605 -135 6 72 -55 160 -24 -214 -117 59 -219 166 -182 308 -195 -56 -97 -51 17 -240 50 -134 -365 34
7627 34 173 210 85 77 -66 -147 -68 209 -17 -91 -20 -213 111 -213 -140 -77 -122 -159 83 -184 -95 -131 319 24 -55
7652 -55 124 -311 -89 -103 -69 -98 11 11 134 65 -84 -235 -19 153 -122 -14 -149 67 36 12 78 10 43 250
7676 250 266 31 92 59 109 83 -129 92 -10 -163 -115 78 132 215 -50 356 -5 27 -26 -30 139 -39 66 -192
7700 -192 -95 58 370 -69 43 203 12 -95 126 -26 22 -8 97 -69 -4 -68 2 -126 -63 -45 285 -75 -157
7723 -157 69 131 17 -49 -152 -144 111 -59 226 -36 -60 16 143 -184 -51 -193 36 -91 15 -31 -1 25 178
$$ packed form
7557A12m39J06L02k31m9J06J72m0m9k23p4M43j53k9m6mK36j29J13n8m06O08j53
7580A15j48r7J6pm6Q9n8L91m84J5J70N7om64M93mK68n2l15N5k16K55p7J69k54
7605a35J41O6j27K15j84j90R7J76k78L85l48M90n03J39m1M6O8k57K90j84k31L99
7627C4J39L7j25qj43q1P9K77k26p4P1j93L24l24P3O3m5l7K42k67Q9l6M50k95p9
7652e5J79m35K22j4L4k9J09%J23o9j49j51K16J72k75J08j35K16l1k4O6o8L3K07
7676B50J6k35O1l3N0k6k12K21j02j53M8J93N4Q3k65M06l61L2n3mJ69j78J05k58
7700a92R7J53L12m39J12J60j91j07K21j52M8l0J05j66O5o4P0j28O3J8L30l60q2
7723a57K26O2j14o6j03QK55j70K85k62k4P6J27l27J33j42K29j27J06m6L0K6J53
$$ plain form
7746 178 44 -50 -66 141 -100 122 -49 278 263 178 -159 -171 -243 -242 -256 -27 -159 -22 9 -175 -28 171 219 -122
7770 -122 -177 -18 12 -196 120 -263 -39 -23 68 -123 -41 67 475 -233 -100 81 -55 -27 -55 30 -35 -168 -72
7793 -72 65 -143 -76 -35 10 -74 -109 180 137 -35 78 201 -73 12 255 141 31 -237 1 147 -25 99 174
7816 174 -63 -175 12 14 -24 46 -117 123 137 115 145 26 21 -48 -192 243 -37 220 -256 -6 -146 -84 18 -11
7840 -11 -154 156 -2 -67 57 -119 -188 -38 -68 -81 -4 143 -308 -97 -85 22 9 43 -77 -240 163 146 -29
7863 -29 156 127 103 53 105 -81 -47 -36 169 202 264 207 59 -1 159 -231 -3 184 89 207 148 3 -151 -68 230
7888 230 -213 -5 -32 71 20 65 206 83 -118 -209 133 43 -7 -19 -38 -19 -5 -105 37 -79 -43 -193 51 73
7912 73 9 -293 -18 -235 51 64 -131 187 -63 109 163 -22 -23 -151 -93 124 -18 96 -36 268 -83 -179 113
$$ packed form
7746A78j34r4j6K07k41K22j71L27j5q5l37j2p2Jj4K29j32J37L1j84J47J99M8l41
7770a22n5J59L0k08L16l83K24J6R1j91Q2J08M08p08J33J81j36K8k8Q5o5j33R6
7793g2J37k08O7M1M5q4l5K89m3j72J13J23k74Q5K43j14j10k68K38J46j72J24P5
7816A74k37j12J87Kl8P0j63K40J4k2L0j19no9j44M35k80K57m76K50j40O2J02k9
7840a1j43L10j58o5J24j76o9J50l0j3P7J47m51K11J2J07j3L4j20j63M03j7j75
7863b9J85k9k4n0N2j86L4J1K05L3O2n7j48o0J60l90K28J87r5J18n9j45j54Q3K98
7888B30m43K08k7J03n1M5J41j23k01r1L42r0n0j2j9J9J4j00J42j16L6j50K44K2
7912G3o4l02K75k17K86J3j95L18k50J72N4j85jj28N8K17j42J14j32L04l51r6K92
$$ plain form
7935 113 -94 194 314 -88 -259 -106 26 -115 -256 85 -151 -146 -238 -66 318 85 251 114 73 -133 -76 209
7957 209 121 -88 -6 -150 58 -86 -245 -88 257 -85 148 100 -1 208 52 -13 -278 175 72 -136 -162 -256
7979 -256 -182 5 32 -19 -68 -171 -131 117 -149 -320 -84 -43 -183 -61 74 68 -115 152 82 -71 -72 78 47 170
8003 170 24 393 -43 -45 -107 -154 26 101 -361 -23 106 -135 280 -93 168 -11 138 305 24 -37 -146 72
8025 72 -237 -19 -111 -37 -171 -329 104 -94 -8 115 -80 -3 -443 0 44 98 17 -18 186 107 137 -58 64 220
8049 220 -40 -235 -25 74 289 121 8 221 -75 -250 15 88 18 11 -146 60 -81 -9 -55 -14 34 -7 69 92
8073 92 94 53 -212 -84 98 -48 -106 252 -41 123 22 241 240 37 59 17 165 136 -164 169 182 266 132 -160
8097 -160 274 -92 100 -125 282 145 40 -176 57 238 -347 -68 31 151 114 -13 -52 -15 -8 -74 333 8
$$ packed form
7935A13k07K88J20m02j71J53J32j41j41L41k36Nr2J72L84k33J66j37m1k06N7K85
7957B09q8k09Q2j44K08j44j59J57L45l42K33m8j01K09j56o5k65M53j03k08k6r4
7979b56P4J87K7n1m9j03M0K48k66j71K36M1j40J22J35oj83K67p0j53jJ50l1J23
8003A70j46L69m36ko2m7J80P5m62L38J29k41M15l73K61j79J49J67k81o1j09K18
8025G2l09K18r2P4j34j58M33j98Q6J23j95P7m40M43M4N4q1l5K04p9L0j95J22J56
8049B20k60j95K10R9K15j68j13K13k96j75K65P3p0pj57K06j41P2m6M1M8m1P6K3
8073I2Km1k65J28J82j46n8L58k93J64j01K19jk03K2m2J48k9l00L33J3Q4j34k92
8097a60M34l66J92k25M07j37j05k16K33J81n85K79R9J20l7j27l9L7Po6M07l25
$$ plain form
8119 8 -64 115 134 -175 -95 -16 -123 36 208 -93 35 -171 -103 -187 42 62 31 89 -12 -99 131 83 25 17 -30 -47
8145 -47 114 24 -257 -124 -58 -371 -100 -54 -213 23 82 43 179 22 52 -151 67 243 67 -62 6 109 -200
8168 -200 147 8 -101 84 -292 -35 125 -45 -24 -252 -130 31 188 38 -416 -76 54 68 171 29 -136
8189 -136 -365 -120
$$ packed form
8119Hp2J79J9l09Q0P9j07J59J72l01J28k06O8q4K29K0l1N8j01q7K30m8n8qm7j7
8145d7J61r0k81J33O6l13K71M6j59K36N9l9J36j57L0k03K18J76j76j29O8J03l09
8168b00L47j39j09J85l76K57J60j70K1k28J22J61J57j50m54L40J30J4J03j42j65
8189a36k29K45
8191a20
$$ Imaginary data points
##PAGE= N=2
##DATA TABLE= (X++(I..I)), XYDATA
$$ plain form
0 0 0 0 0 0 0 0 0 0 0 0 0 0 0 0 7 -8 8 -8 8 -10 16 -16 21 -24 29 -32 40 -45 49 -57 65 -76 86 -97 110 -124
36 -124 138 -155 174 -192 215 -237 264 -292 323 -358 393 -434 480 -528 581 -640 706 -781 859
55 859 -955 1059 -1181 1325 -1492 1695 -1945 2263 -2680 3255 -4101 5473 -8062 14606 -65314
70 -65314 -65251 145186 95376 -33733 -71449 -123483 -136723 2758 65529 38300 11753 -72629
82 -72629 -144320 -81343 -22175 10979 52221 5509 -81544 -89126 -95077 -73804 16196 38891 -603
95 -603 -16039 -88289 -141317 -61768 -1723 -6457 27800 3115 -80987 -79819 -59282 -63250 -5479
108 -5479 22468 -24306 -26182 -30195 -74994 -50232 -12209 -23853 1092 4334 -56276 -43963 -6440
121 -6440 -33933 -16312 11301 -39197 -41720 2033 -20990 -19473 20145 -10877 -32980 -6700 -22951
$$ packed form
0@%%%%%%%%%%%%%%Pj5J6j6J6j8K6l2L7m5N3o1P2q5R4j06J22j41J62j83K07k34
36a24K62k93L29l66M07m52N01n56O15o81P51q27R14j008J109j221J346j487J640
55H59j814K014k240K506k817L187l640M208m943N935p356R574j3535K2668p9920
70f5314O3K10437m9810j29109l7716n2034j3240J39481O2771k7229k6547q4382
82g2629p1691O2977N9168L3154M1242m6712q7053p582n951K1273R0000K2695l9494
95f03j5436p2250n3028P9549O0045m734L4257k4685q4102J168K0537l968N7771
108e479K7947m6774j876m013m4799K4762L8023j1644K4945L242o0610J2313L7523
121f440k7493J7621K7613n0498k523M3753k3023J517L9618l1022k2103K6280j6251
$$ plain form
134 -22951 -26505 12932 7587 219 19211 -13570 -38586 -6760 -653 2412 34432 15699 -13397
147 -13397 3566 -6393 -19424 14233 18064 4776 26603 17730 -10101 4609 6370 -5076 22341
160 22341 29416 7379 15975 17559 1834 17199 19054 339 17482 27059 11530 24737 27463
173 27463 1691 11766 23498 5527 18029 32902 14069 20831 32411 7868 5385 21171
185 21171 10302 18530 39935 22450 12528 23144 9936 6245 24314 18412 16262 32875 22487
198 22487 10419 18192 9769 4977 23097 23868 16811 23876 15995 6539 15610 12347 5560 17383
212 17383 18678 12712 19695 14603 2341 7557 9224 5337 14932 14963 6292 12578 10643 -1060 2854
227 2854 3940 -1708 8592 13955 4067 4245 1887 -8260 -3238 3177 -2852 1908 8223 -1461 -3878
$$ packed form
134b2951l554L9437n345p368J8992l2781k5016L1826O107L065L2020j8733k9096
147a3397J6963r959j3031L3657L831j3288K1827q873k7831J4710J761j1446K7417
160B2341P075k2037Q596J584j5725J5365J855j8715J7143R577j5529J3207K726
173B7463k5772J0075J1732j7971J2502J4873j8833O762J1580k4543k483J5786
185B1171j0869Q228K1405j7485r922J0616j3208l691J8069n902k150J6613j0388
198B2487j2068P773q423m792J8120P71p057P065p881r456R071l263o787J1823
212A7383J295n966O983n092j2262N216J667l887R595L1q671O286j935j1703L914
227B854J086n648J0300N363r888J78k358j0147N022O415o029M760O315r684k417
$$ plain form
242 -3878 -2667 -12236 -11029 -759 -2987 -1804 2132 -7839 -12413 -7707 -12121 -13480 -5471 -5868 -7013
257 -7013 -3421 -9152 -16250 -14243 -15135 -14521 -6641 -6102 -10388 -9285 -11612 -17011 -16107 -15311 -14250 -8505
273 -8505 -6768 -8729 -10303 -14765 -19051 -15663 -12930 -11802 -7428 -6979 -9985 -10410 -13483 -17517 -14333 -11027
289 -11027 -8967 -4745 -4411 -9276 -11261 -12626 -14511 -10802 -7160 -6695 -2817 -1775 -7721 -10309 -9788 -11791
305 -11791 -8811 -2735 -809 -1426 -1726 -5291 -8087 -7529 -7747 -5300 495 1931 453 -89 -3004 -7194
321 -7194 -6407 -2985 -603 2254 4014 2918 336 -2310 -4167 -3667 -846 2677 4849 5532 4284 1004
337 1004 -2515 -2377 -995 1731 5352 7267 6705 4668 1487 -1040 -692 1815 4149 6831 9505 7470
353 7470 3555 2365 1506 328 3596 7316 9296 9408 8004 5032 2841 2150 2241 5632 9586 9930 9616
$$ packed form
242c878J211r569J207J0270k228J183L936r971m574M706m414j359Q009l97j145
257g013L592n731p098K007q92O14P880N39m286J103k327n399R04P96J061N745
273h505J737j961j574m462m286L388K733J128M374M49l006m25l073m034L184L306
289a1027K060M222L34m865j985j365j885L709L642M65L878J042n946k588N21k003
305a1791K980O076J926o17l00l565k796N58k18K447N795J436j478n42k915m190
321g194P87L422K382K857J760j096k582k646j857N00K821L523K172O83j248l280
337A004l519J38J382K726L621J915n62k037l181k527L48K507K334K682K674k035
353G470l915j190q59j178L268L720J980J12j404k972k191o91R1L391L954L44l14
$$ plain form
370 9616 8488 5345 2089 2745 5579 7560 9682 11500 9720 6654 4769 3240 3523 6106 8723 9980
386 9980 11019 9017 5380 3636 3739 3807 6356 9245 9678 8898 7986 4246 1597 2902 4096 5583 8251
403 8251 9073 6698 4437 2398 1037 927 3169 4913 6445 6962 4290 939 -90 -781 -702 2009 4157
420 4157 4166 3274 1745 -1143 -3226 -3062 -2022 -108 2518 2161 26 -1691 -4080 -5855 -4388 -2215 -1491
437 -1491 -463 19 -1722 -4697 -6305 -6545 -5866 -3211 -1505 -1551 -1949 -4218 -6632 -7391 -6741 -5974 -4091
454 -4091 -1892 -1675 -3733 -5370 -6986 -8101 -6703 -4438 -3127 -2207 -2477 -4327 -6043 -6499 -7445 -6992 -3618
471 -3618 -1633 -1841 -2225 -4055 -6655 -6995 -5665 -4582 -2215 -741 -1659 -2440 -3398 -5891 -6451 -4408 -2938
488 -2938 -1326 330 -643 -3068 -4015 -5059 -4924 -3241 -1368 83 704 -169 -2627 -4134 -4259 -3458 -1796
$$ packed form
370I616j128l143l256O56K834J981K122J818j780l066j885j529K83K583K617J257
386I980J039k002l637j744J03O8K549K889M33p80r12l740k649J305J194J487K668
403H251Q22k375k261k039j361j10K242J744J532N17k672l351j029o91P9K711K148
420D157Rq92j529k888k083J64J040J914K626l57k135j717k389j775J467K173P24
437a491J028M82j741k975j608k40O79K655J706m6l98k269k414p59O50P67J883
454d091K199K17k058j637j616j115J398K265J311R20k70j850j716m56r46M53L374
471c618J985k08l84j830k600l40J330J083K367J474r18p81r58k493n60K043J470
488b938J612J656r73k425r47j044J35J683J873J451O21q73k458j507j25Q01J662
$$ plain form
505 -1796 -16 865 955 -972 -2286 -3027 -3624 -3026 -633 913 1690 1301 -1250 -2893 -2523 -2612 -1194 1241
523 1241 2025 1295 1339 -305 -2669 -2147 -1486 -484 2519 3440 1993 1349 -194 -2291 -1343 911 1348 3160
541 3160 4417 2902 1506 401 -1509 -370 2628 3576 4255 5289 3389 1423 1081 514 1213 3781
557 3781 4568 5537 5909 3767 1717 1306 1663 2550 5229 5861 5798 5450 3589 2034 2128 1834 3087 5911
575 5911 6412 5360 4959 2741 1585 1881 2664 3433 6108 6080 4413 4091 2395 58 1329 3086 3275
592 3275 5057 5310 3015 2384 1149 -799 945 2437 2400 3969 4467 1729 -170 -413 -1630 -482 1686
609 1686 1598 2267 2048 -347 -1915 -1389 -2458 -1874 1302 1694 721 439 -2148 -3201 -2893 -2478 -2077 319
627 319 90 -459 -727 -2704 -4354 -3579 -3172 -1658 224 -420 -1762 -1923 -3649 -4576 -3223 -2349 -2025 343
$$ packed form
505a796J780Q81R0j927j314p41n97N98K393J546P77l89k551j643L70q9J418K435
523A241P84p30M4j644k364N22O61J002L003R21j447o44j543k097R48K254M37J812
541C160J257j515j396j105j910J139K998R48O79J034j900j966l42n67O99K568
557C781P87R69L72k142k050m11L57Q87K679O32o3l48j861j555R4k94J253K824
575E911N01j052m01k218j156K96P83P69K675k8j667l22j696k337J271J757J89
592C275J782K53k295o31j235j948J744J492l7J569M98k738j899k43j217J148K168
609A686q8O69k19k395j568N26j069N84L176L92r73k82k587j053L08M15M01K396
627C19k29n49k68j977j650P75M07J514J882o44j342j61j726r27J353Q74L24K368
$$ plain form
645 343 -189 -2086 -2354 -3828 -5064 -2740 -1522 -1755 -254 -250 -2663 -3007 -3291 -4406 -2685 -982 -1224 304
663 304 -7 -3082 -3732 -2908 -3495 -2302 71 -574 -675 -724 -2708 -3602 -2468 -3016 -1752 569 284 -786
681 -786 -1144 -2605 -3507 -2516 -2017 -1063 383 -310 -998 -1185 -2872 -3388 -1863 -1403 -584 713 -257 -1338
699 -1338 -1338 -2893 -3082 -1112 -696 -334 1318 419 -1914 -1503 -2272 -2781 -310 632 395 1698 775 -1279
717 -1279 -1350 -960 -1634 443 1898 1727 1302 789 -1073 -1146 10 -450 1458 3155 2335 1641 1606 -131 -484
736 -484 261 1398 2648 3759 2985 2032 1674 442 440 1792 2398 3492 3999 3376 2603 2061 625 1090 3029
755 3029 3007 3734 4690 3202 1786 2018 1114 1213 3071 3535 3890 4319 2792 1032 1086 1150 1102 2811 4076
774 4076 2905 3141 2017 349 407 1154 823 2328 3485 2482 1595 1313 -383 -898 510 665 1635 2497
$$ packed form
645C43n32j897k68j474j236K324J218k33J501Mk413l44k84j115J721J703k42J528
663C04l11l075o50Q24n87J193K373o45j01m9j984q94J134n48J264K321k85j070
681g86l58j461r02R91M99R54J446o93o88j87j687n16J525M60Q19J297r70j081
699a338%j555j89J970M16L62J652q99k333M11p69n09K471R42k37J303r23k054
717a279p1L90o74K077J455j71m25n13j862p3J156m60J908J697q20o94l5j737l53
736d84P45J137J250J111p74r53l58j232kJ352O06J094N07o23p73n42j436M65J939
755C029k2P27R56j488j416K32r04R9J858M64L55M29j527j760N4O4m8J709J265
774D076j171K36j124j668N8P47l31J505J157j003q87k82j696n15J408J55R70Q62
$$ plain form
792 2497 1638 497 -178 -1397 -1571 -531 691 1015 1312 520 -584 -1313 -2125 -1525 -700 352 432 843
810 843 -613 -1444 -1856 -2490 -1661 -364 -515 -120 561 -938 -2437 -2493 -2526 -2066 -437 203 -250 -299 -1791
829 -1791 -2959 -2189 -2033 -1791 -212 779 -341 -924 -1561 -2749 -2941 -1567 -927 -188 449 -495 -1707 -1709 -2508
848 -2508 -2701 -1305 -828 -221 -166 -488 -1292 -2417 -2568 -2280 -1250 -684 -191 -489 -1295 -2262 -2597 -2371 -1970
867 -1970 -937 -347 -214 -738 -1574 -2278 -2320 -2494 -1640 -663 -87 -386 -600 -1846 -2453 -2259 -2043 -1252 21
886 21 182 -744 -573 -1683 -2246 -1921 -1247 -669 376 610 -282 -941 -1190 -1753 -1202 -133 551 595 1004 478
906 478 -472 -718 -818 -149 719 1309 1697 1411 997 -82 -280 299 983 1410 2236 2323 1960 1144 627 354
926 354 885 1930 2578 2687 2719 2179 1166 808 1175 1287 2365 3175 2833 2444 2257 1214 838 1400 1957
$$ packed form
792B497q59j141o75j219j74J040J222L24K97p92j104p29q12O00Q25J052Q0M11
810H43j456q31m12o34Q29J297j51L95O81j499j499n6l3M60J629O40m53m9j492
829a791j168P70J56K42J579R91j120n83o37j188j92J374O40P39O37r44j212kp99
848b508j93J396M77O07N5l22q04j125j51K88J030N66M93k98q06r67l35K26M01
867a970J033N90J33n24q36p04m2j74Q54R77N76k99k14j246o07J94K16P91J273
886B1J61r26J71j110n63L25O74N78J045K34q92o59k49n63N51J069O84M4M09n26
906D78r50k46j00O69Q68N90L88k86m14j079j98N79O84M27Q26Q7l63q16n17k73
926C54N31J045O48J09L2n40j013l58L67J12J078Q10l42l89j87j043l76N62N57
$$ plain form
945 1957 2695 3121 2666 2179 1751 1134 634 1306 2080 2186 2674 2795 1722 586 706 628 1049 1975 2052 1831
965 1831 1790 683 75 -39 454 634 1417 1291 1362 768 -69 -694 -868 -228 366 1023 1239 824 -269 -794
985 -794 -733 -1034 -737 284 717 579 132 -741 -1491 -1346 -1055 -629 264 554 -104 -356 -1034 -1844 -1577 -949
1005 -949 -337 -12 188 5 -739 -1774 -1874 -1656 -842 -197 -65 -251 -188 -1072 -1743 -1773 -1410 -561 -38 -133 5
1026 5 -784 -1737 -2102 -1827 -1142 -559 -24 -24 -297 -1208 -1646 -1870 -1893 -1119 -406 -9 -321 -938 -1648 -1880 -1933 -1802
1048 -1802 -1015 -442 -210 -628 -1075 -1623 -2063 -2011 -1335 -771 -282 -225 -576 -1266 -1867 -2126 -1853 -809 -449 -343
1068 -343 92 -634 -1325 -2002 -1755 -1265 -855 242 466 -96 -430 -1410 -1577 -1044 -434 22 822 932 131 -124
1088 -124 -676 -821 -442 120 835 985 851 582 -373 -220 -39 354 993 1745 1586 1378 871 413 255 396
$$ packed form
945A957P38M26m55m87m28o17n00O72P74J06M88J21j073j136J20p8M21R26P7k21
965A831m1j107o08j14M93J80P83j26P1n94q37o25j74O40N94O57K16m15j093n25
985g94O1l01K97J021M33j38m47q73p50J45K91M26Q93K90o58k52o78q10K67O28
1005i49O12L25K00j83p44j035j00K18Q14O45J32j86O3q84o71l0L63Q49N23r5J38
1026Ep89r53l65K75O85N83N35%k73r11m38k24k3P74P13L97l12o17p10k32n3J31
1048a802P87N73K32m18m47n48m40N2O76N64M89N7l51o90o01k59K73J044L60J06
1068c43M35p26o91o77K47M90M10J097K24n62l34r80j67N33O10M56Q00J10q01k55
1088a24n52j45L79N62P15J50j34k69r55J53J81L93O39P52j59k08n07m58j58J41
$$ plain form
1108 396 869 1572 2109 1999 1267 887 510 -123 864 1643 1811 2138 2031 1734 728 620 659 1040 1987 2321
1128 2321 1984 2096 1166 319 452 974 1133 1432 1942 1594 1301 631 389 182 731 1084 1349 1950 1206 566
1148 566 262 -133 177 95 909 1481 762 1022 94 -138 -657 -396 248 821 1190 716 168 -260 -699 -638 -438
1169 -438 172 687 818 414 -95 -646 -596 -551 -206 193 352 557 55 -189 -1113 -927 -158 -426 355 761 154
1190 154 -18 -545 -1003 -807 -218 40 326 382 115 -715 -666 -966 -983 -156 162 387 229 -335 -775 -1076 -1293
1211 -1293 -848 -148 259 221 -252 -628 -1114 -1294 -1311 -772 -364 34 -84 -478 -1036 -1505 -1410 -1414 -793 -197 -66
1232 -66 -433 -889 -1479 -1766 -1718 -870 -1024 -344 -239 -798 -909 -1299 -1955 -1160 -685 -664 -167 -135 -764 -1303 -1365 -1558
1254 -1558 -1221 -464 -135 -190 107 -555 -1335 -1260 -1254 -762 94 239 124 3 -488 -825 -1078 -681 99 582 613
$$ packed form
1108C96M73P03N37j10p32l80l77o33R87P79J68L27j07k97j006j08L9L81R47L34
1128B321l37J12r30q47J33N22J59K99N10l48k93o70k42k07N49L53K65O01p44o40
1148E66l04l95L10q2Q14N72p19K60r28k32n19K61O44N73L69m74n48m28m39O1K00
1169d38O10N15J31m04n09n51N0M5L45L99J59K05n02k44r24J86P69k68P81M06o07
1190A54j72n27m58J96N89K58K86N6k67q30M9l00j7Q27L18K25j58n64m40l01k17
1211a293M45P00M07l8m73l76m86j80j7N39M08L98j18l94n58m69R5mO21N96J31
1232f6l67m56n90k87M8Q48j54O80J05n59j11l90o56P95M75K1M97L2o29n39o2j93
1254a558L37P57L29n5K97o62p80P5OM92Q56J45j15j21m91l37k53L97P80M83L1
$$ plain form
1275 613 470 450 -106 -564 -208 71 620 1042 1194 678 472 -102 -200 47 522 1068 1313 1455 1190 632 124
1296 124 -45 449 849 1333 1808 1596 1064 343 363 16 736 1561 1308 1780 1486 645 461 365 468 624 1343
1317 1343 1493 1163 1108 403 13 214 320 738 1279 1091 745 755 269 -408 -170 546 682 1125 901 764
1337 764 378 -102 -349 -281 357 600 808 664 590 63 -554 -425 -302 559 269 553 693 119 -80 -203 -738
1358 -738 -309 202 842 898 482 53 -601 -612 -593 5 662 515 620 276 -591 -640 -596 -261 133 487 619 371
1380 371 -59 -151 -1024 -416 -257 69 211 381 19 -129 -454 -934 -345 -49 143 392 229 -178 -823 -955
1400 -955 -834 -913 -35 -25 -145 -20 -646 -889 -977 -883 -699 -419 -31 1 -534 -758 -1314 -1339 -1249 -540 -471 -345 -396
1423 -396 -816 -1146 -1340 -1416 -973 -602 -291 -79 -393 -957 -1322 -1111 -1196 -825 -523 -40 -337 -620 -869 -923 -878
$$ packed form
1275F13j43k0n56m58L56K79N49M22J52n16k06n74r8K47M75N46K45J42k65n58n08
1296A24j69M94M00M84M75k12n32p21K0l47P20Q25k53M72k94q41j84r6J03J56P19
1317A343J50l30n5p05l90K01J06M18N41j88l46J0m86o77K38P16J36M43k24j37
1337G64l86m80k47O8O38K43K08j44p4n27o17J29J23Q61k90K84J40n74j99j23n35
1358g38M29N11O40N6m16m29o54j1J9N98O57j47J05l44q67m9M4L35L94L54J32k48
1380C71m30r2q73O08J59L26J42J70l62j48l25m80N89K96J92K49j63m07o45j32
1400i55J21p9Q78J0j20J25o26k43q8R4J84K80L88L2n35k24n56k5R0P09O9J26n1
1423c96m20l30j94p6M43L71L11K12l14n64l65K11q5L71L02M83k97k83k49n4M5
$$ plain form
1444 -878 -813 -314 -211 192 52 -735 -945 -755 -528 -134 28 519 254 -32 -373 -537 -279 233 326 704 922
1465 922 686 45 25 -498 16 164 620 827 1034 564 397 293 169 275 579 913 1146 1144 877 702 158
1486 158 176 567 740 933 1036 811 491 230 54 -32 464 790 824 842 746 289 -48 24 57 487 647 884
1508 884 815 442 -64 156 -196 372 128 898 725 403 -105 11 -386 -119 355 512 613 907 416 -84
1528 -84 -138 -295 -170 210 758 710 393 220 -27 -179 -217 -103 416 940 700 370 186 -345 -293 -183 275 457
1550 457 813 662 671 100 -303 -130 -297 308 281 721 608 189 -363 -515 -122 -287 -13 330 614 407 9
1571 9 -307 -480 -192 222 207 350 337 -348 -209 -619 -593 -292 90 7 38 -142 -171 -813 -717 -635 -350 -171 -142 -22
1595 -22 -353 -490 -1043 -1174 -654 -638 -218 -89 -198 -539 -1102 -1032 -1079 -1006 -398 -57 -215 -85 -640 -1223 -985 -715
$$ packed form
1444h78O5M99J03M03j40p87k10J90K27L94J62M91k65k86l41j64K58N12R3L78K18
1465I22k36o41k0n23N14J48M56K07K07m70j67j04j24J06L04L34K33kk67j75n44
1486A58J8L91J73J93J03k25l20k61j76q6M96L26L4J8r6m57l37P2L3M30J60K37
1508H84o9l73n06K20l52N68k44P70j73l22n08J16l97K67M74J57J01K94m91n00
1528h4n4j57J25L80N48m8l17j73k47j52l8J14N19N24k40l30j84n31N2J10M58J82
1550D57L56j51Rn71m03J73j67O05k7M40j13m19n52j52L93j65K74L43K84k07l98
1571Il16j73K88M14j5J43j3o85J39m10K6L01L82q3L1j80k9o42R6Q2K85J79K9J20
1595b2l31j37n53j31N20J6M20J29j09l41n63P0m7P3O08L41j58J30n55n83K38K70
$$ plain form
1617 -715 -696 -334 -333 -116 -324 -496 -1024 -1083 -728 -231 -67 212 -36 -337 -297 -575 -673 -387 85 302 305 45 -280
1640 -280 -507 -446 -314 101 281 213 635 323 -58 -161 -362 41 360 511 519 635 62 -172 -157 -178 374 88
1662 88 748 868 316 378 -117 -41 114 332 634 635 709 682 87 -213 -82 280 130 465 695 529 24 -134
1684 -134 -185 -210 199 346 579 394 334 5 -405 -251 -14 387 448 610 134 262 -58 -376 -490 234 168 306
1706 306 610 378 259 -48 -217 -73 165 408 603 431 75 262 -85 -170 -7 17 603 556 463 189 -130
1727 -130 6 -203 159 487 395 898 552 0 -266 -15 162 486 583 664 634 375 36 -84 -185 16 408
1748 408 379 371 328 81 -241 -246 -228 110 437 322 119 109 104 -658 -289 -26 -141 105 -9 206 -429 -646 -568 -452
1772 -452 -461 6 104 205 30 -545 -493 -860 -855 -386 -111 -153 -248 -450 -484 -721 -647 -557 -393 -195 -70 -225 -325 -820
$$ packed form
1617g15J9L62JK17k08j72n28n9L55M97J64K79k48l01M0k78r8K86M72K17Lk60l25
1640b80k27O1J32M15J80o8M22l12l81j03k01M03L19J51QJ16n73k34J5k1N52k86
1662H8O60J20n52O2m95P6J55K18L02JP4k7n95l00J31L62j50L35K30j66n05j58
1684a34n1k5M09J47K33j85o0l29m10J54K37M01O1J62m76J28l20l18j14P24o6J38
1706C06L04k32j19l07j69J44K38K43J95j72l56J87l47q5J63K4N86m7r3k74l19
1727a30J36k09L62L28r2N03l46n52k66K51J77L24R7Q1l0k59l39j20j01K01L92
1748D08k9qm3k47l22nJ8L38L27j15k03j0np62L69K63j15K46j14K15o35k17P8J16
1772d52rM67R8J01j75n75N2l67NM69K75m2r5k02l4k37P4R0J64J98J25j55j00m95
$$ plain form
1796 -820 -986 -930 -524 -392 -47 -84 -402 -564 -804 -505 -651 -516 -210 56 -50 -224 -328 -567 -492 -520 -276
1817 -276 236 292 246 -252 -274 -410 -342 -213 182 228 494 148 -26 -226 -297 22 206 406 415 413 280 148 -419
1840 -419 -158 -238 334 207 337 266 64 234 -375 -382 111 219 441 398 242 112 -293 -47 -337 193 194 196 104
1863 104 123 -74 -528 -242 299 273 369 259 279 -196 -196 -225 -185 96 151 233 533 -109 -191 -172 -274 -100 -112 490
1887 490 563 247 5 -161 -268 -499 2 383 446 702 423 -8 19 -202 68 279 302 395 484 130 -117 0
1909 0 104 186 488 508 413 550 241 178 67 58 180 492 451 404 248 298 22 135 257 355 438 365 384 137 25
1934 25 -211 -64 75 166 426 222 144 -9 -195 -379 -154 340 322 428 106 66 -284 -207 -482 -523 164 -68
1956 -68 40 -82 -173 -280 -663 -616 -446 -216 29 32 -317 108 -751 -643 -385 -40 -156 -141 -211 -286 -282 -604 -940
$$ packed form
1796h20j66N6M06J32L45l7l18j62k40K99j46J35L06K66j06j74j04k39P5k8K44
1817b76N12N6m6m98k2j36O8J29L95M6K66l46j74k00p1L19J84K00Rkj33j32n67
1840d19K61q0N72j27J30p1k02J70o09pM93J08K22m3j56j30m05K46k90N30JKr2
1863A04J9j97m54K86N41k6R6j10K0m75%k9M0K81N5Q2L00o42q2J9j02J74j2O02
1887D90P3l16k42j66j07k31N01L81O3K56k79m31K7k21K70K11K3R3Q9l54k47J17
1909@J04Q2L02K0r5J37l09o3j11rJ22L12m1m7j56N0k76J13J22R8Q3p3J9k47j12
1934B5k36J47J39R1K60k04p8j53j86j84K25M94j8J06l22m0l50P7k75m1O87k32
1956f8J08j22r1j07l83M7J70K30K45Ll49M25q59J08K58L45j16J5p0p5Ml22l36
$$ plain form
1979 -940 -286 -102 -61 52 105 53 -739 -678 -423 -301 -335 -5 -81 135 -138 -658 -293 -387 99 145 94 218 265
2002 265 -153 -473 -221 -66 320 17 421 246 -222 -161 -373 -352 245 333 41 305 247 -175 -31 152 -103
2023 -103 -56 475 98 337 -147 30 -67 -275 299 -82 258 445 214 -141 -77 -212 -90 -144 16 269 263 -276
2045 -276 -303 -116 -313 -292 119 98 445 302 -231 -328 -141 -494 70 200 -26 18 -146 -384 -225 -316 -406 83
2067 83 -57 100 398 149 -214 -74 -291 -15 -45 328 405 552 201 -105 -194 -55 -185 348 673 521 310
2088 310 170 -66 -48 113 142 366 510 144 260 74 -156 86 65 366 268 314 227 255 137 -38 46 -27 440
2111 440 293 411 113 72 -502 -215 132 48 281 384 288 70 -78 26 -192 109 -18 194 41 -69 -84
2132 -84 -437 -145 -307 -203 122 203 -120 -365 -238 -233 -528 -280 -168 136 -57 -83 -419 -295 -434 -531 -61 -158
$$ packed form
1979i40O54J84M1J13N3n2p92O1K55J22l4L30p6K16k73n20L65r4M86M6n1J24M7
2002B65m18l20K52J55L86l03M04j75m68O1k12K1N97Q8k92K64n8m22J44J83k55
2023a03M7N31l77K39m84J77r7k08N74l81L40J87k31l55O4j35J22n4J60K53on39
2045b76k7J87j97K1M11k1L47j43n33r7J87l53N64J30k26M4j64k38J59r1r0M89
2067H3j40J57K98k49l63J40k17K76l0L73P7J47l51l06q9J39j30N33L25j52k11
2088C10j40k36J8J61K9K24J44l66J16j86k30K42k1L01r8M6q7K8j18j75Q4p3M67
2111D40j47J18k98m1n74K87L47q4K33J03r6k18j48J04k18L01j27K12j53j10j5
2132h4l53K92j62J04L25Q1l23k45J27Nk95K48J12L04j93k6l36J24j39r7M70r7
$$ plain form
2154 -158 -165 -136 -178 -462 -257 -259 -444 -300 -24 -1 -113 -247 -435 -155 -238 -31 -207 119 46 46 -202 -246 -126 -259
2178 -259 -111 252 -298 -112 -7 4 -339 -160 20 -185 165 376 -18 -208 -145 -158 -332 -117 168 -8 53
2199 53 -38 26 -172 -48 -83 31 295 356 217 -161 -97 -168 -108 269 -39 109 75 208 -91 -201 -195 -98 -58 66
2223 66 248 -125 108 170 -343 -511 -414 -80 257 96 130 -151 -333 -229 -104 -238 103 168 -81 -6 -114 -348
2245 -348 -435 -251 0 -27 220 46 20 -3 -428 -235 74 97 -65 387 55 113 52 -67 -158 4 184 302 392
2268 392 34 -27 -126 -34 2 283 198 588 648 436 166 138 1 57 -10 365 347 209 184 -35 122 64 79 242
2292 242 623 418 234 198 15 -2 -315 168 287 41 71 59 -75 -375 -146 -113 197 -101 186 292 -288 -269
2314 -269 45 -394 6 82 416 -62 -63 -145 -179 -297 -340 89 -115 -159 -226 -259 -230 -265 -309 -444 -241 -39 -183 41
$$ packed form
2154a58pK9m2k84K05kj85J44K76K3j12j34j88K80q3K07j76L26p3%k48m4J20j33
2178b59J48L63n50J86J05J1l43J79J80k05L50K11l94j90O3j3j74K15K85j76O1
2199E3r1O4j98J24l5J14K64O1j39l78O4p1O0L77l08J48l4J33k99j10OR7M0J24
2223F6J82l73K33O2n13j68R7L34L37j61L4k81j82J04J25j34L41O5k49P5j08k34
2245c48q7J84K51k7K47j74k6k3m25J93L09K3j62M52l32N8o1j19r1J62J80J18R0
2268C92l58o1r9R2L6K81q5L90O0k12k70k8j37N6o7L75j8j38k5k19J57n8J5J63
2292B42L81k05j84l6j83j7l13M83J19k46L0j2j34l00K29L3L10k98K87J06n80J9
2314b69L14m39M00P6L34m78jq2l4j18m3M29k04m4o7l3K9l5m4j35K03K02j44K24
$$ plain form
2338 41 -400 -593 -315 -5 -332 -105 -209 -66 -38 -248 -72 -265 -401 -176 -56 223 78 147 52 -183 143
2359 143 -234 25 -197 71 87 -1 -268 -194 -152 -139 -154 246 -117 -495 -78 -164 31 -195 112 275 265 230 204
2382 204 -123 -78 -393 30 250 -28 90 304 -312 -91 -190 -22 -133 206 123 -74 264 -137 -121 -64 -245 -162
2404 -162 350 296 253 -21 -530 -237 -116 93 117 23 -110 -168 -170 -81 -45 -88 -144 5 370 48 -12 -97 -138 -200 -134
2429 -134 120 -70 -320 338 -81 -315 -302 62 76 379 96 -124 40 219 -264 -41 66 20 375 360 117
2450 117 -35 19 1 163 226 157 149 344 370 212 -338 -5 28 276 64 235 228 179 210 175 131 -45 492 309 495
2475 495 246 82 -119 69 89 -92 93 119 436 307 141 -66 42 35 -53 190 329 89 -59 33 -347 -166
2497 -166 -87 -94 323 35 -230 -163 -116 -102 -18 -26 -17 -13 199 -33 -358 89 -462 179 -49 -48 -31 44 -25 -228 -127 -252
$$ packed form
2338D1m41j93K78L10l27K27j04J43K8k10J76j93j36K25J20K79j45O9r5k35L26
2359A43l77K59k22K68J6q8k67P4M2J3j5M00l63l78M17q6J95k26L07J63j0l5k6
2382B04l27M5l15M23K20k78J18K14o16K21r9J68j11L39q3j97L38m01J6N7j81Q3
2404a62N12n4m3k74n09K93J21K09K4r4j33n8kQ9L6m3n6J49L65l22o0q5m1o2O6
2429a34K54j90k50O58m19k34J3L64J4L03k83k20J64J79m83K23J07m6L55j5k43
2450A17j52N4j8J62O3o9qJ95K6j58n50L33L3K48k12J71pm9L1l5m4j76N37j83J86
2475D95k49j64k01J88K0j81J85K6L17j29j66k07J08pq8K43J39k40j48R2l80J81
2497a66P9pM17k88k65O7M7J4Q4qRMK12k32l25M47n51O41k28JJ7P5o9k03J01j25
$$ plain form
2523 -252 -318 24 -48 -83 68 132 -117 -203 -95 40 -91 -5 54 -70 -33 -233 -190 -38 50 281 7 -78 -44 70
2547 70 -256 -63 18 172 -32 186 300 -97 -76 5 97 62 155 -157 250 95 84 -87 -182 402 191 -72 275
2570 275 -19 66 -248 -412 -3 -35 -76 136 -2 -78 -149 -127 -324 -185 171 -200 -146 -45 19 -173 -111 -176 -261 77
2594 77 32 103 49 -158 -243 -4 -176 33 79 -157 104 -108 239 -171 -339 -130 40 81 -72 -88 -224 116 20
2617 20 -126 -88 209 419 247 352 29 -183 7 -173 -71 289 144 57 217 -143 190 214 247 241 202 176 251
2640 251 114 -72 -225 -85 94 263 271 197 152 -9 102 115 87 -84 30 196 184 243 -78 80 -240 -308 86
2663 86 91 76 143 338 40 158 -142 113 193 -89 257 49 87 34 -319 -180 -116 90 86 -19 -52 -312 -178 -247
2687 -247 275 85 54 2 -63 -35 -221 -330 -94 58 -73 -176 215 -70 75 130 -39 -193 187 121 181 260 173
$$ packed form
2523b52o6L42p2l5J51O4k49q6J08J35j31Q6N9j24L7k00M3J52Q8K31k74q5L4J14
2547G0l26J93Q1J54k04K18J14l97K1Q1R2l5R3l12M07j55j1j71r5N84k11k63L47
2570B75k94Q5l14j64M09l2m1K12j38p6p1K2j97J39L56l71N4J01O4j92O2o5q5L38
2594G7m5P1n4k07q5K39j72K09M6k36K61k12L47m10j68K09J70M1j53j6j36L40r6
2617B0j46L8K97K10j72J05l23k12J90j80J02L60j45q7J60l60L33K4L3ol9k6P5
2640B51j37j86j53J40J79J69Qp4m5j61J11J3k8j71J14J66j2N9l21J58l20o8L94
2663H6Nj5O7J95k98J18l00K55Q0k82L46k08L8n3l53J39O4K06mj05l3k60J34o9
2687b47N22j90l1n2o5K8j86j09K36J52j31j03L91k85J45N5j69j54L80o6O0P9q7
$$ plain form
2710 173 13 -210 -95 -260 -246 -70 74 321 -87 -195 -231 -275 -84 -144 543 368 -4 69 103 -160 -110 -186 153
2733 153 -153 250 102 -301 -198 -30 -219 238 466 -289 71 -18 -242 11 59 57 -50 319 307 48 58 -273
2755 -273 -51 -33 31 214 -275 60 144 -87 57 -369 -44 0 166 -47 -136 -346 -283 -62 -262 -373 54 37
2777 37 -6 -106 -484 69 -108 -140 52 244 168 -269 3 -192 -168 -236 -5 42 5 -351 -97 -154 -75 -26 -275 -53
2801 -53 -68 73 -68 -73 -191 -279 -9 53 84 72 -73 481 36 -156 -195 -94 -124 -135 121 222 -46 137 -53 -106
2825 -106 76 278 275 112 231 -122 107 223 255 356 87 176 163 148 205 51 96 268 -54 155 247 -93 80
2848 80 176 -191 8 -9 93 73 181 -125 197 -316 -51 48 -289 64 197 175 16 -58 -118 -112 -83 -92 -194 104
2872 104 -43 -87 -104 35 -75 -9 -43 129 150 19 -147 -51 -261 -171 280 24 171 199 74 -48 -197 -225 -158
$$ packed form
2710A73j60k23J15j65J4J76J44K47m08j08l6m4J91o0O87j75l72P3L4k63N0p6L39
2733A53l06M03j48m03J03J68j89M57K28p55L60q9k24K53M8kj07L69j2k59J0l31
2755b73K22J8O4J83m89L35Q4k31J44m26L25M4J66k13q9k10O3K21k00j11M27j7
2777C7m3j00l78N53j77l2J92J92p6m37K72j95K4o8K31M7l7l56K54n7P9M9k49K22
2801e3j5J41j41nj18q8K70O2L1j2j45N54m45j92l9J01l0j1K56J01k68J83j90n3
2825a06J82K02lj63J19l53K29J16L2J01k69Q9j3j5N7j54M5J72l22K09R2l40J73
2848H0R6l67J99j7J02k0J08l06L22n13K65R9l37L53J33k2j59p4o0OK9rj02K98
2872A04j47m4j7J39j10O6l4J72K1j31j66R6k10R0M51k56J47K8j25j22j49k8O7
$$ plain form
2895 -158 -88 368 214 4 194 -4 -34 -126 -132 174 29 -10 152 235 -135 -36 73 191 182 6 328 26 -25 83
2919 83 76 2 -143 213 69 58 150 -123 -79 308 65 288 -66 -95 -154 16 -93 33 -16 52 105 -95 70 95
2943 95 -167 -40 -36 39 -43 147 -26 67 -193 14 164 -261 -186 -235 39 -178 2 -180 -74 -51 -259 -166 -5
2966 -5 -54 -51 -19 -97 -51 -29 -76 -15 1 -38 -72 -64 -22 -224 -3 265 155 -112 -3 -27 -235 12 -78 -152 152 50 102
2993 102 71 -76 -154 -13 -111 136 21 134 137 -99 75 32 -8 -71 19 -128 133 180 56 144 -67 37 34 67 317
3018 317 42 101 -33 5 -180 -223 108 168 289 204 179 -215 -134 -33 -221 -100 -170 -61 39 8 366 -35 -265
3041 -265 -118 -105 -75 128 137 -346 125 122 -253 -260 -102 -126 134 202 -102 -93 -38 -64 31 90 57 193 41 226 -44 15
3067 15 -116 188 26 41 -128 71 -74 -160 -24 -110 -69 98 166 -61 34 116 -52 -68 1 -75 168 129 109 181 -259
$$ packed form
2895a58P0M56j54k10J90j98l0r2oL06j45l9J62Q3l70R9J09J18rj76L22l02n1J08
2919H3pp4j45L56j44j1R2k73M4L87k43K23l54k9n9J70j09J26m9O8N3k00J65K5
2943I5k62J27MP5q2J90j73R3k60K07J50m25P5m9K74k17J80j82J06K3k08R3J61
2966em9LL2p8M6K2m7O1J6l9l4QM2k02K21K68j10k67J09k4k08K47r0p4L04j02N2
2993A02l1j47p8J41r8K47j15J13Lk36J74m3m0o3R0j47K61M7j24Q8k11J04lL3K50
3018C17k75N9j34L8j85m3L31O0J21q5k5l94Q1J01j88J21p0J09J00l1L58m01k30
3041b65J47J3L0K03Rm83M71ll75pJ58k4K60O8l04RN5k6R5N9l3J36j52J85k70N9
3067A5j31L04j62J5j69J99j45q6J36q6M1J67O8k27R5Q2j68j6O9p6K43l9k0P2m40
$$ plain form
3092 -259 71 -22 -192 139 286 -69 -222 45 303 -209 -29 237 422 270 41 202 148 -110 67 122 -191
3113 -191 -215 17 57 -79 -135 -356 69 -395 -45 156 36 -127 32 -179 -233 -30 -151 -218 -60 -39 -220 -293
3135 -293 177 -142 228 59 -26 -30 34 -28 14 -171 -344 59 10 -312 -129 -327 -72 1 -330 -101 134 147 -125
3158 -125 203 -208 75 -126 -190 -289 297 -150 121 -169 -113 -80 -109 84 28 -6 -190 42 -144 89 147 -70 172
3181 172 267 152 -127 -20 163 -125 -50 437 276 291 64 -89 253 36 242 -34 256 33 235 145 131 87
3203 87 -261 60 265 -165 -136 384 257 -58 172 -104 -59 135 -79 -12 -144 -99 9 -78 289 -96 60 -204
3225 -204 190 -22 -199 32 43 -196 -268 -175 -277 55 -276 117 -29 -163 26 -83 -54 254 -54 -102 -117 -156
3247 -156 -260 -88 57 -161 56 110 -48 330 144 84 65 90 90 155 231 96 -125 70 165 430 227 21 -37
$$ packed form
3092b59L30r3j70L31J47l55j53K67K58n12J80K66J85j52k29J61n4k58J77N5l13
3113a91k4K32M0j36n6k21M25m64L50K01j20j63J59k11n4K03j21o7J58K1j81p3
3135b93M70l19L70j69q5mO4o2M2j85j73M03m9l22J83j98K55P3l31K29K35J3k72
3158a25L28m11K83k01o4r9N86m47K71k90N6L3k9J93n6l4j84K32j86K33N8k17K42
3181A72R5j15k79J07J83k88P5M87j61J5k27j53L42k17K06k76K90k23K02r0j4m4
3203H7l48L21K05m30K9N20j27l15K30k76M5J94k14O7j32M5J08q7L67l85J56k64
3225b04L94k12j77K31J1k39p2R3j02L32l31L93j46j34J89j09K9L08l08m8j5l9
3247a56j04J72J45k18K17N4j58L78j86o0j9K5%O5P6j35k21J95R5K65k03k06n8
$$ plain form
3270 -37 -82 -5 124 34 175 266 241 153 -124 -173 66 185 105 245 275 -25 144 214 -154 -38 -55 -3 39 108 -143
3295 -143 -2 153 -161 121 -31 -222 133 103 127 -113 74 51 -55 -28 -135 74 -20 -27 -16 178 150 -233 -121
3318 -121 -128 142 -46 -206 53 177 -482 159 -352 62 -38 -88 -47 47 112 9 -398 -150 -62 -76 24 79 -186
3341 -186 -220 15 -238 8 -37 -188 271 -122 -179 -134 125 123 -59 102 -174 204 57 171 8 -62 -286 249
3363 249 64 -55 79 -119 -190 52 241 267 96 19 -10 -45 10 112 -66 160 -17 133 88 -15 118 127 13
3386 13 -40 -98 -49 76 -92 -245 22 -174 234 -128 -173 -39 39 34 -50 -382 -124 75 -51 51 109 216 -271
3409 -271 49 -79 35 21 107 -46 130 216 7 -124 -202 -255 -207 112 -29 -145 -120 321 37 -177 0 295
3431 295 -78 114 -49 206 102 152 56 98 249 -32 119 230 170 -9 -67 -65 92 239 10 430 281 225 73
$$ packed form
3270c7m5P7J29r0J41R1k5q8k77m9K39J19q0J40L0l00J69P0l68J16j7N2M2O9k51
3295a43J41J55l14K82j52j91L55l0K4k40J87k3j06K7j07K09r4pJ1J94k8l83J12
3318a21pK70j88j60K59J24o59O41n11M14j00n0M1R4O5j03m07K48Q8j4J00N5k65
3341a86l4K35k53K46m5j51M59l93n7M5K59kj82J61k76L78j47J14j63p0k24N35
3363B49j85j19J34j98p1K42J89K6j71p7k9l5N5J02j78K26j77J50m5j03J33Rj14
3386A3n3n8M9J25j68j53K67j96M08l62m5J34P8nq4l32K58J99j26J02N8J07m87
3409b71L20j28J14j4Q6j53J76Q6k09j31p8n3M8L19j41j16K5M41k84k14J77K95
3431B95l73J92j63K55j04N0r6M2J51k81J51J11o0j79n8KJ57J47k29M20j49n6j52
$$ plain form
3454 73 -178 -83 95 -77 326 -99 -33 -18 123 -43 -56 142 120 -6 302 -373 -193 -35 123 159 -43 59
3476 59 -104 -155 24 -30 -65 -65 31 333 116 30 23 128 -151 -33 104 -120 -87 192 -118 61 33 -108 -195 98
3500 98 113 -80 -195 185 -76 -377 -55 139 -73 162 124 -81 -273 -168 61 -151 -258 51 53 38 18 23 -156
3523 -156 -204 -5 107 -39 287 212 -132 -158 122 248 17 278 34 -120 -21 -80 -185 130 56 80 113 140 -66
3546 -66 164 118 121 -208 32 386 85 36 223 128 94 1 157 221 -123 75 63 54 164 -151 47 -48 -86 168 -126
3571 -126 -74 -206 92 -331 -17 63 -48 73 244 6 -34 -103 -26 -108 -246 -139 -101 143 -44 -280 -120 -37 -95
3594 -95 113 70 -100 -22 5 -143 183 153 61 -126 -179 142 37 14 -35 209 -26 -215 113 137 202 109 -169 -15
3618 -15 128 111 -258 108 196 167 1 -167 142 13 -297 100 161 122 -299 122 71 -65 3 -1 -163 366 160
$$ packed form
3454G3k51R5J78j72M03m25O6J5J41j66j3J98k2j26L08o75J80J58J58L6k02J02
3476E9j63n1J79n4l5%R6L02k17q6pJ05k79J18J37k24L3K79l10J79k8j41q7K93
3500I8J5j93j15L80k61l01L22J94k12K35l8k05j92J05K29k12j07L09Kj5k0Nj79
3523a56m8J99J12j46L26p5l44k6K80J26k31K61k44j54R9n9j05L15p4K4L3K7k06
3546f6K30m6Ll29K40L54l01m9J87r5l4r3J56O4l44J98j2rJ10l15J98r5l8K54k94
3571a26N2j32K98m23L14Q0j11J21J71k38m0o9P7q2j38J07L8K44j87k36J60Q3n8
3594i5K08m3j70P8K7j48L26l0r2j87n3L21j05k3m9K44k35j89L28K4O5r3k78J54
3618a5J43j7l69L66Q8k9j66j68L09j29l10L97O1l9m21M21n1j36O8mj62N29k06
$$ plain form
3641 160 287 41 111 196 6 163 -50 100 170 136 77 64 169 264 176 -81 -11 146 92 110 -111 -16 148 -158
3665 -158 127 331 51 167 65 -113 -3 18 -135 -100 -232 144 157 -313 -222 -1 -70 193 268 49 165 91
3687 91 -248 -63 56 -23 25 -149 -24 -80 -140 58 132 370 31 -107 -70 220 -170 281 98 132 103 124 -53
3710 -53 -36 335 101 65 -34 37 -58 73 -82 57 -106 271 38 281 83 188 -24 -17 33 -108 56 33 131 -64
3734 -64 -16 144 206 127 26 66 115 90 211 -38 -103 -79 178 48 86 -98 -108 -8 52 148 104 -132 -172 -136 8
3759 8 126 45 144 148 179 -143 -3 -168 -134 -280 -109 106 -11 -101 75 36 188 -31 -134 -29 -61 -411 -25 64
$$ packed form
3641A60J27k46P0Q5j90J57k13J50P0l4n9j3J05R5q8k57P0J57n4J8k21R5J64l06
3665a58K85K04k80J16j02j78J10K1j53L5j32L76J3m70R1K21o9K63P5k19J16p4
3687I1l39J85J19p9M8j74J25n6o0J98P4K38l39j38L7K90l90M51j83L4k9K1j77
3710e3J7L71k34l6r9P1r5J31j55J39j63L77k33K43j98J05k12PN0j41J64k3R8j95
3734f4M8J60O2p9j01M0M9k5J21k49o5K4K57j30L8j84j0J00O0R6m4k36m0L6J44
3759HJ18q1R9ML1l22J40j65L4j46J71K15j17r0J76l9J52k19j03J05l2l50L86Q9
$$ [...]
8191a4
##END NTUPLES=NMR FID
##END=
