##TITLE=1H_SR75h-1
 aceton-d6
 8 sc, 
 21.11.2023
##JCAMPDX= 6.0         $$ Bruker NMR JCAMP-DX V2.0
##DATA TYPE= NMR FID
##DATA CLASS= NTUPLES
##ORIGIN= UXNMR, Bruker Analytische Messtechnik GmbH
##OWNER= root
$$ XWIN-NMR		Version 3.5
$$ Tue Nov 21 15:55:48 2023 Russian Standard Time (UT+4h)  she@DPX200
##.OBSERVE FREQUENCY= 200.1313
##.OBSERVE NUCLEUS= ^1H
##.DELAY= (6, 6)
##.ACQUISITION MODE= SIMULTANEOUS
##.ACQUISITION SCHEME= undefined
##.AVERAGES= 8
##.DIGITISER RES= 18
##SPECTROMETER/DATA SYSTEM= spect
##.PULSE SEQUENCE= zg30
##.SOLVENT NAME= CDCl3
##.SHIFT REFERENCE= (INTERNAL, CDCl3, 0, 15.7039)
##AUDIT TRAIL= $$ (NUMBER, WHEN, WHO, WHERE, WHAT)
$$ ##TITLE= Audit trail, XWIN-NMR		Version 3.5
$$ ##JCAMPDX= 5.01
$$ ##ORIGIN= Bruker BioSpin GmbH
$$ ##OWNER= she
$$ F:/spectra/data/she/nmr/H-F/1/audita.txt
$$ ##AUDIT TRAIL=  $$ (NUMBER, WHEN, WHO, WHERE, WHAT)
(   1,<2023-11-21 15:54:24.64 +0400>,<she>,<DPX200>,
      <created by zg, POWCHK disabled, PULCHK disabled
       configuration hash MD5:
       00 E9 B6 7A A2 85 ED C7 34 08 36 98 17 FE 4E 26
       data hash MD5: 16K
       44 59 34 8D 42 5F A5 E1 99 69 6A EB 69 3B 6A DC>)
$$ ##END=
$$ 
$$ hash MD5
$$ 43 4E 99 3C 80 81 C6 12 45 9D 04 2D 92 9C C8 3C
##$RELAX= 
##$RELAX= 
##$RELAX= 
##$RELAX= 
##$RELAX= 
##$RELAX= 
$$ Bruker specific parameters
$$ --------------------------
##$DU= <F:/spectra>
##$EXPNO= 1
##$NAME= <H-F>
##$PROCNO= 1
##$TYPE= <nmr>
##$USER= <she>
##$AMP= (0..31)
100 100 100 100 100 100 100 100 100 100 100 100 100 100 100 100 100 100 
100 100 100 100 100 100 100 100 100 100 100 100 100 100 
##$AQSEQ= 0
##$AQ_mod= 1
##$AUNM= <au_zg>
##$AUTOPOS= <>
##$BF1= 200.13
##$BF2= 200.13
##$BF3= 200.13
##$BF4= 200.13
##$BF5= 200.13
##$BF6= 200.13
##$BF7= 200.13
##$BF8= 200.13
##$BYTORDA= 1
##$CFDGTYP= 0
##$CFRGTYP= 5
##$CHEMSTR= <none>
##$CNST= (0..31)
1 1 145 1 1 1 1 1 1 1 1 1 1 1 1 1 1 1 1 1 1 1 1 1 1 1 1 1 1 1 1 1 
##$CPDPRG= <>
##$CPDPRG1= <>
##$CPDPRG2= <>
##$CPDPRG3= <>
##$CPDPRG4= <mlev>
##$CPDPRG5= <mlev>
##$CPDPRG6= <mlev>
##$CPDPRG7= <mlev>
##$CPDPRG8= <mlev>
##$CPDPRGB= <>
##$CPDPRGT= <>
##$D= (0..31)
0 1.2 0 0 0 0 0 0 0 0.06 0 0.03 0 0 0 0 0.0002 0 0 0 0 0 0 0 0 0 0 0 0 
0 0 0 
##$DATE= 1700567664
##$DBL= (0..7)
120 120 120 120 120 120 120 120 
##$DBP= (0..7)
150 150 150 150 150 150 150 150 
##$DBP07= 0
##$DBPNAM0= <>
##$DBPNAM1= <>
##$DBPNAM2= <>
##$DBPNAM3= <>
##$DBPNAM4= <>
##$DBPNAM5= <>
##$DBPNAM6= <>
##$DBPNAM7= <>
##$DBPOAL= (0..7)
0.5 0.5 0.5 0.5 0.5 0.5 0.5 0.5 
##$DBPOFFS= (0..7)
0 0 0 0 0 0 0 0 
##$DE= 6
##$DECBNUC= <off>
##$DECIM= 32
##$DECNUC= <off>
##$DECSTAT= 4
##$DIGMOD= 1
##$DIGTYP= 9
##$DL= (0..7)
0 120 120 120 120 120 120 120 
##$DP= (0..7)
150 150 150 150 150 150 150 150 
##$DP07= 0
##$DPNAME0= <>
##$DPNAME1= <>
##$DPNAME2= <>
##$DPNAME3= <>
##$DPNAME4= <>
##$DPNAME5= <>
##$DPNAME6= <>
##$DPNAME7= <>
##$DPOAL= (0..7)
0.5 0.5 0.5 0.5 0.5 0.5 0.5 0.5 
##$DPOFFS= (0..7)
0 0 0 0 0 0 0 0 
##$DQDMODE= 0
##$DR= 18
##$DS= 0
##$DSLIST= <SSSSSSSSSSSSSSS>
$$ [...]
##$SUBNAM2= <"">
##$SUBNAM3= <"">
##$SUBNAM4= <"">
##$SUBNAM5= <"">
##$SUBNAM6= <"">
##$SUBNAM7= <"">
##$SUBNAM8= <"">
##$SUBNAM9= <"">
##$SW= 18.0517328524113
##$SWIBOX= (0..15)
0 0 2 0 0 0 0 0 0 0 0 0 0 0 0 0 
##$SW_h= 3612.71676300578
##$TD= 16384
##$TD0= 1
##$TE= 0
##$TE2= 300
##$TE3= 300
##$TEG= 300
##$TL= (0..7)
0 120 120 120 120 120 120 120 
##$TP= (0..7)
150 150 150 150 150 150 150 150 
##$TP07= 0
##$TPNAME0= <>
##$TPNAME1= <>
##$TPNAME2= <>
##$TPNAME3= <>
##$TPNAME4= <>
##$TPNAME5= <>
##$TPNAME6= <>
##$TPNAME7= <>
##$TPOAL= (0..7)
0.5 0.5 0.5 0.5 0.5 0.5 0.5 0.5 
##$TPOFFS= (0..7)
0 0 0 0 0 0 0 0 
##$TUNHIN= 0
##$TUNHOUT= 0
##$TUNXOUT= 0
##$USERA1= <user>
##$USERA2= <user>
##$USERA3= <user>
##$USERA4= <user>
##$USERA5= <user>
##$V9= 5
##$VALIST= <valist>
##$VCLIST= <CCCCCCCCCCCCCCC>
##$VD= 0
##$VDLIST= <DDDDDDDDDDDDDDD>
##$VPLIST= <PPPPPPPPPPPPPPP>
##$VTLIST= <TTTTTTTTTTTTTTT>
##$WBST= 1024
##$WBSW= 4
##$XGAIN= (0..3)
0 0 0 0 
##$XL= 0
##$YL= 0
##$YMAX_a= 863637
##$YMIN_a= -749024
##$ZGOPTNS= <>
##$ZL1= 120
##$ZL2= 120
##$ZL3= 120
##$ZL4= 120
##$ABSF1= 10
##$ABSF2= 0
##$ABSG= 5
##$ABSL= 3
##$ALPHA= 0
##$AQORDER= 0
##$ASSFAC= 0
##$ASSFACI= 0
##$ASSFACX= 0
##$ASSWID= 0
##$AUNMP= <proc_1d>
##$AZFE= 0.1
##$AZFW= 0.1
##$BCFW= 1
##$BC_mod= 2
##$BYTORDP= 1
##$COROFFS= 0
##$CY= 11.3945322036743
##$DATMOD= 1
##$DC= 2
##$DFILT= <>
##$DTYPP= 0
##$F1P= 15.7292609196834
##$F2P= 12.9074282941183
##$FCOR= 0.5
##$FTSIZE= 0
##$FT_mod= 4
##$GAMMA= 1
##$GB= 0.15
##$INTBC= 1
##$INTSCL= 1
##$ISEN= 128
##$LB= 0.24
##$LEV0= 0
##$LPBIN= 0
##$MAXI= 10000
##$MC2= 0
##$MEAN= 0
##$ME_mod= 0
##$MI= 1.114404
##$NCOEF= 0
##$NC_proc= 0
##$NLEV= 6
##$NOISF1= 3.799351
##$NOISF2= 2.8
##$NSP= 1
##$NTH_PI= 0
##$NZP= 0
##$OFFSET= 15.70392
##$PC= 1
##$PHC0= -23870.47
##$PHC1= 9.45269
##$PH_mod= 1
##$PKNL= yes
##$PPARMOD= 0
##$PSCAL= 0
##$PSIGN= 0
##$REVERSE= no
##$SF= 200.130013532006
##$SI= 16384
##$SIGF1= 3
##$SIGF2= 2
##$SINO= 400
##$SIOLD= 16384
##$SREGLST= <1H.CDCl3>
##$SSB= 0
##$STSI= 0
##$STSR= 0
##$SW_p= 3612.71676300578
##$SYMM= 0
##$S_DEV= 0
##$TDeff= 0
##$TDoff= 0
##$TI= <>
##$TILT= no
##$TM1= 0
##$TM2= 0
##$TOPLEV= 0
##$USERP1= <user>
##$USERP2= <user>
##$USERP3= <user>
##$USERP4= <user>
##$USERP5= <user>
##$WDW= 1
##$XDIM= 8192
##$YMAX_p= 0
##$YMIN_p= 0
$$ End of Bruker specific parameters
$$ ---------------------------------
##NTUPLES= NMR FID
##VAR_NAME=  TIME,          FID/REAL,        FID/IMAG
##SYMBOL=    X,             R,               I
##VAR_TYPE=  INDEPENDENT,   DEPENDENT,       DEPENDENT
##VAR_FORM=  AFFN,          ASDF,            ASDF
##VAR_DIM=   8192,          8192,            8192
##UNITS=     SECONDS,       ARBITRARY UNITS, ARBITRARY UNITS
##FACTOR=    0.0002768,     1,               1
##FIRST=     0,             0,               0
##LAST=      2.2672688,     0,               0
##MIN=       0,             -749024,         0
##MAX=       2.2672688,     863637,          0
$$ Real data points
##PAGE= N=1
##DATA TABLE= (X++(R..R)), XYDATA
$$ [...]
1978d159L194N435l629m622K916M278k419m327J505M837q37m985l5N740K14o538
1994c432Q30N942j196n196N69M499O53m252j373M277K368n128k353N374K436n562
2010a544k121M954J728l993k084L154L027k978l706L152M310l319m397L342M196
2025C721l381l754K846L531j995l726J117M443m82m941N22M929q41n023R92M741
2041B699q95m362N93L648M50l340j242M105J421m633j622M762J542m578j143L857
2057A262J283l188j731K651K738k653l507K597L667l036l457L381K788k800k796
2072b801K282K843j104l131O31L580q60l687M55M585j343l954J003L390m31k958
2088a500J04K718O00k950j371L625J452l847j279L654P72l290n87K612J314k368
$$ y = [-4159, -965, 4470, 841, -3781, -865, 3413, 994, -3333, -1828, 3009, 2172, -2813, -2848, 2892, 3106, -3432, -2602, 3340, 2144, -3052, -2483, 2016, 2669, -1583, -2956, 1321, 3689, -1439, -3792, 1582, 4018, -1544, -3665, 1289, 3017, -976, -3060, 94, 3121, 143, -3563, -411, 3899, 580, -3817, -475, 3721, 340, -3414, -568, 2963, 968, -2758, -1641, 2802, 2320, -2621, -2099, 2830, 1989, -3034, -2042, 2699, 1804, -2558, -1965, 1683, 2133, -1207, -2449, 1656, 3077, -1556, -3178, 1584, 3126, -1452, -2595, 1262, 2545, -643, -2374, 277, 3015, 362, -3145, -548, 3119, 83, -3374, 7, 2795, -5, -2801, -519, 2324, 1220, -1911, -1280, 2300, 1440, -2247, -1792, 2793, 1450, -2504, -1501, 1889, 1458, -1500, -1396, 1322, 1922, -1028, -2399, 1226, 2678, -1169, -2448, 1206, 1978, -1312, -1899, 713, 2027, -341]
2104c41j727K042K364k165k567K330K526k580k624K676K444k149j994J116K430
2119A781q58k526M42L161p98l446J057L119p75k909Q26K346l04k098l90K368R09
2136A905k506j488K915J084k912q14K892N03k280q19J803J218j222j749J037J990
2152A557j393k108J916K196k149j698J696J411q66j749O45J576j47k207J78K475
2168A333j12k752O42K270o26j555R0J565K73j549p96J682J011j742j182K120P59
2185A431k114m94J845L08j007j022Q39J216o83j566Q95J577r79j828J342J826
2201A586j520q21O33Q33j86j227j77J500J46j692j85J993m5j683L28J492l07r91
2219c23j47O44P67p44j437J354J046j419r38J802L60j191p51J084M25k32j123
$$ y = [-341, -2068, -26, 2338, 173, -2394, -64, 2462, -118, -2742, -66, 2378, 229, -1765, -649, 1781, 923, -1603, -1161, 2000, 1202, -2244, -1187, 1932, 1157, -1752, -926, 1420, 1116, -982, -1372, 996, 1905, -601, -2089, 826, 1910, -1002, -1816, 1076, 1579, -701, -1520, 283, 1501, 279, -1470, -433, 1557, 164, -1944, -28, 2168, 19, -1679, 17, 1428, 562, -1187, -542, 1034, 887, -1320, -1142, 1333, 1221, -1531, -889, 1381, 755, -800, -710, 855, 1128, -421, -1217, 465, 1476, -266, -1448, 672, 1431, -683, -1177, 668, 976, -31, -1053, -214, 1002, 319, -1247, -352, 1225, 246, -1582, -240, 1586, 66, -755, -122, 711, 525, -702, -879, 621, 767, -925, -1110, 883, 838, -845, -517, 975, 668, -323, -470, 174, 941, 197, -1240, 114, 1160, -259, -1197, 605, 965, -226, -977, 107, 532, 300, -823]
2236h23M09J125m12j477P58J613q35j265R18Q73p28n78Q8O27Q5p43l77Q56P41
2255H55j254k66J337m52r63M89O39M7m40m18J96Q35m37r18R05N67r38n55J179
2274D08J8m51k68J10N82j31o97o1R29n9j182L89J138o58l75L37J79r2j45l82O22
2295B11L34q05l14O72O06r38j79Q94j47o66P1qM49J06p31Q8O67j61o67Q11L69
2316F62n15l40N5K74R6j46k44K19M43o61j78P39p0p46K05L94j65l01J35Q8K2J07
2338G3m97K84O68m05m44M79J85o03J89L69k34l9j67M7K21O2l62N7N38k78o72L67
2360a62M02j90q0M9n2J29o0m45O37K35o05l0M46j00n16L30K67l16o4j4K6L44j34
2383I7m56K36L53l44j43N33m9l48j68M40j61R6l70L13Q1L6n73L97M87p73PM73
$$ y = [-823, -414, 711, 299, -1178, -420, 1193, 358, -907, 11, 884, 156, -422, -334, 293, 378, -365, -742, 114, 855, -399, -665, 672, 220, -743, -254, 385, 432, -8, -426, -230, 605, 168, -750, 155, 722, -216, -771, 408, 426, -25, -293, -183, 399, 268, -429, -490, 439, 380, -802, -413, 725, 67, -308, 29, 208, 116, -29, -411, 211, 545, -260, -574, 98, 704, -234, -413, 481, 334, -332, -261, -269, 180, 286, -445, -357, 310, 149, -518, 293, 662, 147, -193, -138, 136, 232, 86, -158, 61, 504, -157, -335, 404, 334, -412, -207, 187, 22, -279, -144, -56, -34, 73, -424, -140, 528, 123, -321, 158, 343, -260, -71, 298, 64, 25, -142, -95, 126, 188, -174, -117, 421, 143, -529, -162, 240, 50, -30, 19, -33, 96, 36, -409, 228, 463, -142, -172, 274, 174, -342, -12, 255, -61, -125, -139, -113, 231, 97, -359, -123, 230, -114, -257, 276, 227, -121, -289, 151, -10, 86, -284, 29, 110, 146, -427, -30, 457, -316, -309, 164]
2405A64j04k73K03K95j6k65p3j28M60j54m07L38L09n47j73O10K7l81J38J19q4
2426E8N0l32L2N54j99n31K08M36k75j47J30L34l18j79P9L92K0l08l45N42J08o92
2448c83J95O08m06l97K98J6L68j66m13M81J03l87k65N86L71q96j46O67M1n19J09
2469a35K73J14k13k66L9O40m30m87M93M18n73k52Q23j45l64j18p2N97j61m41K34
2490b6O41l78p21K79N38j59m71K67K24O6m54j96O18R7n19l43P06Q7p06J24P15
2511C89J7o47k11N07M20k44p58K78Q17o08m35O68M28m25o31K78N95k60n95J10
2531c07N53q2o20q2J293n46p11K65O64J18o66k27O31K37r07k83R19L78q05m25
2551f03R45K43q84j71Q27L17o16p23M57Q62m95q48P26P01p95p08Q13O73o69n01
$$ y = [164, 60, -213, -10, 285, 269, 4, -69, -197, 263, 109, -298, 40, 349, -198, -371, 239, 266, -115, 23, 142, 58, 108, -224, -192, 362, 163, -368, -160, 276, 1, -146, -16, 318, 0, -179, -100, 292, 312, 4, -341, 201, 309, -383, -188, 420, 14, -383, -85, -69, 299, 133, -280, 201, 304, -83, -348, 238, 609, -287, -433, 234, 275, -244, -135, 138, 252, 39, -227, -188, 452, 22, -465, 28, 446, -127, -379, 444, 299, -65, -183, -255, 342, 181, -260, -26, 615, 237, -484, -205, 333, 174, -297, -30, 194, 260, -194, -390, 228, 325, -194, -537, 169, 256, -450, -326, 389, 406, -241, -452, 55, 475, 231, -527, -249, 568, -40, -475, 193, 621, 196, -435, -157, 438, 178, -417, -307, 246, 164, -456, -538, 755, 209, -502, -237, 427, 545, -121, -348, 283, 520, -387, -670, 249, 627, -178, -603, 342, 585, -299, -470, 357, 674, 58, -665, -208, 654, 159, -689, 37, 738, -57, -765, 48, 721, 52, -449]
2571d49K76N58k42p30J70J139q1j108kJ120j82j070K08J068l54q03o7Q56J72q82
2591d03l15J007L90r98k77J150K25r64l76P24L73o87n40O84O90o38q60Q47J007
2610A039r64o69L75P87m63q69O75O30j66j041K28R94J0j324K95R24j72o24m5Q56
2630D76R4j091j20Q42M51q13n73J218J40r48NO16J52n81n17O96O30p17o21P06
2650D5O87o29r82N03J017n76n70M88O74m62q86M48O86J69j073j44J050o1q07J64
2670b59P66l12p28l9P31K64n94j81O64L27r01k90Q44M24q72l63N25L22m76l12
2690d60L53P12n59p75O11R54o81p96M75N79l69n96K21P58q9o40j15Q31K46j063
2710d03P5Q86p1q85o1O81P7o23k44O50J86k49o41Q01M18p10l94N52L89n32k49
$$ y = [-449, -173, 385, 143, -587, -417, 722, 641, -467, -469, 651, 469, -601, -393, 675, 321, -482, -549, 307, 479, -403, -718, 289, 679, -319, -596, 554, 779, -185, -561, 163, 536, -151, -691, -7, 683, 45, -815, 32, 1039, 75, -594, -219, 568, 105, -764, -89, 541, 375, -666, -438, 556, 566, -758, -463, 461, 289, -335, -380, 476, 570, -521, -641, 201, 652, -161, -734, 484, 624, -324, -319, 297, 449, -132, -649, 47, 677, -40, -661, 45, 732, 103, -879, -376, 641, 65, -505, -17, 657, 195, -691, -243, 443, 612, -461, -605, 445, 384, -423, -259, 507, 195, -533, -572, 159, 423, -171, -352, 312, 639, -262, -552, 292, 716, -156, -519, 6, 328, -148, -460, -107, 605, 46, -729, -118, 836, 155, -641, -166, 413, 44, -552, -331, 427, 338, -302, -417, 414, 660, -403, -328, 558, 487, -398, -459, 222, 299, -324, -568, 82, 268, 19, -622, 179, 597, -113, -507, 45, 434, -98, -347]
2731c47M44L96n48m04N45J63J07q26L34N90l95m62J96M75j5m73o1N60j39l39R7
2752a02N89k59m82O6M45K17q80qN39J70l95j60L69M12o95l15M78M15l04l66L14
2773D8L52m80n1J69L79j52o28K57L11j6n15K46K72o2m15j8N17j58j94N0J39J32
2795A83l91p8L67J09l73l5L46R1k48r2K48O9j63l44P2N67j96m44L04K50l05j00
2817a63J57J04P1l44j15N45Jm83j26O44M7n35j4M53j22j34o0L8K07j22j94J79
2839C4L81n85o9K40K06j96k28J58J05q9nj7O7J88n02P1M79k68j95K25K05k11j60
2862a66nK39R2j80j29L55k07j95m6J75K17j87j43J57K74j76j53k51O69j60n49
2883c69L58M44m47l37M79k5J8l90L20J19j10o0k36N75N8n94JO26k81l48j09M71
$$ y = [-347, 97, 493, -55, -459, 86, 249, 356, -470, -136, 454, 59, -403, -207, 268, 253, -220, -281, 279, 140, -199, -102, 487, 228, -254, -188, 257, 474, -406, -414, 125, 295, -100, -260, 109, 521, -174, -489, -11, 404, 100, -266, 48, 400, -80, -131, 38, 417, 265, -363, -106, 205, 189, -326, -80, 192, 130, -285, -303, 214, 56, -138, -88, 51, 183, -208, -286, 81, 190, -183, -218, 128, 219, -29, -121, 127, 196, 33, -311, -239, 328, 132, -312, -8, 242, -63, -163, -6, 98, 169, -175, -290, 255, 256, -227, -353, 291, 338, -197, -211, 242, 120, -14, -74, -36, 171, 49, -145, 34, 415, -170, -239, 1, 207, 11, -217, -59, 46, -43, -48, -65, 2, 190, -312, -241, 238, -30, -225, 0, 205, -6, -166, -171, 68, 160, -20, -149, 206, -1, -196, -242, -67, 150, -37, -180, -23, 251, 75, -78, -329, 340, 180, -369, -11, 433, -14, -351, 128, 103, 121, -269, 51, 170, 60, 0, -236, 339, 397, -197, -196, 430, 149, -199, -308, 163]
2905A63P4l91m4J87L80m78j04M49J74l97l58L90L68n26p8N7K91o0l03M03J43k98
2927D2k56J15L46j24l83R0M77j45m32J26L94qn92Q6N90Mo40rO61l7o20J2M44L56
2951D97p03j92O52K83q70k14P62L06o66k29M74K68m23l82M04O00n32o48M89O57
2971E33l53r23P20O85m15p06L96O88l14r41L60Q59k81n06k50J016k14q89K99P92
2991E56l06n87N5N46L32p35n92Q12P46j113l26Q57N82j069n72J019L07p52n43
3010g83R07O64o70r22Q51P36o60r91P86R33p39j079O32J220m12j277L25J247j54
3029F14j372K75J233l35j163J0J370M8j111j11J050K06j380k07J431K86j223m03
3047g82J060P59j102j150J455R33j296r48J056J223j278r32R59J205j079j262
$$ y = [163, 237, -154, -198, -11, 369, -109, -213, 236, 410, 13, -345, 45, 413, -113, -191, -134, 157, 97, -206, 197, 340, 42, -214, -99, 247, 123, -260, -170, 307, 162, -270, -144, 250, 242, -350, -264, 326, 330, -310, -319, 342, 305, -315, -303, 141, 497, -206, -398, 254, 537, -333, -547, 215, 521, -145, -374, 100, 368, -55, -437, -33, 567, 35, -613, -124, 533, 180, -743, -23, 662, 247, -459, -63, 625, 311, -630, -270, 589, 308, -198, -448, 568, 354, -535, -236, 556, 250, -337, -282, 264, 596, -139, -731, 81, 827, -286, -612, 245, 827, -242, -814, 205, 512, -240, -783, 124, 788, 118, -804, 47, 783, 123, -868, -82, 851, 112, -967, -335, 885, 473, -804, -479, 768, 614, -758, -483, 750, 415, -748, -738, 632, 680, -431, -542, 508, 714, -666, -873, 558, 844, -379, -782, 278, 1037, -65, -1215, 240, 1173, -123, -1071, -15, 1208, -70, -1002, -43, 1162, 83, -1179]
3063a179Q90J499o81j623N98J711p72j340L56J555j72j952K15J741Lj715m5J738
3081H27J78j715m12J712O72j947n86J820P66j860q04J889Q70j612j385J554J503
3098A470j407j556J341J674j345j757J408J751j166j821J020J760p66j944N06
3113h32K231m51k274K32K431m10k004k43K526R5k360j04K065N40k231p04K357
3130H64P31k152r26K006R53j960j198K037J574k172j628K004J755j700k027J607
3146b32K164j536k196J265K221j040k344R97K414j082k329N78K813n96k605J75
3162a333K860Qk843j66K620M74k719p41K827Q41k766r11K518J314k557j419K422
3179D29J607k317j840K276J876j956k221K057K141j799k394J803K363j314k902
$$ y = [-1179, -289, 1210, 529, -1094, -496, 1215, 443, -897, -541, 1014, 842, -1110, -895, 846, 849, -866, -911, 827, 1005, -710, -1122, 590, 1262, -685, -1271, 549, 1315, -545, -1349, 540, 1410, -202, -1587, -33, 1470, 63, -1493, -152, 1522, 177, -1580, -172, 1579, 413, -1408, -388, 1372, 606, -1338, -832, 1399, 948, -1326, -1094, 1337, 927, -1077, -1320, 1206, 1301, -1059, -1163, 902, 1442, -789, -1493, 864, 1595, -557, -1483, 523, 1476, -484, -1682, 355, 1929, -243, -1871, 133, 1888, 188, -1839, -232, 1932, 396, -1800, -535, 1686, 646, -1698, -701, 1713, 631, -1698, -1120, 1693, 1097, -1508, -1333, 1527, 1535, -1308, -1474, 1146, 1620, -1099, -1840, 987, 1828, -938, -1849, 669, 1983, -574, -1993, 429, 2036, -281, -2121, 155, 2031, 75, -2146, -89, 2052, 253, -2141, -338, 2025, 711, -2191]
3194b191J277K729r22k757O90L104p11l058L80L285l03l199K3L258K60l314m02
3211a851L118O13k795j193K981J283k985j428L014J438k516k118K641K172k441
3226f7k290K199K335j879k623J761K968j774k827J515K899j212l093R91L047p00
3242A250l301N72L376k18l457p8L494L09l693l37L564M47l003j377L231J523k987
3259f85j720L051J915k919k327K936K395k874k392K571K668k229k939K140L072
3274B663j978l096J262L538j397l301J115L478r80l189L37L533k48l706M1L701
3290A773J26l569l95L481P54l480q93L545J157l511j288L112J568l002j904L029
3306E03K115l022k422L077K320k440k658K262K767j809l238J791L183j392l502
$$ y = [-2191, -914, 1815, 893, -1864, -1174, 1930, 1219, -1839, -1459, 1826, 1523, -1676, -1653, 1605, 1865, -1449, -1851, 1267, 1880, -915, -2108, 873, 2156, -829, -2257, 757, 2195, -321, -2439, 202, 2374, -67, -2357, -158, 2177, 298, -2325, -564, 2404, 630, -2197, -682, 2217, 1005, -2088, -1097, 1950, 1250, -2051, -1479, 1897, 1679, -1778, -1856, 1638, 1947, -1746, -2083, 1481, 1928, -1075, -2452, 779, 2302, -685, -2405, 646, 2561, -358, -2685, 251, 2646, -228, -2620, -49, 2619, 390, -2549, -409, 2663, 685, -2411, -1149, 2389, 992, -2309, -1194, 2284, 1304, -1885, -1548, 1985, 1737, -1969, -1928, 1773, 1899, -1670, -2065, 1416, 2170, -1310, -2203, 1342, 2499, -1012, -2300, 812, 2380, -622, -2526, 503, 2618, -404, -2826, 251, 2571, 131, -2527, -265, 2502, 693, -2545, -754, 2429, 1037, -2465]
3321b465J455L387j187l299O17L470k77l622J59L542J17l520l99L287Q56l542
3337a421q38L535J060l236j526L199J696l077k019L048K194k950k282K699K451
3352B533k386k628K162K706k023k693J618L168j426l303J162L187o79l541O82
3367a461L448m60l531L09L486J10l205p42L530N48l403r66L454J068l030j434
3383b279K923J799l113j806K864J902k549k264K544K447k397k409J996K837j903
3398E92k793J470L083j446l086J029L067o88l217N40L292m33l055j16L368J38
3414A745l302m63L387P51l334p50K991J124k926j302K918J324k606j742K478K063
3430B356k572k051K245K216j913k654K075K623j652k745J573K486j235k931J245
$$ y = [-2465, -1010, 2377, 1190, -2109, -1492, 1978, 1701, -1921, -1762, 1780, 1897, -1623, -2022, 1265, 2121, -1421, -2259, 1276, 2336, -900, -2426, 773, 2469, -608, -2627, 421, 2615, -335, -2617, 82, 2533, 147, -2481, -319, 2387, 364, -2329, -711, 2457, 1031, -2272, -1110, 2077, 1398, -2143, -1461, 1987, 1527, -2004, -1695, 1791, 1901, -1304, -2046, 1484, 2032, -1371, -2337, 1117, 2185, -845, -2279, 644, 2443, -670, -2476, 388, 2290, -259, -2523, 21, 2468, 71, -2338, -342, 2495, 592, -2201, -731, 2352, 906, -2180, -1151, 1916, 1228, -1989, -1449, 1843, 1410, -1645, -1761, 1607, 1745, -1557, -2020, 1367, 2118, -1216, -1966, 1025, 2149, -777, -2079, 839, 2163, -443, -2185, 293, 2356, -216, -2267, -22, 2194, 281, -2373, -298, 2325, 673, -2072, -499, 1987, 752, -2179, -934]
3445i34K989r05l001N26K918o8l097K3K897K06k928l50L005L86k917n77K783P90
3463A746k609j056K613J370k503j450K194J724k205j935K081K117j922k196J793
3478b38K267j532k343J300K463j032k526O36K758o95k530K20K563j65k459j08
3494a421K838k5k423m08K481O22k505p74K312J040k214j182K084J355k081j457
3510a758J832J725j913j555J487J815j481j723J198K022j110k070R02K110p85
3525F96k074L96K339k35k361J71K127L02k379k32K135M78k269o25K295P65k185
3542f56r36K025R12j755j138J829J343j771j332J387J640j470j547J513J576j121
3558D99k083J127J782o96j965R18J766o73j758K75J930l48j695j14K093J60k155
$$ y = [-934, 2055, 1150, -1851, -1325, 1593, 1525, -1572, -1549, 1348, 1554, -1374, -1724, 1281, 1667, -1250, -1827, 956, 1746, -863, -1919, 694, 2064, -439, -1889, 305, 2029, -176, -2111, -30, 2087, 165, -2031, -238, 2029, 497, -1846, -546, 1917, 885, -1641, -1005, 1753, 1058, -1472, -1252, 1311, 1146, -1313, -1421, 1417, 1392, -1031, -1439, 1042, 1664, -841, -1615, 697, 1737, -477, -1659, 425, 1780, -301, -1758, 74, 1799, -114, -1669, -182, 1633, 152, -1571, -373, 1649, 539, -1531, -629, 1481, 696, -1378, -982, 1357, 1122, -1239, -1068, 1059, 1361, -1018, -1250, 885, 1363, -906, -1531, 764, 1529, -656, -1592, 433, 1345, -410, -1548, 281, 1624, -147, -1479, -92, 1548, 78, -1469, 44, 1620, 499, -1584, -457, 1325, 629, -1336, -418, 1348, 675, -1083, -808, 1122, 774, -921, -1035, 1058, 1218, -937]
3575i37p4J656L88j573o98J621P57j513r20J469J039j420j143J453J163j355j313
3592a400J193J271r00j414R34J499p82j535P24J537n01j586M56J325k59j461J9
3609h80J618P7j542k53J642K14j533k42J317M11j378m97J452N05j327n20J210
3626B74Q68j165r49J075R92j077j200J159J102r17r75O15J083m56j447N97J323
3643I02l50j340L11J202k16j207j94J505K25j455l3J174J90j164m35J157O99j393
3661d22m34J140N24r40p15P71J068r93p84N90J022o85r18O53P32l29r95M01J059
3680G45l49j198M12J044p8j273J16J216o8r10m7Q27J86r07m68J136J83q45k03
3699d81O86M79q53n33P05O77p13m91M44O65n04p57N19P70n01p82M13Q59k50r25
$$ y = [-937, -1011, 645, 1033, -540, -1238, 383, 1140, -373, -1293, 176, 1215, -205, -1348, 105, 1268, -87, -1400, -207, 1064, 164, -1250, -316, 1183, 401, -1134, -410, 1127, 626, -960, -504, 821, 562, -899, -880, 738, 815, -727, -980, 662, 876, -657, -899, 418, 829, -549, -1046, 406, 911, -416, -936, 274, 1142, -23, -972, 103, 1095, 18, -1182, -23, 1079, 162, -813, -198, 885, 429, -1018, -421, 902, 552, -788, -477, 725, 509, -698, -892, 613, 838, -617, -650, 524, 714, -450, -885, 272, 971, -422, -856, 284, 808, -132, -847, -76, 992, -1, -785, -195, 827, 142, -776, -123, 609, 280, -715, -314, 745, 396, -802, -390, 654, 576, -697, -581, 635, 567, -343, -390, 437, 623, -284, -752, 384, 567, -278, -481, 205, 684, -169, -702, 3, 680, -33, -524, -80, 585, 81, -676, -157, 613, 112, -670, -257, 602, 352, -573]
3719e73L80P64l26p04L2Q29q6o83j34Q13J24p57K1N46K68o71l76N12L92m40m06
3740d75N33L89m02o10P27K11m03l10L75L76m10l79J86N49j63m96K24M52k06m76
3760c08j37P60j16n73K93K86M9n61j26P86J1n46l37O76o7j32k18L35J32l85l61
3781e39N24L69n07k33L68K01k57j83L14K16j95l72K41K92k73l09L03K98L2m65
3801a75l6O07m2m83j7L01R1m59j60N56R9m02j35L21J72k49k24J69K77l82j5J60
3823b6K26j72k26K23K40j82k08P7K36j39l17J85K80j94p1M4NN4L4j41K32j35o1
3846c6n7J85J09l94K31J57j29r4j88J01M4j34J43J36K6j71Q9L0J17k01R0m7J4
3869B1n6J29m9l4n7l7K00j51m2n8j6L06j89K2J19j24Qo8L6M3J74j14P9j55J70
$$ y = [-573, -193, 571, 245, -459, -427, 402, 316, -367, -501, 312, 436, -321, -300, 246, 514, -157, -533, -21, 371, -69, -475, 58, 447, 45, -565, 162, 373, -30, -340, 35, 411, 1, -378, -192, 357, 194, -302, -78, 374, 168, -308, -445, 315, 199, -374, -81, 205, 254, -307, -433, 353, 364, -182, -519, 157, 90, -42, -260, 75, 207, -178, -539, -15, 354, -153, -386, -18, 183, -74, -257, 57, 273, 78, -294, -53, 239, -34, -343, -40, 258, 290, -175, -211, 396, 354, -129, -146, 155, 246, -213, -373, 183, 282, -120, -255, 66, 238, -11, -235, -66, 211, -171, -186, -26, 200, 28, -198, 25, 265, 83, -125, -48, 188, 49, -268, -83, 197, 3, -68, -24, -19, 35, 69, -72, 160, 25, -36, -93, 92, 201, -193, 38, 195, 66, -28, -216, -115, -71, -205, -62, 74, 100, -71, 18, 48, 165, -36, 54, 7, 21, -35, 94, 45, 11, -46, -83, 117, -34, -76, -134, -150, 156, -33, -11, 108, -16, -8, -76, -40, 3, 177, 63, 142, -13, 157]
3894A57j88J46Q9j23j96L3p6j8R3P2q9J92j26n5J80O5l57L45j33j18R9J98N6k30
3918A6n1j3J58j33N1N4J08j29j26j30L39k17j16J09J32nj05R0P6J64m91J10K81
3941A72j40Pn7K13j43k81J28J48J0l47J38J00L14m00j26K72L8rk76L91j09Q1l46
3964b22L27Q5l06j21J04J40J44l00J66J96q3q3j9J80j9k76jK14r4j62j43N52k17
3987F2k79J19J64R5k76j84M47n9j86j44L76J24l31p5J4L64k06j77J56K80k35k09
4009a60K67J24j52m08K17L77k66j29R7K27K9n08K89K05k30j00j5K10K36l80L1
4030c9lK85n64J40L35j36r1j01M06K1l38kJ73J31m02L0K44Q9r9k25J76J48j06
4053G2l40K55J79o4k70M0M75j82j89r4N25k55l81j01N24m8l08l9L00K27l81k05
$$ y = [157, -31, 115, 204, 81, -115, -82, -158, -176, -83, -11, -100, 92, -34, -89, 91, 156, -201, 144, 11, -107, -8, 190, 246, 16, -35, -48, 110, -23, 28, 82, 190, 61, -65, -195, 144, -73, -189, -80, 52, 47, -58, 32, 108, 272, -219, -109, 172, 32, 39, -18, 195, 52, -229, -101, 47, 57, -290, -152, -52, 262, -138, -264, 8, 46, 37, -239, 152, 43, 124, -222, 105, 190, -116, -237, -133, 7, 151, -149, 17, 213, 130, 47, 28, 208, 189, -87, -88, 126, 32, -130, -273, 279, 62, -217, -98, 66, 161, -115, -299, 148, 89, -97, -241, 135, 259, -72, -147, -133, 231, 25, -152, 4, 284, 49, -160, 107, 231, 79, -329, -112, 265, -1, -130, -33, 194, 223, -285, 4, 209, -21, -121, -136, 74, 310, -70, -39, -42, 243, -321, -181, 154, 18, -73, -174, 232, 253, -85, -87, 86, 217, -185, -155, 89, 178, 79, -146, 30, 178, 72, -268, -13, 166, 102, -168, -128, 347, 165, -24, -118, 407, 152, -229, -330, 194, 146, -162, -201, 99, 326, -55, -260]
4075b60K98O9j66k80M10L13l49l69M74M2m9l68J79K34n5l33N6L25k84j35L25J16
4097A93j20j89p7L18J01m67K23K52j05l41o7M36k2k83j48L13J07j93j94L70J40
4118B47k93k74K97J80j31l33K42J49p7k81J56R5K95m72Q1L94k40j86j79M67K3
4139A60m47K0N00o7k60m3K74K2k99j44L17L51m39J8R5K25m48n6K48J80K1l70J37
4162eL14k94k10O6K35p2k62N7M21r1m15J91K95j3l35J31J63n8j01j39K23ok02
4185a07j23L84Q8m23N6J98o8m3j73J45K75k58j9K2K91j46l35L09J12k04j00k3
4207a42L70p4m16J51L48l1k08l01M43j11jj57K26J85k44j61K94Oj00l91L51J63
4229B00k25j08J52K33k09j49PK56M8n04L57L4J17p8k71K79kk95J91Q5l2k59K2
$$ y = [-260, 38, 107, -59, -339, 71, 384, 35, -334, 140, 182, 133, -235, -56, 178, 123, -210, -154, 171, -113, -248, 77, 193, 73, -116, -193, 125, 226, -241, -18, 234, 129, -212, -279, 157, 135, -148, -296, 17, 124, -69, -263, 107, 247, -46, -320, -23, 157, 26, -307, -65, 84, 7, -274, -118, -23, 272, -200, -119, 275, 35, -151, -330, 137, 160, -287, -267, 233, 166, -94, -137, 137, 159, -140, -284, 33, 384, -55, -37, 58, 283, -165, -221, 27, 207, 228, -142, -5, 309, 15, -195, -129, 106, 34, -228, -171, 250, 159, -256, -65, 230, 217, -118, 13, 176, 118, 17, -122, 101, 95, -107, -230, 154, 242, -181, -125, 73, 5, -38, -211, -66, 209, -49, -68, -46, 245, 99, -236, 73, 185, -19, -119, -142, 228, 154, -262, -111, 237, 206, -2, -303, 140, 29, 28, -129, 97, 282, 38, -123, 171, 177, 77, -314, 37, 200, -25, -133, 19, 252, 43, -106, -99, 157, 205, -299, 58, 92, 209, 131, -140, 139, 137, -158, 33, 118, 86, -173, -151]
4252a51L07M2l81QL79L0j15l37L44l1j22j60K03J98k05j68J09J23M4j75J07j16
4274f7J94k93J89O4J16k38j56N46k15k53l5K30j01r7n6M37Ml29r8J39J04j12p8
4297a05PK04k56J9K20R8j91m0J44J03k01j04K0J31Kl70K82K14l13J9M1K60j42
4320D2j16j5R8j61J91n8J61Jj45k35J84J72k2k13L9L81l77j01J03K55l71r6K48
4343c5N4n8q4J63M6L0k22L22j04j25rj16L08k07J14j29K13j43j06M0Q7j0j14J09
4367B4J2O8j51O3j07J94o4r9m4J46k9j59K10j92K41k44O3J12j3q8q7Q9J5J75m9
4392H6j36J15J01j57J49o1p7J60o4n9p2J08r7R6j22P7o8j03J44J39j64K1k0J26
4416A22j51QK33k21j30L3P6J56j37K5l1O8m8m8l2J71j99J38J87j02qj86K11m5
$$ y = [-151, 156, 198, -183, -175, 204, 234, 119, -218, 126, 95, -27, -187, 16, 214, 9, -159, -50, 73, 117, -58, 49, -67, 127, -166, 23, 87, 203, -35, -191, 355, 140, -113, -148, 82, -19, -116, -172, 265, 269, -60, -158, -19, 85, -27, -105, -98, 106, -150, -131, 89, 187, -4, -44, 100, 203, 2, -102, -82, 49, 51, -319, -37, 177, -136, -117, -76, 184, 42, -74, -89, 9, -152, 39, -19, 142, 143, -2, -237, -53, 119, 97, -116, -77, 304, -73, -174, -71, 184, -187, -283, -35, 19, -39, -123, 40, 86, 116, -106, 216, 112, -13, -22, -138, 170, -37, 77, -52, 161, 18, -88, -48, 39, 29, -85, 24, 36, 104, -47, 16, -91, 103, 39, -60, -104, 42, 13, -146, 64, -128, 113, -131, -68, 44, 31, -57, -144, -55, -40, 135, 86, -50, 65, 166, 9, 158, 97, 20, 180, 116, 57, -15, 93, -4, 92, -30, 47, -21, -124, 20, 159, -5, 16, -4, 122, -29, -21, 212, -9, -139, -106, -30, 126, -11, 14, -17, 51, 3, -45, -77, 94, -105, 33, 220, 118, 110, -76, 135, 90]
4440I0n6j54%K05j86j25K51q0K46l02K9K05J07k50k89M27k4o6K4L3P6j38j54L13
4464A82k50j9O5K39l13m9Q3j55M66r3k44R1K19j86k19K01R3j37j1J51J4j02j24
4487i8J46J57j20j0k71J97J81k35j1J77K24k40j03n5J23j40o5K04J17k07k49J57
4509a21K79k70j27J77L50k88l57K26L02q1k72J8L85j57j13j56L27J71k08l12K96
4530F9J38j93k52L30K07l31j30K4K11k53j31M49O5k93m2k2L78p5m33J85L74k45
4552C0k72K1N56j01l68m7M38j12l15Q3L09L7l55pK06P4l43q5L78J46m23L5K56
4575A41J95m32k28M34L0j53j17K6M08k58k42Q8K89k24j57O5L02p4l92J54K72J57
4597B84n52O0L55Pk84k10M62J62m77j65N28J49m46k52M42L54m50l45N08K54m00
$$ y = [90, 34, -120, -120, 85, -101, -226, 25, -55, 191, -111, -82, 123, 230, -20, -309, 118, 94, 28, 52, 85, 161, 23, -131, 182, -68, -87, -22, 217, -96, -145, -62, -217, 249, 156, -88, 3, 222, 36, -183, 18, 111, -26, -37, 114, 128, 26, -98, 48, 205, 85, 75, -196, 1, 182, -53, -64, 113, 337, 97, -6, -61, 62, -78, -143, 61, 178, -29, -278, -121, 158, -112, -239, -62, 288, 0, -357, -131, 171, 90, -182, -164, 221, 64, -49, -205, 122, 293, 85, -227, 69, 207, 14, -238, 92, 299, -32, -162, -138, 73, -180, -311, 138, 203, -90, -132, -154, 224, 149, -284, -99, 275, 30, -242, -221, 335, 234, -134, -181, 257, 145, -170, -87, 222, 259, -96, -103, 103, 177, -166, -251, 127, 273, -150, -115, 141, 336, -96, -324, 110, 140, -13, -130, -104, 304, 46, -196, -108, 181, -43, -200, -135, 167, 93, -299, -145, 127, 284, -268, -208, 147, 154, -130, -340, 122, 284, -193, -358, 170, 319, -127, -379, 63, 417, -33, -378, 130, 384, -16]
4618a6k30K21K72k15j87K45J98l51l65K66L93k87k75N8O56k57l38q5N83J6m57
4639a55j28N88Mm05r0L79j27k55k95N42L35m83j47L53L1p6l34L46J95l10k89J66
4661a55M14k27k54J03M56k38l97J68N91m03k85J54L00lm37J31K99J40p74M9N54
4682A86O2n68O9L87J77m69j59M84N4m59j49M33L75n54k29M43K11l30l03L55L80
4703C96j63o03J84M96j81m19J00N02k00l04J4M82j37l50j51O21n1n16r3M93J33
4724B53l87j51N63P1n03k29N33J15m39j72N72M5k96l14M66J94k73l19K32K40j95
4745Fo05M59N94l17m56J03O15j52p18J99O22j38m69J84M56j12m71R1K11J1k36
4766a23k35L90J78m05LK96R5k66k22K63K84o9m68K90L27l58k27J26L79k28n06
$$ y = [-16, -246, -25, 247, 32, -155, 90, 288, -63, -428, -162, 231, -56, -331, -273, 383, 126, -212, -297, 286, 302, -155, -283, 305, 309, -96, -186, 193, 66, -189, -484, 58, 393, -90, -237, 116, 147, 71, -263, 83, 278, -32, -321, -155, 259, 32, -222, -119, 337, 99, -298, -130, 461, 58, -227, -73, 227, 224, -213, -82, 217, 357, -417, -368, 186, 248, -320, -251, 136, 313, -156, -315, 169, 223, -236, -385, 48, 423, -131, -360, 83, 294, -36, -339, 16, 396, 233, -370, -186, 310, 129, -290, -190, 312, 112, -192, -178, 304, 167, -183, -334, 287, 236, -280, -373, 120, 253, -134, -285, 278, 349, -154, -383, 150, 265, -174, -346, 226, 271, -25, -339, 127, 321, 48, -271, -39, 201, 6, -599, -140, 454, 137, -319, -216, 399, 247, -471, -272, 350, 212, -257, -73, 383, 271, -200, -109, 102, 113, -123, -358, 32, 210, -195, -192, 104, 199, -67, -289, -26, 258, 189, -279, 11, 338, -20, -247, -121, 258, 30, -476]
4787d76M02L94k65k06q7N42j55l39L8N39j88l45j8N16r1m28J9K77J26l27j71M45
4809B02o1k51k28L61J34k01j45K31L18l47l60L18M13m25l01L03K29j41j65p7M01
4830B08k41n7k9N08k20m82P3M60O2l52k65L74J41l80lM83J4m75j70L17K78l75
4852a31O5J26R3p4l83M05J81j99l49L25J90j39l56o6M73Q4o60K55K85K8m71J35
4874a83L66j09m33K01L37j47j45p9M31J27m77n2M55r7j75q4J99J16m33j52K79
4895e5L83l61k39K44K36k00k09K82O9Qj87j41L60j74k14qL41l2j38j51K79J22
4917B15m21NM22m3k66m8K35k6j96j17J95K85k84l75N93J43l19k57J50M25k72k12
4939a68M7K67r7k39J79O7M5j93J1L00j08l33K51J96j9l10k8L44N0l87j05L39n3
$$ y = [-476, -74, 320, 55, -151, -238, 304, 149, -190, -152, 387, 199, -146, -164, 352, 261, -167, -148, 129, 255, -72, -243, 202, 141, -110, -338, 23, 157, -44, -189, 42, 360, 13, -347, -29, 384, -41, -342, -39, 190, 49, -116, -193, 208, -33, -90, -119, 389, 169, -313, -240, 220, 282, -70, -335, 39, 180, -200, -203, 280, 294, -181, -351, -34, 244, -131, -66, 60, 153, 79, -304, 101, 282, 83, -266, 59, 249, 110, -246, -312, 161, 245, -415, -160, 125, 153, -318, -183, 183, 74, -359, -158, 179, 32, -113, -192, 239, 366, -111, -163, 292, 195, 20, -64, 135, 251, -182, -334, -55, 328, -33, -272, -28, 208, 8, -201, 81, 150, 158, -29, -170, 190, 16, -198, -206, 135, 103, -35, -186, 93, 215, -206, -201, 221, 178, -88, -136, 99, 73, -123, -240, -45, 240, -44, -419, 174, 317, -2, -259, -109, 316, 44, -168, -121, 146, 49, -190, -11, 56, 101, -92, -81, 219, 111, -222, 29, 225, 206, -104, -132, 212, 262, -125, -230, 109, 56]
4962E6k60O2L90J8m02q8M55n5k88K7J44J3o2k84L32M67m31k27K29JM0k94K68o8
4986D3m5o1k12M36r3k40P0L29L7m01j16K71K61l90j18K69K46l56j71L44J70m66
5008a93k8J01J66P2k40J31J70j91n3r2K27k07n2K25J4j45K3k03M75k6k66j56L20
5031G2M6k21r5K57J23k19O9l6N7j80O5J05J26j95p7J79J05k17k7J50k9l2j88O7
5055i5J88k0k16K56j56n2J84o5J19j43J1n1qJ19j12J17J93p4m41K22J9O4nj12
5079e8J31nl7j16K19L2k25q6K41Q2j69j32K2M31k38l03J17J99O4k55R3R2J6j91
5103g6j14L54r5o2K9J74j12k36M4K37J37m21kP2J93k52M1J86Q7k57K8R3j28k6
5127a06j60J45L23j16l26L19K6q6lQ4o3J28k70O1O3m2q2L0J02o8n1NN9l2k3N4
$$ y = [56, -204, -142, 248, 266, -136, -224, 231, 176, -112, -85, 59, 72, 10, -274, 58, 525, 94, -133, 96, 97, 137, -157, 111, 43, -2, -63, -275, 161, 68, -172, -102, 227, 264, -137, -253, 18, 279, -111, -229, 40, 286, -70, -241, 103, 273, -193, -221, -120, 46, 118, -122, 9, 179, -12, -65, -157, 70, -137, -189, 36, 50, -95, -72, -275, 200, 174, -92, -248, 72, 118, -103, -198, 59, 182, -37, 32, -4, 53, -127, -62, 43, 169, -26, -103, 76, 181, -36, -63, 87, 58, 26, -162, -95, 93, 73, -143, 113, -43, -95, 89, 24, 143, 0, 11, -40, -48, 71, -41, 76, 269, 195, -246, -24, -5, 59, 54, -58, 73, 68, 31, -85, 134, 166, -59, -145, 96, 178, 9, -123, -101, 330, 92, -211, -94, 105, 169, -86, 7, 99, 115, -76, -190, 164, 69, 7, 36, 210, 98, -138, -94, 143, 280, -141, -143, -71, 122, -130, -89, 97, 184, -73, -45, 48, -80, -106, -266, -121, 202, 86, -240, 79, 105, 19, 16, 100, 37, 165, -105, -44, 19, -23, -105, -75, 27, -41, -92, -87, -28, -60, -83, -29]
5153b9N6J13j66n6K19j21o3o5J78J41k30j5L2N4j2j49K34N5l13Q7O9lj9k35L31
5178I3j30J7n1P5p7J01j41M9J36k17J38j35K17r2o5K8K10k82J17m1J20p3K2m3
5202b4P2k3k03Q8K28p1j14o5J81Q6k99J72p8J53Q6k26N7J4L9k07J50o4j46J15
5226g9P8O8k09J7J17M9L7o8q0L6K05k37p1O1J60k61J75J06m0j16O2N2j42J77k68
5251a71K40o0j64L06j06q5K46k34lK14j28k06J29L0j16nL4K25p0j17J53K8j93
5274e3J87Pj73J63j20j1q5L1J14m1r1M9R2k23K50P3k92MJ87k3q8l1o5L1Q1rpJ57
5302A14j17N8Q1kLj00j32K8J63j07r9J22N2k5j65J34q2m9J4J12r7P4J18K1j3n
5328A01j21JP8j7J2J2k92K01O0j56J93p2j2J01o5J62l14J07K13j40k0J47j25q6
$$ y = [-29, 27, 140, -26, -82, 137, 16, -47, -112, 66, 207, -23, -38, -6, 48, 36, -113, 121, 176, -137, -50, 19, 16, -3, -238, 93, -37, -20, -71, 4, -73, 28, -113, -64, 72, -145, -7, -142, 75, -17, -82, -54, 156, -126, -9, -50, 70, -3, 19, -24, 48, 25, -178, -90, 138, 67, -47, -112, 69, 155, -144, 28, -50, 103, 189, -37, 20, 34, 73, -134, 16, -48, -194, -79, -1, 67, -142, -125, -8, 41, 78, 10, -70, -34, 171, -66, -137, -76, 84, -177, -2, 104, 64, -52, 10, 62, -80, 97, -171, 69, 9, -155, 151, 45, -40, 206, -28, -31, 183, 55, -151, -22, 8, -108, -113, -79, 146, 76, -41, 112, 140, -53, 134, 141, -32, 131, 11, 0, -85, -54, 60, 19, -72, -23, 69, -154, 96, 169, -123, -119, 68, 45, -43, -74, -139, -108, -27, -36, -43, 114, -3, 55, 136, 134, 137, 37, -95, -67, 96, -11, -110, 12, 64, 39, -126, 8, -74, -123, -109, 3, -94, -20, 98, 119, 106, 101, -20, -19, 59, 42, 54, 66, -226, -25, 35, -121, 72, 0, -12, 89, 24, 186, -128, -21, 192, 52, 32, 179, 54, -32]
5352c2l1K13j66P9n1r3J01o4q7K28r2p1jJ25j5q5Q3k19L79j31j84J10j4J34j64
5377d8m8J12m6j23J11o2P9j8J9J50L9J8j30q6P0j2j1om3R9j70P4J23j40k1k4P9
5404a5J43j60m2K01r1k8o1L8P7k4J10j06l1M6o3M2%k67K66j63J32P5o9L3p9n2
5430h8P5R5n7k27J81J01j0j15l6l5r5J57N8qqJ8K0PJ21j6Qj09j11J03p8J02j08
5457e5K34q8q3m0m8J14N4k57J42o5Q3Pj00P0R2r4om2P3p3j43K99K9j28J06k8m8
5484EP4j24K3o1J30L6R4k01L4p5J22Nr4M5l9o1J30k4k4L7J23k42PJ17j01J46j6
5511F6kk05J20J76j42j2K9lO7K6j62K00n1j5j48nJ78j0kp4J8J54k69O3l3j6M2
5538a0M7P9r9O7q7N7K7o3p5J04j27J72k72J31J01K6k8Mj43o0n6J38Q5p2m8RJ07
$$ y = [-32, -63, 150, -16, 63, 12, -81, 20, -44, -131, 97, 5, -66, -67, 58, 43, -42, 41, -178, 201, 70, -114, -4, -18, 116, -48, -96, 16, -30, -153, -42, -104, -25, -43, -24, 126, 165, 183, 53, -33, 37, 25, 14, 8, -35, 64, -106, -32, 91, -49, -70, -94, -15, 128, -32, -74, 127, 36, 8, -53, -15, 62, 38, 148, 42, 11, 57, -6, 36, 36, -231, 35, -128, 4, 79, 10, 43, -36, -88, -13, 82, 25, -202, -21, 80, 70, -45, -81, -116, -211, -54, 4, -4, -12, 6, 26, 33, 154, 138, 146, 37, -74, 29, -49, 53, -55, 179, 91, 8, -32, -80, 34, 88, -169, -27, -92, -9, -2, -102, -32, 60, -34, -40, -82, -9, -82, -225, 74, 103, -25, 81, 53, 5, 79, -45, -22, -83, 47, 83, 177, -24, 10, -65, 57, 62, -32, 13, -26, -87, 43, 19, -5, 32, 155, -87, -80, 37, -64, 82, 66, 64, -141, -21, 155, 13, 1, 30, 27, 94, 120, -42, 158, 107, 92, -56, -61, 117, 107, 105, 31, 49, 203, -66, -3, -36, -52, -10, 37, 116, 17, 84, -3, 54, 81, 18, -57, 47, -80, 92, -180, -49, 52, 78, 50, 54, -89, -149, -205, -67, 18, -54, -102, -93, 14]
5565A4q4J6J33Lp1o1m9J15P9p8J08j79M8L6j54J7M2J43J79k31o8MJ45O8k35P3
5591A3R3k19m7K04j4N9r0o6R4p9R7n9QJ30K4k50J37j97K15j71K32r1J23r8j18
5616g0J78k08J99j49k1J37n6j1J10j42p2J49m7J5j05J07j29l5j1K17p8j4n4J19
5640B9o6N7r1J90r8n6M4O7m3k18L38j86J33j68R1o9L4J00k5o4o8J74j17J70k87
5665a29O7J7K6o0J27j43R0J63j76J08r3j9%K3L2n9Q2O9k26J24p3J31o5jp6O7K11
5692B17j30j87O8K3M9J08k94J66J36j11k08K82Q1j40j04J29L7P7k55J49L1j65
5714d1Mj46K13Rj21M1l4P9J31l47K60j28M6K22k11j34J59p9J32q7qJ74j30J0o
5739Hk02Q9J72mn7J2r3J74j16k3R2j11J37r6q5MJ19r9l9N5Q3L9k17J06J49q7J19
$$ y = [14, -70, -54, 79, 82, 11, -50, -99, 16, 95, 17, 125, -54, -6, 30, -124, -107, -65, 78, 257, 26, -42, -38, 107, 175, -60, 13, 106, -113, -160, 44, 30, 89, -1, -67, 27, -52, 45, -14, -6, 124, 148, -102, 35, -162, 53, -118, 114, 23, 146, 48, -70, 108, -100, 99, -50, -71, 66, 10, -1, 109, -33, -105, 44, -3, 12, -93, 14, -115, -150, -161, 56, -22, -36, -90, 29, -37, 20, -71, 119, 21, -35, 9, 76, 33, -185, 153, -33, 100, -68, 23, -46, -12, 88, 63, -1, -69, 105, -12, 158, -129, -62, -45, -19, -79, 48, -95, -5, 158, -18, 90, -3, -22, -22, 1, 33, -26, 56, 125, -101, 23, -50, 81, 16, 15, -61, 6, 217, 87, -100, -32, -9, 40, 148, -146, 20, 156, 45, -163, 119, 200, 60, -44, 85, 122, 199, -56, 93, 124, -41, -37, -183, 30, 39, -82, -41, -75, 4, 135, -212, 48, -80, -34, 188, -23, -157, 2, -77, 55, -32, -40, 134, 4, 14, 8, -194, -105, 67, 63, 6, 18, -75, 99, -17, -40, 52, -59, 78, -18, -103, -99, 20, -79, -118, -63, 20, 59, -158, -52, 97, 10, 129]
5766A29k3j34N0l9q6q2J50J53k57K38j03M5j36R5M9j97J74j69K26Q4k12J03j00
5789d2J17J16p0Pk58K46k03J67j29Q5P5j42M7J47l61J92K2j18k4J82j49J31nj4
5813A9l0q6K9q9J33N3lk7j33L9J47Ql9j07Q7o2K15k8O2k27R5O5j17J15j59MNJ9
5841a2p4J60m9k8J32qj33Lj32J57k8Pm8Rk1O8Qq6J01r0L8m0P0j6Q3r1J04j0n5
5870A9J51l02N7J52j55K47Rj74K22k20j02J0K7pK09r6q2p2K29k15K2Q8K22k18
5894B1O1j87J14q9J94n1r0Q4p1J20k14K20j57j0R1K7l8p2q0J01n9K56r3M0j26
5919hk3mN8R5n4l65L08p0L0K2j24J15k02L81j3j46n2jK6R7j06J20M4r9Ql7j3O9
5947E6l7j20R0K6p1K2J24l8j18l3n7L15k59J52pk02L12k60J46o8J47po0lr0j9
$$ y = [129, 106, -28, 22, -17, -103, -185, -35, 118, -139, 99, -4, 41, -95, 0, 49, -148, 26, -143, 83, 167, -45, 58, -42, 75, 191, 121, 128, -130, 116, -87, 80, -49, 36, 111, -31, 16, 163, -198, -6, 16, -102, -126, 56, -93, 38, 33, 19, -11, -97, -68, -157, -24, 29, 26, -1, -134, -95, 52, 60, 21, -86, 1, -61, 154, 126, 188, -39, 56, 121, 4, 119, -40, -36, -31, -12, -86, 74, 25, -3, 129, 121, -12, -9, -141, 16, -12, -5, -53, -44, -65, 3, 11, -75, 26, -64, -26, -66, 4, -12, 71, -20, 84, 74, 19, 170, -132, -75, 77, -78, 169, 178, 4, 226, 6, -96, -86, -59, -66, 143, 47, -35, -107, 122, -93, -71, 17, 239, 21, 82, -105, 9, -80, 114, 63, -27, 57, -14, 106, -108, 112, -45, -55, 36, 63, 25, -47, -127, -26, -85, 171, 78, 118, -8, -31, -35, 23, 118, 64, -301, 7, -63, -33, -11, -135, -20, -222, 159, 146, 0, -52, -53, -27, 70, -36, 84, 128, 29, 37, 0, -13, 56, 19, -101, -11, 15, -56, -34, 90, 52, -66, -99, -156, 159, -100, 52, 45, -157, 155, -105, 41, -27, 120, 113, 53, 50, -40, -59]
5973e9J85r3o3O5J23p7k27J96m2J36j42m2K4J57m7j85J95k06J6J35L6j22o3O3
5997c7j37K62j39J13J7j19J23L0j39n%pj38K28r3q8R8n7L7j03J54k68K35j0J15
6022G2J35k16O8q9R8m2n2R2j95J85L3N1j6j21m0J42N7q5N2k45L6K3M3J07k6j24
6048e7O0j39n4K69q0J05k95K21k7r6K78k08j61K00pjk2j20J22r9M7L7kJ56k28
6073a01Q9Q0q3J49k99J93r9PJ4J03o5j35J11j12o9J43m1K2n2J49l8j35J09p3J39
6098FJ32j38lp0L6j16J70l4QP6j76m7J24J05j49J65o2j39K18r6R4j97Rk7J77J9
6124H5m0j96O8J59j08j1j2J7N1j49L5P1L0M4k70Q0K04j05M0J16k03L2M2J01j61
6149h0N6P5j73K13l9nO7j40r0K26j42M4j8p3J71j0q0J43l17J55j19J95Jq7N4j23
$$ y = [-59, 126, 33, -30, 35, 158, 81, -146, 50, 8, 144, 2, -40, -16, 141, 94, -91, 104, -102, -86, 49, 85, -37, -100, -37, -174, 88, -51, 62, 79, -40, 83, 113, -26, -31, -31, -38, -176, 52, -41, -129, -31, -88, -51, -154, 0, -268, -33, -43, 72, 207, -9, 59, -30, 68, 26, -26, 66, -129, 56, 89, 140, 124, 3, -37, 105, 162, 77, 129, -116, -80, -57, -14, 93, 67, -57, 3, -136, -190, 79, -1, 104, -191, 30, 3, -93, 185, -23, -184, 16, 9, 8, -14, -134, -12, -111, -64, -27, -29, 127, -101, -12, 68, -15, 134, -165, 28, -71, -64, -50, 53, -12, -147, -36, -148, -217, -74, -115, -93, -145, 4, -34, -169, -60, -133, 6, 138, 0, -3, -73, -37, -153, 17, -17, -9, 67, -109, -156, -32, 73, -76, 89, 27, -112, 106, 10, 104, -93, -84, -111, 66, 85, 45, -151, -83, 76, -32, -43, -55, -38, 13, -136, -101, -30, 0, 44, -226, -146, 58, -47, -7, 109, -94, -62, -20, 81, -80, -24, 51, -122, 91, 52, 47, 114, -26, -116, 110, -32, 12, -6, -79, 92, 82, 2, 145, -172, -17, -136, 59, 60, -27, 27, -96]
6175i6J18k7N8J6j30N5J23k77K95l6j11J60j11j99K36j69J95j76l1K44p7j43K06
6198A23l7j70J12n9M2j3J53O8k37l1JR7j56J47j37O9K9j33L03j27m7jp7J65j87
6223a03J16P4l6P2k10J34k3R6k14J93l6j32K61k13J51k31j1Q1Q2j17J8K56l44
6246a36J50R8kj4oj69L9J69k03P0P6P2k57O7L1Pj53L25j73M5j64L9K9l7Q9j29
6272a37lJ29o9R7j07m6L07k52R6J16j34J11j05J04o6k94K26j6K8j5O8k8j42O1
6296g1J2P7j64J25R3j36J36q6j02K74j36J3Q7m4mp1Oj69K69j13K19j19q6J9L8
6321F7o0p9J31j89J03R3l8O9r5n6Q9j16J07N4n6q2%j1K65m1j09l7J65k4j71p7
6347i8J56j8K6j57PJ51m3k1m1O4L2J9l0J25rk08N3R3l9M4o4J03k07j05R4m0K01
$$ y = [-96, 22, -5, 53, 69, -61, -6, 117, -160, 135, 99, -12, 148, 37, -162, 74, -95, 100, -76, -107, 137, 60, -83, 123, 86, -84, 28, -31, 11, -2, 151, 219, -18, -49, -48, 49, -107, 40, -97, -28, 1, -132, 171, 44, -3, -4, -81, 84, -103, 13, 87, 51, 123, -87, 47, 24, 120, -94, 99, 63, -69, 192, -21, 130, -101, -112, -31, 51, -66, -48, 208, -136, 14, 112, 110, 96, 90, -79, -40, 129, -74, -4, 72, 144, -113, -46, -15, -8, -161, 164, -9, 36, -128, -89, -60, -97, -8, -137, -140, -11, -80, 17, -90, -136, 171, -81, 15, 131, -3, 108, 3, 107, 41, -253, -27, -43, -15, -30, 38, 10, -132, -71, -59, 18, -146, -21, 72, -64, 72, -14, -116, 158, 22, 35, 122, 78, 74, 3, 9, -160, 109, -4, 215, 96, 10, 29, 67, 7, -72, 59, -130, -27, 66, 28, 97, 2, -54, 35, -81, 26, 80, 24, -58, -58, -69, 196, 155, 46, 9, 174, 150, -21, -98, 58, 40, 66, -91, -84, 67, 24, 3, -38, 26, 58, 77, 47, 172, 163, -45, 8, 101, 62, 106, 42, 145, -62, -167, -73, -113, 88]
6374H8q8l2J84j31n1qK17k02M1j59N6K00j13l1j8J47j61N3j51J58R2Op4mj67K2
6400a26K40j14M9m5M3j3j19P2n8Q9M6j19j18J88L4j26J40K4R6j90R1j45K09k41
6424i3Q6j1Q8J2o7j72J70M3m5J7m5K6n8J01j30O5m8Jj6O7l5q8J33J1N1k01J46
6451HM5j07L1m3J52k41R7J68L7j60j1J7jJ15k21O1q5R7J32j58J84j18O3j61K27
6476A28j92n9Q3J06k96R5J98n7K4o8Q2o9Q7m9j33J9l9L5J72j34K53j85k1J20k00
6501a00J05K3L9k05K48k02J02K48m06R3R7n1M0m1Lq1K50j55l7l9n1O7J49j99P9
6526b4K39k70J2J87p0j69J33Nj30O5J18l4j25L3l6K4R5J8j75J34l5j35j25Q3K44
6551F2LO7j21rj79J03K04l8j38N6k2l5M8M8j33J51k66J84J00q7p0N3J00q9K1M2
$$ y = [88, 0, -32, 152, 21, -30, -38, 179, -23, 18, -141, -85, 115, 2, -29, -47, 100, -61, -8, -159, -1, 91, 97, 23, 19, -148, -126, 114, 0, 49, 4, 47, 34, -85, -13, -71, 18, 64, -55, -173, 15, 49, -77, 63, 87, 183, -7, 84, -61, 148, -93, -7, -18, 70, 82, 15, -157, 13, 56, 11, 28, -17, 9, -49, 52, -78, -13, -61, -60, -76, -9, -44, -132, 1, 12, 63, -138, 8, 53, -54, -23, -66, 86, -155, -58, 110, 147, -13, -24, -7, -8, 107, -114, -53, -138, -41, 91, -67, 117, -1, 62, -99, 128, -64, -123, -40, 66, -230, -135, 63, 6, 30, -38, 44, -25, 62, 13, -120, -101, -140, -105, 67, -67, 186, 1, -20, 100, -100, 5, 28, 67, -138, 110, -92, 10, 258, -148, -55, 42, -9, 31, -10, -7, -88, 162, 7, -30, -69, -120, -53, 96, -103, -24, 215, -55, -43, 144, 74, -95, 38, 43, -87, -22, 96, 62, -63, -30, -66, -42, 53, 71, -104, 30, -5, -140, -265, -182, 62, 65, 132, 11, 2, -177, -74, 130, 92, -46, 10, -12, -47, 1, 49, -84, 67, -199, -15, 85, -2, -72, -19, 81, -8, 13, 55]
6577E5J6N0j17P7m0j1lO0j17P6j5o2K08k28J36j06J22Pj51l7J17p8P0j39K03j39
6603d6N8Q5j96J33o2j22J39l1J62j29k0J10j43O2J82r6j75M3K3J35M1k18K69j76
6627B8Q7j34On6P5j08R0j29J7K56J6j73J36j33J33r0M5j09P6N5j44K97j80k16
6651a55J36j2J25p5O0p8R2j3j0K4k90J93R4k2j04N3pj08K81k01P2j10K7n3Q9L7
6677D5r2l7K5J03o9J5N2k9Q9l2p7J15j12Q4K3k63K19m8k5J52j82KL2M8j80P8m9
6704a13K06j05R8o2j90K71r6L4J52k49N2M4M4j49M3N3J35l24K31j32j23K60j9
6727F1p0k1j13Q0q9K11j7n9P4l0N8j62J24j01lQ7j1N8n1j18L7J56o9L3m0j31J11
6754Er6J30m0N9P4k72M3Q5J45k52K72j33L8j41j2J14M2p2R9q2J10J6k09KjK2J6
$$ y = [55, 71, 121, 4, 81, 41, 30, 27, 87, -30, 46, 31, -31, 177, -51, 85, -21, 101, 108, -43, -80, 37, -41, 29, -110, 93, -46, 12, 97, -99, 34, -28, -150, -11, -42, 120, -9, -29, 81, -62, 0, 182, 86, -89, -46, -23, 112, 153, -65, 204, 28, 115, -19, -13, -69, 6, -102, -12, -141, -124, 132, 148, -25, 111, -22, 111, 21, 66, -43, 33, 88, -56, 241, 61, -155, -19, -31, 94, 19, 79, 1, 93, 80, 70, 94, -196, -3, 91, 69, -35, 18, 11, -97, 184, -17, 55, -55, -28, -81, 8, 45, -47, -84, -59, 44, -25, -10, 42, 13, 102, 70, -7, 108, -4, 80, 103, -160, 59, 11, -14, 138, -44, -42, -10, 38, -142, -64, -113, 93, -12, 86, 24, -166, 105, 9, 43, 195, -54, -2, 42, 86, -63, -20, 33, 168, -156, 75, -57, -180, 80, 61, -9, -30, -143, -63, -152, 59, 42, -17, 57, 27, 85, -77, 47, -54, -57, 30, 19, 77, 26, -92, -55, 101, 32, 65, 25, -106, 5, -91, 39, -1, 58, 132, -140, -97, -12, 133, -119, 153, 20, 58, -83, -95, 19, 61, -11, 88, 6, 116, 132, -77, -75, -76, -54, -38]
6781c8nJ65o2O8j23J05j03j37J77q3m7J40o9K6K6j91L9k0J87j46R4J07k61K24
6805G3j18k3J17J2j68K66j92%j6K7p1j9J44q4J57o2j6p5P2R8j33o9n0J13PJ18
6831A08r4K4N2l10K55k4O3q7o4R8Q8j54P1om2K2N8j98J98N9j02Q6j47P9j51J44
6857B6l8j17K37j09R0n0J6j7K4J01j96K9j2q7o6L02l4j10j04M3M6ON0n9K01j58
6883A4j01P0R9J3m2m6J81j6k09j40J58J53j04R6M9j32r8J36n5q9K10j98N2K4O6
6908I1j65l3K32j09J57l75P6J99m7J2Q5j28j07R5%M9l3jj08N8P2L5r3n1oQ8m3
6935e0O1j03J84j37O7m7N4O1k7Q6n5l8K5o5j03J05NK8r4J49j73Q7mj6q2O8j76
6962a90J96n7K01k24P2L2p8J33k21J49PN6l36J53J76j71RK17m1rj78J7P9m7N2
$$ y = [-38, -43, 122, 60, 128, 5, 110, 7, -130, 47, -36, -83, 57, -12, 14, 40, -151, -112, -132, 55, -91, 3, 110, -151, 73, -45, -68, 49, 61, -107, 159, -33, -33, -49, -22, -93, -112, 32, -52, 105, 43, 27, -48, 24, 122, -11, -80, -130, -17, -10, 108, 14, 38, 90, -220, 35, 11, 74, -13, -77, 21, 109, -45, 26, 20, -22, 0, 58, -140, 58, 117, 15, 101, -46, 33, -118, 26, -12, -129, 108, -1, 89, 39, 55, 38, 62, 163, -33, -4, -16, -103, -169, 133, 99, -11, -115, -72, -26, -20, 30, -29, 172, 14, -87, -17, 82, 95, 53, 7, 188, 172, -37, -177, -19, 134, 30, 126, 175, 43, -55, 81, 26, -63, 147, -51, 1, 25, 91, -74, -107, 125, 16, 173, -202, -126, 73, 26, 38, 123, -5, -112, -17, -17, 32, -1, -2, -110, -52, 20, 55, -38, -89, -95, -7, -50, 11, -92, 92, -45, 22, -25, 29, 90, 63, 149, 94, 56, 81, 16, -87, 18, 23, 51, -43, 106, -67, 20, 16, 0, -82, -14, -190, 6, -51, 150, -74, -2, 30, -48, 85, -136, 13, 20, 76, -260, -107, 69, -102, -93, 124, 83, 74, -104, -87, -8, -55, -3]
6987cK3L0m0K2r7J40j72J53Q9k29M3K6K5QR7q4M4j31o0K1l2K32j24J56k70K23
7013I0j65J36k29J7M45k80K7K3R1j30N0j29M1j1M6J7j31j3r4J41n4P2O8j59K30
7038I9n6n4J91j99J29n5o0m6MJ40o2K2kj77J14L4R6r6m2r7K53Q3k64r8J67j80
7064a56J87r4Q5J4p6J05l1l6J6k34L11R1j09q4m4qk4J64Rj28j16J79j2P2r9P1
7090E3j33K33p3j58rK26j97J65k46J37k31J12M3L7J5Q6k16L43j74J9R2k10K39
7113A53m7J7j76K9j17P7Q4j14J16P6L4k4J00l68J46KOK2J12l3j51J36j28N2O7
7138G1N4r2o9r0L35k21J58j11k17J93m3q1J24N2q2K3l2O8K9m7j8r2J7o4Q4n3M2
7165f2Q0m3J27j75R7j54J41o5j90J42R8j1R9k32J46j4Qk5J38lk2Jl3k04mr1K77
$$ y = [-3, 20, 50, 10, 32, -65, 75, -97, 56, 145, -84, -41, -15, 10, 18, 115, 31, 75, -56, -116, -95, -127, 105, -19, 137, -133, 90, -75, 61, -168, -151, 294, 14, 41, 64, 155, 25, 75, -54, -13, -24, 22, 39, -92, -105, -199, -58, -112, -40, 28, -131, 99, 43, -11, 180, -19, 110, 55, -5, -51, -47, 93, 31, 53, 51, -126, -12, 22, 118, 22, -20, -117, 136, 219, -45, -143, 24, -156, 31, -63, 22, 36, -40, 65, 34, -2, 14, -220, 91, 182, 73, -11, -55, -63, -87, 77, 86, -42, -158, 21, 9, 81, -18, 53, -80, 153, 80, -78, -87, 139, -58, 107, -139, -2, -233, -121, -78, -41, -26, 60, -156, 187, 13, 32, 124, -86, 153, 106, 123, -53, -24, -141, -64, 20, -94, 22, 98, 132, 108, 208, -160, -14, -12, -6, 16, 128, 95, -56, 80, -48, 4, 71, 125, 33, -36, -126, 209, -12, 146, 35, -182, 11, -32, -113, 11, 63, -19, 4, -28, 40, 69, 22, 4, -88, -71, -135, -51, -104, -62, 18, -25, 102, -73, 24, -130, 11, -54, -244, -102, -4, -15, 84, -148, -2, -16, -8, -33, 105, 102, 80, 81, 48, -156, -160, -251, 26]
7192B6jK6R5j46J12j77K06Mn2n2l4n8lp9J69p1J79k38O2J83j06p2M7q4O1M6j95
7219a52L6K87j91j84K40j49J28N5j99J02J0O2L7N6m5k21J2K22j85m2p5K67k11
7242a40M4J69p0p7J74Nj67l4K23k04J07Q4j85J16j55j06K43k2l5r2N7M4jk8J8
7267c2NK6j28P0kk6K32j34k7LL9J59j72K1k8N3r3jJ17j96J48j02O9N4j69K01j12
7294b5mQ3q5J11qj1j04P7o0P1o3N3m4m5j36J99kkj11K21j17K5j9L2j02P2j56J36
7322a4N7o2R3j30R2m4K56l42J13P4q7pj88J71o3J16P0l9o4J0n2J47n1j82k2J45
7348cK2K9j24P4o9k6j3J81j43n4J64R4l19Q7L7J3m6J30m7m2Mq4Q4Ml3P8m3J51
7376A06j99J31P6j37k7Q0r6l4K05j07j03J32o1J26j13O7r3q9K24l3q0JJ44j74
$$ y = [26, 25, 51, 146, 0, 112, -65, 141, 145, 93, 41, 7, -51, -54, -133, 36, -35, 144, -94, -32, 151, 45, -27, 20, -64, -3, 43, -152, -116, 171, -20, -204, 36, -113, 15, 70, -129, -27, -17, 45, 82, 138, 93, -128, -116, 106, -79, -121, -196, 71, -140, -96, 73, 3, -74, 100, 105, -62, -96, 127, -77, 30, 114, -71, 45, -110, -216, 27, 5, -30, -122, -65, -21, -22, -50, -32, -27, -1, -129, -59, -61, -87, 145, 11, -16, -13, 26, 185, 13, 34, 6, 59, -34, -35, 82, -114, 34, -68, 1, 55, -114, 87, -25, -29, 54, -31, 80, 72, 61, -43, 34, -26, 45, -18, 35, -9, -54, -190, 9, 7, 5, -106, 115, -2, 23, 4, 36, -66, 6, -150, -14, 43, -19, 74, -56, 36, -8, 248, -94, 19, 93, 6, -1, -189, -18, -81, 35, 105, 66, 2, 12, -40, 107, 56, -126, -148, -3, 19, 48, -76, -2, -71, -97, -110, 71, -72, -126, 38, 132, -187, -100, -63, -50, -96, 34, -13, -55, -51, -135, -51, -47, -80, -2, -45, 106, -93, 38, 114, -23, -50, 30, -66, -100, 105, -2, -105, 27, -34, 92, -21, 46, -47, -136, 88, 55, -25, -24, 120, -54]
7400e4K2J8k4R3k9p0K22m4j78j62J42J57k38K09j1j28K28j19j00N6L2O6M1k8j16
7425a5L0m6R4l4j20J22k34P3J27k0K1O1L0j09P4m3J1j23pk5M6N6J22m9j17M0Q8
7452E3k6j8r9j21J36J64K9j96J01l0P4P1j00Q4k07J37j64J49j84K25k17P4K23
7475A58L3j83J89j23j25J87j57J18k47K03j20j12J61J74k13J3J57j67R9j02o3
7496a20R2K9J26j47M6j73J48n2o1L6km5J75J20l11J87k07Q0J98j37O7k61L7K50
7520G5j47p2Q3Q2P6j24j23J91o0J43o9k29K41j25J3K54j88O4j27L8J13k50K27
7543H6q4j5J05j32j04J4J59K5m5J9m2O5j28Q6l7K29j90K7O5j21K69l03J04m7l4
7568b9L2J55j60m1O5Oj49O5K12r6q5J32j19p9N6J35j12N3p9nK1L9k0J8p5J00K1
$$ y = [-54, -32, -14, -38, 55, 26, -44, 178, 134, -44, -206, -64, 93, -145, 64, 53, -75, 153, 34, -66, -10, 22, 88, 129, 101, -15, 15, -31, 63, 29, -91, 31, -203, -130, -3, -23, -2, 59, 89, -20, 54, 11, 22, -101, -108, -133, -87, -31, 91, 42, -75, -35, 53, 27, 9, -90, -211, -75, 89, 118, -78, 23, -7, 67, 138, 38, 122, -85, 52, -112, 37, -147, 78, -139, -65, 158, 191, 8, 197, 74, -51, 136, -21, 97, -150, 53, -67, -179, -18, 156, -57, -44, 113, -54, 45, -57, -120, -28, 1, 127, -20, 26, -147, 1, -51, -112, -76, -78, -123, 52, 172, -139, 48, -159, -79, 119, -18, 49, -212, -175, 75, -72, -144, -61, 21, 97, -27, -150, 41, -19, 124, 55, -174, 67, -58, -45, 209, 21, 85, -42, -4, 109, -141, 86, 2, -13, 92, -40, -144, -130, 29, 54, 9, 28, -14, 51, -77, 9, -28, 201, 11, 38, 103, -18, 251, -52, 52, 5, -29, 3, 158, -2, -43, 22, 28, -121, -56, 156, 60, -25, 107, -12, -91, -35, 100, -12, 41, -38, -43, -22, 17, -3, 15, -60, 40, 61]
7595F1j03M4O6r9J0Mp3N7Q3K6n1j49J17J99j51j47K11L4j83jJ2qk6l3J14j32P3
7622d5K8L0J95j82nR1k24J48l9J25j79K11j7j17L5l9J47l25K6O1J17N1k51J27
7646c1k9m5J66j69K06m9j32J13n2J26j87J33J5n9R4J09k86J06L7n0r6Q4J82j65
7670B1r4J35M1j52KM3l1M0L9j68Q1N0N1K6j16j38K68j50M5Pj6N2o8J04j12M3J58
7697A61j60L1r9n3J83j55J32kO3j70j8o4J28q9K94j43J08j74l6N4k8L2J06j1k48
7722a58J40n8J45Kj20K31k02J1J60k34J50j12R6j15K17k28J52j06P4k4j58K97
7744A60k90J65L5o0q4Q4k28L90j54K0j15P5J00j6j62r9K6J81n8m2J2J04n3o5J24
7769E0m0n7m8Q4O3K6k45J50J75j42j62J99l7k6J06Nn7j41k7K22N1J6k33Q0m4j3
$$ y = [61, -42, 2, 68, -31, -21, -17, -90, -33, 50, 76, 25, -124, -7, 192, 41, -106, 105, 139, -44, -45, -33, -41, -67, -100, 14, -118, -45, -17, 13, 208, 26, 21, 112, -112, 36, -3, 122, -57, 154, 137, 20, 55, 16, 163, -162, -136, -75, 42, 93, -158, -31, -60, -105, 61, -108, 98, 49, -83, 30, -22, 104, -83, 50, 65, 6, 100, 209, -77, 29, 66, 16, -80, 4, 186, 21, -73, 62, 103, -49, -47, -4, -35, 5, 44, -124, -43, 7, 58, 84, -32, -170, 98, -52, -7, 0, -16, 36, -32, 72, -40, 3, 161, 1, 32, -67, -120, 63, -92, 40, 38, 101, -69, -87, -151, -23, -112, 182, 39, 147, -27, -63, -9, -37, -5, 101, 90, -158, -18, -76, 69, 71, -49, 182, -20, -9, 151, -83, 67, -45, 51, -64, 153, -75, 77, -29, 45, 21, -137, 160, -130, 35, 70, 10, -74, 10, -218, 172, 18, 38, -77, -2, 98, 82, -80, -179, -153, 28, -30, -72, -60, 44, -9, -74, 50, 10, -47, -95, -11, 52, 78, -167, -17, 158, 16, -146, 53, 16, -10, 96, 101, 44, -97, -124, 98, 149, 165, -68, 12, -32, -45]
7795d5K2j08O9O7Q4o9k6P8k29J28m6J09k24K02L4j44K6J3j9J05J10j48K02j63
7819B8m3l9l4P7K2o1kJ93j34Q0j20n1J64j03j0j7R7j19K1o5Q3J00L4M0n8r7o3
7846g7nmM5o7K21r0q9J02J0LO4k48J01J17j93J26N1kj7j33J0J25p8N4k2k11L09
7873A02k20J42j6p5J60k7o7j02K6J01J8p1p6R7KN5oMJ3j53j4N2O8K3r1j72K37
7900A0kL7r2RJ06k18J59J5R3k00p2K35MO5o0J08j12Kj78K6l7O1j2j00K08k0p9
7927d4n0K92r6j69q0L50j73q0n0OJ52j42Q9o9J15O4j35J32j73Q2l6k6J50j79J75
7952A05j98k3K60k09J07j6j01J26L4j22K62l52Q1J8Q4j03P2J93k11j3nN1r5R6
7976D1k10J56m9o6m4J81J3J20o1R6j48K30k84n3M1Q9p6p3J54k12J3K00j66L53
$$ y = [-45, -23, -131, -62, 5, 89, 20, -6, 72, -157, -29, -75, 34, -190, 12, 46, -98, -72, -59, -78, 27, 137, -11, 191, 28, -15, -54, -88, -11, 11, -50, -52, 141, 7, 87, -33, -84, 80, -23, -33, -50, 47, -72, -51, -116, -33, 67, 101, 141, 83, -14, -77, -82, -86, -41, -108, 113, 23, -66, 36, 46, 49, 113, -135, -34, 83, -110, 16, 67, 65, 48, -85, -75, 50, -28, 26, 4, -207, 102, -118, 24, 8, -67, 93, 66, -1, -103, -77, 24, 42, -29, -105, -8, -6, 49, 43, 47, 60, -93, -107, -55, 13, 36, -55, -227, 10, 8, 45, -47, -38, 68, -150, 9, 24, 117, -83, -155, 80, 84, 149, 89, 197, 85, 87, -91, -65, -102, -41, -53, -153, 55, 35, -44, -94, 198, 102, -67, -147, 203, 30, -50, -100, -94, 58, -84, 5, -64, 51, 115, -20, 112, -61, 21, -15, -41, 109, -70, 105, -93, -116, 144, -65, 42, 26, -75, 51, 85, -37, 225, -127, -46, -28, 56, -47, 25, 218, 7, -6, -11, 40, -55, 41, -169, -13, -62, -128, -172, 9, 22, 142, 81, 177, 29, 259, -25, -78, -37, 52, -24, -97, 57, -155, -142, 58, -108, 245]
8000B45k46m1M1O4j37L3L3N4kk27L07M5j67m2p3N1m4l3J32o7N1%P6M6k85J18q1
8027a49K24j57K10k08P1L0m0pJ52n4j1k22K21M5k9j20K41k57R5N9J2J11k49N9
8051B7K26k13L2m7j69P5j73J11J66J00j39k03K06K56l80J51R3j68J8r2N3J0L8
8074b2p9n2R1l0L37l47J27J63l20R9K6R8m5J1PL3k26j6J79n1k43K24n3Kr2J60
8100a9J16j88J35j69J39L2k01J74K4M1p1NQ3m3kj8J9j02J17o0N8J06k52K43k23
8125e6L0n4J27q7J63J31k73q8J07j6l6j2p7lM5NJ85R6j52j09KO5j47L06k19nJ77
8152A05q8p1l3J37k19J10J63j8k9j07j99J79K11k1p2o2N9j39P8j2k5J76n0k0j17
8177f4O8J30k91J24k7J73j41P7j79J75P2j65R2K4
$$ y = [245, -1, -42, -1, 63, -74, -41, -8, 46, 44, -183, 124, 169, 2, -40, -113, -62, -106, -139, -7, -74, -23, -23, 53, 99, -186, -68, -149, 75, -82, 128, -80, -9, 21, -19, -26, 126, 72, 61, -161, 60, 105, 76, -44, 197, -60, 35, 94, 106, 217, -32, 27, 253, 40, 72, 25, -144, -69, -242, -131, 35, 135, -4, -207, -1, 255, -125, 26, 119, -49, -31, -123, -70, -60, -22, -101, -153, -62, -92, 245, -102, 25, 188, -132, -33, -7, 91, 46, 57, 64, 97, -129, -145, 34, -17, -260, -36, -89, -87, -179, -19, 97, -91, 44, -125, 14, 46, -155, 19, 43, 84, 13, 18, 101, 58, 56, 38, 57, -45, 72, 12, 70, 176, -76, 167, -56, -26, -80, 47, -40, 123, 254, -19, -107, 0, -16, -52, -64, -141, -144, -99, -94, 91, 187, 35, -74, -72, -7, -154, 152, -67, -72, 105, 17, -54, -87, 50, -169, -59, 104, 86, 57, -50, -249, -70, 141, 120, 48, -14, 45, -94, -16, -28, -53, 123, 73, 53, -64, 4, 134, -157, -33, -60, 113, -28, 49, -130, 45, 117, -48, 44, 68]
8191F8
$$ Imaginary data points
##PAGE= N=2
##DATA TABLE= (X++(I..I)), XYDATA
0@%%%%%%%qJ6j6J7k5L3m1N6p2Q8j12J44j76K07k40K89l45M02m69N49o40P36q44
30d51R69j106J255j423J613j820K041k288K565k866L190l546L939m366M830n338
46b802N896o503P163p894Q702r586J0561j1649J2867j4229J5771j7539J9584k1975
60a1633K4820k8279L2582l8099M5476n5907P1854r9500J60520n25978L29857R57924
72H63637j079525n11261Q09780N15545o31737m31583L21602O75168j95088q59124
82e22586J41685J063348k78041j027189M12042R19709m93385p45078L11931N97365
92C79801j00373o05782j98538P09559L25474q61679l00528J025999K16660r91952
102d01359j17512Q34030J14995n78049k13988M17942M16310l76110o07903M79009
$$ y = [0, 0, 0, 0, 0, 0, 0, 0, -8, 8, -8, 9, -16, 17, -24, 32, -40, 48, -64, 80, -96, 111, -129, 160, -185, 217, -252, 297, -343, 393, -451, 518, -588, 667, -756, 857, -963, 1078, -1210, 1355, -1511, 1679, -1867, 2072, -2294, 2536, -2802, 3094, -3409, 3754, -4140, 4562, -5024, 5537, -6112, 6755, -7474, 8297, -9242, 10342, -11633, 13187, -15092, 17490, -20609, 24867, -31040, 40814, -58686, 101834, -424144, -94287, 863637, -215888, -727149, 82631, 598176, -33561, -465144, -143542, 531626, 336538, -522586, -380901, 682447, 404406, -622783, -210741, 708968, 215583, -529495, -217564, 379801, 279428, -326354, -524892, 184667, 510141, -351538, -652066, 373933, 590593, -401359, -518871, 315159, 430154, -147895, -361883, 56059, 472369, 96259, -511644, -32635]
112c2635P20355o11447p09912O50275N39727o31348m21883M59572L73245k60927
122G5022m74339J04677O71043l0418q13052R6511Q66522k04336p89120K83868
132b13622O66057k06268n06680L9727M34604J66221m73703l15748N75813L16283
142D82684p21649k66628P39964J64161o50150j10659M81089J48450l19588k74092
152c26418K51814M48165k83210n71731L85603O08241m39388n02343M49211L85109
162D05053l54197l21735J88970L42806m5683m68750n5355N84345L2252o60880
172c53174N7878O47294j39517n55195J30791M27763k5101l36497j24562L39707
182F9387K69604m03662l13827N20680K96754n75187k21682N29013J42240m10098
$$ y = [-32635, 687720, 76273, -633639, 16636, 556363, -74985, -496868, -37296, 335949, 75022, -399317, -294640, 376403, 345985, -467067, -370556, 495966, 291630, -497490, -213622, 452435, 246167, -260513, -220786, 213818, 380039, -93664, -409412, 166401, 482684, -238965, -505593, 234371, 398532, -251618, -362277, 118812, 267262, -52326, -326418, -74604, 373561, 90351, -481380, -95777, 512464, 73076, -429267, 19944, 405053, 50856, -270879, -81909, 260897, 215214, -253536, -308891, 275454, 307706, -353174, -295296, 351998, 212481, -342714, -211923, 215840, 190739, -145758, -270320, 69387, 338991, -64671, -378498, 142182, 438936, -136251, -357933, 171080, 313320, -96778]
192i6778j37850K59914K04503j73665l38982J59514M52972k18015n02807K82600
202a08594M50981l17822l48220K82698K70035j59208k42341K8421L09838P5783
212B41571m05415q9978M85771L0553n05414M3755M51399p3277l50088K1522K45755
223I6154P9183k16109k07269K48084K78231l35703k81990M06512K32873l96503
233i6537j50430L26995J13830k12513j41822J14874K32311p2995l35274J03261
243a18300M00836j65046l83214K15497L02804k18154k27832J33419J71977k7862
253H4125j91555p0650K63138J16433l35375q0934L82600J7021l56373L2378K72832
264A33640k5322j74757l8152J23997J41891j25179k19592J83704K45318k55694
$$ y = [-96778, -234628, 25286, 229789, 56124, -282858, -123344, 329628, 111613, -391194, -108594, 342387, 24565, -323655, -40957, 229078, 69870, -172471, -144050, 165788, 241571, -163844, -253822, 231949, 262502, -242912, -199157, 252242, 178965, -171123, -149601, 96154, 175337, -40772, -248041, 43, 278274, -57429, -339419, 67093, 299966, -96537, -246967, 80028, 193858, -18655, -160477, -45603, 186708, 113713, -221561, -118300, 282536, 117490, -265724, -50227, 252577, 34423, -193409, -59990, 111987, 84125, -107430, -178080, 85058, 201491, -133884, -214818, 167782, 184803, -171570, -139192, 133640, 108318, -66439, -104591, 19406, 161297, 36118, -183474, 230, 245548, -10146]
274a0146k20790K72784J40637k44711q8449J57586Q6869o0786j40733P120K27729
285A27110r247k92934N9657L04927j16709k56120J44312J85107j00320j15918
295g0135K0193J04190O7907j51597j24301K14486J09329k71083o2148K68670N355
306A10866k11587J9616J28795Q967o3627q4320M5169J65586p6631k02754J41066
317a8854J93126j76605j29132J75295O9015j21301m5716L4731O2975K6735j27776
328e7507m7109J91873J2270k23242M4540J99650q6831j42435P4777P4415k1128
339A9273l7535m6103O1163J10201j09185j18292J70409Q7374j90864l2346J56676
350G0771j5332r5526J1120K9699L7593L528j05816O198J51315n5930j59428J01164
$$ y = [-10146, -230936, 41848, 182485, -62226, -150675, 6911, 93780, 32994, -107739, -100619, 127110, 117863, -175071, -115414, 189513, 72804, -183316, -39004, 146103, 45783, -70135, -49942, 54248, 122155, -29442, -153743, 60743, 170072, -101011, -163159, 105511, 110866, -100721, -81105, 47690, 56657, -6970, -91290, -46121, 119465, 42834, -159920, -18854, 174272, -2333, -131465, 43830, 112845, -8456, -54172, -19441, 43534, 70269, -57507, -104616, 87257, 99527, -123715, -79175, 120475, 33644, -108791, -34014, 40401, 19273, -18262, -64365, -3202, 106999, -2186, -120478, 49931, 137305, -53559, -85905, 70771, 55439, -40087, -28967, 732, 38325, 41853, -63963, -57765, 93550, 37620, -121808, -20644]
362b0644J15147j22479n4397R7442J7716k5524j0319l5400N3128O8695j07956
373b4591n2041J47294K210j51118M1545J06685n7146m3479K9901o418K2834M760
385B0436q3381L0850J07564q3748q9648J18032M4654j06371R982O7960k6798q291
397A241M244l2622N2054L9302j02747o638J18067m4444r5327P5651M3360p4300
409b2159k002K4708k1588L1377N154o8193M2349O9233q6776l0661J06024j4837
421C2629p9633M5186K8872l8229K3205M728l8960M6292J8341q4544K2576Q2224
433F2687o6927n0368P3603n257n1767L8877O804l0268M0552n907n8687N1946M2330
446D7618p8871J970P5407m2710l7502N9515n519l1706L8265j6675m0020N4200
$$ y = [-20644, 94503, -27976, -82373, 15069, 32785, 7261, -3058, -38458, 14670, 83365, -24591, -76632, 70662, 72872, -78246, -36701, 69984, 12838, -30641, -740, -7158, 15676, 20436, -62945, -32095, 75469, -8279, -97927, 20105, 64759, -41612, -31630, 36330, 9532, 1241, 5485, -27137, 24917, 64219, -38528, -45166, 72901, 28457, -66870, 8781, 52141, -22159, -24161, 547, -21041, 10336, 15490, -52703, -10354, 58879, -27897, -58558, 47466, 32629, -47004, -1818, 27054, -11175, 12030, 16758, -22202, 24090, 42431, -42113, -19537, 62687, -4240, -54608, 18995, 13738, -38029, 848, 7652, -22616, 17936, 12029, -46658, 5288, 47618, -31253, -29283, 46124, 3414, -34088, 25427, 19908, -11798, 26467, 9792, -30228, 23972]
458B3972L085p0524L6783M5648o8312o603O3123k9259k2881M4863k4456k6009
470c0570N2832j5911m5614N7816J4846o7766K7385M8329m8339l262M3773l7055
482c536j3151M5276l3061k6898N9964j4548n7251M7108K2422n5035K0873L3308
494B5471m6093M586L8490l9218k713N5113l2883l3317N7553n300n0747M0572J7859
507B9373m9985J8060K3716m3291J5456L8697m7383r527N4449k9711l6314N0700
519A4240j661m4199L3558J0432m0548L2165K5175m8056J4223M1034m5124j1773
531b0534N1579k3906l2445M1925n688l5966L7403O470m3132K9911K1208n3474
543b6649J0480M3189l9316j4158M3490k0343k1139M2327r267l1562M1091L619
$$ y = [23972, 27057, -43467, -6684, 38964, -29348, -35951, 27172, -2087, -24968, 19895, -4561, -30570, 22262, 6351, -39263, 18553, 33399, -34367, -6982, 41347, -6992, -10254, 33519, -3536, -16687, 28589, -4472, -31370, 28594, 14046, -43205, 3903, 26325, -28710, -7837, 25471, -20622, -16036, 22454, -16764, -19477, 35636, 2753, -30564, 26989, 21689, -29058, 11514, 29373, -20612, -2552, 21164, -22127, -6671, 32026, -15357, -24884, 29565, -146, -36460, 14240, 12579, -31620, 1938, 12370, -28178, 3987, 29162, -18894, -4671, 36363, -8761, -20534, 31045, 7139, -25306, 16619, 10931, -25035, 12368, 18838, -24294, 5617, 26825, -26649, -16169, 27020, -12296, -26454, 17036, -3307, -24446, 17881, 8614, -22948, 18143, 21762]
555B1762m8950K8287K7918m6161O678L6433l4511p186L8988k4448j7717M1569
567B2662j6767l6809M0695P476m6777K4096K7478l9522O967L1123l0763R88L6175
580B7022l2299j7354M7557j3061l8745L7609J2340m0875J7542J9556l3814J2159
592b363K3518l9045K507M0141l2857k0584M7074p422l7544K9706J1516l1491J7838
605I94J1900l1719J9868K3688m2518M465M7123k9904k8189M0756j415l1689K0226
618C586L315k3318K3411M352l7119K5336L0072m6436n512M7613k1458k8346L1192
631F688N95j9872K0445m917j9399L3795L434m6083K2872L7475m3934j5856M2103
644A7346j0367k3068J9205n445p450K6708j7134k8401M0764J1567n2112J2655
$$ y = [21762, -27188, 1099, 29017, -17144, -10466, 25967, -8544, -15730, 23258, -1190, -18907, 22662, 5895, -30914, 9781, 17257, -29520, -5424, 22054, -17468, -10501, 20622, -10141, -9153, 27022, -5277, -22631, 24926, 11865, -26880, 10729, 23069, -17806, -264, 19292, -14522, -2363, 21155, -17890, -15383, 24758, -8099, -28683, 18391, 10969, -26575, 3131, 14647, -16844, 994, 12894, -18825, 1043, 24731, -17787, -13322, 33801, 3897, -24292, 16464, 15049, -16640, 3586, 6901, -16417, 6994, 11346, -25773, -437, 29635, -16801, -22313, 25300, 3842, -24504, 6688, 7283, -12589, 7856, 2939, -16460, 17335, 20769, -25314, -2442, 35033, -8901, -24757, 17346, 6979, -16089, 3116, -2329, -9779, 16929, -205, -28606, 12158, 23725, -28387, -15732]
656a5732M3309k9213j9056K9453l762p241J5604j8769m998L7708j9267m0139M0727
669H624K3370n0036j804L8760j4205j5329J2458r285N664J8939l2877j0334N1597
682B5542r541n0243L0518L3609l5525j0206K5275m561j696K425k2310J4337L3365
695C0989l7512k4889N2877L829n2426J3575L3238j9322j1129O034m751J7341O591
708A4445l7169J0906M7735l1300l9662M4618K0143m1200k096K1716m117J869o620
721g32j5662K8921J5828m9838m238N4941j6244m7324K7025K6624k3401p298N995
734e403L761J9495j2235l4187L1085L3438m7846j9843N2800K301m2989Q846K2715
747A1938l378k264j4539n781L4264m850m9335K1633M7487l5812l3602L8270J6536
$$ y = [-15732, 27577, -1636, -20692, 8761, 4999, -2242, 13362, -5407, -10405, 27303, 8036, -32103, 8624, 31994, -18042, -19846, 18914, 4709, -10620, 1838, -7447, -1783, 17156, -15721, -26055, 25542, 16001, -34242, -3724, 29885, -5640, -15846, 9429, 4868, 3172, 5597, -16713, -2376, 30989, -6523, -31412, 21465, 25294, -27132, -13557, 19681, 359, -10770, -4736, -9487, 7854, 14445, -22724, -11818, 35917, 4617, -35045, 9573, 29716, -11484, -13580, 8136, 4019, 5888, -732, -16394, 12527, 28355, -21483, -25721, 29220, 12976, -34348, -7323, 19301, -4100, -11398, -5403, -1642, 17853, 5618, -28569, 2516, 35954, -11892, -31735, 21065, 23366, -19623, -10777, 11938, 8560, 6296, -8243, -14024, 20240, 15390, -33945, -12312, 35175, -637, -34239, 4031, 20567]
760B0567k5336m127N770P151J3295k3561k0328M3724J3506n4486K349N0510j5857
773A3177l5174J7325J7054o943p113j4550Q156L2237k0580l8440L8167K9987m7714
786a4411j4160M3019K252k6329J77P762J1500N098k8008k985M3907r425n0024
799c1627K3449M0682l1647k4660K4612R799q250o959r297J7543K0502l3965k0867
812c0685M6001R365m8411N304L9421j1938k0910P008P842J0078l714k7906J0490
825h055L6313k5387l5090L5986K3505l7684r384K6900K686q814o837o705K0627
838H061R701l6520j911M5452j0068m0909K0268K8696j9655j3599R559N510O752
851A1337r823k1742K1594K5393l5393j8064M1164M498l6047M331K2410m010q486
$$ y = [20567, -4769, -8896, -3126, 4025, 17320, -6241, -26569, 17155, 30661, -23825, -21476, 29034, 13177, -21997, -4672, 12382, 5439, -1674, -16224, -8068, 24169, 3589, -34851, 3316, 33303, -14411, -28571, 14448, 16700, -9629, -9452, -1690, 9810, 14908, -13100, -16085, 27822, 18397, -31627, -8178, 32504, 857, -23803, 809, 10608, 2358, -4601, -13898, 3645, 24147, -9818, -30685, 15316, 24681, -23730, -18426, 20995, 9057, -11853, -4845, 2997, 13075, 9361, -18545, -8055, 28258, 2871, -32219, 3767, 27272, -10412, -19796, 7104, 9790, 976, -5861, -12566, 8061, 17762, -18758, -20669, 24783, 14715, -26194, -5926, 22770, 3115, -10484, -925, 4585, 11337, 1514, -20228, 1366, 26759, -8634, -26698, 14466, 18964, -17083, -12752, 9658, 5648, -2838]
864b838n611l03K1319p17l2936J2239L5925k4680k7668K9528J4905k3036m485
877h358Q848L836N329j2346j3559K5395J0937l6904j930L7390r505k8079J4588
890d358J4549q071l663m684K817J8667j0605k5654K1420K2775l0243j2114L0835
903A1671J545k1138L857O290J483L825j4648o416K5378j535l1475J2496K8079
916A9412j8976j6809J9109N720r401M41m429L815J4305j4980j5973K6069R568
929A7871k9278J550K4270q823j3647P743J511M78L556j4161p51K2906q940k2713
943a8428J9044J5468k2232m457J6366k113n028K331o118N071J1559j5805q273
956a2615K4477j257k4517J0071J5497j2781m283P451l484K636L181j3269L629
$$ y = [-2838, -8449, -8752, 12567, 11850, -21086, -8847, 27078, 2398, -25270, 4258, 19163, -3873, -8358, 490, 4326, 9655, -2691, -16250, 9145, 20082, -16822, -18752, 18638, 9133, -18946, -4358, 10191, 2120, -1543, -6227, -3410, 15257, 4652, -21002, 418, 23193, -7050, -19164, 11671, 13216, -7922, -4065, 2225, 3708, 7533, -7115, -13531, 11847, 10312, -21163, -8667, 19412, 436, -16373, 2736, 8456, -945, -504, -4933, -1118, 13187, -1793, -17766, 8303, 17871, -11407, -9857, 14413, 5590, -8057, -314, 1197, 1675, 5231, -8930, -9681, 13225, 4285, -18428, 616, 16084, -6148, -10605, 5761, 3648, -1380, 951, -5167, -96, 11463, -4342, -12615, 11862, 10605, -13912, -3841, 11656, -1125, -5408, 2043, -1441, 1195, 4376, -8893, -5264]
969e264J8377j3351j5059K0054N482j8396M660J0823p395Q56J753q096P894Q237
983A0575j7078k252J9825p248j5953J3479P426j2368K122K863o290P210J721j4025
997i993P252J3325j5147o573J8553j183j2918P581L544p097N393n08r200J0731
1011C760M619j7413L717J6445j0439q803J2444m71q560N143m75m861R549j776
1025B879j3445J0771R784j5353m43J4987p037p627Q132j534l371P464n229p406
1039g428J2306Q85j4952P540J1225j2809l132J0297m716k436O864n814k726J0605
1053E709n451r460J2756M843j4270L118R858q371p36O936o059q2P555q917m194
1068f765J3223k669j2215Q817N275j0614K577O829o893J419N458r494N94J1836
$$ y = [-5264, 13113, -238, -15297, 4757, 10239, -8157, -3497, 7326, -69, 787, 2540, -5556, 2338, 10575, -6503, -8755, 11070, 3822, -12131, 1348, 8774, -3594, -1472, 1391, -4899, 2311, 4032, -9993, -2741, 10584, -4563, -11136, 7417, 6234, -6684, 897, 4441, -2656, 2737, 2229, -6971, 3760, 8379, -9034, -5317, 11128, 689, -8114, 4330, 3859, -4701, 442, -33, -4894, 4655, 2879, -10566, 205, 9989, -5364, -5807, 9180, 2143, -5484, 2648, 1114, -2257, 5207, -22, -7428, 4878, 5763, -9189, -1649, 9576, -3233, -6365, 3932, -784, -3220, 3644, -2170, -4896, 5709, 258, -9202, 3554, 8397, -5873, -2755, 7103, -1268, -2004, 4932, -1127, -1209, 6346, -2571, -6765, 6458, 3789, -8426, 391, 5666, -4948, -2371, 4458, -2435, -1016, 4442, -5052, -4458, 7378]
1082G378q010o571J2033o97j0217O752M375o740L068K486q792L883P627j0873
1096d298j439J2589o121q294R339J358o444N237j20o948O480K929j0258M237R998
1111H245j0040m603J1512k073o041O111j391m584O143k473p975R331M729j3113
1125f222R61J1456o289n140P573j205l280M637m688l086J1111k396j1516Q384
1139C00P747j1017j737R971k573m233K605l413J300P326p829o087J3014K03j4421
1154h844N290J0582o686m204M198q68J698J924p690K158J1483q448j1241J3362
1168B714O313j2820n31P958j705j995r72k452O672L341j3474j356J6391m068j4260
1183a0244Q300R784p857m299L111K668L919m237r378R009R781j3879p052J6933
$$ y = [7378, -632, -7203, 4830, 4133, -6084, 668, 5043, -1697, 1371, 3857, -4935, -1052, 6575, -4298, -5737, 6852, 731, -7563, 1776, 3134, -3310, 1927, 1807, -5141, 1339, 4268, -5990, -1753, 8245, -1795, -6398, 5114, 3041, -3000, 3111, 1720, -2864, 3279, 806, -7169, 2162, 6891, -6222, -5261, 6195, -94, -5234, 2339, 1134, -2146, 2491, -2197, -5283, 5828, 3432, -8084, 300, 8047, -2970, -4707, 5264, 2691, -1542, 1063, -2350, -1050, 6276, -1553, -7640, 5374, 5577, -8844, -3554, 7028, 342, -3862, 336, -532, 1166, 3090, -4600, -2442, 9041, 593, -10648, 2714, 9027, -3793, -4324, 3634, 1929, -66, -1038, -3490, 3182, 6523, -6951, -8307, 8084, 4016, -10244, -1944, 7840, -17, -4316, -1205, 1463, 5382, 1145, -8233, 776, 10557, -3322, -10374, 6559]
1197F559K664j4981K50R422J29l335m948J09J0743k427j5977O835J7403j0600
1211A846j4052J1914R619r107n424L569N731K364j0545n990J6370N291j9793j616
1225i823K0007k645j6281L006J1580l03p859o363P029J2044r910j4847J5275J4024
1239A4934j8126j0523J7693P540j2550p071O918R423k923j4475J694K0255m260
1252H529k3320P554K1785r706j7145P892J3262l204j2801k717J4999P467j9052
1265f457r440K3546P390k4472l549K2762K227j7818m392J2655R626j0613j5746
1278a4281J1792J9223j5439k0462J8608J8749j8325j5635J5012J3119r326j4210
1290a1175L798J8965j580k4203K265K7873l930k7328O247K4275n924k1028K508
$$ y = [6559, 9223, -5758, -5508, 3914, 4043, 708, -4240, -4131, 6612, 4185, -11792, -4957, 12446, 1846, -12206, -292, 9327, 220, -5204, -1635, 4096, 6460, -4085, -10075, 6295, 11586, -8207, -9823, 10184, 7539, -8742, -5736, 5844, 5541, -2318, -8681, -1652, 10392, 482, -14365, 910, 14934, -3192, -13715, 3978, 11518, -1032, -8103, -1185, 8238, 5315, -9160, -7466, 12789, 8529, -14791, -7237, 14548, 4842, -12303, -4411, 8851, 5647, -7154, -9871, 5128, 12595, -6457, -15897, 7649, 15039, -9433, -12982, 9780, 12007, -5811, -10203, 2452, 12078, 1465, -14281, -2489, 16734, 1295, -19167, -559, 18190, -135, -15770, -758, 12361, 3035, -11175, -7377, 11588, 10008, -14195, -11930, 15943, 12013, -15315, -9068, 15207, 9283, -11745, -9237]
1303i237J7748L482j8594r849K1830J2697k5296j1822K7341R573k6351q169K2492
1316E845R198j7761j2469J3862J7726j2682k2773J5500K5488j8136k4715J8186
1328b731K2108j5874j9893J1141J9513o097k2412J957K6925n2l0740P95L1779
1341A6419k780k9601L718K5668o54k2838m908K1967J0756k3272j4604K6078J5680
1354B1629k8435j4498K8703J3109k5893j2993K0412J5154j5980j9845J4255K4894
1366B0512j5077k8132J6782K9143j7409k7090J6016K4448j2811k3019P068K4899
1378A5330j921k8768o36L2298J087l3729J33L2828j000l0611q61K6961M948k4039
1392g980j0836K4267J5322k6084j7344K8845J7303k9412j6474K6899J5811k2835
$$ y = [-9237, 8511, 11993, -6601, -16450, 5380, 18077, -7219, -19041, 8300, 17873, -8478, -16647, 5845, 15043, -2718, -15187, -1325, 16401, 3719, -19054, -3554, 21934, 3798, -20917, -2731, 19377, 3503, -16390, -5249, 14264, 8167, -14245, -12288, 14637, 14585, -16155, -15360, 16419, 13639, -15962, -12244, 13424, 12770, -10068, -14976, 6991, 17747, -5525, -20129, 5949, 21629, -6806, -21304, 7399, 20508, -5385, -18378, 2034, 17188, 1208, -18637, -4382, 20512, 5435, -22697, -5915, 23228, 5819, -21271, -5255, 19193, 6382, -16637, -9569, 15330, 13409, -15359, -15995, 16303, 17390, -16339, -16206, 16622, 15622, -14989, -15850, 11111, 16059, -7980, -18816, 5451, 20773, -5311, -22655, 6190, 23493, -5919, -22393, 4506, 20317, -2518]
1404b518j6632J8255J9853j4742k4708J4331K9205j5453l0774J6278K8957j5533
1416F519k6708J2574K5520q221k5993L131K8221J065l1179k629L3785J758l4134
1429a6291p03L2011J708k8619n401K5904R987k4557j4576K5649J7772k7764j8970
1442b3850K8726J8355k7585j7242K3646J7157j8997j9601J5688K3916j3780k7772
1454b1339J3697K9957j4058k9750J3795K8140j2698k6067Q593K5660l149k6933
1466a4152r34K9557K942l2101k787L2537K270l2030k890K9474M569k5643q309
1479a7497K3898J2985k4171j6596K6166J8434k7401j8746K6612J7697k4076j7210
1491a9905K0732J8323j6826k1678J4202K5607j3147k8589J3474K8874j4150k7567
$$ y = [-2518, -19150, -895, 18958, 4216, -20492, -6161, 23044, 7591, -23183, -6905, 22052, 6519, -20189, -7615, 17905, 9684, -16309, -13178, 15043, 16108, -15071, -17700, 16085, 17843, -16291, -16994, 15017, 16725, -11894, -17295, 8609, 18596, -5961, -20537, 5112, 22884, -4880, -23850, 4876, 23231, -4354, -21596, 2050, 19207, 210, -19391, -3703, 20213, 6433, -21339, -7642, 22315, 8257, -21493, -7698, 20442, 7744, -18323, -9730, 15930, 12781, -14152, -15086, 14471, 17413, -14688, -17475, 15062, 17332, -14698, -17588, 11886, 16455, -9188, -17497, 6401, 19386, -4785, -21381, 4785, 23219, -4182, -22928, 3684, 21381, -2695, -19905, 827, 19150, 2324, -19354, -5152, 20455, 7308, -21281, -7807, 21067, 6917, -20650]
1503b0650J2981K6194r948k4962N734K5231j288k6723j509K9173K183l0740k259
1516a6583L0833J953k8254l382K5029N897k2720r837K2670J3443k3442j6404K4471
1529C674J7068k4987j5757K3548J4902k0543j5712J7245J8513j4244k1622J2972
1541d943K3955j2878k5539J3449K5299j3660k3883J1358K2728q029k1596L682
1553a0057K3083p80k5656l88K7325M56k7483o15K6144J362k3448k860K1318N845
1567A4246k0126r831K0530J2468k1593j3626K2038J2945k1274j2242J9670J2472
1579A5677j6667j4118J3538J6449j1406j9304J1415K1128j2336k1529J2768K0767
1591A6382j1415j9118Q727J8323n712j8893K963K0210o94k3055K68K3868m69k3202
$$ y = [-20650, -7669, 18525, 8577, -16385, -10651, 14580, 13292, -13431, -14940, 14233, 16416, -14324, -16583, 14250, 16203, -12051, -15433, 9596, 15493, -7227, -17064, 5606, 19049, -4393, -20797, 3674, 20742, -4245, -20002, 3546, 18448, -2095, -17807, -562, 17951, 3707, -17915, -4943, 19012, 6134, -19405, -5956, 19343, 5683, -18200, -6842, 15886, 7857, -13739, -10057, 13026, 12246, -13410, -13798, 13527, 13983, -13500, -14115, 12029, 13391, -10057, -12917, 8401, 14246, -5880, -15711, 4819, 17287, -4306, -17932, 4106, 17051, -4223, -16465, 3205, 15677, -990, -15108, -1570, 14879, 3473, -15831, -4416, 16712, 4376, -17153, -4385, 16382, 4967, -14151, -5424, 12899, 7187, -11706, -8743, 11467, 10773, -12282, -12014, 11854, 11385, -11817]
1605a1817J076K1172o9j9004k586J8209N680j7619q809J8285J0390j9570j0500
1618a5162K0061R671j8677r276J6055J0099j3238j2135J1349J4189j0806j6437
1630a4307J1206J7596j1676j7370J1410J6462r680j5036P341J4818m490j6532
1642a0258K314J8566j625j9819J766J9936k132j9026K150J7347p02j5861k316
1655i660J5017N008j5772o529J7044O993j7948o235J7455O373j5824o527J3739
1668C134P374j1630r587J0534J2145j1140j3749J1884J3802j1967j2641J0936
1680i05J1633r164j1583P091J2252m737j3882L366J5393l122j6278M237J5848
1693A0149m366j4568L130J3176j174j2513r75J2484K627j3734l710J5218L805
$$ y = [-11817, -10741, 10431, 10362, -8642, -11228, 6981, 12661, -4958, -13767, 4518, 14908, -4662, -15162, 4899, 14570, -4107, -13383, 2672, 12771, -467, -12602, -1253, 12936, 2130, -14307, -3101, 14495, 2819, -14551, -3141, 13321, 3641, -11395, -4054, 10764, 6274, -10258, -7944, 10622, 8997, -10822, -9056, 10880, 8748, -10278, -8128, 9219, 8517, -7344, -9660, 5357, 10365, -5407, -11936, 5108, 12101, -5847, -12082, 5373, 11746, -4078, -10605, 3134, 10508, -1122, -10709, -175, 11970, 830, -12919, -1035, 12767, 800, -11841, -905, 10728, 1564, -10019, -2928, 9324, 4587, -9295, -5929, 9464, 6342, -9936, -5699, 10149, 5783, -8785, -5655, 7521, 6347, -6166, -7141, 5343, 7970, -5764, -9474, 5744, 9549]
1706I549j5484l256J4633K654j2557l282J0907M805j0129o934J0127R029j0643
1719e81r534J1244R354j1668p873J0089P555q447q323O159R542m623j1163M905
1733c364J2261n551j2312N511J2247n504j0827M122R588k130r560K38J0753J096
1747F568j2225j173J2648J017j2436m82J1215M83j0350j244R007L511q537n285
1761g283R065O322j0141n906J0588N367j0091n241Q694N104p129n759N842P355
1775F787n409r086O179R594o477r601O300Q661n627p661M315P612k616q230J157
1790d102R799p27j0602Q32J0808j805j0024J776R357j227q239n84P809K190p697
1805b436l405Q553L931r793l463R920K813q987k673P518L135o049m481O063N659
$$ y = [9549, -5935, -9191, 5442, 8096, -4461, -7743, 3164, 7969, -2160, -9094, 1033, 10062, -581, -10115, 1129, 10483, -1185, -9058, 1031, 8586, 139, -8184, -2025, 7517, 2894, -8269, -3364, 8897, 3346, -8966, -3455, 8792, 3288, -7539, -3417, 6171, 4041, -5519, -5281, 5472, 6568, -5657, -6830, 5818, 6835, -5601, -6083, 5132, 5615, -4735, -5979, 3028, 6539, -1998, -7283, 1782, 8104, -2037, -7943, 2645, 8012, -2079, -7320, 1374, 6478, -651, -6410, -568, 6787, 1378, -7708, -1529, 8065, 1588, -8013, -1713, 6948, 1321, -6340, -2025, 5587, 2971, -5259, -4102, 5697, 4970, -5632, -4800, 6008, 4203, -5821, -4045, 5312, 4085, -4154, -4738, 3071, 5261, -2436, -5841, 2712, 6643, -3150, -6613, 3307, 6120, -2867, -5540, 1978, 5113, -936, -5417, 646, 6305]
1820F305o103p083O578P422p191o802P066N969o241n780M979O246l178p343K527
1835b629Q207k628q823K959Q991l579q369L150P627k035o687N04O863O04p670
1850c515j449Q800J231r156q21Q616O07p613q61O927J636o064l226O008M598o580
1866h62n153P196M515p397l927P017L731n734m165M555M777l511n850L402O826
1881E420m095p336M735O865m353o160L511N922k726n496J579O005p10p273K36
1896c876P853l69p921R61P426j147o255R3N800J232n563k435N634L140o247l216
1912d890P049K714o953k479O255K491m850l108L962L910m073m644M013N480m350
1927E27n626M562N307m566m434L755M506k561n014J515N809j001o666J201O633
$$ y = [6305, 202, -6881, -303, 7119, -72, -6874, 192, 6161, -80, -5860, -881, 5365, 2187, -5156, -2629, 5578, 2950, -5873, -2914, 6077, 2498, -5871, -2721, 4906, 2871, -3816, -3312, 3551, 4155, -3515, -4964, 3836, 5067, -4089, -4910, 3706, 4313, -3300, -4161, 2766, 4402, -1662, -4888, 1120, 5718, -862, -6015, 1181, 5696, -1701, -5628, 1389, 5120, -614, -4779, -224, 4553, 1042, -4808, -1406, 5420, 1325, -6011, -1276, 5589, 1236, -4924, -1413, 4509, 1783, -3713, -2134, 3871, 3161, -4112, -3876, 3977, 3608, -4313, -3352, 4074, 2927, -3328, -3235, 2565, 3797, -1766, -4201, 1433, 4573, -1674, -4890, 2159, 4873, -2080, -4559, 1696, 4187, -663, -3771, 191, 4101, 28, -4616, -603, 4877, 527, -5099, -537, 4770, 204, -4230, -475, 4031, 1470, -3544, -2029, 3780, 2779, -3887, -2686, 3947]
1942C947j512o579J688O262j428n598M12N124P29n228j488N671J996o399j923
1957d326O825J609o031j495N259J589m551k395L910L323l773m539M554M566m634
1972a09m272M855L483m074l754L345L865k341m324J616N111j346n949K085O041
1987D232k285n594K074M685j148m628M33M459M20n024q21N479J271n997j060N922
2003B418N57n172l38M274J319m157k345M027L088l944l544M364L491m703l105
2018c770M542K650l663k777K468L370j918m155K016M572k001m844K001N120k212
2033A399m389J858L792j289l654K38M019O65m870n54N091M58m988k21M703r5m266
2050b103k82L407J371l291j926L243K893l911k575M243K161m025k251L495K168
$$ y = [3947, 2435, -4144, -2456, 3806, 2378, -3220, -2808, 2316, 3045, -2183, -3671, 2000, 3996, -2403, -4326, 2499, 4108, -1923, -3418, 1841, 3430, -1121, -3516, 394, 3717, -56, -4595, -41, 4525, -109, -4381, 474, 3957, -117, -3871, -526, 3339, 998, -3326, -1710, 3401, 2055, -3894, -1809, 4232, 1947, -3647, -1573, 3112, 1964, -2664, -2231, 2228, 2648, -2376, -3197, 2282, 3553, -2444, -3504, 2418, 2975, -2197, -2535, 1739, 3058, -1099, -3444, 583, 3671, -273, -3817, 547, 4038, -665, -3770, 772, 3422, -241, -3018, -550, 2820, 902, -3253, -1237, 3335, 1334, -3510, -1509, 3611, 1399, -2990, -1132, 2660, 1371, -2283, -2045, 1974, 2639, -2231, -2785, 2306, 2764, -2224, -2445, 2258, 2163, -2103, -2385, 1022, 2393, -898, -2824, 419, 3312, -599, -3174, 1069, 3230, -795, -3046, 449, 2617]
2065B617k693k282K014K641j470l584J760M150k100m055K044L560j894l162J553
2080i01K823o14l252P5L506O16l897n24M072K14m048J17L457K45l044q96K594
2097E43J370k510j802K861K064l247j891L132J871k943j664K592J492j778j989
2112a899J496K625j408l238J627L044j461l011J654K518j455k287Q63K179j11
2127A136k135n94K967L78l190J1K997K7k941l7K216L68j662q04J559J427k081
2144c58j796K526J850k693j566K378J329j921j043J476J374j225j762O47K482
2159A698r32k495J041K456j486j891J135J684p00j353r9J654N08j949o23K278
2175I26M51k644k08K617q9j950j68J516O01j088j117J082J660j447j838J734J291
$$ y = [2617, -76, -2358, -344, 2297, 827, -2757, -997, 3153, 1053, -3002, -958, 2602, 708, -2454, -901, 1922, 1308, -1944, -1869, 1637, 2253, -1644, -2168, 1904, 2118, -1930, -1813, 1644, 1889, -1155, -2051, 543, 1913, -597, -2399, 462, 2526, -721, -2612, 520, 2391, -552, -2216, 376, 1868, 90, -1899, -403, 2222, 814, -2424, -797, 2247, 786, -2225, -571, 1947, 492, -1795, -932, 1247, 1136, -999, -1593, 1374, 1752, -1438, -1427, 1570, 1597, -1344, -1381, 835, 1203, -459, -1263, 296, 1723, -358, -2154, 372, 2222, -471, -2037, 341, 1670, -251, -1294, 182, 1556, 331, -1431, -784, 1698, 766, -1729, -688, 1768, 282, -1609, -474, 1210, 510, -843, -942, 712, 1220, -729, -1352, 926, 1377, -1267, -1475, 1142, 1053, -897, -1065, 451, 1052, -36, -1153, -71, 1589, 142, -1696, 38, 1329]
2192A329j482j080J412P01r63p42M70J337p2j879R7J968n08j884Q72J700r23j311
2210i58N81J085j60r44n25J336N61j585l95J562M90j681l52J546J49r13k59P79
2228C17N17o65j117N54J680j355j154J201Q01r10n81P20N93k44r26J9R89K70j490
2247g81K5J630m61j346N58R88k23q43K04N26K67o65n79R16P02j307p20J606M9
2266E46j000J01M58K20k36n76K08Q26k88p80J58Q97l12q41O90N16n67l15o4N69
2286B10J99m38l76M82K24q44K3Q34m8q35L34L69j6J21l17K5M65m95n67N78O25
2307E53o94l58Q03r0l79R2N0K38l5n06k67Q96K73j000L95N46l52l83K02M68m93
2328d1O7m38J84O48l93o16J014L8o57J9L98p9j13k41m5L05J06l93oO90k62o16
$$ y = [1329, -153, -1233, 179, 880, -83, -825, -355, 982, 910, -969, -872, 1096, 588, -1296, -424, 1276, 353, -958, -377, 708, 548, -396, -921, 415, 976, -609, -1004, 558, 1048, -633, -985, 561, 710, -203, -462, 317, 834, 169, -948, -394, 1286, -69, -1223, -22, 779, -131, -712, 8, 601, 357, -569, -550, 439, 709, -781, -756, 874, 413, -933, -375, 613, 390, -453, -249, 277, 544, -121, -700, 216, 918, -389, -1109, 497, 546, -454, -353, 105, 325, 89, -487, -279, 547, 259, -521, -363, 534, 222, -619, 71, 587, 20, -295, -359, 210, 409, -29, -405, 77, 301, -543, -520, 314, 266, -569, -235, 134, 118, 239, -78, -53, 412, -83, -650, -72, 553, -141, -499, 304, 214, -165, -73, -23, 215, 180, -326, -593, 303, 576, -424, -29, 517, 165, -218, -16, 452, -41, 26, -412, -228, 420, 27, -589, 425, 463, -194, -175, 223, 144, 31, -210, -255, 50, 156, -237, -243, 447, 185, -431]
2350d31M42L98m35j16M61l25R7j61k39M55K2m41j81O44n5n46L73N37n47r0J80
2371D2J01r3j1m13K08M25n21k11P54m0l68r7L03J14k67K53J1k03J06o23N20L38
2393C28j90m38M91K78n92j46M47j19j15k7p9L25o1m79L81N09o30k69K65K99l60
2414a82K36Rk8j46L0j07M58m1l56p5N45j51n48N62n9l16j7J36R0j4n1j06J86K86
2438C41o77K22N75l19n72M54O8N4l26J17K70l6m03j53P88K21r09j34P88l24m04
2459c59N0N00J76m95j30L46K24k64l07L96M29p30m29R78N7o83L3J30K91j13k98
2480a98N5O79l57p37M19N16l92m44M08M74m26k96K82L73K0p31N7O17o2p37J01
2501c79Q47j68o55J6M79K51m73l48K75P04p71n33J021L32p57o11Q50K71m93l09
$$ y = [-431, 11, 409, -26, -142, 319, -6, 91, -70, -309, 146, 168, -273, -454, 190, 135, -411, -38, 499, -48, -138, 42, 143, 50, 39, -374, -166, 259, -262, -473, 281, 241, -127, -224, 79, 193, -74, 179, 190, -13, 93, -530, -10, 328, 138, -300, 191, 469, -123, -269, 178, 59, -56, -83, -162, 163, 102, -377, 4, 513, -117, -386, -121, 178, -182, 54, 63, 35, -111, -81, -188, 270, 229, -127, -202, 343, 192, -356, 206, 147, -169, -186, -50, 40, 26, -25, -131, 55, 341, -336, -114, 461, 142, -430, 24, 92, 146, -180, -63, 207, 171, -232, -385, 403, 624, -285, -419, 369, 45, -359, -309, 191, 367, -128, -258, 88, 312, 48, -259, 137, 566, -164, -593, 385, 442, -241, -208, -78, 213, 100, -198, -143, 536, 179, -558, -139, 377, -15, -459, -51, 423, -3, -299, -17, 356, 376, -355, -298, 319, 257, -480, -379, 468, 300, -355, -339, 140, 391, -82, -430, -155, 549, -222, -755, 266, 598, -159, -770, 80, 351, -142, -451]
2521d51N07M11k38o76K61Q38n68p74N31O93n35m30L20O21m61l08m7O72Q6o85l54
2542e87J098j87j010K71R50q6o15j95O23J77o92l13Q37J67n48p14R91M20q68l54
2562f35O84N23n33n91L44R96n81j070N72R06n35p55N21P65l02q23K02O54M6q28
2582d40m7R90J29j164q6J094J35j098k23J056J69r03j78O94L48m84r00J147M75
2601G14r82m13Q55O02r67n19Q58M61o04n59L06Q49l43j246P43J167o98q41M62
2620a55Q29l62o76K8P74j34o47k22Q51L50j355K52J031J58j047o0P96P0q22l12
2640f53Q86M43p32n36N44R76j120m65Q33N37q10m93M57P40m33p76K94Q38l94q16
2660f80M49R70m76q14M43L85j8o23k43R90m7o94l50J058M2q96J70N40K04q15j13
$$ y = [-451, 56, 467, 229, -447, -186, 652, 84, -690, -159, 534, -1, -431, -111, 510, 49, -259, -306, 366, 452, -233, -587, 511, 324, -686, -415, 535, 449, -166, -361, 262, 439, -253, -566, 271, 438, -110, -824, 167, 587, -281, -635, 49, 572, 39, -552, -208, 788, 207, -863, -291, 615, 80, -675, -154, 611, 309, -514, -312, 342, 388, -440, -487, 503, 632, -532, -618, 476, 611, -487, -710, 346, 515, -388, -566, 128, 476, -8, -908, 239, 714, -268, -681, 174, 776, -191, -710, 148, 609, 5, -554, -248, 601, 258, -988, -245, 922, 224, -617, -155, 674, 312, -364, -336, 438, 304, -343, -565, 286, 636, -719, -467, 564, 722, -325, -385, 411, 481, -341, -653, 233, 676, -56, -592, -48, 928, -192, -657, 176, 713, -97, -590, -133, 607, 174, -602, -308, 530, 136, -680, -231, 739, 263, -551, -108, 277, 259, -364, -607, 383, 336, -358, -708, 350, 392, -504, -334, 206, 410, -405, -518]
2681e18O18K67m02o55P64O20p91l89N77L04n76l81O13O44l69p04L30M56k60o76
2701e28L50Q30m39q93L86P07jp84K20L37J35m48m17O78L04p09k54O85K56n93j29
2722c07L89L17n54m73N46L52l20m69M51O47o77m39M89N43m80l33K74K27Q1n24
2742b60o4P14l16l17k60R89j20n48L1L93l6l76RL67L51o84k44O22J56m93o7K36
2764H3J79n40k38N19K48l24k15K54M15j79n64K29M38n39j20L30K90l54Q4PJ86
2785A89n8l56J5M65n9m24J9M27J3l25o1L15j23j00j14J37K98k78m17N19K64k53
2807I3k76J35K56m55o4K35J34J6j62J27K62j16m23R4N10k63k26j43K19J83n9k84
2829b07L88j14k66%K54J25q7j83Q6N7r7r2J83J32o3k01J09J81j29l48K33K65k72
$$ y = [-518, 100, 367, -35, -690, 74, 694, -97, -486, 91, 395, -181, -562, 51, 695, 326, -378, -48, 408, 148, -528, -178, 652, 213, -680, -294, 413, 412, -372, -152, 185, 320, -128, -545, 133, 437, -272, -526, 159, 415, -178, -307, 82, 399, -155, -628, -82, 270, -50, -519, -68, 579, -98, -537, -48, 495, 15, -318, -44, 183, 264, -260, -324, 390, 74, -243, -503, 486, 366, -182, -151, 242, 206, -170, -161, 206, 557, -127, -371, 251, 407, -86, -153, 83, 262, -278, -516, 3, 251, -73, -288, -34, 381, 202, -362, -133, 305, -234, -354, -24, 266, -88, -4, 3, 189, 131, -225, -210, 255, 196, -228, -209, 218, 231, -94, -155, 160, 37, -63, -177, -40, 258, -20, -437, 82, 346, 93, -183, -48, 208, -247, -311, -76, 58, 74, -88, 39, 301, 185, -238, -144, 366, 103, -123, -266, -47, 136, 77, -207, 181, 67, -199, -199, 55, 180, 93, -90, -4, 53, -44, -136, 47, 179, 116, -85, 24, 205, 76, -272, -39, 226, -46]
2852d6j70J56O6J66l45j09M67R5k79k37N73l1m39L7j2K92k34k19L82l2q5l23L00
2875b7J63k20j69K46J32r6j32n1L56k01l09J61M67p4m56J72L34k65k29K2L93j75
2897D2Lm01M92J64m10j25M23K06o25p8N12J87n90P2J36K04k19k59M30K36m31m25
2919d56M61L86n12k25L08J56q8m21L71L94k20n25K09N47j70n88K12N95k89l62
2939b17P9M25o7m44KO26r7n84k67P74J01m95k80M73L46o67n2O27L3l29m26M39
2961@N21m73n25N17L75m21l91M53N13n06n96L46P46l69o97J14J013n21o41K53
2981b89P93k22p99J16P89p7p76J42Q26P5r68j61J042O8r27j26Q56J91q80r5O99
3002B77L66r10l81P47O74q74p62J015O90q58p21O44Q82o65q19M77R12o50j091
$$ y = [-46, -216, -60, 6, 172, -173, -282, 185, 280, 1, -236, 337, 306, -133, -96, -108, 184, -50, -269, 113, 81, -4, -327, -27, 136, -84, -253, -7, 125, 29, -103, -154, 202, 1, -308, -147, 320, 246, -210, -38, 296, 31, -198, -176, 217, 42, 45, -356, 136, 300, -110, -235, 188, 394, -231, -309, 203, 390, -200, -128, 8, 212, -7, -266, 164, 400, -31, -456, 5, 391, -121, -346, -38, 118, 30, -391, -20, 374, 154, -371, -162, 385, 215, -373, -161, 434, 145, -217, -138, 287, 220, -224, -222, 404, 307, -277, -544, 230, 331, -164, -444, 29, 375, -292, -344, 283, 316, -13, -439, 0, 521, 48, -477, 40, 415, -6, -397, 56, 569, 63, -533, -187, 559, 190, -507, -393, 620, 99, -542, -289, 504, 282, -517, -401, 388, 311, -465, -323, 503, 578, -390, -551, 491, 559, -368, -494, 362, 553, -327, -422, 277, 643, -267, -648, 99, 773, -101, -863, 152, 842, -16, -737, -93, 789, 124, -695, -218, 694, 44, -1047]
3021a047J004R92o80j271P35J058m14j226M12J177j05j246j79J449J3j228m00
3038i56J500K35j291m65J443M52j167q95J227R71j344p44J143J056j251j117J249
3055D6J062j011j324J134J151r53j235Q12J434n99j674P50J612p96j491N23J632
3072A073l46j773K25J736P2j871j54J735K60j817k37J891N16k102n32K047N29
3089A252j822r38J809J079j725j194J746J225j490j511J571J606j678j320J164
3104b26J807j247j822J054J832p09k073P19K120p11k218P05K183n55j971rK197
3121A076J21k385O6K075L49k248n26K370P33k425o77K016J088k170j307K301J332
3138A789k103j540K003J630j796j860J714J878j620j990J523K342j114k701J047
$$ y = [-1047, -43, 949, 269, -1002, -267, 791, 377, -849, -437, 740, 635, -611, -790, 659, 672, -556, -956, 544, 779, -512, -977, 466, 918, -249, -1144, 83, 1054, -290, -1034, 109, 1165, -86, -1203, 46, 1108, 97, -1227, -93, 1058, 105, -1130, -318, 1116, 517, -1157, -407, 1205, 409, -1082, -559, 1073, 727, -1046, -821, 915, 987, -884, -1038, 697, 957, -860, -1097, 794, 1310, -792, -1324, 723, 1252, -570, -1508, 301, 1380, -345, -1539, 207, 1432, -58, -1569, 2, 1608, -70, -1390, -226, 1581, 334, -1488, -434, 1398, 689, -1384, -665, 1455, 744, -1474, -769, 1414, 859, -1112, -1121, 1076, 1197, -1188, -1122, 953, 1302, -946, -1472, 898, 1631, -794, -1471, 545, 1633, -537, -1844, 457, 1789, -314, -1854, 149, 1779, -17, -1877, -163, 1715, 95, -1895, -372, 1970, 856, -1845, -798]
3153g98K609r67k587Q84K351m35k438J79K660j97k824n9K864L97k743p16K825
3170A005P51k790r39K636J060k236j595K588J549k330j829K225J908j969k164
3185b130K100K065j747k467J789K472j499k728J334K826j206k773J061L003r77
3200A123l085P51L018l70l100J13K966L42l167k26K988P13l211q87L014J170k906
3217g54j481K782J569k407k046K492K193k503k190K289K432j978k692J948K532
3232B186j612k972J828K665j245k965J070L174r23l263P90L198m41l466K55L362
3248A641K32l345n99L469P51l508q54L500J113l220j648L297J473k921j885K841
3264C37K116k776k135K481K694k585k818K288K823j668l219J890K824j272l364
$$ y = [-798, 1811, 844, -1743, -859, 1492, 1057, -1381, -1202, 1458, 1261, -1563, -1622, 1242, 1639, -1104, -1820, 1005, 1756, -1034, -1973, 663, 1723, -513, -2108, 480, 2029, -301, -2130, 95, 2003, 34, -2130, -30, 2035, 288, -2179, -390, 2082, 583, -2145, -811, 2015, 809, -1964, -903, 2100, 1123, -1962, -1211, 1807, 1437, -1663, -1550, 1416, 1758, -1409, -1635, 1353, 2066, -1145, -2032, 982, 2152, -754, -2235, 547, 2116, -291, -2337, 155, 2348, -155, -2345, -56, 2376, 398, -2294, -346, 2186, 574, -2398, -570, 2095, 850, -2115, -1045, 2129, 1206, -2057, -1267, 1931, 1490, -1976, -1721, 1641, 1873, -1472, -2071, 1398, 2149, -1359, -2213, 1287, 2400, -820, -2468, 829, 2302, -619, -2504, 337, 2453, -323, -2458, 23, 2717, 132, -2686, -398, 2425, 757, -2462, -572, 2252, 980, -2384]
3279b384J248L420q03l584O12L658n55l663K67L695r3l486j30L354M94l571n66
3296b087L508R26l353j452L309J588l072j823K947K193l013k212K639K507k502
3311A03k744K465K753k185l005J991L061j477l508J435L250p91l584R36L471m87
3327A684l639K11L662N0l694k31L475N16l486p14L551Q39l359j209L168J633l209
3344g52j686L042J843k708k405K705K385k285k580K211K632k182k711J777L123
3359B409j725l056J502L116r46l327Q16L105m10l335J12L612j3l605k43L550N12
3376B074l468p59L301J238l260j341K779J775k805j949K711J967k608k193K508
3391c0K308k338k287K030K529j811k687J469L250j560l081J189L198j055l133
$$ y = [-2384, -1136, 2284, 1481, -2103, -1491, 2167, 1612, -2051, -1784, 1911, 1818, -1668, -1798, 1556, 2050, -1521, -2087, 1421, 2347, -1006, -2458, 851, 2439, -633, -2456, 491, 2684, -329, -2541, 98, 2605, 103, -2641, -176, 2577, 392, -2613, -622, 2439, 962, -2546, -1111, 2139, 1348, -2236, -1300, 2171, 1684, -1955, -1744, 1918, 1968, -1726, -1957, 1518, 2034, -1452, -2166, 1385, 2224, -1135, -2344, 824, 2457, -752, -2438, 604, 2447, -261, -2666, 39, 2424, 139, -2441, -230, 2402, 220, -2491, -714, 2409, 684, -2372, -870, 2246, 1300, -2027, -1211, 1894, 1484, -1851, -1739, 1873, 1860, -1745, -1988, 1562, 2074, -1394, -2153, 1148, 2386, -874, -2215, 564, 2339, -466, -2415, 296, 2263, -345, -2538, -30, 2278, -60, -2347, -317, 2212, 401, -2286, -817, 2433, 873, -2208, -1019, 2179, 1124, -2009]
3406b009P17L328n76l368M31K992K30l325l49L390L35l154n57L087J074l285j117
3423b156K868J623k950j521K407J886k357j994K311K194k294k309K161K460j866
3438D63k625J398K822j296k607R05K829p61l034Q17L048n83l099J96L163j05k884
3455a353k95L032K59k771o92K865O67k388j216K569J249k530j351K235J813k375
3471b82j673J952K192k177j998J700K223j473k428J262K561j082k618J007K616
3486A782m89k965L86K799j38k680J2K504J51k632l21K649N02k443p85K371J064
3503A767k542j004K416J133k054j364J763J728j811j744J735J913j574j988J157
3518d69K305j356k149R98K126o74k297N19K246k78k141J82K255k6k428q4K176
$$ y = [-2009, -1292, 2036, 1460, -1908, -1477, 1515, 1745, -1580, -1929, 1461, 1796, -1358, -1915, 1172, 2246, -1039, -2156, 712, 2335, -615, -2136, 271, 2157, -200, -2194, 117, 2311, 17, -2292, -131, 2329, 463, -2162, -764, 2058, 762, -1845, -940, 1889, 1128, -1906, -1089, 1959, 1376, -1723, -1527, 1636, 1531, -1353, -1648, 1384, 1643, -1128, -1820, 1045, 1712, -676, -1892, 677, 1926, -604, -1955, 280, 2093, -282, -1955, -3, 2189, 12, -1986, -286, 1937, 464, -1964, -702, 1859, 777, -1841, -834, 1782, 1293, -1672, -1286, 1513, 1375, -1305, -1293, 1211, 1362, -1270, -1591, 1058, 1560, -883, -1668, 703, 1767, -775, -1779, 637, 1770, -284, -1648, 115, 1843, 32, -1712, 23, 1936, 362, -1626, -469, 1836, 480, -1669, -671, 1455, 781, -1516, -997, 1249, 971, -1170, -988, 1267, 1241, -1187, -1271, 905]
3535I05M03k224n91K289O66k144p94K074R46k055r32J828J134j696j445J697J429
3552A490j662j231J306J580j158j710R54J899q83k022R23J800o51j837M92J604
3568H94J39j969mJ904r2j879j54J891M43j886m54J770N09j573q05J770O80j462
3586b78j046J397J187j086j516J311J263j062j524R72J544q26j454Q57J361n80
3602E20j691N69J552k31j673K68J457J00j546j93J548J14j401l74J636L57j619
3619f07m45J402O81j427n44J184O15p98j181J176J055j129j075J112Q52p39j047
3636i15P77R48n71j136O61R04j70j250J86J294j39j279P0J439k92j036l34J313
3654D70J32r66m53J131M99j224m94J087O80j014o03R34O98j021o16O48J031o68
$$ y = [905, 1308, -916, -1507, 782, 1448, -696, -1490, 584, 1530, -525, -1457, 371, 1505, -191, -1636, 61, 1490, -172, -1403, -97, 1483, 325, -1385, -431, 1468, 585, -1437, -514, 1286, 635, -1202, -710, 894, 1033, -936, -940, 964, 872, -1007, -1161, 730, 1173, -713, -1167, 603, 1112, -461, -1266, 504, 1184, -278, -1324, 73, 1260, 174, -1342, -31, 1232, 170, -1354, -382, 1162, 336, -1118, -261, 1100, 520, -1171, -602, 950, 719, -954, -686, 771, 871, -675, -868, 680, 794, -607, -981, 655, 1012, -607, -1052, 350, 1031, -396, -940, 244, 859, 61, -1120, 56, 1111, -18, -1093, 19, 871, 132, -915, -138, 810, 239, -897, -236, 668, 498, -752, -566, 728, 589, -690, -620, 819, 527, -509, -843, 470, 602, -364, -817, 314, 813, -411, -905, 182, 862, -152, -755, 179, 877, -144, -760, -112, 919, 251]
3672B51r98K58J240m79j074N86Q85l73q94L03R36j50j042pJ064P3j059k07J139
3691D52L00j139p5P47K59q94l71Q57O95q56o51Q96L33o06o72P62N84m57p97M49
3711a84P80k95r10M31O49j98q86L23O87p7p76J50P26j53m87j99P52P9o33k00N94
3732A73L31o68k15P17J37o76l97O81L03o99q9L01O09n23m53M72N16m96n04L21
3752a59M12j4q11L59N48lp33J90M50ko55K05O16j76l66j77O74r9m09o2M69M5n83
3775b81O0K82K58o08n2M69J94l19k90M52J76l01l29K68L43l51k38N5N31k71k90
3796b42O9N23l52j40LK26Nm45K45K22k2j94m9K43J19m22M1L00R2k32K4N2Q6k04
3820e2j63L38Q0k86j26L54R8k74L3j78M41k37j78Q7K05m2l42K17R5j19j19PJ47
$$ y = [251, -747, -489, 751, 272, -802, -216, 669, 296, -598, -295, 641, 491, -551, -558, 506, 579, -480, -687, 452, 752, -387, -462, 285, 544, -350, -721, 136, 831, -25, -676, 220, 553, -53, -725, 37, 621, 164, -633, -184, 596, 301, -609, -178, 471, 273, -613, -290, 397, 320, -456, -306, 420, 267, -220, -419, 333, 412, -221, -421, 173, 504, -164, -379, 338, 475, -201, -598, 83, 386, -313, -402, -101, 508, -15, -468, 4, 520, 24, -480, -159, 253, 239, -572, -213, 335, 332, -401, -211, 239, 237, -418, -213, 403, 227, -139, -316, 358, 259, -150, -212, 257, 302, -281, -221, 61, 319, -289, -341, 128, 322, 3, -287, 165, 341, 40, -289, -21, 322, -29, -267, -212, 319, 48, -242, -173, 350, -2, -142, -139, 87, 92, -353, -108, 114, 92, -102, -151, 92, 211, -211, -170, 130, 222, -10, 14, 66, 152, -52, -215, 123, 203, -83, -209, 145, 243, -31, 2, -176, 265, 28, -150, -63, 142, 100, -242, -25, 70, -49, -168, -161, -14]
3843a4M8k51J77N8k6Oj78J01J25J9r5J25J02j84J5q5K8j24J20l1K16o2l05L37
3867A22O8l55J37J55K8m4j61J24J08j62k2P8J7q8L8j44K13n4r8l0J0J8k31K72
3891aj5N3k51L29k1j0p3J60k02J03O2L5l20O5l9R5J20j40j54K89Q9l09J41p8J70
3916I8J1k07K03l9J46k39N7J09o5k19N1J42q0k48P1L31j51j49J29K18q5l15K33
3939Bk2K38m39J7L01l4k29p5M44m0k01j47L07Q8k62j85L71R2l94L6K79o0k95L8
3963a70J56J83k71r0M87j08l04j02J91K12j67k16J01K25j01o9j7K52j29m46K82
3984a01K87N3m78RM55k81M3j61K55L47o41q7K84K30k62k56K88K11k48k83K17L25
4006B06k12k78J87K98p2j88P3R4j4n60M45M11j60m10K34J90j90k84o9N45m3l36
$$ y = [-14, 34, -217, -40, 18, -8, -2, -180, -79, 46, 65, -30, 95, 197, 13, 28, -57, -29, -153, -33, -64, 152, 90, -215, 122, 190, -165, -28, 127, 155, 111, -50, 74, 182, 20, -2, 76, 93, 5, 43, -101, 112, 58, -40, -70, -60, -42, -273, -1, -16, 37, -214, 115, 94, 84, 11, 171, -31, 72, 134, 169, -151, -86, -125, -30, 90, -50, -204, 85, 174, -135, 6, -72, 98, 109, -98, 105, 66, 212, -27, 30, 139, 74, -145, -94, 48, -32, -280, -209, 122, -29, -178, -49, 169, 84, -231, 2, -20, 218, -221, -204, 97, 63, -166, -241, 203, 163, -38, -185, 122, 210, -52, -237, 134, 226, -168, -132, 147, 87, -208, -170, -14, 169, -102, -192, 295, 187, -117, -219, -28, 184, 17, -199, -98, 127, 26, -43, -60, 192, 63, -383, -101, 186, 239, -239, -230, 225, -56, -13, -174, 81, 428, -213, -300, -16, 214, -48, -304, -16, 195, -53, -336, -119, 206, -6, -284, -97, 201, 129, -59, 14, 108, 94, -466, -21, 390, 230, -180, 54, 244, 54, -230, -299, 246, 203, -133]
4028a33J54J08P0k52m4J39L61m95k45M56J00j39k03J13K86l05k54K58K27l54k09
4049c61K61L90k40l13M46k2j62l48J07M34n8l63R5L55j34l73N9M63j07k67K2K56
4071A40K41l62j80K62J3j50o0J47J82l23o5K42K17l61j02R6L65l23k20O8M16k86
4093d3k06p6N49P7n67K08J97j36j09j47M42J3l42LK86K71n98r2K61L34m75L4K95
4116A79n9n4j92K09J88k84j24K57L2o3k16J68J73k75l15J78M52j9l31p4J91R2
4138A13l33P4L20Q3l11l38O10j97k0r5Q0K30k89j46K37J61k68k69L72K46j62m53
4160c55K86K57m08O9k7L04r8j80O0K11j33k06J28J89J90n10K26J50j13k9o7J84
4182A28l2k58jJ70K90k62l34K96L36k33k47J63K49l19m0rK52p3l03K96m6q1j95
$$ y = [-133, 21, 129, 199, -53, -97, 42, 403, -92, -337, 119, 219, 80, -123, -10, 276, -29, -283, -25, 202, -152, -361, -100, 290, 50, -263, 183, 161, -1, -349, -242, 192, 134, -229, -134, 221, 87, -286, -227, 236, 129, -138, -116, 140, 381, 19, -161, 101, 114, -36, -96, 51, 233, -90, -155, 87, 304, -57, -159, -63, 302, -21, -241, -173, 243, -43, -249, -325, 224, 301, -266, -58, 139, 3, -106, -253, 189, 202, -140, -137, 149, 420, -178, -270, -9, 325, -150, -116, 179, 120, 66, -126, 83, 271, -13, -137, 120, 152, 89, -127, 41, 214, -61, -376, -198, 254, 235, -96, -170, 21, 113, -220, -146, 174, 257, -54, -392, 218, 21, 1, -94, -14, 216, -73, -219, 18, 179, -89, -358, 14, 260, 98, -355, -69, 188, -220, -151, -178, 126, 28, -152, -92, 119, -14, -220, -92, 97, 287, -223, 3, 153, 40, 11, -56, 128, 96, -162, -163, 7, 297, 35, -299, -3, 333, 100, -147, 16, 265, -54, -94, -103, 149, 76, -227, 69, 23, -58, -253]
4205b53J71J66N0k85p7N21k17j78r8K73J56m76J33K51j02k02j13L06J25k72M9
4226g2J37L1k41l7O0K74j95j48J09K32j08j80K3K98o6l51PL91Oj54j61L11r3j97
4250a24K5J70o0q4M2J99j50k3o1J0K78k67j31J43L69l88n2o0L11k1l24J98R7K2
4274A19l05K62j13K57j86m3K69k31j24L1m1K33k31K8L07k12p4k2j7L10j69l00
4296b52K86J4j57M6J9J46j7l36L36Q4L3k78J48P8q9n7k0K1J2k85K08M8K30l38
4320a20J54J3J6n3k5J08j43k70L79KL8l2k03J34K09l10J13npJ2r3L6J65j50q2
4345a14Pm8J09j07K25K0l12L25j53J64j65Q1j41p6j5J0J85j70K61q3j39L03j75
4368hN7j70N2K33j77L2j49K97k77R0k3JJ41k36jK45j4j11P4r6Q6j00Q3q2j49K02
$$ y = [-253, -82, 84, 134, -151, -228, 293, 76, -102, -200, 73, 229, -247, -114, 137, 35, -167, -280, 26, 151, -121, -72, 65, 96, -145, -182, -122, 152, -43, -191, -82, 150, 42, -138, -115, 183, 117, -234, -227, 164, 170, 16, -145, 166, 73, -124, -99, 71, 11, -73, -31, 168, 18, -5, -66, -56, 222, -45, -176, -33, 336, -52, -104, -164, 147, 126, -198, 0, 97, 119, -186, 76, -37, 220, 34, -9, 260, 29, -95, -64, -105, 128, -103, -75, 232, 20, -54, -76, -93, 217, 48, -252, 34, 48, -109, -63, -44, 102, 85, -251, 85, 169, 202, -76, 72, 150, 61, 4, -16, 5, 17, -268, -60, -12, 218, -120, 34, 47, 63, 10, -15, 93, -50, -320, 59, 61, 99, 67, -136, -2, 207, -103, 10, 5, -2, 10, -83, -47, 118, -32, -114, -107, -155, -46, -153, 72, 92, -220, 105, -48, 116, -49, 32, -109, -185, -200, -190, -5, -175, 86, 3, -136, 167, -8, 49, -121, -69, 164, -13, 19, -130, 167, -110, -20, -43, -42, 99, -137, -138, 107, 93, -18, 56, -40, 46, -54, 29, -53, -202, 0]
4394@o1Q5j31J51J27j76O8l7K18k61r5J67j10l7J07R6j41q7pO2R9n9j56L11k32
4419i9k5l3J38m7J19k5m2j59j01K34J11p8J9j58J81P7j18q0P5N5K0j24n9L08j33
4444E6n5j22J51j79J62k2J1l7J28j36K13j88m6N1O6J13j37J9J26M4k83R5r2J29
4468F7P1j29l4J67l2k63O6L3K2l4k24N78m10Q9M8m1J4q6L5J7K25k47k03M61k28
4493c8k07M1L34j5k50k1Q7N3J40l73K25K88j92j18K2K11j18k85O9L56j97j86M3
4516a31M18r7k75p5K91J44m59J65J62Q1l08j61J87J33P5m35L45R2j52j06J65R6
4538A55j83k12L63P1k97j01L13J45l21J5Q5Pql21L05K28j36j86n0L63o8l21m2
4561a96L20L62p21R1L45k6k72k1J67J57k66q4K37J65j21m75L59K58k62k27J64
$$ y = [0, -61, 24, -107, 44, 171, -5, 63, 26, 244, -17, -112, 55, -55, -92, 15, 111, -30, -117, -124, -62, 37, -22, -178, 133, -99, -124, -157, -19, -66, 53, 28, -14, -173, -274, -40, 71, -7, 12, -146, 35, 112, -6, -86, -11, 44, 64, -60, -119, 189, 56, 1, -121, 30, -149, 13, -9, 2, -35, 93, -43, 170, -18, -64, -13, 53, 166, 29, 48, 174, 218, -65, 30, -62, 67, 138, 9, -25, 142, 110, -153, -87, -54, -32, -66, -290, 288, -122, -33, 15, -26, -12, -98, -63, -46, 179, -68, -271, 190, -38, -245, -204, 130, 115, -135, -156, -69, -16, 124, -249, -24, 264, 72, -46, -24, 187, 69, -216, -147, 209, 12, -174, -131, 287, 190, -85, -160, 131, 275, -184, -19, 143, 224, -84, -245, -58, 75, 150, -285, 60, 152, 0, -106, 59, 155, -28, -240, 123, 194, -103, -204, 109, 254, -67, -52, 33, 40, 32, -289, 16, 244, 108, -78, -128, 235, 167, -154, -196, 124, 486, -235, -144, 201, 175, -97, -118, 49, 206, -60, -144, 93, 258, 137, -338, 21, 279, 17, -210, -46]
4582d6L16l17o1J45R1j15j80j46N91j26m79K23M34j42n65J66L93K6m60L9L26M8
4604A61m06J13L25r0l59O6K17R6j83l11K96L03m86o6M17J3j60j94J25M31k67l11
4626b70J17N56l50j62Q2N23l81m87K40M68j17n69K10L00p0m49P3M75n5k30k01
4647b97N29N6l65m3L91J49n17k53N35K09m18l78L66L13l03l46M39K48k64m17J85
4668a81N41k40n13M97K72k78l51O2M85j23m42l9M50L5m79l4O53o8l60j68O10j26
4690B03l68k07L25L88n80l2J74L46l63k30L67N11m52l92L58J87j16m70K96N31
$$ y = [-46, 270, -47, -108, 37, 128, 13, -167, -313, 278, 152, -327, -104, 330, 188, -377, -211, 182, 208, -252, -213, 113, 161, -245, -132, 193, 103, -256, -190, 27, 123, -60, -371, -75, 228, -258, -324, 93, 106, -54, -248, -123, 308, 41, -270, -153, 403, 53, -109, -27, 496, 115, -372, -132, 336, 219, -350, -140, 160, 90, -359, -286, 189, 134, -96, -297, 232, 288, -77, -120, 271, 420, -97, -350, 185, 394, -24, -402, -36, 277, -26, -372, 67, 315, 51, -366, -181, 360, 120, -393, 104, 376, 98, -253, -191, 294, 171, -271, -310, 140, 175, -304, -338, 315, 247, -113, -281, 329, 203, -165, -372, -47, 341, -239, -271, -97, 249, -114, -344, 23, 534, 82, -310, 48, 235, 119, -351, -55, 476]
$$ [...]
8191A40
##END NTUPLES=NMR FID
##END=
