##TITLE=1H_SR75_DMSO
 DMSO
 8 sc, 
 13.05.2022
##JCAMPDX= 6.0         $$ Bruker NMR JCAMP-DX V2.0
##DATA TYPE= NMR FID
##DATA CLASS= NTUPLES
##ORIGIN= UXNMR, Bruker Analytische Messtechnik GmbH
##OWNER= root
$$ XWIN-NMR		Version 3.5
$$ Fri May 13 13:53:36 2022 Russian Standard Time (UT+4h)  she@DPX200
##.OBSERVE FREQUENCY= 200.1313499996
##.OBSERVE NUCLEUS= ^1H
##.DELAY= (6, 6)
##.ACQUISITION MODE= SIMULTANEOUS
##.ACQUISITION SCHEME= undefined
##.AVERAGES= 8
##.DIGITISER RES= 18
##SPECTROMETER/DATA SYSTEM= spect
##.PULSE SEQUENCE= zg30
##.SOLVENT NAME= DMSO
##.SHIFT REFERENCE= (INTERNAL, DMSO, 0, 15.7039)
##AUDIT TRAIL= $$ (NUMBER, WHEN, WHO, WHERE, WHAT)
$$ ##TITLE= Audit trail, XWIN-NMR		Version 3.5
$$ ##JCAMPDX= 5.01
$$ ##ORIGIN= Bruker BioSpin GmbH
$$ ##OWNER= she
$$ F:/spectra/data/she/nmr/H-F/1/audita.txt
$$ ##AUDIT TRAIL=  $$ (NUMBER, WHEN, WHO, WHERE, WHAT)
(   1,<2022-05-13 13:52:26.42 +0400>,<she>,<DPX200>,
      <created by zg, POWCHK disabled, PULCHK disabled
       configuration hash MD5:
       00 E9 B6 7A A2 85 ED C7 34 08 36 98 17 FE 4E 26
       data hash MD5: 16K
       42 DF 07 F5 8B C8 AF 83 30 D4 A4 E9 42 9B AC 14>)
$$ ##END=
$$ 
$$ hash MD5
$$ 1E 23 D0 1A FE 80 C3 C9 40 83 8B 55 F4 DC 4A 56
##$RELAX= 
##$RELAX= 
##$RELAX= 
##$RELAX= 
##$RELAX= 
##$RELAX= 
$$ Bruker specific parameters
$$ --------------------------
##$DU= <F:/spectra>
##$EXPNO= 1
##$NAME= <H-F>
##$PROCNO= 1
##$TYPE= <nmr>
##$USER= <she>
##$AMP= (0..31)
100 100 100 100 100 100 100 100 100 100 100 100 100 100 100 100 100 100 
100 100 100 100 100 100 100 100 100 100 100 100 100 100 
##$AQSEQ= 0
##$AQ_mod= 1
##$AUNM= <au_zg>
##$AUTOPOS= <>
##$BF1= 200.13
##$BF2= 200.13
##$BF3= 200.13
##$BF4= 200.13
##$BF5= 200.13
##$BF6= 200.13
##$BF7= 200.13
##$BF8= 200.13
##$BYTORDA= 1
##$CFDGTYP= 0
##$CFRGTYP= 5
##$CHEMSTR= <none>
##$CNST= (0..31)
1 1 145 1 1 1 1 1 1 1 1 1 1 1 1 1 1 1 1 1 1 1 1 1 1 1 1 1 1 1 1 1 
##$CPDPRG= <>
##$CPDPRG1= <>
##$CPDPRG2= <>
##$CPDPRG3= <>
##$CPDPRG4= <mlev>
##$CPDPRG5= <mlev>
##$CPDPRG6= <mlev>
##$CPDPRG7= <mlev>
##$CPDPRG8= <mlev>
##$CPDPRGB= <>
##$CPDPRGT= <>
##$D= (0..31)
0 1.2 0 0 0 0 0 0 0 0.06 0 0.03 0 0 0 0 0.0002 0 0 0 0 0 0 0 0 0 0 0 0 
0 0 0 
##$DATE= 1652435545
##$DBL= (0..7)
120 120 120 120 120 120 120 120 
##$DBP= (0..7)
150 150 150 150 150 150 150 150 
##$DBP07= 0
##$DBPNAM0= <>
##$DBPNAM1= <>
##$DBPNAM2= <>
##$DBPNAM3= <>
##$DBPNAM4= <>
##$DBPNAM5= <>
##$DBPNAM6= <>
##$DBPNAM7= <>
##$DBPOAL= (0..7)
0.5 0.5 0.5 0.5 0.5 0.5 0.5 0.5 
##$DBPOFFS= (0..7)
0 0 0 0 0 0 0 0 
##$DE= 6
##$DECBNUC= <off>
##$DECIM= 32
##$DECNUC= <off>
##$DECSTAT= 4
##$DIGMOD= 1
##$DIGTYP= 9
##$DL= (0..7)
0 120 120 120 120 120 120 120 
##$DP= (0..7)
150 150 150 150 150 150 150 150 
##$DP07= 0
##$DPNAME0= <>
##$DPNAME1= <>
##$DPNAME2= <>
##$DPNAME3= <>
##$DPNAME4= <>
##$DPNAME5= <>
##$DPNAME6= <>
##$DPNAME7= <>
##$DPOAL= (0..7)
0.5 0.5 0.5 0.5 0.5 0.5 0.5 0.5 
##$DPOFFS= (0..7)
0 0 0 0 0 0 0 0 
##$DQDMODE= 0
##$DR= 18
##$DS= 0
##$DSLIST= <SSSSSSSSSSSSSSS>
$$ [...]
##$SUBNAM2= <"">
##$SUBNAM3= <"">
##$SUBNAM4= <"">
##$SUBNAM5= <"">
##$SUBNAM6= <"">
##$SUBNAM7= <"">
##$SUBNAM8= <"">
##$SUBNAM9= <"">
##$SW= 18.0517283424761
##$SWIBOX= (0..15)
0 0 2 0 0 0 0 0 0 0 0 0 0 0 0 0 
##$SW_h= 3612.71676300578
##$TD= 16384
##$TD0= 1
##$TE= 0
##$TE2= 300
##$TE3= 300
##$TEG= 300
##$TL= (0..7)
0 120 120 120 120 120 120 120 
##$TP= (0..7)
150 150 150 150 150 150 150 150 
##$TP07= 0
##$TPNAME0= <>
##$TPNAME1= <>
##$TPNAME2= <>
##$TPNAME3= <>
##$TPNAME4= <>
##$TPNAME5= <>
##$TPNAME6= <>
##$TPNAME7= <>
##$TPOAL= (0..7)
0.5 0.5 0.5 0.5 0.5 0.5 0.5 0.5 
##$TPOFFS= (0..7)
0 0 0 0 0 0 0 0 
##$TUNHIN= 0
##$TUNHOUT= 0
##$TUNXOUT= 0
##$USERA1= <user>
##$USERA2= <user>
##$USERA3= <user>
##$USERA4= <user>
##$USERA5= <user>
##$V9= 5
##$VALIST= <valist>
##$VCLIST= <CCCCCCCCCCCCCCC>
##$VD= 0
##$VDLIST= <DDDDDDDDDDDDDDD>
##$VPLIST= <PPPPPPPPPPPPPPP>
##$VTLIST= <TTTTTTTTTTTTTTT>
##$WBST= 1024
##$WBSW= 4
##$XGAIN= (0..3)
0 0 0 0 
##$XL= 0
##$YL= 0
##$YMAX_a= 118621
##$YMIN_a= -144919
##$ZGOPTNS= <>
##$ZL1= 120
##$ZL2= 120
##$ZL3= 120
##$ZL4= 120
##$ABSF1= 10
##$ABSF2= 0
##$ABSG= 5
##$ABSL= 3
##$ALPHA= 0
##$AQORDER= 0
##$ASSFAC= 0
##$ASSFACI= 0
##$ASSFACX= 0
##$ASSWID= 0
##$AUNMP= <proc_1d>
##$AZFE= 0.1
##$AZFW= 0.1
##$BCFW= 1
##$BC_mod= 2
##$BYTORDP= 1
##$COROFFS= 0
##$CY= 11.3945322036743
##$DATMOD= 1
##$DC= 2
##$DFILT= <>
##$DTYPP= 0
##$F1P= 2.36226072786647
##$F2P= -0.459571619588291
##$FCOR= 0.5
##$FTSIZE= 0
##$FT_mod= 4
##$GAMMA= 1
##$GB= 0.15
##$INTBC= 1
##$INTSCL= 1
##$ISEN= 128
##$LB= 0.24
##$LEV0= 0
##$LPBIN= 0
##$MAXI= 10000
##$MC2= 0
##$MEAN= 0
##$ME_mod= 0
##$MI= 1.114404
##$NCOEF= 0
##$NC_proc= 0
##$NLEV= 6
##$NOISF1= 3.799351
##$NOISF2= 2.8
##$NSP= 1
##$NTH_PI= 0
##$NZP= 0
##$OFFSET= 15.70392
##$PC= 1
##$PHC0= -18027.51
##$PHC1= 0.6007423
##$PH_mod= 1
##$PKNL= yes
##$PPARMOD= 0
##$PSCAL= 0
##$PSIGN= 0
##$REVERSE= no
##$SF= 200.130013532006
##$SI= 16384
##$SIGF1= 3
##$SIGF2= 2
##$SINO= 400
##$SIOLD= 16384
##$SREGLST= <1H.CDCl3>
##$SSB= 0
##$STSI= 0
##$STSR= 0
##$SW_p= 3612.71676300578
##$SYMM= 0
##$S_DEV= 0
##$TDeff= 0
##$TDoff= 0
##$TI= <>
##$TILT= no
##$TM1= 0
##$TM2= 0
##$TOPLEV= 0
##$USERP1= <user>
##$USERP2= <user>
##$USERP3= <user>
##$USERP4= <user>
##$USERP5= <user>
##$WDW= 1
##$XDIM= 8192
##$YMAX_p= 0
##$YMIN_p= 0
$$ End of Bruker specific parameters
$$ ---------------------------------
##NTUPLES= NMR FID
##VAR_NAME=  TIME,          FID/REAL,        FID/IMAG
##SYMBOL=    X,             R,               I
##VAR_TYPE=  INDEPENDENT,   DEPENDENT,       DEPENDENT
##VAR_FORM=  AFFN,          ASDF,            ASDF
##VAR_DIM=   8192,          8192,            8192
##UNITS=     SECONDS,       ARBITRARY UNITS, ARBITRARY UNITS
##FACTOR=    0.0002768,     1,               1
##FIRST=     0,             0,               0
##LAST=      2.2672688,     0,               0
##MIN=       0,             -144919,         0
##MAX=       2.2672688,     118621,          0
$$ Real data points
##PAGE= N=1
##DATA TABLE= (X++(R..R)), XYDATA
$$ [...]
$$ plain form
1898 -551 -1026 -1021 -355 -768 -1429 -1128 382 1239 781 1023 1565 1733 775 184 341 993 364 41 447 1219
1918 1219 1189 -179 -777 -473 -799 -1499 -2157 -1169 -372 -414 -950 -334 483 221 -1005 -858 143 439 371 276
1938 276 1505 2291 1338 641 734 1093 181 -728 -520 183 376 -381 -547 0 70 -1239 -2139 -1389 -841 -882
1958 -882 -1336 -494 774 893 221 -51 891 752 21 -205 772 2029 1257 702 971 1601 780 -297 -953
1977 -953 -325 -387 -1086 -1079 -291 355 -595 -785 -738 -507 -844 -1408 -919 207 555 237 562 1399 1561 696 -5
1998 -5 377 1220 679 73 689 1400 800 -33 -616 -141 -341 -1816 -1758 -912 -577 -619 -928 -254 484 -373 -1015
2019 -1015 -593 123 226 -181 560 1540 1590 1073 678 746 1236 360 -508 -135 754 510 -226 -136 308 -121 -1373
2040 -1373 -1692 -1180 -1025 -1421 -1401 -169 409 472 -126 163 617 460 -54 -228 1160 1102 978 939 1384 1730
$$ packed form
1898e51m75NO66m13o61L01J510Q57m58K42N42J68r58n91J57O52o29l23M06P72
1918A219l0j368n98L04l26p00o58R88P97m2n36O16Q17k62j226J47J001K96o8r5
1938B76J229P86r53o97R3L59r12r09K08P03J93p57j66N47P0j309r00P50N48m1
1958h82m54Q42J268J19o72k72R42j39p31k26R77J257p72n55K69O30q21j077o56
1977i53O28o2o99PP88O46r50j90M7K31l37n64M89J126L48l18L25Q37J62q65p01
1998eL82Q43n41o06O16P11o00q33n83M75k00j475N8Q46L35m2l09O74P38q57o42
2019a015M22P16J03m07P41R80N0n17l95O8M90q76q68L73Q89k44p36R0M44m29j252
2040a373l19N12J55l96K0J232N78O3n98K89M54j57n14j74J388n8j24l9M45L46
$$ plain form
2060 1730 521 -246 -613 -226 -638 -996 -597 36 0 -467 -772 -387 -742 -1163 -1334 -847 18 309 84 704
2080 704 1176 1121 98 288 701 801 304 515 668 1263 469 239 -5 -11 -534 -1451 -1253 -805 -479 -990 -623
2101 -623 -74 -31 -810 -823 -610 -59 -284 -178 479 1166 1349 1119 1155 1008 819 -37 -25 221 463 120 207 361
2123 361 152 -343 -1215 -1003 -755 -774 -1217 -888 -12 137 -198 -191 110 460 49 71 234 776 869 728 1082 1347
2145 1347 938 416 65 16 11 -756 -596 -238 15 -207 -567 -136 -675 -736 -1285 -1030 -291 -75 -173 372 827
2166 827 961 407 130 608 677 185 343 465 970 818 263 393 362 -149 -678 -834 -651 -385 -840 -570 -122
2187 -122 -120 -87 -725 -714 -59 -240 -449 -85 595 766 739 409 1366 759 357 -107 33 457 310 92 232 396
2209 396 163 -410 -718 -609 -560 -1080 -1052 -448 31 -52 -377 173 166 155 -232 -243 45 535 279 649 914 1130
$$ packed form
2060A730j209p67l67L87m12l58L99O33l6m67l05L85l55m21j71M87Q65K91k25O20
2080G04M72n5j023J90M13J00m97K11J53N95p94k30k44on23r17J98M48L26n11L67
2101f23N49M3p79j3K13N51k25J06O57O87J83k30L6j47j89q56J2K46K42l43Q7J54
2123C61k09m95q72K12K48j9m43L29Q76J49l35PL01L50m11K2J63N42R3j41L54K65
2145A347m09n22l51m9np67J60L58K53k22l60M31n39o1n49K55P39K16r8N45M55
2166H27J34n54k77M78O9m92J58J22N05j52n55J30l1n11n29j56J83K66m55K70M48
2187a22KL3o38J1O55j81k09L64O80J71k7l30R57o07m02m64J40M24j47k18J40J64
2209C96k33n73l08J09M9n20K8O04M79q3l25N50pj1l87j1K88M90k56L70K65K16
$$ plain form
2231 1130 488 259 124 369 -447 -738 -382 82 -72 -356 -628 -243 -412 -940 -870 -732 -186 -535 -416 213
2251 213 700 651 343 70 481 167 68 -53 763 639 506 559 322 476 -135 -821 -611 -394 -495 -835 -558
2272 -558 363 36 -253 -589 -122 -104 -579 -491 49 692 377 502 627 865 830 18 91 301 206 -93 37 460
2294 460 423 37 -270 -347 -433 -507 -937 -583 -265 -124 -55 42 226 435 23 -40 109 370 140 73 274 917 903
2317 903 239 253 331 28 -768 -688 -152 95 -108 -519 -143 249 -494 -959 -561 -413 -315 -557 -70 583 770
2338 770 383 251 451 315 207 -43 101 537 634 72 125 470 393 -241 -623 -438 -655 -533 -702 -284 160
2359 160 -27 -342 -336 -71 -220 -508 -510 84 509 515 406 477 453 410 209 -65 157 54 -150 -146 124 126 31 -673 -563
2384 -563 -637 -806 -699 -519 -214 -99 -370 -102 160 155 190 -173 -19 196 117 105 507 621 494 332 151 220
$$ packed form
2231A130o42k29j35K45q16k91L56M64j54k84k72L85j69n28P0J38N46l49J19O29
2251B13M87m9l08k73M11l14r9j21Q16j24j33N3k37J54o11o86K10K17j01l40K77
2272e58R21l27k89l36M67J8m75Q8N40O43l15J25J25K38l5q12P3K10r5k99J30M23
2294D60l7l86l07p7q6p4m30L54L18J41O9R7J84K09m12o3J49K61k30o7K01O43j4
2317I03o64J4P8l03p96Q0N36K47k03m11L76L92p43m65L98J48R8k42M87O53J87
2338G70l87j32K00j36j08k50J44M36R7n62N3L45p7o34l82J85k17J22j69M18M44
2359A60j87l15OK65j49k88kN94M25Oj09P1k4m3k01k74K22j03k04MK70Kr5p04J10
2384e63p4j69J07J80L05J15k71K68K62nL5l63J54K15p9j2M02J14j27j62j81O9
$$ plain form
2406 220 201 -354 -354 -178 30 -329 -102 -167 19 -143 -894 -445 -254 -84 -384 177 235 432 314 270 302 374 222
2429 222 15 399 389 379 422 97 419 125 -8 -321 -666 -232 -687 -599 -311 -12 114 -264 -371 -286 -59 -651
2451 -651 -462 128 234 315 460 276 512 290 -57 -47 40 60 88 -197 485 119 -29 -319 -297 -391 -508 -811
2473 -811 -672 -210 -65 71 -7 275 181 115 -69 -103 122 141 343 337 690 389 224 377 21 -54 -378 -409 -145
2496 -145 -100 -34 -334 92 -13 -180 -450 -571 -393 -426 -298 164 273 491 84 122 222 398 159 -78 99
2517 99 208 384 490 290 218 163 -307 -310 -541 -99 -389 -522 -270 124 -13 -44 -112 7 -370 -63 -240 -162 382
2540 382 400 499 485 570 498 26 141 12 6 327 -47 5 165 -12 -184 -318 -401 -494 -428 -470 -112 -297 -30 277
2564 277 114 206 -166 -187 -136 79 447 199 600 402 605 80 259 56 86 -61 -130 -204 -96 14 -197 -5
$$ packed form
2406B20j9n55%J76K08l59K27o5J86j62p51M49J91J70l00N61N8J97j18m4L2P2j52
2429B22k07L84j0j0M3l25L22k94j33l13l45M34m55Q8K88K99J26l78j07Q5K27n92
2451f51J89N90J06Q1J45j84K36k22l47J0Q7K0K8k85O82l66j48k90K2r4j17l03
2473h11J39M62J45J36p8K82r4o6j84l4K25J9K02oL53l01j65J53l56p5l24l1K64
2496a45M5O6l00M26j05j67k70j21J78l3J28M62J09K18m07L8J00J76k39k37J77
2517I9J09J76J06k00p2n5m70lk31M42k90j33K52L94j37l1o8J19l77L07j77P8N44
2540C82J8R9j4Q5p2m72J15j29oL21l74N2J60j77j72j34q3r3O6m2L58j85K67L07
2564B77j63R2l72k1N1K15L68k48M01j98K03n25J79k03L0j47o9p4J08J10k11J92
$$ plain form
2586 -5 41 -51 -277 -493 -698 -153 -187 -211 -109 325 258 161 125 178 135 -79 188 319 365 388 286 114 -121 155
2610 155 -138 -524 -294 -476 -234 -305 108 48 -122 -165 -74 -26 -242 -155 -442 364 501 459 525 328 286 278 225 97
2634 97 138 140 156 82 104 -42 -80 -311 -313 -307 -374 -170 -379 -202 75 -175 -178 290 -180 39 11 -77 211 174 129 337
2660 337 434 569 -74 21 -229 38 -286 -308 -95 -61 -69 -224 36 -219 -240 -375 -381 -48 145 77 110 400 393 325 183
2685 183 108 162 232 119 181 392 443 87 49 150 -203 -18 -447 -233 -461 -289 -429 -163 -245 134 -146 -352
2707 -352 -186 -264 -172 242 273 363 420 549 378 438 176 -94 256 294 -8 -262 174 121 -33 -246 -160 -428 -337
2730 -337 -389 -323 -225 -14 -94 227 -271 154 96 197 -109 159 239 373 176 288 465 440 128 -18 -150 -55 -130
2753 -130 -229 -110 -50 112 28 133 -157 -181 -200 -240 -200 66 165 87 267 395 346 266 281 318 288 -17 33 36 380 390
$$ packed form
2586eM6r2k26k16k05N45l4k4J02M34o7r7l6N3m3k14K67J31M6K3j02j72k35K76
2610A55k93l86K30j82K42p1M13o0j70m3R1M8k16Q7k87Q06J37m2O6j97m2qn3j28
2634I7M1KJ6p4K2j46l8k31kOo7K04k09J77K77k50lM68m70K19k8q8K88l7m5K08
2660C37R7J35o43R5k50K67l24k2K13L4qj55K60k55k1j35oL33J93o8L3K90po8j42
2685A83p5N4P0j13O2K11N1l56l8J01l53J85m29K14k28J72j40K66q2L79k80k06
2707c52J66p8R2M14L1R0N7J29j71O0k62k70L50L8l02k54M36n3j54k13Q6k68R1
2730c37n2O6R8K11q0L21m98M25n8J01l06K68Q0J34j97J12J77k5l12j46j32R5p5
2753a30r9J19O0J62q4J05k90k4j9m0M0K66R9p8J80J28m9q0J5L7l0l05N0LL44J0
$$ plain form
2779 390 -60 -45 10 -27 -407 -361 -438 -432 -469 -111 -51 -15 -18 -287 -58 70 -1 233 208 403 479 317 320 179 248 232
2805 232 77 -35 -19 25 157 -245 192 -58 -225 -385 -448 -136 -360 -78 -239 -195 147 -35 -140 -92 148 55
2827 55 -70 103 579 496 397 458 290 -13 93 -162 49 -152 -268 -221 -404 106 -140 -492 -384 -122 -179 -473
2849 -473 -225 -239 100 185 278 632 474 199 206 160 115 144 86 -152 174 361 -15 27 -72 -195 -213 -194 -106 -473 -188
2874 -188 -96 -308 156 127 -280 -115 -41 125 117 124 275 676 339 500 252 258 112 267 13 98 229 227 26 91
2898 91 -85 -288 -150 -99 -410 -296 -163 -138 -320 0 -32 -9 -178 251 155 387 350 62 531 355 379 202 477
2921 477 -47 -167 50 -36 -225 -246 200 123 -12 -336 -201 -439 -380 -314 -230 -55 -65 -176 -189 322 181 198 328
2944 328 -43 148 363 58 79 85 224 116 -163 82 -243 -202 -301 -390 -323 -295 -195 -95 -16 113 -199 -56 20
$$ packed form
2779C90m50J5N5l7l80M6p7Ol7L58O0L6lk69K29J28p1K34k5J95P6j62Lj41O9j6
2805B32j55j12J6M4J32m02M37k50j67j60o3L12k24K82j61M4L42j82j05M8K40r3
2827E5j25J73M76q3r9O1j68l03J06k55K11k01j16M7j83N10k46l52J08K62n7k94
2849d73K48j4L39Q5R3L54j58k75Pm6m5K9n8k38L26J87l76M2r9j23j8J9Q8l67K85
2874a88R2k12M64k9m07J65P4J66qPJ51M01l37J61k48Oj46J55k54Q5J31kk01O5
2898I1j76k03J38N1l11J14J33K5j82L20l2K3j69M29r6K32l7k88M69j76K4j77K75
2921D77n24j20K17q6j89k1M46p7j35l24J35k38N9O6Q4J75j0j11j3N11j41J7J30
2944C28l71J91K15l05K1OJ39j08k79K45l25M1r9q9O7K8J00J00P9J29l12J43P6
$$ plain form
2967 20 129 200 6 264 605 249 373 156 10 334 210 -248 138 62 -147 -328 160 -121 -123 -267 -279 -140
2989 -140 -409 -192 -68 2 -36 -16 248 101 72 -373 230 396 116 155 260 200 246 678 -80 -143 -12 -150 -140
3012 -140 -128 -82 245 66 -116 -167 -177 -380 -208 -389 -234 -100 -54 -97 189 152 -26 276 122 -87 35 352
3034 352 80 176 65 -9 -42 -169 32 -177 -480 -357 -187 -12 -251 -228 -206 211 -100 -152 -165 -31 110 199 148
3057 148 359 159 -41 93 530 403 110 -48 130 152 -314 176 -55 16 -239 -196 -408 -173 -267 -190 -100 -221
3079 -221 67 184 6 -52 -67 231 166 24 -24 339 303 188 412 133 274 -32 -161 -126 167 11 -101 -259
3101 -259 -283 -253 132 -358 -82 -204 -14 -134 -526 9 89 286 352 138 348 39 -61 251 -30 230 -23
3122 -23 -16 266 -86 -246 -208 -42 -14 -287 -323 -185 -73 -203 -232 -233 -296 -15 -135 -75 114 162 118 59 436 314 246
$$ packed form
2967B0J09P1j94K58L41l56J24k17j46L24j24m58L86p6k09j81M88k81kj44j2J39
2989a40k69K17J24P0l8K0K64j47k9m45O03J66k80L9J05o0M6M32p58o3J31j38J0
3012a40J2M6L27j79j82n1j0k03J72j81J55J34M6m3K86l7j78L02j54k09J22L17
3034C52k72R6j11p4l3j27K01k09l03J23J70J75k39K3K2M17l11n2j3J34J41Q9n1
3057A48K11k00k00J34M37j27k93j58J78K2m66M90k31P1k55M3k12K35r4P7R0j21
3079b21K88J17j78n8j5K98o5j42m8L63l6j15K24k79J41l06j29L5K93j56j12j58
3101b59k4L0L85m90K76j22J90j20l92N35Q0J97O6k14K10l09j00L12k81K60k53
3122b3PK82l52j60L8J66K8k73l6J38J12j30k9jo3K81j20O0J89M8m4n9L77j22o8
$$ plain form
3147 246 167 260 17 74 -2 104 135 -73 -121 -144 -134 37 -265 -307 -119 -363 -255 102 -159 223 -156 119 160
3170 160 -70 215 63 56 221 301 108 61 447 239 -37 100 -150 194 -41 -251 -205 -110 -113 -201 -280 -99 -172 -268
3194 -268 -464 -88 46 28 111 -50 542 14 30 -186 274 289 430 -52 295 226 175 -212 74 -165 -15 -294
3216 -294 -363 -151 -57 -281 -47 -44 -148 -83 -46 -26 208 -37 150 76 259 121 170 3 13 453 -67 135 120 189
3240 189 383 19 165 -168 -124 -146 -232 -327 40 -80 -137 -51 -179 -60 -145 110 -8 -220 188 -44 69 186
3262 186 184 186 151 178 238 63 -114 -328 -147 -176 114 -36 -58 -85 54 83 -97 -62 -147 -139 -86 12 345 186 42 129
3288 129 234 204 31 62 -83 -66 -43 279 79 55 -115 40 -115 167 -9 -123 -55 -265 -248 -199 96 -59 -438
3311 -438 -34 -44 184 116 229 336 95 271 -1 394 -5 -64 99 27 229 209 4 73 171 -253 -226 -222 -257 -85
$$ packed form
3147B46p9R3k43N7p6J06L1k08m8k3J0J71l02m2J88k44J08L57k61L82l79K75M1
3170A60k30K85j52pJ65Q0j93m7L86k08k76J37k50L44k35k10M6R5lq8p9J81p3r6
3194b68j96L76J34j8Q3j61N92n28J6k16M60J5J41m82L47o9n1l87K86k39J50k79
3216b94o9K12R4k24K34Lj04O5L7K0K34k45J87p4J83j38M9j67J0M40n20K02j5O9
3240A89J94l64J46l33M4k2q6r5L67j20n7Q6j28J19q5K55j18k12M08k32J13J17
3262A86kKl5K7O0j75j77k14J81k9K90j50k2k7J39K9j80L5q5QN3R8L33j59j44Q7
3288A29J05l0j73L1j45J7K3L22k00k4j70J55j55K82j76j14O8k10J7M9K95j55l79
3311d38M04j0K28o8J13J07k41J76k72L95l99n9J63p2K02k0k05O9R8m24K7Ml5J72
$$ plain form
3335 -85 -198 -56 -77 75 15 -49 73 55 -233 62 2 191 409 -12 -97 158 149 45 -79 -109 36 -61 -164 -58
3359 -58 -65 63 -120 -173 -94 -67 -305 -73 154 -21 247 9 -134 180 328 125 176 3 165 3 222 205 371
3382 371 152 34 95 106 -90 -193 -183 -108 -172 -76 -88 84 -183 -168 45 -275 -13 41 228 10 467 -29 -59
3405 -59 345 109 -104 115 11 -70 333 95 -136 253 130 -119 70 -290 -403 -301 -60 -182 9 -23 -147
3426 -147 -385 -152 4 27 330 -58 -54 63 79 69 141 233 337 -51 -218 124 33 -195 -235 -86 -96 -103 -15 -307
3450 -307 -178 53 -53 -61 1 59 -206 -22 76 305 139 74 -80 261 228 8 298 70 -4 292 132 27 -20
3473 -20 -561 -90 -173 -162 -143 -109 -191 -296 -8 119 -147 54 20 -170 16 163 186 347 51 111 282 97 208
3496 208 -10 47 274 30 63 -86 -266 -283 -80 -104 -420 -81 128 -262 -106 89 -52 -60 -3 239 61 297
$$ packed form
3335h5j13J42k1J52o0o4J22j8k88K95o0J89K18m21q5K55rj04j24l0J45r7j03J06
3359e8pJ28j83n3P9K7k38K32K27j75K68k38j43L14J48k03N1j73J62j62K19j7J66
3382C71k19j18O1J1j96j03J0P5o4R6j2J72k67J5K13l20K62N4J87k18M57m96l0
3405e9M04k36k13K19j04q1M03k38k31L89j23k49J89l60j13J02K41j22J91l2j24
3426a47k38K33J56K3L03l88MJ17J6j0P2R2J04l88j67L42r1k28m0J49j0pQ8k92
3450c07J29K31j06qO2N8k65J84R8K29j66o5j54L41l3k20K90k28p4K96j60j05m7
3473b0n41M71q3J1J9L4q2j05K88J27k66K01l4j90J86J47K3J61k96O0J71j85J11
3496B08k18N7K27k44L3j49j80j7K03k4l16L39K09l90J56J95j41qN7K42j78K36
$$ plain form
3518 297 309 119 192 93 101 332 164 -7 74 -13 48 83 129 51 -60 65 59 -203 -309 -50 -142 -32 -180 78 225
3543 225 16 -46 103 67 -6 -46 -61 -65 201 -10 158 38 47 28 12 -78 29 -89 -62 -155 52 63 16 -252 -129
3568 -129 20 -107 15 -104 147 -136 247 -130 177 153 -206 133 -83 121 -97 -193 191 169 -151 -58 -160
3589 -160 -74 63 -193 -243 -161 41 -102 -92 60 -212 -205 181 -186 45 134 -86 185 423 157 127 201 144 79 146
3613 146 157 85 -111 187 -201 -303 102 173 -103 -365 -255 -267 -202 -122 -197 152 179 140 -168 167 110 -67 77
3636 77 -75 155 154 -254 95 -23 178 -67 -52 -329 247 -151 -241 -140 -161 -302 -147 86 101 -216 39 24 42
3659 42 400 -54 -116 204 -46 79 -105 -152 123 64 -114 -57 83 138 -166 -289 35 -286 -165 -210 -169 -146 -181
3682 -181 -173 -34 178 340 -19 -62 -48 420 -135 -9 11 238 29 63 -321 333 137 -68 37 -167 211 -147
$$ packed form
3518B97J2j90P3r9QK31j68j71Q1q7O1L5M6p8j11J25ok62j06K59r2J10j48K58J47
3543B25k09o2J49l6p3m0j5mK66k11J68j20Rj9j6r0J07j18K7r3K07J1m7k68J23
3568a29J49j27J22j19K51k83L83l77L07k4l59L39k16K04k18r6L84k2l20R3j02
3589a60Q6J37k56n0Q2K02j43J0J52k72PL86l67K31Q9k20K71K38k66l0P4n7o5O7
3613A46J1p2j96K98l88j02M05P1k76k62J10j2O5Q0p5L49K7l9l08L35n7j77J44
3636G7j52K30jm08L49j18K01k45J5k77N76l98r0J01k1j41J55K33J5l17K55j5J8
3659D2L58m54o2L20k50J25j84m7K75n9j78N7J40N5l04j23L24l21J21m5M1K3l5
3682a81QJ39K12J62l59m3J4M68n55J26K0K27k09L4l84O54j96k05J05k04L78l58
$$ plain form
3704 -147 145 -198 -123 -59 -161 -6 -106 125 189 -263 181 230 187 -54 10 -74 143 15 58 103 189 63 53 237
3728 237 99 23 -174 -52 -211 -104 -151 76 270 6 -40 -284 29 127 -253 -48 45 108 -71 -26 10 266 127
3751 127 50 135 -46 9 -239 -334 195 4 -82 -120 -246 -22 -60 -158 -96 56 -168 157 187 83 27 128 -39 -95
3775 -95 -73 -164 34 158 194 209 62 -114 256 120 -311 -28 -96 179 25 -173 111 160 -188 -316 -106 118
3797 118 45 -108 -49 -82 22 111 -53 77 -33 80 199 -32 -32 341 -3 182 -159 -121 100 -117 -132 -74 -177
3820 -177 -86 -220 284 -137 -36 242 235 -191 -155 -91 295 174 -13 -143 -3 247 -22 -164 -17 -333 -145 -118
3842 -118 -292 -46 426 8 -182 -220 -47 -93 -359 -3 -48 -2 -138 -49 124 -268 -69 -84 -113 182 34 112 23
3865 23 42 26 -9 -215 -183 -194 -114 81 -82 238 -188 214 -114 -191 2 -157 195 -280 67 133 39 280 238 -14
$$ packed form
3704a47K92l43P5O4j02J55j00K31O4m52M44M9m3k41O4q4K17j28M3M5Q6j26j0J84
3728B37j38p6j97J22j59J07m7K27J94k64m6k44L13R8l80K05R3O3j79M5L6K56j39
3751A27p7Q5j81N5k48r5N29j91q6l8j26K24l8r8O2J52k24L25L0j04n6J01j67n6
3775i5K2r1J98J24L6J5j47j76L70j36m31K83o8K75j54j98K84M9l48j28K10K24
3797A18p3j53N9l3J04Q9j64J30j10J13J19k31%L73l44J85l41L8K21k17j5N8j03
3820a77R1j34N04m21J01K78pm26L6O4L86j21j87j30J40K50k69j42J47l16J88K7
3842a18j74K46M72m18j90l8J73m6k66L56m5M6j36Q9J73l92J99j5k9K95j48P8q9
3865B3J9j6l5k06L2j1Q0J95j63L20m26M02l28p7J93j59L52m75L47O6r4K41m2k52
$$ plain form
3889 -14 143 93 309 42 -202 -106 148 18 97 209 -14 -156 -170 -304 56 86 111 23 -191 208 46 -22 -42
3912 -42 -11 -42 -161 118 115 58 12 -12 2 27 359 -63 -189 -108 -93 100 -104 -44 28 2 -198 -259 -214 -93 -52 104
3938 104 -43 167 -186 327 264 55 -60 -62 -165 -284 235 411 -141 122 153 331 -95 55 -10 37 -111 160
3960 160 -159 89 102 -117 -133 -273 -141 -82 -159 176 32 163 -214 -136 -75 212 115 187 86 203 184 -189 26
3983 26 -400 231 -40 99 84 -104 160 187 62 31 -46 -19 102 -165 174 26 16 -135 -100 152 137 104 386
4006 386 -154 78 26 -41 164 36 -55 108 39 -194 -138 -93 89 83 -205 2 58 -325 -12 -113 264 -119 126
4029 126 -352 30 -19 -321 27 -101 11 198 46 -17 64 -90 5 -155 98 -58 141 18 -44 123 -6 -232
4051 -232 -65 -82 150 22 -172 45 69 -94 -39 65 -141 -186 -251 -87 12 -51 -62 86 -103 87 -324 -183 -54
$$ packed form
3889a4J57n0K16k67k44R6K54j30P9J12k23j42j4j34L60L0K5q8k14L99j62o8k0
3912d2L1l1j19K79ln7m6k4J4K5L32m22j26Q1J5J93k04O0P2k6k00o1M5J21M1J56
3938A04j47K10l53N13o3k09j15kj03j19N19J76n52K63L1J78m26J50o5M7j48K71
3960A60l19K48J3k19j6j40J32N9p7L35j44J31l77P8O1K87r7P2j01J17j9l73K15
3983B6m26O31k71J39j5j88K64K7j25l1p7K7J21k67L39j48j0j51L5K52j5l3K82
4006C86n40K32n2o7K05j28r1J63o9k33N6M5J82ok88K07N6l83L13j01L77l83K45
4029A26m78L82m9l02L48j28J12J87j52o3Q1j54R5j60K53j56J99j23o2J67j29k26
4051b32J67j7K32j28j94K17K4j63N5J04k06m5o5J64R9o3j1J48j89J90m11J41J29
$$ plain form
4074 -54 192 -84 -200 -114 142 -247 -115 -116 -40 -54 98 6 -70 21 -77 -269 79 260 65 54 140 145 167 -40 -257
4099 -257 143 6 -100 -68 35 44 -216 -40 -77 252 -65 -143 -201 -140 -113 -214 -207 -191 -60 -150 148 348 -17 275
4123 275 137 255 -48 8 -179 -262 194 -24 133 87 -41 -128 -51 72 -69 47 150 -254 158 110 -6 -11 -245
4146 -245 169 -155 -17 54 -46 -94 10 22 -55 0 28 40 -76 185 -99 41 -132 97 91 67 69 14 -129 230
4170 230 -126 -384 -70 -50 88 80 167 58 5 139 -133 171 -231 -88 -282 -108 286 -65 45 -137 -9 -73
4192 -73 -14 -60 -338 -54 140 79 169 142 -30 -123 -227 262 83 49 60 19 251 28 -166 200 -156 -289 -187
4215 -187 86 9 -189 244 -367 -21 102 -175 -14 -13 24 -254 -13 36 94 -42 -33 220 131 -136 -89 -19 -19 41 -69
4240 -69 158 -24 66 -76 13 140 129 25 -180 -120 8 -92 117 98 -63 -102 -19 -136 3 134 101 -289 51
$$ packed form
4074e4K46k76j16Q6K56l89J32jP6j4J52r2p6R1r8j92L48J81j95j1Q6NK2k07k17
4099b57M00j37j06L2J03Rk60J76l7L29l17p8n8O1K7j01PJ6J31r0K98K00l65K92
4123B75j38J18l03N6j87q3M56k18J57m6j28q7P7J23j41J16J03m04M12m8j16nk34
4146b45M14l24J38P1j00m8J04J2p7N5K8J2j16K61k84J40j73K29ok4Kn5j43L59
4170B30l56k58L14K0J38qQ7j09n3J34k72L04m02J43j94J74L94l51J10j82J28o4
4192g3N9m6k78K84J94o1R0k7j72r3j04M89j79l4J1m1K32k23j94L66l56j33J02
4215a87K73p7j98M33o11L46J23k77J61JL7k78K41M9N8j36RK53q9k67M7P0%O0j10
4240f9K27j82R0j42Q9J27j1j04k05O0J28j00K09j9j61l9Q3j17J39J31l3l90L40
$$ plain form
4263 51 197 -129 -267 -113 -2 -13 -109 -268 -14 101 130 96 190 61 -300 -143 -238 47 139 189 -8 -31 36 44
4287 44 92 120 44 -171 -125 -22 -41 286 -202 -107 146 -88 169 -112 -261 91 -141 128 -3 -171 -25 77
4309 77 10 -79 -146 -80 62 94 -82 91 99 50 116 37 151 44 -242 -161 141 193 83 12 -28 113 108 115 -59 19 -206
4336 -206 57 38 -111 140 93 228 -71 -286 -24 36 -53 -334 106 235 -45 54 -77 112 204 47 -73 -16
4358 -16 -173 19 -11 -283 59 -308 32 -34 -40 -162 43 152 -64 91 -29 31 10 124 -57 74 -165 69
4380 69 273 100 57 150 62 -76 28 102 86 235 -179 5 204 -51 136 -159 -190 79 -174 -90 -67 -67 102 72
4404 72 64 -59 13 -116 -41 -78 84 6 -75 136 -122 63 -65 153 -90 -4 -52 19 75 -58 123 2 -155 113
4428 113 175 -198 72 82 -84 -276 -62 43 24 191 -90 131 33 110 7 115 -101 36 87 -98 106 -180
$$ packed form
4263E1J46l26j38J54J11j1r6j59K54J15K9l4R4j29l61J57r5K85R2N0j97k3O7Q
4287D4M8K8p6k15M6J03j9L27m88R5K53k34K57k81j49L52k32K69j31j68J46J02
4309G7o7q9o7O6J42L2j76J73Qm9O6p9J14j07k86Q1L02N2j10p1m0J41nPj74P8k25
4336b06K63j9j49K51m7J35k99k15K62O0q9k81M40J29k80R9j31J89R2j57j20N7
4358a6j57J92l0k72L42l67L40o6oj22K05J09k16J55j20O0k1J14j81J31k39K34
4380F9K04j73m3R3q8j38J04P4j6J49m14J84J99k55J87k95l1K69k53Q4K3%J69l0
4404G2qj23P2j29P5l7J62p8q1K11k58J85j28K18k43Q6m8P1N6j33J81j21j57K68
4428A13O2l73K70J0j66j92K14J05j9J67k81K21r8P7j03J08k16J37N1j85K04k86
$$ plain form
4450 -180 85 60 -52 -51 -189 -12 -103 -4 1 -72 -88 -53 114 30 56 -101 -108 -42 50 124 87 27 -236 -32 230 127
4476 127 128 174 -162 -237 -48 -201 -38 157 -149 -323 49 -76 62 169 -65 -31 154 -136 18 302 -204 50
4498 50 47 51 227 150 -272 110 -89 -66 149 -50 -12 13 25 54 -20 -162 206 -121 -184 -33 155 40 7 -84 -131
4523 -131 -67 -4 249 -245 -176 -133 -127 -104 196 -9 60 -54 -44 15 31 -111 -98 -56 47 30 -165 153 -108 117 47
4548 47 152 2 48 119 -29 90 22 -121 -106 225 -197 -11 -35 77 51 -243 212 -112 81 -215 -40 56 112
4571 112 -252 -241 10 58 -236 277 -81 138 8 123 221 -181 32 -263 -91 -98 58 171 -27 3 -72 131
4593 131 -17 -114 21 79 -137 36 77 22 15 -78 76 69 56 -153 -16 172 -69 -65 -49 128 64 10 35 7 105 -155
4619 -155 -103 -88 67 -109 -174 -67 -8 -46 -216 84 359 230 28 -192 -80 131 -206 -117 -12 96 -95 98
$$ packed form
4450a80K65k5j12Jj38J77r1R9Np3j6L5J67q4K6j57pO6R2P4l7o0k63K04K62j03
4476A27JM6l36p5J89j53J63J95l06j74L72j25J38J07k34L4J85k90J54K84n06K54
4498E0lMJ76p7m22L82j99K3K15j99L8K5J2K9p4j42L68l27o3J51J88j15l3r1m7
4523a31O4O3K53m94O9M3OK3L00k05O9j14J0N9J6j42J3M2J03j7j95L18k61K25p0
4548D7J05j50M6P1j48J19o8j43J5L31m22J86k4J12k6k94M55l24J93k96J75R6N6
4571A12l64J1K51M8k94N13l58K19j30J15R8m02K13k95J72pJ56J13j98L0p5K03
4593A31j48r7J35N8k16J73M1n5pr3J54pj3k09J37J88k41MJ6J77o4n4K5k8R8k60
4619a55N2J5J55j76o5J07N9l8j70L00K75j29k02k20J12K11l37Q9J05J08j91J93
$$ plain form
4641 98 -5 93 129 193 -58 131 -144 138 -13 182 48 -84 -208 -210 93 -30 21 195 -92 -8 293 -84 -42
4664 -42 3 76 91 -51 -165 -58 -98 -185 313 233 -32 182 -62 -211 -354 -261 -160 -62 28 55 -43 -88 -203 313
4688 313 -198 230 -167 33 112 -16 95 54 -123 246 203 206 -105 247 -93 152 143 -101 -161 -78 -18 73 -82 130
4712 130 -20 -89 -246 -177 -4 131 -204 -52 193 19 273 -153 235 47 26 -118 -126 -44 205 307 -85 -62
4734 -62 133 -167 -66 139 -91 -112 -44 175 -175 74 171 -34 13 96 229 3 102 -70 -59 105 -83 -73 31
4757 31 102 21 82 95 -55 -6 -72 -120 -135 -216 143 53 -44 59 218 29 18 61 -37 29 -51 96 -86 125 -33 -45
4783 -45 -220 -67 -73 136 -159 120 10 -298 42 -136 -137 15 193 -408 15 -111 -169 -20 -325 47 -79 39
4805 39 -104 32 -92 88 192 96 95 -114 79 -61 37 16 158 -54 -78 84 -161 -156 -220 208 -99 -96 21 63
$$ packed form
4641I8j03R8L6O4k51J89k75K82j51J95j34j32j24kL03j23N1J74k87Q4L01l77M2
4664d2M5P3J5j42j14J07m0q7M98q0k65K14k44j49j43R3J01R8R0K7r8m5j15N16
4688C13n11M28l97K00P9j28J11m1j77L69m3Ll11L52l40K45rk44o0Q3O0R1j55K12
4712A30j50o9j57O9J73J35l35J52K45j74K54m26L88j88k1j44qQ2K49J02l92K3
4734f2J95l00J01K05k30k1O8K19l50K49R7k05M7Q3J33k26R9j72J1J64j88J0J04
4757C1P1q1O1J3j50M9o6m8j5q1L59r0r7J03J59j89j1M3r8O6q0J47j82K11j58j2
4783d5j75J53oK09k95K79j10l08L40j78jJ52J78o01M23j26n8J49l05L72j26J18
4805C9j43J36j24J80J04r6jk09J93j40R8k1J42k12k4J62k45No4M28l07LJ17M2
$$ plain form
4829 63 -175 -13 70 30 -188 31 130 111 -49 389 -182 11 187 -50 102 90 52 -59 55 -124 -23 -46 -188
4852 -188 -295 -104 -137 196 -35 -33 -175 -26 -38 140 -55 205 -45 90 196 56 -116 146 260 -83 1 -273
4874 -273 -159 -14 43 198 45 -89 85 242 -32 -30 -82 80 152 2 85 303 -110 32 -93 159 128 -374
4896 -374 18 -21 158 202 -90 20 162 -223 47 -215 -19 132 -31 -237 113 178 -100 -90 2 61 41 -48 -75
4919 -75 -17 -55 -13 12 -71 -243 -71 -92 -107 148 195 -151 -45 231 89 -111 177 308 238 21 -62 -68 19 34 -382
4944 -382 -62 84 133 -124 -93 178 118 -144 -50 217 -66 46 -160 -129 -108 69 181 -91 94 -116 24 213
4966 213 -49 -99 -92 -23 -241 84 -75 -95 -45 174 198 106 134 -124 261 -40 -188 29 -27 71 -6 -22 4 -134 87
4991 87 -179 181 80 188 -92 -42 -16 35 115 -12 -9 27 -126 -229 -89 19 164 -82 -147 18 40 -14 279 -157
$$ packed form
4829F3k38J62Q3m0k18K19R9j9j60M38n71J93J76k37J52j2l8j11J14j79J01k3j42
4852a88j07J91l3L33k31Kj42J49j2J78j95K60k50J35J06j40j72K62J14l43Q4k74
4874b73J14J45N7J55j53j34J74J57k74Kn2J62P2j50Q3K18m13J42j25K52l1n02
4896c74L92l9J79M4k92J10J42l85K70k62J96J51j63k06L50O5k78J0R2N9k0q9k7
4919g5N8l8M2K5q3j72J72k1j5K55M7l46J06K76j42k00K88J31p0k17q3oQ7J5m16
4944c82L20J46M9k57L1K71o0k62R4K67k83J12k06L1K1J77J12k72J85k10J40J89
4966B13k62n0PO9k18L25j59k0N0K19K4r2K8k58L85l01j48K17n6R8p7j6K6j38K21
4991H7k66L60j01J08k80N0K6N1Q0j27LL6j53j03J40J08J45k46o5J65K2n4K93m36
$$ plain form
5015 -157 -78 272 231 -72 9 -13 167 -64 103 156 -130 3 -164 -163 -168 -39 -76 -22 33 -75 10 73 60 -88 232
5040 232 87 -9 -54 -264 279 35 -163 -76 65 185 -3 6 -46 -52 -375 48 86 -106 41 46 -80 -89 -84 -4 -39 -145
5066 -145 86 169 -87 60 -92 57 212 11 -11 187 -97 -69 37 3 -186 -146 27 -94 133 -222 -192 87
5088 87 -28 -302 -112 -12 -219 212 -80 -53 69 -234 -104 116 58 -45 134 -105 233 157 -238 -213 -243 -164
5110 -164 153 -54 -131 -378 -38 133 11 18 44 188 -1 -63 -401 116 -193 -150 45 -43 106 -73 -63 10 22
5133 22 -5 -97 -81 -63 -52 -47 -79 -315 -21 -287 -159 13 92 19 36 36 117 12 49 -105 -31 58 0 31 161 -408 -162
5160 -162 -182 12 52 -84 -201 147 106 31 32 -104 101 -80 91 10 28 26 144 86 165 252 -105 -155 -248 -138 97
5185 97 -210 4 270 0 -8 382 -64 -43 123 95 146 -201 -32 4 41 -18 218 -37 213 212 64 -230 16 284
$$ packed form
5015a57P9L50m1l03Q1k2J80k31J67N3k86J33j67JnJ29l7N4N5j08Q5O3j3j48L20
5040B32j45r6m5k10N43k44j98Q7J41J20j88Rn2ol23M23L8j92J47Nj26rNQ0l5j06
5066a45K31Q3k56J47j52J49J55k01k2J98k84K8J06l4j89M0J73j21K27l55L0K79
5088H7j15k74J90J00k07M31k92K7J22l03J30K20n8j03J79k39L38p6l95K5l0P9
5110a64L17k07p7k47L40J71j22PK6J44j89o2l38N17l09M3J95q8J49j79J0P3J2
5133B2k7r2J6J8J1Nl2k36K94k66J28J72P9p3J7%Q1j05L7j54P4Q9n8L1J30n69K46
5160a62k0J94M0j36j17L48m1p5Jj36K05j81J71q1J8kJ18n8P9Q7l57n0r3J10K35
5185I7l07K14K66k70qL90m46K1J66k8N1l47J69L6L7n9K36k55K50jj48k94K46K68
$$ plain form
5209 284 108 -59 20 115 -13 36 67 234 17 -216 -98 177 142 -118 -281 -48 23 -32 -7 52 -37 -47 -75 15
5233 15 -296 22 387 271 -81 -79 59 32 -34 58 -105 -30 -177 273 -2 -131 44 74 -69 111 -25 42 -60
5256 -60 -326 96 18 77 137 56 143 -254 -1 54 269 83 123 -53 -198 105 127 -71 160 60 280 335 161
5279 161 -77 -43 311 87 -133 32 152 -43 49 80 -114 -156 -144 -128 10 -161 1 -3 -308 -11 26 -43 22 -3
5303 -3 91 -117 230 19 74 196 -198 -262 44 98 -47 -254 88 63 -269 126 -210 -166 129 22 48 -293 -116
5326 -116 -136 -35 -152 90 102 67 -48 17 -159 132 -208 -111 134 5 34 -50 26 -93 119 -206 199 -118 197
5349 197 -217 32 -66 -157 -155 29 -22 24 15 12 35 75 110 -155 247 55 -199 153 48 18 140 32 -80 -148 -138
5374 -138 -3 -5 -203 183 34 116 -41 -361 78 -5 -25 -11 -119 -29 208 -3 31 -169 -8 -18 -93 -1 -61 265
$$ packed form
5209B84j76j67P9R5j28M9L1J67k17k33J18K75l5k60j63K33P1n5K5N9q9j0k8R0
5233A5l11L18L65j16l52KJ38k7o6R2j63P5j47M50k75j29J75L0j43J80j36O7j02
5256f0k66M22p8N9O0q1Q7l97K53N5K15j86M0j76j45L03K2j98K31j00K20N5j74
5279A61k38L4L54k24k20J65J20j95R2L1j94m2J2J6J38j71J62ml05K97L7o9O5k5
5303cR4k08L47k11N5J22l94o4L06N4j45k07L42k5l32L95l36M4K95j07K6l41J77
5326a16k0J01j17K42J2l5j15O5j76K91l40R7K45j29K9q4P6j19K12l25M05l17L15
5349A97m14K49r8r1KJ84n1M6rlK3M0L5k65M02j92k54L52j05l0J22j08j12o8J0
5374a38J35kj98L86j49Q2j57l20M39q3k0J4j08R0K37k11L4k00J61j0p5R2o0L26
$$ plain form
5398 265 -283 114 -53 254 99 -111 323 -164 -114 -187 -120 32 23 -51 75 70 -1 -248 172 -167 -39 13 -111
5421 -111 -173 158 190 80 -177 154 -135 -198 37 -47 -179 -79 -9 -63 -22 -87 -15 -224 -68 -232 -72 138 240
5444 240 -35 119 214 -145 224 -93 -214 126 153 -27 97 -120 -141 -130 -113 -86 197 114 -130 -138 240 -3 86
5467 86 24 164 -91 347 169 128 129 233 114 349 -182 123 47 -100 -41 93 -188 9 106 -133 7 106 -16
5490 -16 -63 19 -229 117 -274 -167 63 159 -43 -176 -162 -64 81 -297 24 -96 132 112 36 -144 34 -91 68
5513 68 -43 -107 -17 -100 -52 -129 234 -49 -21 -162 40 29 -189 -51 -102 129 46 260 187 -78 186 242 189 128 45
5538 45 61 -72 172 -12 -42 -97 -52 41 230 -87 -17 -241 132 -27 -75 -138 -149 -85 -10 105 67 -130 115 193 -31
5563 -31 -34 -79 48 -104 -43 59 -3 21 72 329 -58 -142 -35 -131 13 158 59 -103 14 -49 84 164 -46 10 237
$$ packed form
5398B65n48L97j67L07j55k10M34m87N0p3O7J52rp4J26np1k47M20l39J28N2j24
5421a11o2L31L2j10k57L31k89o3K35q4j32J00P0n4M1o5P2k09J56j64J60K10J02
5444B40k75J54R5l59L69l17j21L40K7j80J24k17k1J1J7K7K83q3k44qL78k43Q9
5467H6o2J40k55M38j78m1JJ04j19K35n31L05p6j47N9J34k81J97R7k39J40R9j22
5490a6m7Q2k48L46l91J07K30R6k02j33J4R8J45l78L21j20K28k0p6j80J78j25J59
5513F8j11o4R0q3M8p7L63k83K8j41K02j1k18J38n1K31q3K14p3k65K64N6n3o1q3
5538D5J6j33K44j84l0n5M5R3J89l17P0k24L73j59m8o3j1O4P5J15l8j97K45P8k24
5563c1lm5J27j52O1J02o2K4N1K57l87q4J07r6J44J45r9j62J17o3J33Q0k10N6K27
$$ plain form
5588 237 -41 90 -72 -106 64 -42 160 109 126 72 -218 -173 -81 197 -114 -124 -78 3 -88 -144 25 -36 144 -78
5612 -78 64 52 -47 -132 -48 -137 97 -81 -318 -45 -13 -230 39 -84 96 92 -41 63 36 -248 -47 -50 -124 61
5636 61 -124 299 212 126 141 257 -2 -31 -48 -79 82 -11 -14 -28 142 90 229 -46 81 -299 35 -236 -270 -118
5660 -118 238 123 -2 95 92 83 -88 75 -106 -221 -130 -29 -73 11 154 94 -111 166 -151 -109 -390 -203 -41
5683 -41 -77 -234 2 218 158 -246 -9 -133 -237 161 -29 270 -171 32 -105 -8 -17 9 -167 -213 -131 45 -69
5706 -69 -151 -158 165 -29 113 -128 -91 128 -61 13 -177 -124 -10 2 -197 -80 -253 -127 29 -145 -138 -231 -124 -87
5730 -87 89 -61 226 -42 -285 32 225 -45 13 90 -183 -113 -59 44 -84 -46 16 186 14 -225 261 -69
5752 -69 -42 -43 337 -12 -80 60 129 35 -87 118 -30 166 189 -49 116 -157 -115 258 46 0 64 -10 -115 -112 -157
$$ packed form
5588B37k78J31j62l4J70j06K02n1J7n4k90M5R2K78l11j0M6Q1r1n6J69o1J80k22
5612g8J42j2r9q5Q4q9K34j78k37K73L2k17K69j23J80mj33J04k7k84K01lp4J85
5636F1j85M23q7q6J5J16k59k9j7l1J61r3lj4J70n2J39k75J27l80L34k71l4J52
5660a18L56j15j25R7lrj71J63j81j15R1J01m4Q4J43o0k05K77l17M2k81J87J62
5683d1l6j57K36K16o0m04K37j24j04L98j90K99m41K03j37R7rK6j76m6Q2J76j14
5706f9q2pL23j94J42k41L7K19j89P4j90N3J14J2j99J17j73J26J56j74Pr3J07L7
5730h7J76j50K87k68k43L17J93k70N8P7k73P0N4J03j28L8O2J70j72k39M86l30
5752f9K7jL80l49o8J40O9r4j22K05j48J96K3k38J65k73M2L73k12m6O4p4j05Lm5
$$ plain form
5777 -157 -3 -82 -49 185 177 44 280 35 -144 -143 26 -64 -37 -57 134 72 -202 92 -189 119 215 -162 -139 -83
5801 -83 -51 118 27 25 -90 115 47 -9 -50 -1 -53 103 13 -19 -117 160 69 35 5 119 0 48 -135 -223 67 -43
5827 -43 -47 43 -55 -160 49 -124 -135 136 206 60 -217 -146 73 -18 41 -178 66 240 35 -267 221 -235 113
5850 113 -172 17 -58 -55 -13 -80 45 42 -154 -80 -124 65 170 86 121 14 -163 -34 172 -29 -162 -104 11 -38
5874 -38 -117 76 -221 -89 223 -106 -185 187 6 -37 265 -71 -277 -53 45 83 120 -149 -185 -28 -10 3 -2 -87
5898 -87 181 102 -57 -356 -193 -50 -138 -117 -109 186 22 12 181 0 59 136 -126 93 26 -53 -54 21 80 -158 -49
5923 -49 -76 -94 144 15 -71 -106 30 -79 105 191 -196 71 67 129 -50 -47 219 126 -121 65 60 -3 133 94 -206
5948 -206 199 -142 -154 1 -50 34 -186 151 59 45 87 202 -308 -17 -79 -116 -27 -95 90 0 28 -11 -7 -64 47
$$ packed form
5777a57J54p9L3K34qj33K36k45j79JJ69r0K7k0J91o2k74K94k81L08R6l77K3N6
5801h3L2J69r1kj15K05o8n6m1M9n2J56r0l2r8K77r1l4l0J14j19M8j83q8K90j10
5827d3mR0r8j05K09j73j1K71P0j46k77P1K19r1N9k19K44J74k05l02M88m56L48
5850A13k85J89p5LM2o7J25lj96P4m4J89J05q4L5j07j77J29K06k01j33N8J15m9
5874c8p9J93k97J32L12l29p9L72j81m3L02l36k06K24R8L8L7k69l6J57J8J3nq5
5898h7K68p9j59k99J63J43q8K1QK95j64j0J69j81N9P7k62K19o7p9jP5N9k38J09
5923d9k7j8K38j29q6l5J36j09J84Q6l87K67mO2j79LK66r3k47J86no3J36l9l00
5948b06M05l41j2J55n1Q4k20L37r2j4M2J15n10K91o2l7Q9o8J85r0K8l9Mn7J11
$$ plain form
5973 47 -220 -14 -124 34 162 34 -133 -67 17 -38 -110 26 -103 -25 -86 45 229 5 29 15 194 44 -308
5996 -308 -73 -216 81 -19 -52 4 94 25 216 -57 -97 27 -185 -36 -132 99 101 21 35 69 308 231 143 326
6020 326 121 113 2 -135 39 46 141 55 -30 30 179 11 53 -176 -230 -75 -171 325 -87 -87 20 -46 5 107 50
6045 50 -189 169 130 -163 32 257 189 18 79 93 198 -189 30 -136 104 162 99 168 -131 -150 55 195 62
6068 62 55 -32 -190 -27 -57 72 127 150 -8 -18 19 -105 135 280 -9 -69 9 257 69 -170 -64 -125 -152 253
6092 253 -231 66 263 170 -80 118 57 6 -63 142 -43 -17 112 -70 -3 -53 130 -197 -59 -21 -228 -117 -19
6115 -19 14 134 115 -194 -129 -371 27 45 -119 -137 -163 102 67 -26 -17 -142 125 25 -17 5 -72 35 12 111 -32
6140 -32 18 -38 183 -244 -20 106 -74 -219 -194 -59 -67 -223 -69 130 149 -162 -52 -176 57 137 49 -192 32
$$ packed form
5973D7k67K06j10J58J28j28j67O6Q4n5p2J36j29P8o1J31J84k24K4j4J79j50l52
5996c08K35j43K97j00l3N6R0o9J91k73m0J24k12J49r6K31Kq0J4L4K39p7q8J83
6020C26k05qj11j37J74PR5q6q5O0J49j68M2k29n4J55r6M96m12%J07o6N1J02n7
6045E0k39L58l9k93J95K25o8j71O1J4J05l87K19j66K40N8o3O9k99j9K05J40j33
6068F2pq7j58J63l0J29N5K3j58j0L7j24K40J45k89o0P8K48j88k39J06o1k7M05
6092B53m84K97J97r3k50J98o1n1o9K05j85K6J29j82O7n0J83l27J38L8k07J11R8
6115a9L3J20j9l09O5k42L98J8j64j8k6K65l5r3Rj25K67j00m2K2p7J07k3R9j43
6140c2N0n6K21m27K24J26j80j45K5J35qj56J54J99J9l11J10j24K33Q0q8k41K24
$$ plain form
6163 32 0 12 88 54 -6 -93 -70 39 -31 93 155 -236 -111 145 10 -81 -70 166 184 16 66 146 76 -146 -24
6188 -24 30 -242 -175 183 34 -19 -82 10 80 -122 -33 -242 -181 -23 -72 219 -7 -52 109 -69 -114 -84 74 -203
6212 -203 -173 -85 -117 125 -175 115 285 -71 -1 -163 230 -6 -3 -211 -74 -130 -56 -202 23 -6 45 -209 -45
6235 -45 168 -3 -114 20 81 -287 -199 305 -174 242 182 -24 28 -4 40 313 -142 82 -40 -47 -69 44 -121
6258 -121 -148 -76 -82 -7 115 -32 -228 -166 -174 190 48 -96 -112 -14 -40 -23 119 32 217 89 49 -22 -74 131 -14
6283 -14 52 -77 140 -83 -4 -73 -53 -149 46 -95 131 -137 -78 -33 25 -36 264 -162 268 -113 81 156 -126 57
6307 57 29 -45 -67 -47 74 -15 -84 -30 -166 287 79 88 -231 -129 -216 35 77 23 -192 37 -62 -311 -8 -268 131
6332 131 -181 239 -49 249 -46 92 86 96 -191 153 56 25 117 -77 -49 -95 141 102 40 14 -25 22 -140 -3
$$ packed form
6163C2l2J2P6l4o0q7K3J09p0J24O2l91J25K56j35r1J1K36J8j68N0Q0p0k22J22
6188b4N4k72O7L58j49n3o3R2P0k02Q9k09O1J58m9K91k26m5J61j78m5L0J58k77
6212b03L0Q8l2K42l00K90J70l56P0j62L93k36Lk08J37n6P4j46K25k9N1k54J64
6235d5K13j71j11J34O1l68Q8N04m79M16o0k06N2l2M4K73m55K24j22pk2J13j65
6258a21k7P2oP5J22j47j96O2qL64j42j44j6R8k6J7J42q7J85j28m0p1n2K05j45
6283a4O6j29K17k23P9o9K0r6J95j41K26k68N9M5N8o1L00m26M30l81J94P5k82J83
6307E7k8p4k2K0J21q9o9N4j36M53k08Rl19J02q7K51M2n4k15K29r9k49L03k60L99
6332A31l12M20k88K98k95J38oJ0k87L44r7l1R2j94K8m6K36l9o2k6l9M7j62J37
$$ plain form
6356 -3 -216 -132 -44 -11 -125 18 110 71 64 177 -81 -75 -3 -106 200 -141 71 44 -14 259 -24 154 -60 77 278
6381 278 -11 -106 77 159 -36 3 -179 -10 157 209 77 116 -83 -176 46 -32 4 36 1 -6 16 -44 -60 49 -5
6406 -5 44 -75 175 44 -11 0 85 218 -68 -78 -47 237 -144 -11 -80 -136 186 139 109 -136 74 6 67 14 184
6431 184 341 -55 87 -270 241 117 -285 14 189 -115 167 -53 43 246 -26 78 -132 68 68 -112 7
6452 7 53 -195 -71 291 -31 -216 90 223 61 50 -47 -32 -51 -17 -273 -32 82 51 -128 82 -65 -125 -157 168
6476 168 109 73 -204 -97 -298 -70 -51 72 63 -17 141 -226 -101 -54 -43 135 70 123 -62 8 161 -88 11 -17
6500 -17 31 -1 68 -2 -25 -23 -132 -251 35 166 22 -106 157 247 65 123 196 35 88 0 175 87 -54 11 66
6525 66 217 18 -332 -13 14 11 217 -74 -57 166 60 -138 -104 141 -154 -202 -22 -155 -30 -14 -42 173 -31
$$ packed form
6356ck13Q4Q8L3j14J43R2l9pJ13k58OP2j03L06l41K12k7n8K73k83J78k14J37K01
6381B78k89r5J83Q2j95L9j82J69J67N2j32L9j99r3K22p8L6L2l5pK2o0j6J09n4
6406eM9j19K50j31n5J1Q5J33k86j0L1K84l81J33o9n6L22m7l0k45K10o8O1n3J70
6431A84J57l96J42l57N11j24m02K99J75l04K82k20R6K03k72J04k10K00%j80J19
6452GM6k48J24L62l22j85L06J33j62j1r7J5j9L4k56K41J14l1j79K10j47o0l2L25
6476A68n9l6k77J07k01K28J9J23rq0J58l67J25M7J1J78o5N3j85P0J53k49R9k8
6500a7M8l2O9p0k3Kj09j19K86J31j44j28K63R0j82N8P3j61N3q8J75q8j41O5N5
6525F6J51j99l50L19K7lK06k91J7K23j06j98L4K45k95m8J80j33J25J6k8K15k04
$$ plain form
6548 -31 115 -152 -12 20 -139 -96 250 -23 53 -72 -191 84 -207 232 226 135 -135 88 -72 -234 -4 437
6570 437 72 -204 125 7 136 -40 175 394 -143 -332 -43 -188 195 65 -10 10 -136 -217 -3 234 -100
6591 -100 -128 275 -221 -59 -177 -28 132 -57 81 79 101 14 47 61 -135 47 -178 147 82 33 148 118 89 38
6615 38 8 -184 34 205 -32 -115 -146 63 -65 53 178 117 117 -91 175 56 79 -31 -353 -59 -1 115 64
6638 64 -43 171 -168 -4 134 3 -122 -102 -61 -25 75 -151 -91 57 -172 33 -12 9 -103 -186 -102 229 -44
6661 -44 -115 37 -17 20 1 -36 -215 116 -137 -198 45 115 -113 95 -30 99 76 153 58 -110 -35 -85 -85 95 41
6686 41 14 79 19 150 65 33 -19 174 92 118 -63 -125 -53 -60 -91 -187 -133 203 204 -7 -35 -4 -69 54 -89 108 -28
6713 -28 14 -7 -274 175 -376 47 8 -140 -21 35 -91 34 114 118 92 -137 -193 183 -169 339 141 135 168 16
$$ packed form
6548c1J46k67J40L2j59M3L46k73P6j25j19K75k91M39or1k70K23j60j62K30M41
6570D37l65k76L29j18J29j76K15K19n37j89K89j45L83j30p5K0j46q1K14K37l34
6591a00k8M03m96J62j18J49J60j89J38kK2q7L3J4j96J82k25L25o5m9J15l0k9n1
6615C8l0j92K18J71k37q3l1K09j28J18J25o1%k08K66j19K3j10l22K94N8J16n1
6638F4j07K14l39J64J38j31j25K0M1L6J00k26O0J48k29K05m5K1j12q3Q4L31k73
6661d4p1J52n4L7j9l7j79L31k53o1K43P0k28K08j25J29k3P7r5j68P5n0%J80n4
6686D1k7O5o0J31q5l2n2J93q2K6j81o2P2pl1r6N4L36Jk11k8L1o5J23j43J97j36
6713b8M2k1k67M49n51M23l9j48J19N6j26J25Q0Mk6k29n6L76l52N08j98oL3j52
$$ plain form
6737 16 226 238 -70 -80 -28 -76 -112 62 -160 -237 246 65 -80 92 28 -87 -87 307 117 315 -29 -84 -15 -164
6761 -164 41 263 151 307 -36 211 43 -90 -78 -76 157 203 64 198 86 179 -190 177 -2 -281 -164 -30
6783 -30 -168 114 152 20 -76 -51 143 33 -82 -19 -61 -50 -26 -207 55 133 -58 79 -57 -108 -13 39 -112 0
6807 0 39 219 -348 59 -197 86 1 -75 6 -100 -49 135 -98 -146 44 -37 144 -1 -89 111 -106 123 43 -79
6831 -79 -17 -119 -63 39 74 14 106 -37 163 73 -71 -167 66 11 10 53 42 326 -100 -51 -8 174 231 -65 -110 4
6857 4 -46 -130 79 -80 208 -325 -89 -95 -154 -33 85 155 -29 -169 50 81 -21 -132 197 -10 147 -20 242
6880 242 -162 -238 -18 70 -122 47 223 0 16 163 31 19 -216 210 -157 26 118 -296 147 124 76 -265
6902 -265 -131 -104 -12 -94 195 -136 106 4 -52 220 62 387 -132 -182 117 -42 33 -6 -199 -8 -173 149
$$ packed form
6737A6K10J2l08j0N2m8l6J74k22p7M83j81j45J72o4j15%L94j90J98l44n5O9j49
6761a64K05K22j12J56l43K47j68j33J2KK33M6j39J34j12R3l69L67j79k79J17J34
6783c0j38K82L8j32r6K5J94j10j15O3m2J1K4j81K62P8j91J37j36n1R5N2j51J12
6807@L9J80n67M07k56K83q5p6Q1j06N1J84k33m8J90q1J81j45q8K00k17K29q0j22
6831g9O2j02N6J02L5o0R2j43K00r0j44r6K33n5jM3j1K84m26M9M3J82N7k96m5J14
6857Dn0q4K09j59K88n33K36on9J21J18P0j84j40K19L1j02j11L29k07J57j67K62
6880B42m04p6K20Q8j92J69J76k23J6J47j32j2k35M26l67J83R2m14M43k3m8l41
6902b65J34K7R2q2K89l31K42j02n6K72j58L25n19n0K99j59P5l9j93J91j65L22
$$ plain form
6924 149 -123 128 81 88 -55 16 -30 -99 -344 186 -51 -78 14 206 -168 -104 -354 83 -143 -90 228 74 1 -70
6948 -70 -93 -84 207 279 243 -189 -41 -35 -11 -274 95 267 191 131 -13 -163 165 16 -91 -30 -202 40 -41 -89 -20
6973 -20 -39 -29 147 -77 108 -20 345 73 -87 -90 -58 66 -142 251 44 -197 16 66 -174 34 -63 -218 -229
6996 -229 -8 56 95 51 -83 169 -110 28 79 -71 -481 57 -27 -7 -308 82 -131 109 -45 98 -124 121
7018 121 -173 -27 -54 -20 223 31 140 94 181 -82 104 -127 16 -325 -93 -107 51 115 67 -114 18 121
7040 121 19 -70 136 190 103 48 -157 257 230 15 -251 -25 8 -220 25 -74 168 44 -219 -77 -189 -8
7062 -8 187 130 139 -52 33 14 2 162 48 -111 -44 -162 -232 177 125 76 -54 93 -32 -68 91 -329 -99 257
7086 257 67 -44 -157 112 93 -125 -72 -355 220 162 -96 168 -137 -310 -21 33 -4 161 -26 -53 -118 229
$$ packed form
6924A49k72K51m7Pj43P1m6o9k45N30k37k7R2J92l74O4k50M37k26N3L18j54p3p1
6948g0k3RK91P2l6m32J48OK4k63L69J72p6o0j44j50L28j49j07O1j72K42q1m8O9
6973b0j9J0J76k24J85j28L65k72j60lL2J24k08L93k07k41K13N0k40K08r7j55j1
6996b29K21O4L9m4j34K52k79J38N1j50m10N38q4K0l01L90k13K40j54J43k22K45
7018A21k94J46k7L4K43j92J09m6Q7k63J86k31J43l41K32j4J58O4m8j81J32J03
7040A21j02q9K06N4q7n5k05M14k7k15k66K26L3k28K45r9K42j24k63J42j12J81
7062hJ95n7Rj91Q5j9j2J60j14j59O7j18p0M09n2m9j30J47j25l6J59m20K30L56
7086B57j90j11j13K69j9k18N3k83N75n8k58K64l05j73K89N4l7J65j87k7o5L47
$$ plain form
7108 229 176 138 46 -103 157 21 -26 -273 -183 -288 -52 133 -126 -23 69 -279 -107 -280 -91 81 10 -109
7130 -109 -306 83 14 7 -183 -131 203 116 -86 -105 -280 -17 119 -14 137 121 -28 43 244 92 -17 -37 -288
7153 -288 -21 12 -62 215 115 27 -7 -102 -162 -33 -84 6 -57 -138 -166 -32 149 132 102 -324 164 182 -27 -162 52
7178 52 -151 -190 -189 40 29 242 -78 227 135 85 -273 48 -200 -38 86 -305 -80 -9 108 78 -56 22 -200
7201 -200 -67 53 152 38 3 40 54 -83 -54 93 179 -253 0 -95 3 -116 -249 -23 96 88 -20 -4 -37 -112
7225 -112 118 -217 56 -96 210 213 -129 274 -119 38 237 -244 -122 -253 -24 46 -324 -87 -71 -186 23
7246 23 259 30 242 86 -13 -88 13 14 -40 27 -9 -106 93 -7 -11 8 106 204 17 -42 71 157 31 -15 -132 -27
7272 -27 -114 207 72 -44 -47 52 -28 33 23 -75 55 -71 162 -287 -136 209 90 -62 95 -307 2 -45 151
$$ packed form
7108B29n3l8r2j49K60j36m7k47R0j05K36J85k59J03R2l48J72j73J89J72p1j19
7130a09j97L89o9pj90N2L34q7k02j9j75K63J36j33J51j6j49P1K01j52j09k0k51
7153b88K67L3p4K77j00q8l4r5o0J29n1R0o3q1k8J34J81j7l0m26M88J8k09j35K14
7178E2k03l9JK29j1K13l20L05r2n0l58L21k48J62J24l91K25P1J17l0j34P8k22
7201b00J33J20R9j14l5L7J4j37K9J47Q6m32K53r5R8j19j33K26J19qj08J6l3p5
7225a12K30l35K73j52L06Ll42M03l93J57J99m81J22j31K29P0l70K37J6j15K09
7246B3K36k29K12j56r9p5J01Jn4O7l6r7J99j00mJ9R8R8j87n9J13Q6j26m6j17J05
7272b7q7L21j35j16lR9q0O1j0r8J30j26K33m49J51L45j19j52J57m02L09m7J96
$$ plain form
7295 151 -275 114 54 15 233 -87 40 -249 4 -167 -110 6 -182 -76 -18 62 -31 105 30 -14 140 -4 -38
7318 -38 -43 40 33 -62 84 150 205 268 38 126 -78 -172 94 -100 -222 139 18 -176 -157 1 16 -64 2 17 110 -79
7344 -79 -23 26 -296 120 110 -19 33 10 108 -228 -10 -104 -195 132 -41 -129 55 -125 -11 -129 57 105 37 -75
7368 -75 -106 93 24 70 -139 39 119 -104 -25 -71 65 -128 -34 -13 75 -89 290 141 -93 -35 -144 102 310 -142
7392 -142 47 35 -63 -156 35 -169 105 145 33 35 -88 54 -164 56 -160 -24 9 68 -52 43 107 -38 -137 -89
7416 -89 -96 138 45 16 -51 -52 164 -26 -97 -2 -129 -60 -16 165 -51 -152 -54 -96 -69 -40 -29 105 -154 -80 -39 68
7442 68 86 -90 -11 -34 238 -180 -32 -181 183 231 -133 -179 110 -106 81 -155 -56 -143 273 147 -288 -22 133
7465 133 -47 154 45 174 278 -94 -208 29 -11 -94 2 -177 -6 -92 -101 110 41 72 143 -243 -217 -47 -7 -29
$$ packed form
7295A51m26L89o0l9K18l20J27k89K53j71N7J16j88J06N8Q0r3J36p5m4J54j44l4
7318c8nQ3pr5J46O6N5O3k30Q8k04r4K66j94j22L61j21j94J9J58J5q0O6J5R3j89
7344g9N6M9l22M16j0j29N2k3R8l36K18r4r1L27j73q8J84j80J14j18J86M8o8j12
7368g5l1J99o9M6k09J78Q0k23P9m6J36j93R4K1Q8j64L79j49k34N8j09K46K08m52
7392a42J89j2r8r3J91k04K74M0j12Kj23J42k18K20k16J36L3N9j20R5O4j45r9M8
7416h9pK34r3k9o7jK16j90p1R5j27O9M4J81k16j01R8m2K7K9J1J34k59P4M1J07
7442F8J8j76P9k3K72m18J48j49L64M8l64m6K89k16J87k36R9q7M16j26m35K66J55
7465A33j80K01j09J29J04l72j14K37m0q3R6j79J71q6rK11o9L1P1l86K6J70M0k2
$$ plain form
7489 -29 81 -149 -82 50 330 89 -245 -250 264 -120 -62 121 -106 -64 -274 110 118 -17 63 12 -149 -195 125 -176
7513 -176 -33 76 -112 -96 185 182 -17 -25 -85 -157 111 102 -8 -41 -60 155 6 13 98 24 74 40 96 46 33 -63 71
7540 71 85 -115 -54 -121 -137 -39 -123 -111 -157 57 -34 -93 -33 -93 77 59 -151 6 132 105 56 -170 32 -87 32
7565 32 -35 259 94 -288 -28 40 -34 -40 -85 -89 87 208 118 -103 101 144 137 -281 -152 80 50 63 -1 129 111 -61
7591 -61 -212 2 58 5 -161 -5 -7 189 124 -102 -42 83 92 -11 -37 -53 2 20 -231 -26 188 97 -135 189 -151
7616 -151 258 23 -18 148 130 64 250 34 -52 49 -33 -16 -187 -80 -322 -49 101 -163 -271 -21 -107 -176 24
7639 24 186 52 -72 -58 -94 141 -13 -3 -163 -272 51 -65 -123 21 -14 54 -11 47 96 88 -223 -216 -22 -76 86
7664 86 -127 -7 3 203 -73 -165 -53 -204 122 -98 97 -77 -272 15 -87 -132 -3 -109 -66 61 95 -75
$$ packed form
7489b9J10k30O7J32K80k41l34nN14l84N8J83k27M2k10L84Qj35Q0n1j61m6L20l01
7513a76J43J09j88J6K81lj99qo0p2K68rj10l3j9K15j49PQ5p4N0l4N6n0j3r6J34
7540G1J4k00O1o7j6R8q4J2m6K14r1n9O0o0J70j8k10J57J26k7m9k26K02j19J19
7565C2o7K94j65l82K60O8p4om5mJ76J21r0k21K04M3pm18J29K32l0J3o4J30j8j72
7591f1j51K14N6n3j66J56kJ96o5k26O0J25Rj03k6j6N5J8k51K05K14r1k32L24l40
7616a51M09k35m1J66j8o6J86k16q6J01q2J7j71J07k42K73J50k64j08K50q6o9K00
7639B4J62j34j24J4l6K35j54J0j60j09L23j16n8J44l5O8o5N8M9ql11PJ94n4J62
7664H6k13J20J0K00k76r2J12j51L26k20J95j74j95K87j02m5J29j06M3J27L4j70
$$ plain form
7686 -75 -152 -73 -166 52 22 4 212 28 38 -256 63 -34 -30 230 140 77 225 -138 216 286 41 135 36 -97 -64
7711 -64 -163 -25 208 -119 -281 -90 -52 -192 133 29 6 236 57 -40 -78 26 -7 299 43 -146 -71 -25 62
7734 62 -57 -214 187 -154 111 0 -340 -2 46 -70 -14 -29 -135 -87 -40 311 150 204 -12 26 -70 -40 86
7757 86 -145 -261 35 194 -189 -180 66 57 -8 204 -236 135 11 -93 -27 182 -34 -200 57 -165 299 125
7779 125 172 88 -39 -204 -71 162 182 32 37 133 32 264 92 -131 -152 -55 -30 -49 103 -253 58 -32 -127 -45
7803 -45 -145 52 -302 -54 -83 -122 -64 -121 -70 -321 14 102 -60 -257 -40 -125 155 -49 -66 -93 -264 23 77 -243
7827 -243 28 140 85 376 -30 -16 -167 -44 241 24 -94 69 56 -144 -194 -155 32 -73 33 440 -107 -49
7849 -49 101 190 232 12 -36 -93 -44 116 -67 -131 -203 -39 98 -134 -5 -35 190 82 -154 4 30 209 -37
$$ packed form
7686g5p7P9r3K18l0j8K08j84J0k94L19r7MK60r0o3J48l63L54P0k45R4r9j33L3
7711f4r9J38K33l27j62J91L8j40L25j04k3K30j79r7l8J04l3L06k56j89P5M6Q7
7734F2j19j57M01l41K65j11l40L38M8j16N6j5j06M8M7L51j61N4k16L8r6L0J26
7757H6k31j16K96J59l83RK46ro5K12m40L71j24j04O6K09k16j66K57k22M64j74
7779A25M7q4j27j65J33K33K0j50NR6j01K32j72k23k1R7K5j9J52l56L11r0r5Q2
7803d5j00J97l54K48k9l9N8n7N1k51L35Q8j62j97K17q5K80k04j7k7j71K87N4l20
7827b43K71J12n5K91m06J4j51J23K85k17j18J63j3k00n0L9J87j05J06M07n47N8
7849d9J50Q9M2k20m8n7M9J60j83o4p2J64J37k32J29l0K25j08k36J58K6J79k46
$$ plain form
7872 -37 148 269 -78 195 -64 21 62 39 -162 156 161 125 106 282 -149 -123 -160 2 18 -203 71 -47 -51 136
7896 136 85 -95 -14 222 -178 36 -170 134 -101 202 189 -103 -106 12 53 -34 185 -35 -107 103 52 90 -48
7919 -48 -109 -78 111 6 -48 165 76 53 31 41 -22 -113 152 273 86 141 -21 191 -230 122 -6 152 -69 104
7943 104 -68 65 -78 -211 168 246 94 -79 -172 39 125 26 121 90 -19 33 -19 -9 -75 -106 135 126 -69 -73 97
7968 97 19 83 -1 12 -115 -200 -268 -74 215 -265 -9 -172 13 -46 -274 -132 -56 7 222 90 -169 257 -64
7991 -64 -88 25 -201 -287 -197 65 2 95 71 93 48 -40 212 -30 -235 -220 163 -45 9 6 103 212 -44 -18 64 89
8017 89 143 -24 133 -159 115 105 56 53 13 -45 -58 238 170 -26 -60 -39 -181 104 -32 31 49 299 -97 -139 -7
8042 -7 -50 -135 172 -39 -18 89 -171 31 -231 252 -147 167 -16 -21 -50 39 -293 -132 133 -79 -164 -12 136
$$ packed form
7872c7J85J21l47K73k59Q5M1k3k01L18Nl6j9J76m31K6l7J62J6k21K74j18mJ87
7896A36n1j80Q1K36m00K14k06L04k35L03j3k92lJ18M1q7K19k20p2K10n1L8j38
7919d8o1L1J89j05n4K13q9k3k2J0o3r1K65J21j87N5j62K12m21L52j28J58k21J73
7943A04j72J33j43j33L79P8j52j73r3K11Q6r9R5l1j09N2n2J0o6l1K41rj95mJ70
7968I7p8O4q4J3j27q5o8J94K89m80K56j63J85n9k28J42P6O3K15j32k59M26l21
7991f4k4J13k26q6R0K62o3R3k4K2m5q8K52k42k05J5L83k08N4lR7J09k56K6Q2K5
8017H9N4j67J57k92K74j0m9lm0n8j3K96o8j96l4K1j42K85j36O3J8K50l96m2J32
8042gm3q5L07k11K1J07k60K02k62M83l99L14j83nk9Q9l32J61K65k12q5J52J48
$$ plain form
8065 136 -312 -209 -40 -142 199 -159 314 -121 -22 65 -94 267 -92 5 -115 -112 -79 44 85 98 52 -92 287
8088 287 149 92 262 8 147 -15 -154 135 227 80 -199 -215 -185 85 -202 -104 228 -366 -10 -109 66 169
8110 169 89 174 -265 82 30 88 -165 -42 1 143 113 159 -93 23 -23 -52 -30 52 237 44 253 6 11 -206
8134 -206 -107 13 204 -2 48 -143 89 -26 -30 70 -7 66 68 -34 -1 60 55 101 -186 134 14 218 -83 -24 -71
8159 -71 -171 -86 -62 -274 14 -134 -60 -113 -164 -127 -87 -144 -41 66 -424 -69 209 249 79 -164 -253 -149 -174 159
8183 159 -30 -49 -99 -313 17 -83 17 -27
$$ packed form
8065A36m48J03J69j02L41l58M73m35R9Q7j59L61l59R7j20LL3J23M1J3m6j44L79
8088B87j38n7J70k54J39j62j39K89R2j47k79j6L0K70k87R8L32n94L56r9J75J03
8110A69q0Q5m39L47n2N8k53J23M3J42l0M6k52J16m6k9K2Q2J85j93K09k47Nk17
8134b06R9J20J91k06N0j91K32j15mJ00p7P3Kj02L3O1nM6k87L20j20K04l01N9m7
8159g1j00Q5K4k12K88j48P4n3n1L7M0n7J03J07m90L55K78M0j70k43q9J04k5L33
8183A59j89j9n0k14L30j00J00m4
8191b7
$$ Imaginary data points
##PAGE= N=2
##DATA TABLE= (X++(I..I)), XYDATA
$$ plain form
0 0 0 0 0 0 0 0 0 0 0 0 0 0 0 0 0 -8 8 -8 8 -8 8 -16 16 -16 24 -24 32 -32 40 -48 52 -58 66 -76 88 -96 109
37 109 -122 136 -152 170 -186 208 -230 255 -280 309 -341 375 -413 456 -502 553 -610 676 -748
56 -748 832 -927 1038 -1172 1334 -1531 1783 -2117 2582 -3272 4411 -6612 12480 -63706 -144919
71 -144919 2056 82180 36750 1063 75414 118621 90386 62688 72151 50721 10480 -2077
83 -2077 18276 27488 15191 -16352 -31485 -3434 20683 -40987 -123817 -99427 -11038 -17003 -85697
96 -85697 -63433 26826 35367 -17484 -10685 27823 4058 -29571 11787 65865 50207 19815 45757
109 45757 87372 80039 34087 -6520 -13374 8922 17072 -18348 -48114 -20160 15664 -11563 -57734
122 -57734 -57081 -46666 -70656 -77100 -33044 -6094 -24983 -16147 42898 70157 35683 7110 24675
$$ packed form
0@%%%%%%%%%%%%%%%qJ6j6J6j6J6k4L2l2M0m8N6o4P2q8J00j10J24j42J64j84K05
37A09k31K58k88L22l56L94m38M85n35N89o50P16p88Q69r58J055j163J286j424
56g48J580j759J965k210K506k865L314l900M699n854P683j1023J9092p6186q1213
71a44919J46975Q0124m5430l5687P4351M3207k8235k7698R463k1430m0241j2557
83b077K0353R212j2297l1543j5133K8051K4117o1670q2830K4390Q8389n965o8694
96h5697K2264R0259Q541n2851O799L8508k3765l3629M1358N4078j5658l0392K5942
109D5757M1615p333m5952m0607o854K2296Q150l5420k9766K7954L5824k7227m6171
122e7734O53J0415k3990o444M4056K6950j8889Q836N9045K7259l4474k8573J7565
$$ plain form
135 24675 48103 46453 36210 31080 35527 50100 55204 27129 -12301 -27178 -28640 -42644 -54732
148 -54732 -47702 -40261 -40810 -27092 -3605 -7214 -35339 -41421 -17340 -24 -3385 -3147 14812 40731
162 40731 58509 56326 35843 19744 22403 25596 11624 -1271 5350 16858 16474 11057 6905 -8970
176 -8970 -34710 -46690 -38650 -35005 -45845 -48120 -24585 3184 6969 -8668 -14573 -2175 9396
189 9396 5348 595 14298 37540 48351 47118 47712 45326 27503 5640 -1468 -742 -11580 -26981
203 -26981 -24028 -5247 -328 -20184 -38588 -35503 -26567 -34266 -45455 -34863 -8017 8884 12342
216 12342 19927 32509 31162 16795 11435 19119 20351 11117 11752 28681 39533 26284 5619 -1463
230 -1463 -1271 -13277 -34059 -39512 -26273 -14796 -16620 -17611 -9388 -4747 -14551 -24727 -20011 -10054
$$ packed form
135B4675K3428j650j0243n130M447J4573N104k8075l9430j4877j462j4004j2088
148e4732P030P441n49J3718K3487l609k8125o082K4081J7316l361K38J7959K5919
162D0731J7778k183k0483j6099K659L193j3972j2895O621J1508l84n417m152j5875
176h970k5740j1980Q040L645j0840k275K3535K7769L785j5637n905J2398J1571
189I396m048m753J3703K3242J0811j233N94k386j7823k1863p108P26j0838j5401
203b6981K953J8781M919j9856j8404L085Q936p699j1189J0592K6846J6901L458
216A2342P585J2582j347j4367n360P684J232r234O35J6929J0852j3249k0665p082
230a463J92j2006k0782n453J3239J1477j824r91Q223M641r804j0176M716R957
$$ plain form
244 -10054 -8553 -6655 10788 33221 38755 28854 24262 28991 25431 8391 -2352 4742 14331 11435
258 11435 4314 5262 6002 -6093 -24979 -34126 -32035 -32138 -35304 -28775 -11017 2856 2179 -2010 2665
273 2665 8683 3474 -4678 1768 18985 27499 24792 27102 36134 32889 13666 -1327 -2399 -4254
287 -4254 -14337 -18485 -9948 -1068 -4090 -12416 -15686 -16071 -21402 -30627 -30788 -19054 -5625 -161 4227
302 4227 15884 25371 19083 6884 6575 13629 11700 5016 11158 25059 27146 17005 10098 7856
316 7856 -1363 -16520 -25539 -23004 -17837 -16991 -15258 -9054 -3041 -4926 -13908 -18072 -13301 -8427 -9033
331 -9033 -4843 10574 24790 25521 20707 21682 22433 12931 1069 234 5790 6688 3615 5254 9087 5283
347 5283 -6745 -17071 -20454 -22173 -25412 -25857 -17418 -5359 1026 711 694 3908 3115 -2575 -5188 1620
$$ packed form
244a0054J501J898J7443K2433N534r901m592M729l560j7040j0743P094R589k896
258A1435p121R48P40j2095j8886r147K091j03l166O529J7758J3873o77m189M675
273B665O018n209q152O446J7217Q514k707K310R032l245j9223j4993j072j855
287d254j0083m148Q537Q880l022q326l270l85n331r225j61J1734J3429N464M388
302D227J1657R487o288j2199l09P054j929o684O142J3901K087j0141o907k242
316G856r219j5157r019K535N167Q46J733O204O013j885q982m164M771M874o06
331i033M190J5417J4216P31m814R75P51r502j1862q35N556Q98l073J639L833l804
347E283j2028j0326l383j719l239m45Q439J2059O385l15j7L214p93n690k613O808
$$ plain form
363 1620 11217 15146 16716 23091 27938 22045 8841 1923 712 -4071 -11581 -11219 -3022 733 -3415
378 -3415 -7210 -7224 -10040 -18529 -24626 -21645 -13077 -6906 -3586 3439 13334 17768 11917 4810 5739 8911
394 8911 5798 2584 9888 20218 18855 11378 10137 9689 -1476 -15826 -18447 -12904 -12384 -15625 -11751
409 -11751 -2712 723 -5108 -11358 -11801 -9128 -8810 -9121 -3273 8523 16262 15927 16089 19224 16099 4155
425 4155 -1855 3606 6709 1147 -1268 7315 13081 3973 -7170 -10688 -11248 -16244 -20906 -18518 -10769
440 -10769 -5258 -2433 872 4042 2639 -3191 -5957 -1954 3792 4044 4821 13278 23034 21866 12461
455 12461 7309 6466 2120 -5515 -8004 -5291 -2456 -1703 -719 -581 -4915 -12420 -16293 -15265 -13416 -14154
471 -14154 -11704 -2363 8034 11722 8684 6511 7074 6624 3831 2475 3770 6835 11576 14949 14398
$$ packed form
363A620R597L929J570O375M847n893j3204o918j211m783p510L62Q197L755m148
378c415l795j4k816q489o097K981Q568O171L320P025R895M434n851p107R29L172
394H911l113l214P304J0330j363p477j241m48j1165j4350k621N543N20l241L874
409a1751R039L435n831o250m43K673L18l11N848J1796P739l35J62L135l125j1944
425D155o010N461L103n562k415Q583N766r108j1143l518n60m996m662K388P749
440a0769N511K825L305L170j403n830k766M003N746K52P77Q457R756j168r405
455A2461n152q43m346p635k489K713K835P53R84J38m334p505l873J028J849p38
471a4154K450R341J0397L688l038k173N63m50k793j356J295L065M741L373n51
$$ plain form
486 14398 8393 2294 -1867 -5998 -10061 -13283 -13699 -10029 -3702 472 -1564 -5803 -6631 -6733 -8083 -9802
502 -9802 -8379 -4430 2687 11291 15845 12512 8765 9739 9469 3280 -1412 429 4046 5947 7851 8996
518 8996 4199 -3113 -6486 -7041 -12468 -18417 -17230 -10148 -3465 -487 -488 -1658 -663 1130 -457 -4941
534 -4941 -3629 4223 10106 11964 15192 17128 12227 5929 5229 3613 -5079 -10962 -5748 2003 1308 -3054
550 -3054 -3479 -2822 -5313 -9590 -13623 -14969 -12033 -5126 538 3270 5977 7572 6259 4566 4411 1863
566 1863 -2304 -456 8378 13451 9824 6595 8897 8715 972 -6504 -9131 -9745 -8652 -5943 -3072 -2832
582 -2832 -3279 -3033 -4086 -7081 -9604 -10883 -8958 -2159 5437 8467 8198 10164 13924 12094 5322 746
598 746 1213 2621 3336 4469 5311 4032 2139 105 -4493 -10480 -14490 -14479 -11922 -7270 -3739 -1910 -246
$$ packed form
486A4398o005o099m161m131m063l222m16L670O327M174k036m239q28j02j350j719
502i802J423L949P117Q604M554l333l747R74k70o189m692J841L617J901J904J145
518H996m797p312l373n55n427n949J187P082O683K978jj170R95J793j587m484
534d941J312P852N883J858L228J936m901o298p00j616q692n883N214P751o95m362
550c054m25O57k491m277m033j346K936O907N664K732K707J595j313j693j55k548
566A863m167J848Q834N073l627l229K302j82p743p476k627o14J093K709K871K40
582b832m47K46j053k995k523j279J925O799P596L030k69J966L760j830o772m576
598G46M67J408P15J133Q42j279j893k034m598n987m010J1K557M652L531J829J664
$$ plain form
615 -246 2817 3872 572 -3427 -3128 436 4043 6093 8592 10961 12051 10883 7561 2927 -1643 -4295
631 -4295 -4291 -2780 -1306 -560 -515 -256 -1005 -4586 -10057 -12611 -10969 -8146 -5966 -2680 1470 4501 6501
648 6501 6623 3972 1646 1096 2292 3802 5725 8802 9985 10136 8633 5697 -22 -5923 -8488 -8658
664 -8658 -8088 -7794 -5535 -3276 -2415 -2446 -4351 -6658 -8052 -6209 -4047 -1512 2333 7538 10942 10945 10479
681 10479 8500 5278 1100 339 1123 2031 2046 3624 4578 3132 -839 -4869 -7987 -9933 -10351 -10063 -7745
698 -7745 -3793 -242 1009 216 554 399 -2256 -3638 -1311 2781 4962 7277 10238 12218 10245 6492
714 6492 3321 994 -1609 -3778 -3371 -1232 74 -264 -1992 -3098 -4702 -8215 -11510 -11438 -8408 -5340
730 -5340 -2570 986 5254 6823 5847 4465 3952 2635 1742 2801 5821 8235 8361 7230 6265 4419
$$ packed form
615b46L063J055l300l999K99L564L607K050K499K369J090j168l322m634m570k652
631d295MJ511J474P46M5K59p49l581n471k554J642K823K180L286M150L031K000
648F501J22k651k326n50J196J510J923L077J183J51j503k936n719n901k565j70
664h658N70K94K259K259Q61l1j905k307j394J843K162K535L845N205L404Lm66
681A0479j979l222m178p61P84R08J5J578R54j446l971m030l118j946m18K88K318
698g745L952L551J251p93L38j55k655j382K327M092K181K315K961J980j973l753
714F492l171k327k603k169M07K139J306l38j728j106j604l513l295P2L030L068
730e340K770L556M268J569r76j382n13j317q93J059L020K414J26j131r65j846
$$ plain form
746 4419 -104 -5387 -8028 -7867 -6775 -6718 -4773 -2394 -1008 -2294 -3467 -4628 -5829 -6795 -4933 -1101
762 -1101 2760 4888 7389 8879 9011 7094 3989 1622 809 1665 2052 2845 3703 4102 3120 597 -2757
779 -2757 -6398 -9481 -10308 -8725 -6575 -4941 -2772 157 1358 -51 -1252 -2029 -2037 -988 2065 5094
795 5094 6910 8755 10045 9734 6850 2979 -408 -1625 -2305 -2472 -2484 -1664 -275 -343 -2573 -5410 -7264
812 -7264 -8320 -8916 -7645 -4474 -1380 700 3192 5902 5885 3477 1221 1885 2582 2147 3317 5610 7834
829 7834 7542 5632 3547 239 -3233 -5551 -6343 -5878 -5207 -3836 -2125 -1098 -1543 -3438 -5449 -5892 -5043
846 -5043 -3895 -2255 671 4753 7511 7726 7070 6027 3914 1927 1183 1418 1782 2254 3583 4196 2790
863 2790 -583 -3490 -5602 -7440 -8518 -7821 -6490 -4055 -1262 845 929 -132 -831 -597 -1069 -891 1043
$$ packed form
746D419m523n283k641J61J092N7J945K379J386j286j173j161j201r66J862L832
762a101L861K128K501J490J32j917l105k367q13Q56L87P93Q58L99r82k523l354
779b757l641l083q27J583K150J634K169K929J201j409j201p77qJ049L053L029
795E094J816J845J290l11k884l871l387j217o80j67j2Q20J389o8k230k837j854
812g264j056n96J271L171L094K080K492K710j7k408k256O64O97m35J170K293K224
829G834k92j910k085l308l472k318p92M65O71J371J711J027m45j895k011m43Q49
846e043J148J640K926M082K758K15o56j043k113j987p44K35L64M72J329O13j406
863B790l373k907k112j838j078O97J331K435K793K107Q4j061o99K34m72J78J934
$$ plain form
880 1043 3886 6146 7577 8758 7447 4761 2412 305 -1612 -3044 -2640 -1491 -1079 -123 163 -2000
896 -2000 -4662 -6033 -6245 -7445 -7661 -4332 -307 1792 2656 4369 4763 3204 1365 1488 1686 2236 3344
913 3344 5101 6295 6412 5241 2535 -366 -2690 -4175 -6202 -6332 -4122 -2110 -2486 -2576 -1191 -1464 -4369
930 -4369 -5554 -3820 -2625 -2047 644 4516 7136 6475 5921 5258 3508 1930 463 412 1122 2122 2854
947 2854 2461 1239 282 -2174 -5773 -6986 -6360 -6060 -5821 -3519 -163 1025 343 161 603 -678 -1639
964 -1639 -556 1448 3286 4958 6482 7026 6628 5028 2388 -226 -1655 -1974 -2205 -2152 -1083 142 -174
981 -174 -2289 -3875 -4813 -6162 -6794 -5795 -3266 -962 651 2850 4282 4057 2991 1668 1240 1646 2374
998 2374 3160 4002 5414 6063 4224 1827 -293 -2138 -4164 -5819 -5389 -4055 -2744 -2232 -1472 -1333 -1986
$$ packed form
880A043K843K260J431J181j311k686k349k107j917j432M04J149M12R56K86k163
896b000k662j371k12j200k16L329M025K099Q64J713L94j559j839J23J98N50J108
913C344J757J194J17j171k706k901k324j485k027j30K210K012l76r0J385k73k905
930d369j185J734J195N78K691L872K620o61n54o63j750j578j467n1P10J000P32
947B854l93j222r57k456l599j213O26L00K39K302L356J188o82j82M42j281r61
964a639J083K004J838J672J524N44l98j600k640k614j429l19k31N3J069J225l16
981a74k115j586r38j349o32R99K529K304J613K199J432k25j066j323m28M06P28
998B374P86Q42J412O49j839k397k120j845k026j655M30J334J311N12P60J39o53
$$ plain form
1015 -1986 -3794 -4431 -3878 -2408 -1160 483 3524 5933 6495 5388 4360 3459 2042 686 110 1122
1031 1122 2398 2353 1979 1415 271 -1989 -4538 -6071 -6000 -5672 -5055 -3144 -706 624 378 -424 -404 -223
1049 -223 -945 -584 953 3357 4941 6160 6327 5850 4598 2390 199 -1207 -1498 -1787 -1624 -420 315
1066 315 -803 -2201 -3769 -4609 -5384 -6156 -5538 -3590 -986 696 2250 3115 3332 2744 1594 1051 1604
1083 1604 1889 2773 3910 4831 5240 3927 1773 176 -1706 -3615 -4841 -4543 -3095 -2064 -1884 -1193 -1412
1100 -1412 -2044 -3212 -3908 -3729 -2547 -1039 582 2776 4606 5426 4308 3601 3209 1822 617 647 1320
1117 1320 2210 2131 2152 1549 177 -1874 -3826 -5157 -5437 -5200 -3988 -2666 -1142 45 547 -109 -571 -259
1135 -259 -880 -711 936 2663 4116 4962 5680 5456 3551 1892 263 -635 -1756 -1495 -979 -234 -637 -491
$$ packed form
1015a986j808o37N53J470J248J643L041K409N62j107j028r01j417j356n76J012
1031A122J276m5l74n64j144k260k549j533P1L28O17J911K438J330k46q02K0J81
1049b23p22L61J537K404J584J219J67m77j252k208k191j406k91k89J63J204P35
1066C15j118j398j568q40p75p72O18J948K604J682J554Q65K17n88j150n43N53
1083A604K85Q84J137R21M09j313k154j597j882j909j226K98J448J031J80O91k19
1100a412o32j168o96J79J182J508J621K194J830Q20j118p07l92j387j205L0O73
1117A320Q90p9K1o03j372k051j952j331k80K37J212J322J524J187N02o56m62L12
1135b59o21J69J647J727J453Q46P18k24j905j659j629q98j121K61N16P45m03J46
$$ plain form
1153 -491 -1368 -2992 -4353 -4599 -4685 -4478 -3047 -811 664 1954 2658 2675 2060 1126 803 772 983 2333 3659
1172 3659 4016 4070 3641 2234 149 -1676 -2631 -3415 -3692 -3376 -1770 -940 -1409 -1556 -1823 -2599 -3304 -3476 -2255
1191 -2255 -1380 525 2405 4025 4461 4169 3193 2158 1400 1042 626 765 1489 2465 2242 517 -308 -1349
1209 -1349 -2815 -4909 -4876 -4035 -3538 -2340 -1043 332 369 -272 -503 -547 -398 -634 326 1907 3697 4439
1227 4439 4544 3752 2890 1957 283 -1254 -1103 -755 -279 -422 -62 -185 -1180 -2389 -3310 -3857 -4316 -4213 -2820
1246 -2820 -841 695 1396 1829 2201 2035 920 727 559 1303 2335 3129 3669 3413 3174 1823 221 -1464
1264 -1464 -2482 -3026 -3242 -2513 -1474 -1129 -1143 -1422 -1410 -1783 -2911 -3010 -2494 -661 1078 2215 2965 3561 3813
1283 3813 3055 1927 1003 499 713 832 1347 2014 1637 1220 -56 -1074 -2269 -3748 -4620 -3571 -2570
$$ packed form
1153d91q77j624j361k46q6K07J431K236J475J290P04J7o15r34l23l1K11J350J326
1172C659L57N4m29j407k085j825r55p84k77L16J606Q30m69j47k67p76p05j72J221
1191b255Q75J905J880J620M36k92r76j035p58l58m16J39P24R76k23j725q25j041
1209a349j466k094L3Q41M97J198J297J375L7o41k31m4J49k36R60J581J790P42
1227D439J05p92q62r33j674j537J51L48M76j43L60j23r95j209r21n47m59J03J393
1246b820J979J536P01M33L72j66j115j93j68P44J032P94N40k56k39j351j602j685
1264a464j018n44k16P29J039L45j4k79J2l73j128r9N16J833J739J137P50N96K52
1283C813p58j128r24n04K14J19N15O67l77m17j276j018j195j479q72J049J001
$$ plain form
1300 -2570 -1584 -1166 -105 503 287 -796 -1054 -945 -266 358 1575 3121 3836 3742 3515 2869 1962 506
1318 506 -785 -962 -557 61 -380 -211 -260 -607 -1995 -3189 -3976 -3604 -3531 -2426 -1002 486 1250 1443 1934
1337 1934 1534 1013 495 340 1284 2064 2419 2851 3344 2888 1916 310 -1197 -2116 -2196 -2304 -2244 -1373 -918 -897
1357 -897 -1046 -1481 -1983 -2746 -2897 -2041 -660 647 1224 2461 3367 3142 2306 1512 990 908 863 1122 1268 1847
1377 1847 2353 1291 -200 -855 -1981 -3032 -3773 -2910 -2250 -1971 -1198 -118 67 -221 -645 -1213 -598 -642
1395 -642 472 1204 2175 3535 3826 3316 2149 1604 754 -97 -798 -632 -102 -281 -234 67 -491 -1866 -2897
1414 -2897 -3197 -3034 -2834 -2222 -1325 -81 931 1277 1278 855 644 606 304 811 1808 2562 2775 2825 2743 1885 462
1435 462 -890 -1196 -1634 -2166 -2034 -1102 -613 -717 -839 -1648 -1976 -2367 -2475 -1802 -1176 255 1466 1638 2350
$$ packed form
1300b570R86M18J061O08k16j083k58J09O79O24J217J546P15r4k27o46r07j456
1318E06j291j77M05O18m41J69m9l47j388j194p87L72P3J105J424J488P64J93M91
1337A934m00n21n18j55R44P80L55M32M93m56r72j606j507r19q0j08O0Q71M55K1
1357h97j49m35n02p63j51Q56J381J307N77J237R06k25q36p94n22q2m5K59J46N79
1377A847N06j062j491o55j126j051p41Q63O60K79P73J080J85k88m24n68O15m4
1395f42J114P32R71J360K91n10j167n45q50q51p01J66N30j79M7L01n58j375j031
1414b897l00J63K00O12Q97J244J012L46Jm23k11l8l02N07R97P54K13N0q2q58j423
1435D62j352l06m38n32J32R32M89j04j22q09l28l91j08O73O26J431J211J72P12
$$ plain form
1454 2350 2589 2285 1281 813 796 1114 965 1479 1925 2134 1383 265 -475 -1322 -2263 -2715 -2977 -2219 -1362
1473 -1362 -1084 -662 52 -105 -635 -1284 -835 -345 -73 782 1970 2948 3136 2824 1997 1541 389 71 -708
1492 -708 -384 431 577 280 -195 -174 -1156 -2314 -2859 -2599 -2560 -1910 -1377 -78 809 1060 637 767 649 367
1512 367 115 618 1452 2038 2524 2275 2230 1823 733 -546 -1285 -1574 -1552 -1639 -873 -320 -241 -1089 -1491 -1534 -1946
1533 -1946 -2465 -2181 -1056 53 1091 1434 1791 2067 2148 1081 673 490 788 1019 941 1402 1497 1238 275
1552 275 -738 -970 -2030 -3007 -2492 -1928 -1299 -949 -470 -111 -198 -591 -1278 -752 -251 58 915 1867 2723 2581
1572 2581 2341 1830 1327 635 -138 -526 -275 11 201 -240 -133 -390 -1273 -2234 -2695 -2288 -2039 -2112 -1121 205
1592 205 410 770 1000 781 698 483 391 623 1388 1851 2158 2164 2304 1610 267 -666 -1172 -1359 -1558 -1562 -879 -445
$$ packed form
1454B350K39l04j004m68j7L18j49N14M46K09p51j118p40q47r41m52k62P58Q57
1473a362K78M22P14j57n30o49M49M90K72Q55J188R78J88l12q27m56j152l18p79
1492g08L24Q15J46k97m75K1r82j158n45K60L9O50N33J299Q87K51m23J30j18k82
1512C67k52N03Q34N86M86k49m5m07j090j279p39k89K2q7P66N53P9q48m02m3m12
1533a946n19K84J125J109J038L43L57K76Q1j067m08j83K98K31p8M61R5k59r63
1552B75j013k32j060r77N15N64O29L50M79L59q7l93o87N26N01L09Q57R52Q56j42
1572B581k40n11n03o92p73l88K51K86J90m41J07k57q83r61m61M07K49p3R91J326
1592B05K05L60K30k19q3k15r2K32P65M63L07OJ40o94j343r33n06j87j99mO83M34
$$ plain form
1614 -445 -407 -870 -1451 -1450 -1716 -2295 -1684 -698 401 762 1614 1941 2009 1689 1139 775 672 475 634 995 1276
1635 1276 1537 892 346 -512 -1256 -2064 -2401 -2245 -1674 -1396 -848 -476 -190 -224 -930 -634 -630 -421 126 652 1851
1656 1851 2535 2503 2435 1913 1292 537 -39 -52 83 -42 -255 132 251 -529 -1350 -1921 -2326 -2236 -2291 -1856 -901
1677 -901 -71 533 594 800 854 239 338 393 893 1561 1577 2010 2392 2163 1233 237 -66 -650 -1248 -1394 -1319 -772
1699 -772 -489 -742 -910 -877 -876 -1789 -1905 -1429 -681 -253 321 1528 1889 1686 1215 1319 1233 635 68 561 1217
1720 1217 1425 1227 701 679 -252 -1270 -1899 -1858 -1765 -1707 -1780 -877 154 -372 -613 -1016 -434 -381 -728 -65 1037
1741 1037 1744 1727 1732 2159 2068 1057 327 119 33 -15 -357 -21 371 205 -536 -1259 -1274 -1658 -2076 -2393 -1788 -573
1763 -573 -327 -210 309 870 606 -201 -84 518 1023 1059 1196 2082 2294 1704 757 532 479 -440 -1155 -1326 -690
$$ packed form
1614d45L8m63n81Jk66n79O11R86J099L61Q52L27O8l20n50l64j03j97J59L61K81
1635A276K61o45n46q58p44q08l37J56N71K78N48L72K86l4p06K96MK09N47N26J199
1656A851O84l2o8n22o21p55n76j3J35j25k13L87J19p80q21n71m05R0n5M35R55
1677i01Q30O04O1K06N4o15R9N5N00O68J6M33L82k29r30r96l03n84n98j46P5N47
1699g72K83k53j68L3Jr13j16M76P48M28N74J207L61k03m71J04q6n98n67M93O56
1720A217K08j98n26k2r31j018o29M1R3N8p3R03J031n26k41m03N82N3l47O63J102
1741A037P07j7NM27r1j011p30k08q6m8l42L36L92j66p41p23j5l84m18l17O05J215
1763e73K46J17N19N61k64q07J17O02N05L6J37Q86K12n90r47k25n3r19p15j71O36
$$ plain form
1784 -690 -215 -716 -903 -738 -632 -1451 -2110 -1681 -1050 -993 -294 343 1223 1542 998 924 1339 1354 533 175 900
1805 900 1668 1474 862 779 1116 404 -1264 -1765 -1369 -1448 -1807 -1434 -609 -83 -564 -1062 -745 -367 -369 -1135 -620
1826 -620 897 1445 1117 1073 2292 2100 737 -87 503 974 173 -85 50 1018 402 -858 -946 -1051 -1210
1845 -1210 -2070 -2299 -1494 -378 -716 -726 176 1096 380 -711 -363 672 977 460 944 1961 2355 1470 721
1864 721 1039 1029 -436 -1221 -565 30 -233 -888 -633 -307 -420 -1818 -2035 -1322 -1040 -1154 -1347 -81 1109
1883 1109 1168 494 549 1072 1138 -150 -264 1042 1638 1042 640 1228 1251 210 -994 -759 -712 -988 -1854 -1332
1903 -1332 -193 89 -825 -1112 -502 -505 -1279 -1461 -199 763 1074 551 1170 2027 1931 434 184 802 805 -49
1923 -49 -383 644 1289 472 -535 -473 -274 -885 -1797 -1919 -1062 -638 -715 -674 54 664 -2 -622 -108 372 506
$$ packed form
1784f90M75n01j87J65J06q19o59M29O31N7O99O37Q80L19n44p4M15J5q21l58P25
1805I00P68j94o12q3L37p12j668n01L96p9l59L73Q25N26m81m98L17L78kp66N15
1826f20J517N48l28m4J219j92j363q24N90M71q01k58J35R68o16j260q8j05j59
1845a210q60k29Q05J116l38j0R02R20p16j091L48J035L05n17M84J017L94q85p49
1864G21L18j0j465p85O56N95k63o55K55L26j13j398k17P13K82j14j93J266J190
1883A109N9o74N5N23O6j288j14J306N96n96m02N88K3j041j204K35M7k76q66N22
1903a332J139K82r14k87O10lp74j82J262R62L11n23O19Q57r6j497k50O18Lq54
1923d9l34J027O45q17j007O2J99o11r12j22Q57M24p7M1P28O10o66o20N14M80J34
$$ plain form
1944 506 -163 819 2113 2099 1323 738 973 752 -251 -933 -364 593 -199 -890 -322 -42 -270 -1677 -1741 -925
1964 -925 -996 -1677 -1246 -19 858 478 170 284 874 637 -114 28 864 1139 879 690 1295 1474 78 -870
1984 -870 -253 -290 -956 -1229 -646 192 -158 -803 -935 -147 -594 -1251 -1385 -343 538 332 429 1234 1711 1321
2004 1321 445 330 942 665 4 -161 861 1317 169 -52 -210 -400 -1049 -1680 -1247 -516 -627 -1009 -726
2023 -726 288 248 -474 -810 -120 287 -291 -156 868 1552 1371 839 819 1390 568 -279 -300 -3 455 -460
2043 -460 -432 156 211 -453 -1326 -1251 -958 -925 -1481 -855 70 721 170 104 473 615 37 -111 225 1236 1010
2064 1010 809 990 1377 821 28 -339 -558 -397 -983 -1051 -447 -65 -331 -1125 -583 -374 -973 -1343 -867 -348
2084 -348 13 -177 235 942 1282 626 91 413 495 114 146 330 1054 970 278 178 114 -165 -1194 -1329 -888
$$ packed form
1944E06o69R82J294j4p76n85K35k21j003o82N69R57p92o91N68K80k28j407o4Q16
1964i25p1o81M31J227Q77l80l08J14N90k37p51J42Q36K75k60j89O05J79j396r48
1984h70O17l7o66k73N83Q38l50o45j32P88m47o57j34J042Q81k06R7Q05M77l90
2004A321q76j15O12k77o61j65J022M56j148k21j58j90o49o31M33P31j11l82K83
2023g26J014m0p22l36O90M07n78J35J024O84j81n32k0N71q22q47k1K97M58r15
2043d60K8N88N5o64q73P5K93L3n56O26R25O51n51o6L69J42n78j48L36J011k26
2064A010k01J81L87n56p93l67k19J61n86o8O04L82k66p94N42K09n99l70M76N19
2084c48L61j90M12P07L40o56n35L22Q2l81L2J84P24q4o92j00o4k79j029j35M41
$$ plain form
2105 -888 -676 -865 -854 -109 220 -119 -266 -360 22 -371 -399 78 939 1359 990 737 987 953 270 -59 -252
2126 -252 421 211 -135 -11 42 32 -581 -951 -742 -1069 -1280 -1279 -763 -58 -386 -297 384 492 338 4 1 526
2148 526 756 664 752 1234 1325 695 144 326 59 -323 -778 -451 -381 -42 -298 -638 -191 -658 -1063 -984 -540 -514
2170 -514 -338 -83 478 785 784 617 349 398 349 97 146 642 675 267 204 426 494 -286 -808 -957 -716 -603 -702
2193 -702 -475 -73 47 24 -596 -148 -124 -334 -372 351 573 777 572 788 1039 827 103 24 200 223 -91 -339
2215 -339 137 438 -176 -550 -581 -702 -953 -1270 -985 -367 -42 -229 155 440 653 -203 -37 393 376 378 19
2236 19 708 1024 872 430 168 179 -121 -576 -681 71 -312 -119 -592 -59 91 -263 -869 -673 -399 -458 -328
2257 -328 -21 419 754 368 342 584 573 143 -344 110 386 687 292 392 543 -25 -440 -671 -456 -621 -1013
$$ packed form
2105h88K12j89J1P45L29l39j47r4L82l93k8M77Q61M20l69k53K50l4o83l29j93
2126b52O73k10l46J24N3j0o13l70K09l27k11JN16P05l28Q9O81J08j54l34lN25
2148E26K30r2Q8M82R1o30n51J82k67l82m55L27P0L39k56l40M47m67m05P9M44K6
2170e14J76K55N61L07jj67k68M9m9k52M9M96L3m08o3K22O8p80n22j49K41J13r9
2193g02K27M02J20k3o20M48K4k10l8P23K22K04k05K16K51k12p24p9J76K3l14k48
2215c39M76L01o14l74l1j21k51l17K85O18L25j87L84K85K13q56J66M30j7Kl59
2236A9O89L16j52m42k62J1l00m55j05P52l83J93m73N33J50l54o06J96K74n9J30
2257c28L07M40L35l86k6K42j1m30m87M54K76L01l95J00J51n68m15k31K15j65l92
$$ plain form
2278 -1013 -577 -196 288 -129 -531 -534 -274 -164 -477 -135 441 487 527 510 862 1112 396 -403 67 203 5
2299 5 -317 -73 364 306 -136 -244 1 -642 -624 -877 -695 -243 47 -310 300 372 238 40 -132 302 289 167
2321 167 314 774 1058 459 357 239 395 22 -769 -696 4 102 -465 -194 -92 100 -336 -680 -236 -228 -327 -317
2343 -317 -181 405 649 392 262 377 613 -57 -96 138 590 619 474 192 315 107 -421 -734 -229 -431 -778
2364 -778 -439 -127 284 -194 8 -54 -87 -145 -412 -165 142 632 465 623 717 748 225 -132 -8 287 -88 -374
2386 -374 -135 209 -30 -135 -159 -364 -397 -513 -645 -128 -64 -222 48 216 443 38 -370 -159 377 43 -32
2407 -32 285 549 585 622 611 274 96 -149 -390 -593 -177 5 -50 -161 75 -195 -265 -557 -465 -379 -364 -208 72
2430 72 476 454 376 257 633 175 -27 -317 133 544 231 276 466 171 216 -231 -242 -187 -409 -427 -698 -184 248
$$ packed form
2278a013M36L81M84m17m02lK60J10l13L42N76M6M0j7L52K50p16p99M70J36j98
2299El22K44M37n8m42j08K45o43J8k53J82M52K90l57O10P2j34j98j72M34j3j22
2321A67J47M60K84n99j02j18J56l73p91P3P00R8n67K71J02J92m36l44M44Qr9J0
2343c17J36N86K44k57j30J15K36o70l9K34M52K9j45k82J23k08n28l13N05k02l47
2364g78L39L12M11m78K02o2l3n8k67K47L07M90j67J58R4L1n23l57J24K95l75k86
2386c74K39L44k39j05k4k05l3j16j32N17O4j58K70J68K27m05m08K11N36l34p5
2407c2L17K64L6L7j1l37j78k45k41k03M16J82n5j11K36k70p0k92R2Q6J5J56K80
2430G2M04k2p8j19L76m58k02k90M50M11l13M5J90k95M5m47j1N5k22j8k71N14M32
$$ plain form
2453 248 -120 -64 -74 82 -270 -268 -180 -4 525 260 655 599 579 458 6 -46 265 26 -313 367 316 194 -255
2476 -255 -209 -274 -468 -560 -729 -499 -203 -258 -17 374 260 264 187 58 53 190 313 -126 184 420 335 13 127
2499 127 217 -47 -165 -438 -194 -57 -388 -18 -78 -151 -291 -316 -294 -333 -126 56 245 319 257 265 270 69 257 14
2523 14 165 49 319 424 242 103 144 15 -353 -431 -464 -444 -687 -334 -103 -172 279 59 -383 147 73 -256
2545 -256 -152 423 377 332 359 472 679 367 366 45 259 137 -39 48 156 -17 -46 -433 -420 -570 -274 -494 -345
2568 -345 -308 -167 72 -1 122 33 -113 -169 194 82 307 274 498 566 400 354 131 -42 20 -162 -357 -435 -315
2591 -315 -351 -18 -129 -300 -265 -188 -223 -381 -298 -154 -259 -54 448 576 241 171 171 -18 123 -131 242 158 288
2614 288 225 216 202 -54 -208 -291 -466 -326 -317 -197 16 146 9 -64 -20 128 -132 -131 248 343 292 304 429 594 355
$$ packed form
2453B48l68N6j0J56l52KQ8J76N29k65L95n6k0j21m52n2L11k39l39O80n1j22m49
2476b55M6o5j94r2j69K30K96n5K41L91j14Mp7j29nJ37J23m39L10K36q5l22J14
2499A27R0k64j18k73K44J37l31L70o0p3j40k5K2l9K07J82J89P4o2QNk01J88k43
2523A4J51j16K70J05j82j39M1j29l68p8l3K0k43L53K31o9M51k20m42N30p4l29
2545b56J04N75m6m5K7J13K07l12jl21K14j22j76Q7J08j73k9l87J3j50K96k20J49
2568c45L7J41K39p3J23q9j46n6L63j12K25l3K24O8j66m6k23j73O2j82j95p8J20
2591c15l6L33j11j71L5P7l5j58Q3J44j05K05N02J28l35p0%j89J41k54L73q4J30
2614B88o3rj4k56j54q3j75J40RJ20K13J30j37p3M4J48k60JL79R5n1J2J25J65k39
$$ plain form
2639 355 54 25 0 67 -12 160 -106 210 30 -242 -337 -254 -248 -412 -89 0 151 102 -378 12 96 85 -61 -44
2663 -44 126 445 177 254 445 273 439 20 -13 117 -224 -177 -400 -114 -241 -461 -234 -220 -137 -446 -391 -441 -93
2686 -93 -19 -74 -31 420 469 256 116 217 77 113 102 -8 194 12 186 -77 -230 -136 -222 -318 -355 -275 -433 -198
2710 -198 -384 145 -76 -42 -161 -182 -160 4 -91 161 217 397 567 543 439 296 -5 -125 -46 -128 -51 -172 -70
2733 -70 -69 -27 -347 36 -208 -293 -401 -233 -128 40 112 6 157 383 -4 48 234 244 218 367 447 136 417
2756 417 -91 208 -111 -162 -402 -324 -285 -289 -36 -295 -218 -265 -264 -418 -206 -130 -75 78 16 60 379 276 227 243 333
2781 333 316 154 157 208 257 51 -42 -2 78 -373 -325 -685 -361 -424 -304 -35 -72 -80 -190 16 88 31 -19 -165 303
2806 303 279 441 311 277 366 366 -113 -331 -72 -11 34 -100 -71 0 -318 83 -353 -601 -358 -397 -341 -152 252 74
$$ packed form
2639C55l01k9k5O7p9J72k66L16j80k72r5Q3Oj64L23Q9J51m9m80L90Q4j1j46J7
2663d4J70L19k68P7J91j72J66m19l3J30l41M7k23K86j27k20K27J4Q3l09N5n0L48
2686i3P4n5M3M51M9k13j40J01j40L6j1j10K02j82J74k63j53R4q6r6l7Q0j58K35
2710a98j86N29k21L4j19k1K2J64r5K52N6J80J70k4j04j43l01j20P9q2P7j21J02
2733g0JM2l20L83k44q5j08J68J05J68P2j06J51K26l87N2J86J0k6J49Q0l11K81
2756D17n08K99l19n1k40P8L9mK53k59P7m7Jj54K12P6N5J53o2M4L19j03m9J6R0
2781C33j7j62LN1M9k06r3M0Q0m51M8l60L24o3J20K69l7qj10K06P2n7n0j46M68
2806C03k4J62j30l4Q9%m79k18K59O1M5j34K9P1l18M01m36k48K43l9N6J89M04j78
$$ plain form
2830 74 -139 213 320 100 88 -107 327 277 287 370 349 500 260 -68 -129 -148 -172 -361 -134 -187 -37 -407 -206
2853 -206 -50 -226 -203 -303 -159 -25 182 62 -2 276 287 398 172 170 93 110 94 224 319 366 -29 -49 183 -74
2877 -74 -299 -338 -392 -275 94 -267 -314 22 -48 -126 -270 99 -112 -125 126 469 431 200 379 171 142 111 -33
2900 -33 -55 -44 -207 11 -4 -54 -32 -249 14 -205 -359 -180 -140 -63 -33 -35 -63 36 135 61 -157 -38 33 284 -115
2925 -115 170 198 -11 106 -277 -271 -52 -46 -260 -229 -136 -190 -52 -337 -76 40 -437 -155 -33 209 215 127 245 371
2949 371 365 158 207 203 10 -15 139 -39 154 254 45 184 -42 -118 -2 -444 -172 -362 -133 -296 -276 -62 -210
2972 -210 -166 31 83 63 90 144 581 503 156 177 374 63 5 -121 -115 203 43 -52 62 138 -200 -196 -265 -458 -227
2997 -227 41 -54 -268 242 135 187 30 221 311 437 62 -186 242 43 311 -57 218 330 69 -237 -216
$$ packed form
2830G4k13L52J07k20j2j95M34n0J0Q3k1J51k40l28o1j9k4j89K27n3J50l70K01
2853b06J56j76K3j00J44J34K07j20o4K78J1J11k26kp7J7j6J30R5M7l95k0K32k57
2877g4k25l9n4J17L69l61m7L36p0p8j44L69k11j3K51L43l8k31J79k08k9l1j44
2900c3k2J1j63K18j5n0K2k17K63k19j54J79M0P7L0kk8R9R9p4k18J19P1K51l99
2925a15K85K8k09J17l83OK19Ok14L1R3n4J38k85K61J16m77K82J22K42Oq8J18J26
2949C71ok07M9mj93k5J54j78J93J00k09J39k26p6J16m42K72j90K29j63K0K14j48
2972b10M4J97N2k0K7N4M37p8l47K1J97l11n8j26OL18j60r5J14P6l38Mo9j93K31
2997b27K68r5k14N10j07N2j57J91R0J26l75k48M28j99K68l68K75J12k61l06K1
$$ plain form
3018 -216 160 -272 -217 -92 -203 -163 -143 -42 -270 5 -206 -288 -111 -87 366 61 283 305 211 49 198 134 393
3041 393 -42 116 125 130 40 -167 -138 190 -331 -192 -369 -281 -220 71 -91 -245 -129 -150 -77 -243 17 106 143 79
3065 79 382 141 76 212 383 -60 36 -242 300 88 -280 -135 30 -334 -70 -144 -432 -112 -5 -231 -82
3086 -82 -25 80 383 43 -144 19 133 101 230 -17 -1 -118 181 222 215 -49 -54 140 -127 -263 -120 -158 92
3109 92 148 -49 -53 -48 -241 -220 145 -58 215 193 52 153 90 180 109 146 -148 -33 172 -109 182 158 80 -91 -103
3134 -103 105 -107 -216 -350 -186 -118 -78 -5 -297 -107 257 -19 -7 -118 94 8 -99 452 185 306 163 583
3156 583 190 -90 5 -17 208 61 -28 -354 78 103 -296 -459 -104 -24 -166 -92 -153 25 118 123 194 224 126 13
3180 13 -97 14 386 137 285 36 362 51 -164 -211 -221 -209 -56 -324 -38 -243 -120 -360 -61 -207 80
$$ packed form
3018b16L76m32N5J25j11M0K0J01k28K75k11q2J77K4M53l05K22K2r4j62J49o4K59
3041C93m35J58RNr0k07K9L28n21J39j77Q8O1K91j62j54J16k1P3j66K60Q9L7o4
3065G9L03k41o5J36J71m43R6k78N42k12l68J45J65l64K64p4k88L20J07k26J49
3086h2N7J05L03l40j87J63J14l2J29k47J6j17K99M1pk64nJ94k67j36J43l8K50
3109I2N6j97mNj93K1L65k03K73k2j41J01o3R0p1L7k94J15K05k81K91k4p8j71j2
3134a03K08k12j09j34J64O8M0P3k92J90L64k76J2j11K12q6j07N51k67J21j43M20
3156E83l93k80R5k2K25j47q9l26M32K5l99j63L55Q0j42P4o1J78R3NP1L0r8j13
3180A3j10J11L72k49J48k49L26l11k15m7j0J2J53k68K86k05J23k40K99j46K87
$$ plain form
3201 80 -34 -46 -54 -83 69 -4 345 206 279 -19 103 270 179 91 143 135 324 -93 -135 -122 -128 -359 -294 -128 -212 57
3227 57 -1 -209 132 -193 -52 -30 -174 112 -181 88 90 388 -19 54 -194 15 211 -11 30 159 -93 -59 23
3250 23 -70 90 -366 -298 -435 -394 -282 19 -156 -137 -19 180 -16 -204 -70 80 -57 99 342 282 44 123
3272 123 415 121 3 -285 -298 172 90 262 -256 -41 -103 -306 -173 -239 11 -147 -600 140 126 26 234 0
3294 0 171 364 -26 -24 270 18 -145 209 67 331 100 -174 -167 -81 -55 -257 -277 -306 213 114 -150 -27 -19 -146
3318 -146 -296 -63 -27 -203 94 242 376 241 257 258 230 253 -226 -169 80 88 -49 296 -85 142 -83 -275 -200
3341 -200 -396 -231 -127 -158 -253 -103 -131 96 -271 130 172 64 30 196 376 285 262 262 0 -103 28 -193 -136
3364 -136 -89 -122 19 195 42 -118 -331 -252 -234 -70 -27 146 96 -219 209 11 62 352 59 90 29 293 314
$$ packed form
3201H0j14j2qk9J52p3L49j39P3k98J22J67r1q8N2qJ89m17m2J3ok31O5J66q4K69
3227E7n8k08L41l25J41K2j44K86k93K69KK98m07P3k48K09J96k22M1J29k52L4Q2
3250B3r3J60m56O8j37M1J12L01j75J9J18J99j96j88J34J50j37J56K43o0k38P9
3272A23K92k94j18k88j3M70q2J72n18K15o2k03J33o6K50j58m53P40j4j00K08k34
3294@J71J93l90KK94k52j63L54j42K64k31k74PQ6K6k02k0k9N19r9k64J23Qj27
3318a46j50K33L6j76K97J48J34j35J6Jk8K3m79N7K49Qj37L45l81K27k25j92P5
3341b00j96J65J04l1r5J50k8K27l67M01M2j08l4J66J80r1k3%k62j03J31k21N7
3364a36M7l3J41J76j53j60k13P9J8J64M3J73n0l15M28j98N1K90k93L1o1K64K1
$$ plain form
3387 314 43 256 195 188 -13 20 -211 -167 -350 -144 -153 25 318 22 -29 -206 -66 -72 -130 229 223 131 152 311 93
3412 93 130 180 -181 93 169 -272 107 86 8 -29 12 41 -173 -127 -128 49 -158 -236 -293 -272 108 139 -188 206 117 10
3438 10 -5 0 -29 98 54 56 371 -116 59 -121 -167 -101 -153 -162 -238 -126 76 -16 -199 -166 -352 -113 97 -353 -99
3463 -99 107 17 -124 -68 123 111 -26 189 122 317 182 186 191 91 -60 25 -32 -83 -58 -36 -74 -239 -159 46 -150
3488 -150 15 5 15 -99 -84 -45 268 -139 198 177 183 38 42 -19 -29 -130 26 -53 -33 31 44 -241 -350 -173 -424
3513 -424 -362 -198 8 -56 -148 -43 -239 -48 -92 358 286 211 -175 -91 266 95 286 223 73 326 98 1 -111
3536 -111 167 -82 52 -266 -40 -169 -338 -70 -332 -15 -30 -109 -9 -13 77 90 139 295 -24 376 176 167 104
3559 104 200 116 61 225 -99 185 -114 -212 -14 -121 -119 -3 -184 -112 119 -122 -174 -28 -296 -297 -63 67 15 39
$$ packed form
3387C14k71K13o1pk01L3k31M4j83K06rJ78K93k96n1j77J40on8L59or2K1J59k18
3412I3L7N0l61K74P6m41L79k1p8l7M1K9k14M6jJ77k07p8n7K1L80L1l27L94q9j07
3438A0j5Nk9J27m4KL15m87J75j80m6O6n2rp6J12K02r2j83L3j86K39K10m50K54
3463i9K06r0j41N6J91j2j37K15o7J95j35MNj00j51Q5n7n1K5K2l8j65Q0K05j96
3488a50J65j0J0j14J5L9L13m07L37k1Oj45Mo1j0j01J56p9K0O4J3k85j09J77k51
3513d24O2J64K06o4r2J05j96J91m4M50p2p5l86Q4L57j71J91o3j50K53k28r7j12
3536a11K78k49J34l18K26j29j69K68k62L17j5p9J00mR0J3M9J56l19M00k00ro3
3559A04R6q4n5J64l24K84k99r8J98j07KJ16j81P2K31k41n2J46k68jK34J30n2K4
$$ plain form
3583 39 104 294 -6 -8 -124 -50 85 240 -43 -7 -113 -227 -219 -144 -62 -116 -208 -56 100 -24 -169 -45 18 -157
3607 -157 67 97 276 140 154 -56 -249 242 115 163 404 221 -13 99 -209 -240 -174 -120 -82 -132 -3 40 13
3630 13 -231 -49 -149 111 66 -247 48 45 70 274 199 -10 -47 -222 -16 249 63 90 290 146 -171 39 -138
3653 -138 -166 -26 -508 -267 -38 57 -46 26 -14 91 -213 56 1 226 236 77 16 -58 115 40 -128 175 403
3676 403 131 -61 -106 3 -55 -60 -62 -137 -128 -303 -67 49 174 180 -20 177 270 -205 -9 34 33 108 99 233 37 227
3702 227 44 243 124 -21 251 -322 -96 120 -39 -125 -104 -235 67 -150 -326 177 -147 -88 -2 72 101 236
3724 236 80 203 147 79 -52 -93 242 38 35 -12 -215 77 -39 -231 31 26 232 -100 -348 117 54 -154 -267
3747 -267 -127 53 -177 -120 33 190 247 53 39 222 -34 -128 167 106 237 115 -75 -284 -68 -99 -280 255
$$ packed form
3583C9O5J90l00kj16P4J35J55k83L6j06j14QP5Q2n4r2J52J56j24j45J24O3j75
3607a57K24L0J79j36J4k10j93M91j27M8K41j83k34J12l08l1O6N4L8n0J29M3k7
3630A3k44J82j00K60m5l13K95lK5K04p5k09l7j75K06K65j86K7K00j44l17K10j77
3653a38k8J40m82K41K29R5j03P2m0J05l04K69n5K25J0j59o1p4J73p5j68L03K28
3676D03k72j92m5J09n8nkp5Rj75K36J16J25Ok00J97R3m75J96M3jP5rJ34j96J90
3702B27j83J99j19j45K72n73K26K16j59q6K1j31L02k17j76N03l24N9Q6P4K9J35
3724B36j56J23n6o8j31m1L35k04lm7k03K92j16j92K62nK06l32k48M65o3k08j13
3747b67J40J80k30N7J53J57N7j94j4J83k56r4K95o1J31j22j90k09K16l1j81N35
$$ plain form
3769 255 -23 -137 -234 -71 -80 106 42 29 147 -22 177 -264 196 47 92 185 68 145 185 261 369 182 2
3792 2 -123 117 -26 65 -306 58 140 -100 125 -204 56 125 147 -26 34 0 -97 92 51 97 111 25 198 -89
3816 -89 122 -2 111 -192 -8 149 9 -174 -152 28 -87 -325 152 73 134 68 115 137 -125 -42 62 119 321
3839 321 143 82 133 213 206 79 163 19 -119 -309 -221 -247 -26 29 251 221 -54 77 -193 -28 112 18 259 -55
3863 -55 38 166 -170 74 -87 50 12 47 16 41 216 234 15 -122 -111 -76 -133 -273 -66 213 -45 315 251 40
3887 40 -128 -36 -255 14 -40 148 95 -167 -309 101 -44 133 48 -219 -67 -19 -29 -168 140 215 -17 36 75
3910 75 42 -157 -158 61 -203 196 36 -154 -45 -35 -84 35 -46 47 38 -54 -235 -25 -64 -10 -74 -5 116 112 52 -100
3936 -100 -140 -70 -25 -134 -83 1 48 -261 -176 126 25 -91 101 -238 27 -110 8 20 33 68 -11 -106 181 222
$$ packed form
3769B55k78j14r7J63rJ86o4j3J18j69J99m41M60j49M5R3j17P7M0P6J08j87j80
3792Bj25K40j43R1l71L64Q2k40K25l29K60O9K2j73O0l4r7J89m1M6J4q6J73k87
3816h9K11j24J13l03J84J57j40j83K2J80j15k38M77p9O1o6M7K2k62Q3J04N7K02
3839C21j78o1N1Q0pj27Q4j44j38j90Q8k6K21N5K22l0k75J31k70J65J40r4K41l14
3863e5R3J28l36K44j61J37l8L5l1K5J75J8k19j37J1L5n7j40K07K79k58L60o4k11
3887D0j68R2k19K69n4J88n3k62j42M10j45J77q5k67J52M8j0j39L08P5k32N3L9
3910G5l3j99jK19k64L99j60j90J09J0m9J19q1R3rr2j81K10l9N4o4O9J21mo0j52
3936a00m0P0M5j09N1Q4M7l09Q5L02j01j16J92l39K65j37J18J2J3L5p9r5K87M1
$$ plain form
3960 222 74 -82 -154 -2 -19 93 96 0 -138 87 10 195 -97 201 57 -176 -181 55 105 143 136 82 -107 89
3984 89 -175 -99 -84 10 -39 -33 168 -49 -220 -112 17 -82 201 -51 -91 143 -6 -55 2 5 132 160 22 27 -63 25
4010 25 -248 -46 149 239 75 -64 190 195 -144 -40 -173 -5 -85 8 19 165 -176 -149 -19 68 -88 199 1
4033 1 75 12 95 -85 208 96 128 177 -141 -72 61 -66 -81 -66 -51 280 192 -47 69 -142 -168 -12 -59 -65 123
4058 123 -160 -47 33 -135 -86 30 163 -234 -204 61 48 232 -129 4 -1 195 -28 174 133 67 98 78 -24
4081 -24 -130 178 74 -113 202 12 73 -192 8 -164 45 -306 -194 195 -29 -159 -67 192 -95 -178 9
4102 9 -281 -130 -86 70 19 30 -195 -97 -50 157 -118 84 48 101 -37 1 -74 154 -94 -238 -40 -75 -75 -71 18 136
4128 136 42 -41 220 65 -95 94 83 -279 74 -137 -55 -162 224 203 20 105 146 -81 87 180 -71 210 -224
$$ packed form
3960B22j48j56p2J52j7J12Lr6j38K25p7J85k92K98j44k33nK36N0L8pn4j89J96
3984H9k64P6J5R4m9OK01k17j71J08J29r9K83k52m0K34j49m9N7LJ27K8j38Nr0Q8
4010B5k73K02J95R0j64j39K54Nl39J04j33J68q0R3J1J46l41K7J30Q7j56K87j98
4033AP4o3Q3j80K93j12L2M9l18O9J33j27j5J5J5L31q8k39J16k11k6J56m7oJ88
4058A23k83J13Q0j68M9J16J33l97L0K65j3J84l61J33nJ96k23K02m1o6L1k0j02
4081b4j06L08j04j87L15j90O1k65K00j72K09l51J12L89k24j30R2K59k87q3J87
4102Ik90J51M4J56n1J1k25R8M7K07k75K02l6N3j38L8p5K28k48j44J98l5%MQ9J18
4128A36r4q3K61j55j60J89j1l62L53k11Q2j07L86k1j83Q5M1k27J68R3k51K81m34
$$ plain form
4151 -224 -4 28 -82 115 74 -231 197 -7 -110 131 -14 18 69 -52 -110 31 -42 -25 -44 36 -165 300 175
4174 175 11 82 149 -118 -20 136 89 28 -25 -117 130 -62 10 82 -21 -240 -317 74 200 14 -53 -13 -75 6 40
4199 40 58 -9 -242 9 32 114 -15 -36 -65 14 -191 -147 -216 117 -164 -48 -22 -13 -170 100 135 11 54 -127 -338
4224 -338 -188 -139 -116 -73 -122 -302 -11 34 374 -81 -41 78 -252 -127 -286 -106 -14 238 -272 -37 206 221 17
4247 17 110 1 322 78 20 75 -63 76 53 -12 80 -15 105 -14 -56 315 15 -203 -95 119 -94 -165 1
4270 1 9 51 73 32 165 -105 14 58 198 54 -19 -42 227 -65 24 -59 34 -129 -58 71 136 26 -261 -25 -149
4295 -149 120 394 -58 -156 119 99 -143 12 -91 -105 160 -105 -193 -255 61 -50 305 94 54 266 -67 -218
4317 -218 -8 156 -114 -143 99 165 -37 57 175 41 5 -72 207 -56 -172 -129 -99 181 -76 -122 100 -131 97
$$ packed form
4151b24K20L2j10J97m1l05M28k04j03K41j45L2N1j21n8J41p3J7j9Q0k01M65j25
4174A75j64P1O7k67R8J56m7o1n3r2K47j92P2P2j03k19p7L91J26j86o7M0o2Q1L4
4199D0J8o7k33K51K3Q2j29k1k9P9k05M4o9L33k81J16K6Rj57K70L5j24M3j81k11
4224c38J50M9K3M3m9j80K91M5L40m55M0J19l30J25j59J80R2K52n10K35K43J5k04
4247A7R3j09L21k44n8N5j38J39k3o5R2r5J20j19m2L71l00k18J08K14k13p1J66
4270AQM2K2m1J33k70J19M4J40j44p3k3K69k92Q9q3R3j63P1J29O5j10k87K36j24
4295a49K69K74m52r8K75k0k42J55j03j4K65k65q8o2L16j11L55k11m0K12l33j51
4317b18K10J64k70k9K42O6k02R4J18j34l6p7K79k63j16M3L0K80k57m6K22k31K28
$$ plain form
4340 97 -139 -234 -116 158 -75 -173 108 -43 13 53 1 183 -176 -112 -355 54 -120 213 48 -92 291 285 95
4363 95 -355 -83 -204 -26 280 -17 -122 147 -94 -132 96 130 -112 -62 -92 125 -60 -328 -144 -102 -213 93
4385 93 128 -57 164 67 40 131 156 196 233 62 187 134 107 250 -59 84 21 -174 185 43 123 17 -65 -9 16
4410 16 55 -161 -105 38 -2 2 152 151 27 -193 58 46 165 89 -124 82 -22 -85 21 52 4 158 -200 53
4434 53 102 101 88 -103 35 -74 106 -222 89 154 21 70 185 62 -141 -98 -6 -21 18 -158 -141 -4 87 141 80
4459 80 -149 95 20 -254 -260 -216 -162 -47 222 -25 -182 -50 47 -198 232 110 198 8 137 169 -129 -186 21
4482 21 151 93 -118 -85 -116 -173 -309 -74 -192 -102 -138 101 -19 380 153 26 253 382 -19 191 104 -229 67
4505 67 87 -199 -72 29 -36 107 28 -104 -282 -10 -42 -105 -195 -48 -122 -43 206 -182 -7 28 260 90 -133
$$ packed form
4340I7k36r5J18K74k33r8K81j51N6M0n2J82l59O4k43M09j74L33j65j40L83oj90
4363I5m50K72j21J78L06k97j05K69k41l8K28L4k42N0l0K17j85k68J84M2j11L06
4385I3L5j85K21r7k7R1K5M0L7j71J25n3k7J43l09J43o3j95L59j42Q0j06q2N6K5
4410A6L9k16N6J43m0MJ50jj24k20K51j2J19p6k13K06j04o3J06L1m8J54l58K53
4434E3M9jj3j91J38j09J80l28L11O5j33M9J15j23k03M3R2j5L9j76J7J37R1N4o1
4459H0k29K44p5k74oM4N4J15K69k47j57J32R7k45M30j22Q8j90J29L2k98n7K07
4482B1J30n8k11L3l1n7j36K35j18R0l6K39j20L99k27j27K27J29m01K10q7l33K96
4505F7K0k86J27J01o5J43p9j32j78K72l2o3r0J47p4P9K49l88J75L5K32j70k23
$$ plain form
4528 -133 -107 -55 38 96 216 -131 -29 129 -170 -41 -196 215 56 4 25 -13 -34 -38 -250 -25 -108 -152 -77 -181
4552 -181 19 73 -104 -152 -94 -204 32 130 -9 67 -47 -195 17 143 57 -233 -15 -44 -30 95 51 29 76 -182
4576 -182 8 -135 -9 249 -13 -99 101 59 -166 -11 -106 252 112 -143 -188 162 -2 -142 39 -209 19
4597 19 -98 -167 100 -135 -88 -176 -21 70 36 145 245 -72 153 -143 -34 -33 103 -35 126 81 41 67 -124 156
4621 156 -164 -323 256 -48 16 -212 27 -204 52 -20 -314 55 356 53 61 128 -392 118 156 -66 254 -43
4643 -43 369 -109 -37 30 214 -314 -54 37 48 95 -79 48 108 93 -96 -335 -155 158 -42 17 -198 192 -91
4666 -91 -103 -186 273 -139 -123 -184 -260 -14 156 -56 -188 145 103 5 -172 121 19 65 -212 87 153 -52 -139 -28
4690 -28 171 -65 64 -102 -114 93 -97 242 -164 -42 255 212 126 189 29 194 -19 -85 73 56 -39 170 -134
$$ packed form
4528a33K6N2R3N8J20l47J02J58k99J29j55M11j59n2K1l8k1mk12K25q3m4P5j04
4552a81K00N4j77m8N8j10K36R8j39P6j14j48K12J26q6k90K18k9J4J25m4k2M7k58
4576a82J90j43J26K58k62q6K00m2k25J55r5L58j40k55m5L50j64j40J81k48K28
4597A9j17o9K67k35M7q8J55R1l4J09J00l17K25k96J09JJ36j38J61m5m0K6j91K80
4621A56l20j59N79l04O4k28K39k31K56p2k94L69L01l03QO7n20N10L8k22L20k97
4643d3M12m78P2O7J84n28K60R1J1M7j74J27O0j5j89k39J80L13k00N9k15L90k83
4666i1j2q3M59m12J6o1p6K46J70k12j32L33m2r8j77K93j02M6k77K99O6k05q7J11
4690b8J99k36J29j66j2K07j90L39m06J22K97m3q6O3j60J65k13o6J58j7r5K09l04
$$ plain form
4713 -134 20 89 -39 -1 -33 -146 -8 186 171 117 21 -5 238 -182 30 -59 -158 148 50 -52 0 76 -110 137
4737 137 -196 138 59 -130 -78 39 101 -108 175 41 -18 -24 15 -25 155 -33 66 356 -36 45 212 75 -84
4760 -84 -157 127 95 -220 -18 130 -95 -178 37 -199 -190 -261 -72 -126 -336 167 -82 57 -56 -122 -111 87 -152
4783 -152 105 -130 26 -27 54 138 231 -23 -79 -71 -280 1 -57 -248 164 275 144 -255 -75 -174 119 -165 -43
4806 -43 181 246 -38 -79 11 114 50 4 -1 40 -80 -117 141 -217 -21 25 -98 -208 108 199 91 65 -30 170 137
4831 137 -185 -123 -289 -208 27 -153 -14 96 -64 25 176 105 -100 208 -194 109 46 94 58 157 48 87 235
4854 235 108 57 -216 -95 10 -119 -244 -95 127 -36 -43 260 -185 -64 -257 -152 69 -78 -76 -3 -49 167
4876 167 -75 2 -34 -53 -51 -8 116 6 14 154 23 -255 18 224 -110 -206 -120 98 -138 338 33 -125 6
$$ packed form
4713a34J54O9j28L8l2j13J38J94j5n4r6k6K43m20K12q9r9L06r8j02N2P6j86K47
4737A37l33L34p9j89N2J17O2k09K83j34n9oL9m0J80j88R9K90l92Q1J67j37j59
4760h4p3K84l2l15K02J48k25q3K15k36Rp1J89n4k10N03k49J39j13o6J1J98k39
4783a52K57k35J56n3Q1Q4R3k54n6Qk09K81n8j91M12J11j31l99J80r9K93k84J22
4806d3K24O5k84m1R0J03o4m6nM1j20l7K58l58J96M6j23j10L16R1j08k6r5K00l3
4831A37l22O2j66Q1K35j80J39J10j60Q9J51p1k05L08m02L03o3M8l6R9j09L9J48
4854B35j27n1k73J21J05j29j25J49K22j63pL03m45J21j93J05K21j47KP3m6K16
4876A67k42P7l6j9KM3J24j10QJ40j31k78K73K06l34r6Q6K18k36M76l05j58J31
$$ plain form
4899 6 61 -74 -75 -126 -30 -145 -24 29 -114 82 75 26 77 190 122 -188 129 -346 23 64 -278 -85 -123 152 26
4924 26 -25 17 243 58 -64 -18 -93 135 36 35 -65 -103 -162 97 47 7 -9 309 -187 -196 158 93 -235 -56 -78 9
4950 9 99 -289 -109 214 72 124 -211 -101 -32 -12 225 -162 -26 -23 76 52 170 -50 148 152 75 -59 483 38
4974 38 -190 39 -125 -3 4 10 -43 -58 -171 -7 49 95 271 -55 -85 13 220 89 -63 49 246 -181 -58 80
4998 80 143 -97 95 -140 -166 166 -22 83 -188 336 -230 129 -7 -12 93 178 287 124 -34 12 43 -13 144
5021 144 -15 47 -10 11 -98 202 165 -110 -126 17 -19 75 87 -52 54 -78 -207 165 -17 39 182 138 166 -26
5045 -26 159 7 -124 73 184 210 40 109 55 150 340 16 13 -213 -30 131 83 331 -5 -186 139 -53 226
5068 226 -96 29 216 -55 39 -27 58 211 10 -168 -206 -117 104 -26 117 -57 13 39 -45 -40 97 -129 -130 19
$$ packed form
4899FN5j35jn1R6j15J21N3j43J96pm9N1J13o8l10L17m75L69M1l42J93l8K75j26
4924B6n1M2K26j85j22M6p5K28r9jj00l8n9K59n0m0j6L18m96rL54o5l28J79k2Q7
4950IR0l88J80L23j42N2l35J10O9K0K37l87J36LR9k4J18k20J98Mp7j34N42m45
4974C8k28K29j64J22POn3j5j13J64N6M6J76l26l0R8K07j31j52J12J97m27J23J38
4998H0O3k40J92k35k6L32j88J05k71N24n66L59j36nJ05Q5J09j63j58M6L1n6J57
5021A44j59O2n7K1j09L00l7k75j6J43l6R4J2j39J06j32j29L72j82N6J43m4K8j92
5045b6J85j52j31J97J11K6j70O9n4R5J90l24lk26J83J61m8K48l36j81L25j92K79
5068B26l22J25J87k71R4o6Q5J53k01j78l8Q9K21j30J43j74P0K6q4NJ37k26jJ49
$$ plain form
5092 19 107 -162 -177 92 -90 -143 91 -134 -78 149 -50 173 61 125 -50 54 -162 139 -175 111 79 -54
5114 -54 74 -125 -290 165 198 22 -160 2 32 -108 86 -76 173 -155 -164 146 115 153 78 -37 127 -32 110
5137 110 298 -94 -1 -43 -10 101 -8 -69 -112 68 -9 -209 -13 124 66 125 -25 -10 146 103 250 -78 124
5160 124 115 40 18 59 237 -147 279 -102 -211 -119 222 -170 87 49 187 -330 -81 -160 -87 46 -99 -86 14
5183 14 -26 -85 -2 -322 -46 -85 86 -39 -263 147 -2 -158 85 -41 -219 -23 255 -203 -97 -108 147 114
5205 114 73 202 -84 -166 -27 -35 43 132 -40 -252 -137 61 -77 138 104 -142 110 241 54 154 181 -33 -140
5228 -140 -60 -9 236 36 -113 4 -313 -17 -83 -94 -158 63 -83 59 332 19 143 -57 -230 184 -141 -180
5250 -180 5 -181 -186 114 -229 355 -20 67 -2 -102 91 72 -47 29 -50 -178 -52 45 6 -46 -61 182 7 57
$$ packed form
5092A9Q8k69j5K69j82n3K34k25N6K27j99K23j12O4j75J04k16L01l14K86l2j33
5114e4J28j99j65M55L3j76j82J62L0j40J94j62K49l28rL10l1L8p5j15J64j59J42
5137A10J88l92R3m2L3J11j09o1m3J80p7k00J96J37n8N9j50J5J56m3J47l28K02
5160A24rp5k2M1J78l84M26l81j09R2L41l92K57l8J38n17K49p9P3J33j45J3J00
5183A4m0n9Q3l20K76l9J71j25k24M10j49j56K43j26j78J96K78m58J06j1K55l3
5205A14m1J29k86q2J39qP8Q9j72k12J15J98j38K15l4k46K52J31j87J00K7k14j07
5228a40Q0N1K45k00j49J17l17K96o6j1o4K21j46J42K73l13J24k00j73M14l25l9
5250a80J85j86nL00l43N84l75Q7o9j00J93j9j19P6p9j28J26R7l9n2j5K43j75N0
$$ plain form
5274 57 273 53 19 -88 34 12 77 -18 21 -29 62 -22 -151 20 -70 -111 93 95 -58 -138 214 -20 162 -144 -258
5299 -258 91 -56 -47 -14 49 47 225 96 28 -83 9 47 -73 -107 68 183 -86 75 -85 -28 279 -102 188 142
5323 142 -6 -83 -58 18 -127 -101 35 165 76 79 -43 -161 -90 207 8 -117 35 41 -90 -56 118 149 46 29
5347 29 -136 0 111 -126 81 88 53 -21 98 -21 -61 1 145 -35 -203 86 -10 207 -105 -145 241 -25 16
5370 16 104 99 26 -7 -200 180 100 -114 -3 7 -2 -60 106 -4 12 154 124 166 122 -66 -134 81 -106 -245 -56
5395 -56 118 224 -127 10 162 142 -121 -89 36 -285 6 205 -60 -84 -245 -41 -59 -90 -1 -116 -82 93 89
5418 89 17 92 -19 15 -168 -17 -33 127 5 34 161 -223 -41 -150 1 79 -14 19 11 -137 -291 -34 -75 -26
5442 -26 9 191 241 202 30 77 36 -155 132 189 29 -23 76 -74 -21 -87 -66 -98 -406 -110 39 78 54 -8 -32 -61
$$ packed form
5274E7K16k20l4j07J22k2O5r5L9n0R1q4j29J71r0m1K04Kj53q0L52k34J82l06j14
5299b58L49j47RL3O3kJ78j29o8j11R2L8j20l4J75J15k69J61j60N7L07l81K90m6
5323A42j48p7K5P6j45K6J36J30q9Lj22j18P1K97j99j25J52Oj31L4J74L1j03j7
5347B9j65J36J11k37K07Pl5p4J19j19m0O2J44j80j68K89r6K17l12m0L86k66M1
5370A6Q8np3l3j93L80q0k14J11J0rn8J66j10J6J42l0M2m4j88o8K15j87j39J89
5395e6J74J06l51J37J52k0k63L2J25l21K91J99k65k4j61K04j8l1Q9j15L4J75m
5418H9p2P5j11L4j83J51j6J60j22K9J27l84J82j09J51P8r3L3qj48j54K57m1M9
5442b6L5J82N0l9j72M7m1j91K87N7j60n2R9j50N3o6K1l2l08K96J49L9k4o2k4k9
$$ plain form
5468 -61 6 -154 15 105 131 -28 88 -137 29 -11 -72 -237 17 -159 -11 72 -117 -205 -3 126 -21 -102 -71
5491 -71 -331 259 383 134 -22 134 84 -34 -187 -96 -179 -7 -156 99 -19 38 134 44 -97 -58 -135 103 281
5514 281 -17 61 33 -18 73 71 141 62 49 47 -120 -98 -31 189 129 55 -227 -41 107 -193 104 -95 26 -90 -158
5539 -158 -41 128 -208 -22 149 138 -36 -35 259 177 -275 74 91 209 174 82 -81 -11 107 -51 21 53 210
5562 210 -58 -60 -78 399 124 -343 -112 15 142 104 -38 -6 60 -113 32 67 -37 102 100 354 -111 -133 -87 137
5586 137 -33 -81 9 127 -227 64 283 109 64 137 -151 -34 -42 -157 355 -145 -227 14 51 52 -66 31 53 13
5610 13 -56 -43 25 66 14 -101 158 -140 -33 -132 120 -286 -33 104 124 -74 8 32 22 -109 142 -81 64 35
5634 35 49 -2 94 -39 63 14 32 -239 -87 58 -401 30 -245 13 238 -13 -131 34 -57 223 98 -82
$$ packed form
5468f1O7j60J69R0K6j59J16k25J66m0o1j65K54j76J48Q3j89q8K02J29j47q1L1
5491g1k60N90J24k49j56J56n0j18j53R1q3J72j49K55j18N7R6r0j41L9p7K38J78
5514B81k98P8k8n1R1kP0p9j3kj67K2O7K20o0p4k82J86J48l00K97j99J21j16o8
5539a58J17J69l36J86J71j1j74JK94q2m52L49J7J18l5r2j63P0J18j58P2L2J57
5562B10k68kj8M77k75m67K31J27J27l8j42L2O6j73J45L5j04J39kK54m65k2M6K24
5586A37j70m8R0J18l54K91K19j74m5P3k88J17qj15N12n00q2K41L7Jj18R7K2m0
5610A3o9J3O8M1n2j15K59k98J07r9K52m06K53J37K0j98Q2K4j0j31K51k23J45k9
5634C5J4n1R6j33J02m9J8k71J52J45m59M31k75K58K25k51j18J65r1K80j25j80
$$ plain form
5656 -82 -115 140 252 -50 210 -65 -136 -163 -152 111 29 -40 -224 94 0 -142 27 -42 159 41 -53 -65 102 -71
5680 -71 -28 -89 -10 225 262 132 10 62 23 -127 102 -50 325 9 67 90 150 153 -50 -62 -64 -38 -92 -4 -132 195
5706 195 -109 -50 -14 69 76 169 -94 -19 104 133 -267 -83 38 -90 -118 -143 137 -4 163 87 139 43 -321 52
5730 52 168 127 84 -124 89 284 -53 46 -216 -65 -34 106 86 100 -35 219 -231 -45 -33 -110 47 45 -67 84
5754 84 -19 -43 55 34 -28 48 -199 -106 -122 132 -116 55 -61 -211 -31 87 -6 -26 242 -167 122 -195 -24
5777 -24 -7 -198 18 -66 -23 137 150 -152 -115 -23 -112 191 -143 23 5 15 18 -130 65 -110 256 -184 96 -248
5801 -248 56 -237 -13 -29 73 -76 -65 199 -27 53 -34 252 104 -96 -2 -18 -124 -16 100 -129 -17 81
5823 81 59 92 34 -166 124 116 45 -140 214 -78 -201 194 -252 43 76 43 149 -86 -99 -22 -209 8 121 139
$$ packed form
5656h2l3K55J12l02K60k75p1k7J1K63q2o9j84L18r4j42J69o9K01j18r4j2J67j73
5680g1M3o1P9K35L7j30j22N2l9j50K29j52L75l16N8K3O0Lk03j2kK6n4Q8j28L27
5706A95l04N9L6Q3PR3k63P5J23K9m00J84J21j28k8k5K80j41J67p6N2r6l64L73
5730E2J16m1m3k08K13J95l37R9k62J51L1J40k0J4j35K54m50J86J2p7J57kj12J51
5754H4j03k4R8k1o2P6k47R3j6K54k48J71j16j50J80J18r3k0K68m09K89l17J71
5777b4J7j91K16q4M3J60J3l02L7R2q9L03l34J66j8J0Lj48J95j75L66m40K80l44
5801b48L04k93K24j6J02j49J1K64k26Q0q7K86j48k00R4j6j06J08J16k29J12R8
5823H1k2L3n8k00K90qp1j85L54k92j23L95m46K95L3l3J06k35j3P7j87K17J13J8
$$ plain form
5847 139 108 -172 121 23 -89 130 -33 -78 -168 -91 -34 -44 72 -278 259 -234 -196 224 -44 4 -237 30 15
$$ packed form
5847A39l1k80K93r8j12K19j63m5r0P7N7j0J16l50N37m93L8M20k68M8k41K67j5
$$ [...]
8191a30
##END NTUPLES=NMR FID
##END=
