##TITLE=1H_SR75_DMSO-DCC
 DMSO
 8 sc, 
 13.05.2022
##JCAMPDX= 6.0         $$ Bruker NMR JCAMP-DX V2.0
##DATA TYPE= NMR FID
##DATA CLASS= NTUPLES
##ORIGIN= UXNMR, Bruker Analytische Messtechnik GmbH
##OWNER= root
$$ XWIN-NMR		Version 3.5
$$ Fri May 13 15:27:00 2022 Russian Standard Time (UT+4h)  she@DPX200
##.OBSERVE FREQUENCY= 200.1313499996
##.OBSERVE NUCLEUS= ^1H
##.DELAY= (6, 6)
##.ACQUISITION MODE= SIMULTANEOUS
##.ACQUISITION SCHEME= undefined
##.AVERAGES= 8
##.DIGITISER RES= 18
##SPECTROMETER/DATA SYSTEM= spect
##.PULSE SEQUENCE= zg30
##.SOLVENT NAME= DMSO
##.SHIFT REFERENCE= (INTERNAL, DMSO, 0, 15.7039)
##AUDIT TRAIL= $$ (NUMBER, WHEN, WHO, WHERE, WHAT)
$$ ##TITLE= Audit trail, XWIN-NMR		Version 3.5
$$ ##JCAMPDX= 5.01
$$ ##ORIGIN= Bruker BioSpin GmbH
$$ ##OWNER= she
$$ F:/spectra/data/she/nmr/H-F/1/audita.txt
$$ ##AUDIT TRAIL=  $$ (NUMBER, WHEN, WHO, WHERE, WHAT)
(   1,<2022-05-13 15:26:01.20 +0400>,<she>,<DPX200>,
      <created by zg, POWCHK disabled, PULCHK disabled
       configuration hash MD5:
       00 E9 B6 7A A2 85 ED C7 34 08 36 98 17 FE 4E 26
       data hash MD5: 16K
       3A E9 6B 07 86 AD 26 24 CF DF 4B BE C1 C4 B1 96>)
$$ ##END=
$$ 
$$ hash MD5
$$ 3C 7C 1B 9B 63 D5 4E 68 EF B9 B5 BA 42 61 67 58
##$RELAX= 
##$RELAX= 
##$RELAX= 
##$RELAX= 
##$RELAX= 
##$RELAX= 
$$ Bruker specific parameters
$$ --------------------------
##$DU= <F:/spectra>
##$EXPNO= 1
##$NAME= <H-F>
##$PROCNO= 1
##$TYPE= <nmr>
##$USER= <she>
##$AMP= (0..31)
100 100 100 100 100 100 100 100 100 100 100 100 100 100 100 100 100 100 
100 100 100 100 100 100 100 100 100 100 100 100 100 100 
##$AQSEQ= 0
##$AQ_mod= 1
##$AUNM= <au_zg>
##$AUTOPOS= <>
##$BF1= 200.13
##$BF2= 200.13
##$BF3= 200.13
##$BF4= 200.13
##$BF5= 200.13
##$BF6= 200.13
##$BF7= 200.13
##$BF8= 200.13
##$BYTORDA= 1
##$CFDGTYP= 0
##$CFRGTYP= 5
##$CHEMSTR= <none>
##$CNST= (0..31)
1 1 145 1 1 1 1 1 1 1 1 1 1 1 1 1 1 1 1 1 1 1 1 1 1 1 1 1 1 1 1 1 
##$CPDPRG= <>
##$CPDPRG1= <>
##$CPDPRG2= <>
##$CPDPRG3= <>
##$CPDPRG4= <mlev>
##$CPDPRG5= <mlev>
##$CPDPRG6= <mlev>
##$CPDPRG7= <mlev>
##$CPDPRG8= <mlev>
##$CPDPRGB= <>
##$CPDPRGT= <>
##$D= (0..31)
0 1.2 0 0 0 0 0 0 0 0.06 0 0.03 0 0 0 0 0.0002 0 0 0 0 0 0 0 0 0 0 0 0 
0 0 0 
##$DATE= 1652441160
##$DBL= (0..7)
120 120 120 120 120 120 120 120 
##$DBP= (0..7)
150 150 150 150 150 150 150 150 
##$DBP07= 0
##$DBPNAM0= <>
##$DBPNAM1= <>
##$DBPNAM2= <>
##$DBPNAM3= <>
##$DBPNAM4= <>
##$DBPNAM5= <>
##$DBPNAM6= <>
##$DBPNAM7= <>
##$DBPOAL= (0..7)
0.5 0.5 0.5 0.5 0.5 0.5 0.5 0.5 
##$DBPOFFS= (0..7)
0 0 0 0 0 0 0 0 
##$DE= 6
##$DECBNUC= <off>
##$DECIM= 32
##$DECNUC= <off>
##$DECSTAT= 4
##$DIGMOD= 1
##$DIGTYP= 9
##$DL= (0..7)
0 120 120 120 120 120 120 120 
##$DP= (0..7)
150 150 150 150 150 150 150 150 
##$DP07= 0
##$DPNAME0= <>
##$DPNAME1= <>
##$DPNAME2= <>
##$DPNAME3= <>
##$DPNAME4= <>
##$DPNAME5= <>
##$DPNAME6= <>
##$DPNAME7= <>
##$DPOAL= (0..7)
0.5 0.5 0.5 0.5 0.5 0.5 0.5 0.5 
##$DPOFFS= (0..7)
0 0 0 0 0 0 0 0 
##$DQDMODE= 0
##$DR= 18
##$DS= 0
##$DSLIST= <SSSSSSSSSSSSSSS>
$$ [...]
##$SUBNAM2= <"">
##$SUBNAM3= <"">
##$SUBNAM4= <"">
##$SUBNAM5= <"">
##$SUBNAM6= <"">
##$SUBNAM7= <"">
##$SUBNAM8= <"">
##$SUBNAM9= <"">
##$SW= 18.0517283424761
##$SWIBOX= (0..15)
0 0 2 0 0 0 0 0 0 0 0 0 0 0 0 0 
##$SW_h= 3612.71676300578
##$TD= 16384
##$TD0= 1
##$TE= 0
##$TE2= 300
##$TE3= 300
##$TEG= 300
##$TL= (0..7)
0 120 120 120 120 120 120 120 
##$TP= (0..7)
150 150 150 150 150 150 150 150 
##$TP07= 0
##$TPNAME0= <>
##$TPNAME1= <>
##$TPNAME2= <>
##$TPNAME3= <>
##$TPNAME4= <>
##$TPNAME5= <>
##$TPNAME6= <>
##$TPNAME7= <>
##$TPOAL= (0..7)
0.5 0.5 0.5 0.5 0.5 0.5 0.5 0.5 
##$TPOFFS= (0..7)
0 0 0 0 0 0 0 0 
##$TUNHIN= 0
##$TUNHOUT= 0
##$TUNXOUT= 0
##$USERA1= <user>
##$USERA2= <user>
##$USERA3= <user>
##$USERA4= <user>
##$USERA5= <user>
##$V9= 5
##$VALIST= <valist>
##$VCLIST= <CCCCCCCCCCCCCCC>
##$VD= 0
##$VDLIST= <DDDDDDDDDDDDDDD>
##$VPLIST= <PPPPPPPPPPPPPPP>
##$VTLIST= <TTTTTTTTTTTTTTT>
##$WBST= 1024
##$WBSW= 4
##$XGAIN= (0..3)
0 0 0 0 
##$XL= 0
##$YL= 0
##$YMAX_a= 104471
##$YMIN_a= -169180
##$ZGOPTNS= <>
##$ZL1= 120
##$ZL2= 120
##$ZL3= 120
##$ZL4= 120
##$ABSF1= 10
##$ABSF2= 0
##$ABSG= 5
##$ABSL= 3
##$ALPHA= 0
##$AQORDER= 0
##$ASSFAC= 0
##$ASSFACI= 0
##$ASSFACX= 0
##$ASSWID= 0
##$AUNMP= <proc_1d>
##$AZFE= 0.1
##$AZFW= 0.1
##$BCFW= 1
##$BC_mod= 2
##$BYTORDP= 1
##$COROFFS= 0
##$CY= 11.3945322036743
##$DATMOD= 1
##$DC= 2
##$DFILT= <>
##$DTYPP= 0
##$F1P= 2.36226072786647
##$F2P= -0.459571619588291
##$FCOR= 0.5
##$FTSIZE= 0
##$FT_mod= 4
##$GAMMA= 1
##$GB= 0.15
##$INTBC= 1
##$INTSCL= 1
##$ISEN= 128
##$LB= 0.24
##$LEV0= 0
##$LPBIN= 0
##$MAXI= 10000
##$MC2= 0
##$MEAN= 0
##$ME_mod= 0
##$MI= 1.114404
##$NCOEF= 0
##$NC_proc= 0
##$NLEV= 6
##$NOISF1= 3.799351
##$NOISF2= 2.8
##$NSP= 1
##$NTH_PI= 0
##$NZP= 0
##$OFFSET= 15.70392
##$PC= 1
##$PHC0= -18036.48
##$PHC1= 10.40074
##$PH_mod= 1
##$PKNL= yes
##$PPARMOD= 0
##$PSCAL= 0
##$PSIGN= 0
##$REVERSE= no
##$SF= 200.130013532006
##$SI= 16384
##$SIGF1= 3
##$SIGF2= 2
##$SINO= 400
##$SIOLD= 16384
##$SREGLST= <1H.CDCl3>
##$SSB= 0
##$STSI= 0
##$STSR= 0
##$SW_p= 3612.71676300578
##$SYMM= 0
##$S_DEV= 0
##$TDeff= 0
##$TDoff= 0
##$TI= <>
##$TILT= no
##$TM1= 0
##$TM2= 0
##$TOPLEV= 0
##$USERP1= <user>
##$USERP2= <user>
##$USERP3= <user>
##$USERP4= <user>
##$USERP5= <user>
##$WDW= 1
##$XDIM= 8192
##$YMAX_p= 0
##$YMIN_p= 0
$$ End of Bruker specific parameters
$$ ---------------------------------
##NTUPLES= NMR FID
##VAR_NAME=  TIME,          FID/REAL,        FID/IMAG
##SYMBOL=    X,             R,               I
##VAR_TYPE=  INDEPENDENT,   DEPENDENT,       DEPENDENT
##VAR_FORM=  AFFN,          ASDF,            ASDF
##VAR_DIM=   8192,          8192,            8192
##UNITS=     SECONDS,       ARBITRARY UNITS, ARBITRARY UNITS
##FACTOR=    0.0002768,     1,               1
##FIRST=     0,             0,               0
##LAST=      2.2672688,     0,               0
##MIN=       0,             -169180,         0
##MAX=       2.2672688,     104471,          0
$$ Real data points
##PAGE= N=1
##DATA TABLE= (X++(R..R)), XYDATA
$$ [...]
1766a42K80ro4J05k16K06k13K8m4q0K73q1K09j80k57M18k48l2L27m55K94m39L43
1789B3l3j30L75j06k11k9K11j4Q9k0k63K6J10k16P2P7k7J79k23L17q1j12N5K06
1813B75k80P0j38N5l29J71R7Kl4P7q5j46p8L67L9J15j87n9J84k4J11k66r3L76
1837B20j18k90J00nQ7p9K78k46K62p9j82n3P4J09Q6k40L05l56J39R6k36r7J73
1860e2R0K6r3j98K97k19L32L0j41l82J84kJ42k9l3O4pj06J85J25m0j65j23M6Q3
1885A4J6r7O6K8j26J67R5j12K75k25j24J34j02j63n4R4J53K3j63J12j0J3r1J69
1909I2J09k73N0M6M3k83N8J34P1p7O4o0j13L14j65P7j80j31J93j05L49j96k5K60
1933B52k91k3J16r6M7M6k07r3K02o1jJ17q9L74m39M26k92o6N7K05l71K92r5j32
$$ y = [-142, 138, 129, 65, 170, -46, 160, -53, -25, -69, -149, 124, 43, 252, 72, -185, 233, -15, -47, 280, -175, 119, -320, 23, -10, -140, 235, 129, -82, -111, 100, 86, 175, 155, -108, -82, 28, -188, -116, -39, -66, 113, -110, 207, 126, 14, 69, 275, -5, 65, -73, -18, -347, -176, -79, -77, -111, -34, -119, -265, -343, 24, 63, 178, -9, -68, 116, 92, 203, -63, -156, 220, 102, -188, -88, -93, -6, -85, 193, -53, 209, 130, -52, -105, -31, 78, 164, -76, 229, -127, 12, 108, -128, -225, -52, 38, 64, -29, -227, 70, -149, 183, 213, 72, -310, -126, -128, 14, -15, -48, 16, 9, -97, 88, 213, 173, 8, -115, -69, 14, 30, -67, -1, 27, -99, 68, 163, 51, 326, 101, -23, 111, 9, -154, -208, -114, 39, 62, -101, 11, 1, 14, -77, 92, 201, -72, -22, 24, 67, -216, -158, -24, 47, -30, 34, -26, -139, 175, 10, 87, -93, -224, -31, -136, 213, 17, -8, 252, -39, -62, 54, -42, 5, 51, -156, -249, -47, -108, -109, 8, -81, 293, -146, 280, -12, -78, -21, 184, -187, 105, 10, -122]
1957a22l1J93j28N1M2j27O8k40L65o6K2k45M74j33j71J19l62M76l06J01J01q5
1979dJ2j5j80J72n9M9Q4j07K6K73j24k15r3L84m85J17J11J22J47k20j10Q2K18
2002A85m23K63J23k94j05M91k92J30j7j38R3Rj05p0L7n4J22J17l14K75j77j09
2024b53O0L89k23j89J82k69K38K05j49L0q6oN9k83M27o3k09K39l7Q8o8j37l7l0
2048a22K42L0k00P3r4j7q9M8N05j83n54M44O3j91j5MP6J38j81L44l11J75j00m1
2072D4J21n2q2q4j4L5p1Q4L3k4j41J58q6k8K56k42k2J47k3m4pK12j00L0k78R6
2098h2R4k72R0J71k6K96k83J22O9j14j9l6j38MJ84k16K02m8q7J36j44P4j50L94
2122B21j62j56J07k3j17j35M17k6J04k62l27L01R5j12J20J70k64J96j41p1Q1p
$$ y = [-122, -153, 40, -88, -37, 5, -122, -54, -294, 71, 5, 27, -218, 256, 123, -48, 71, -291, 185, -121, -20, 81, -4, 8, -7, -187, -15, -74, -25, 59, -48, -22, 251, 127, -88, -181, 203, -282, -165, -54, 68, 215, -5, -115, -33, 185, -238, 25, 148, -146, -251, 240, -52, 78, 61, -77, 16, 25, -80, -150, -113, -167, -45, 72, -242, 33, -144, -253, -193, 196, -27, -216, -34, -303, -65, 140, -9, 21, -65, -71, -12, -295, 132, 69, -140, 99, 62, 150, 82, -55, -92, -122, 120, 150, -50, 23, -71, -88, -177, -129, 376, 193, -361, 83, 146, -45, -60, -56, 20, 158, -23, 321, 10, 185, 85, 44, 165, 113, 31, -53, -67, -32, -103, -19, 14, -10, -151, 7, -79, -107, 149, -93, -115, 32, 9, -35, -42, 170, 70, 100, -178, -82, 12, -260, -170, 1, -25, 271, -12, 110, 179, 65, 46, 10, -128, -124, 60, -156, 46, -2, -89, 47, -97, -23, -173, 221, 59, -97, 10, -13, -130, -265, 152, 126, 230, -32, -359, -58, 37, -75, 45, 215, -49, 147, 6, -65, 16, 9]
2144IP5j64j82L73l47K21J69j88Rl5j27L06k23N6l6K52m6k2q0o8n3M4mJ24P5p0
2170F8j02k62L05j82l9L27j34J44k06o7L64j03j5n7m7K4J25k40R8k81L69j13p0
2193i4K80m19K62k10L28k39J31j48O6PJ63O0j25j35K40p6j32Jj12M0J19j40N3
2216h0N6J37N7k32R7j21l9R9K70l39L48l71J01R2J43j45K5J48j15j77J61Q2k12
2239a5j55k25M16Q4o8J92l48J62J96l86jK33k66K91Q1j30k20J17j25J38K34l18
2261a13J87J15k50K82l17J93j29JK07j19n3N3k6K6q6K50k08L44k5j73k76J93k0
2284E6j69J1J42k35L35qkj71mL5J48n5K2o9jm6Nj23J96J7n7Q4m9m6j01J10m1J61
2312A45j95M05k64k1o7J0O7K23j84M2j33j59L28k94J14j18p8K66k6o8l3K5Oj28
$$ y = [9, 84, -80, -262, 111, -236, -15, 154, -34, -25, -60, -187, 119, -104, -48, -84, 168, 122, 100, 20, -48, -101, -57, -61, 63, 138, 68, -34, -296, 9, -173, -212, 115, -19, 125, -81, -148, 216, 113, 98, 41, -6, 18, 143, -97, 1, -280, 89, -24, -94, 186, -233, 29, -181, 147, -92, 39, -109, -43, -36, 127, 187, 62, -73, 167, 91, -41, -40, -152, -112, 7, -133, -80, -24, 113, 170, -62, 35, -86, -125, -26, 244, -95, 253, -118, -17, 75, 218, 73, 98, 246, 131, -46, 115, 197, -15, -170, -395, 21, 105, 37, 229, -119, 43, 239, -147, -148, 85, -181, 110, 191, 61, -159, -42, -167, -29, 205, -113, 74, 189, -61, 221, -96, 97, -32, -31, 176, 57, 4, 57, 31, 57, -29, 221, 13, 357, 332, 159, -117, 76, 56, -113, -102, 40, -195, 140, 132, 130, -41, -45, -10, 138, 83, 105, 36, 35, -11, -6, -129, 67, 84, 27, 111, 62, 16, -85, 25, -16, 145, -50, 355, 91, 70, 3, 13, 80, 303, 119, 161, 28, -131, 197, -97, 17, -101, -179, 87, 61, -7, -40, -15, -9, -137]
2336a37o3K14j2j27J06K14m44K36L42k89J7j53K04n8k0q6M2j01J08K12l65Q0p5
2359a55j20k1J50K32K6j24Q1k56J24K54k42Q4l34N79l66O8j55K65k68O7J70Jk58
2382a98K35r5K61m09J25M0q9J23j6J11l61L17m4j90J04r2J29n4l7K45K03j95L2
2405A45Q6l61J75J17r2M2m3Q2N8k13j11j33J46nj43K84J8J18M7k53K44o4N1N7
2429B52l84KM4J69m75K30J24K37j01J62m7k01Nj08J55l31J55K46k39J15k08J90
2451hP0J44k10j10J68n0M4M3L5j7k72K15j26L83k23O1l3k07J50j9oj10n2K9n7
2476a58K21q6l2Rm7K4j42J15J08J69q2j72K59l57J71L95m89M06k42P9j29J40k59
2499i9M9N2j62J60o1Q8m1R1j37%L6M04m69oj25j6j08K41J86k09J27q3K81k71m9
$$ y = [-137, -200, 14, 2, -125, -19, 195, -249, -13, 329, 40, 57, -96, 108, 50, 30, -56, -14, -115, -7, 205, -160, -80, -155, -275, -296, -146, 86, 112, -12, 69, -187, -63, 191, -51, 33, -301, 278, -88, -20, -175, 90, -178, -111, 59, 60, -198, 37, -58, 203, -206, -81, -41, -130, -7, -23, 88, -273, 44, 0, -190, -86, -178, -49, -103, -140, 105, 308, 113, 145, 231, -130, 45, 162, 70, 112, 69, 151, 209, -4, -115, -248, -102, -107, -250, 34, 52, 170, 217, -36, 208, 144, 195, 252, -132, -130, -86, 83, -392, -162, -38, 199, 98, 260, 213, 12, 17, -91, 64, -267, -112, 134, -105, 10, -198, -8, 62, 206, -4, -114, 54, 4, 48, 91, 126, 109, -163, 52, -74, 309, 86, 147, 114, -93, 57, 38, 32, -78, -130, -101, -158, 63, -23, -55, -46, -93, -69, -211, -96, 12, 181, 99, -73, 186, -171, 0, 395, -94, 312, 70, 149, 20, 160, -99, -50, 2, -160, 0, -61, 27, -14, 77, -60, -60, -24, 380, -89, -95, -220, -236, -344, -103, 83, -126, 1, -82, 199, -72, -121]
2524a21k5J24Mq2K71k48J85j61K13n4k44Q7o6q8J09J73j16n7Q6k25J38J2q8M0
2548a33Q1k05K43J75q0k65J88K50j78p4N1l69J71L64k10r8q8J01QP2j9j04K55
2571A36k83k5O0K39R0m26O5O5J43k15L26k19J37J3j51j18L30r3k38J08K09k85
2593a32L1Q3j02K2L13j27l1k4K1j81J08K9J6Q5jk29J82Q7J22k28k01K10q7J31
2617I7L0j89L1K6M2m5J8j14P1J75j82q0J53p1l3q8J72m9M1j25N1R8M1l15L41P0
2643A66k82Q6p3J12k30M02m02K75j34ko5J77O4j30J20K4n8P8k18L51j46k11j72
2666b68J79J97j94K03k43K48J06k30j0m4LJ45j22k49K91K55j77M7N1j61l3K51
2688B45l24J71k57J13R9J65J2m13L62j02J3k2J47p8j89q8P2j07O2J5l6L18n6k60
$$ y = [-121, -146, -22, -18, -100, 171, -77, 108, -53, 160, 106, -138, -51, -117, -205, -96, 77, -39, -96, -10, -235, -97, -85, -173, -133, -52, -257, -14, 161, 81, -184, 4, 254, 76, 2, 53, -316, -145, 219, 9, -89, -177, -76, -68, 4, -15, -119, 136, -147, -172, -112, 127, 217, -209, -144, -79, 64, -151, 175, -44, 93, 106, -45, -163, 167, 74, -164, -56, 153, -132, -101, -18, -120, -98, 215, 88, 57, 33, 54, -127, -19, 10, 26, 111, 110, -119, 63, 150, 272, 44, -157, 53, -34, 97, 127, -62, -31, -5, 37, -8, 10, -104, -33, 142, -40, -120, 33, -38, -71, -159, 13, -36, 5, -120, -69, 29, 70, -245, 96, 166, -116, -30, -103, 9, -221, 181, -221, 54, -80, -82, -147, 30, 94, -36, 84, 108, 50, 128, -90, 261, 115, -96, -268, -89, 108, -86, 117, -126, 122, 228, -2, -12, -56, -53, 92, -30, -279, 12, 267, 90, 137, 188, 27, -6, 245, -79, 92, -165, -52, 47, 212, 224, -189, 173, 71, 84, 62, 209, 131, -58, -146, -74, -181, -119, -104, -140, 178, 122, -138]
2712a38Q3k1K2Q9P0N5p0j61L60k16j48K09km5n9rp9M0q3N8J3J50k12L5q3K3J85
2739F6o6P7o0M6L3l44J06K62L4P3l07M2L60m33K11R9j17j10k77J92J56j45j3j6
2763a31K40J3l49K67P1k8k2j52L78l01r5K77k68J67r8l2J14qk19K65l4O8o9qJ5
2788F1Q3Q9m97J18M9J00l3O5mk59J62q1M5J6j31M10j43j95K31J15j63N1k73J20
2812f4K79j0j6n04M42j91K40j27J84l96J48K48m8q0pl46J74K06K2k30J5o4R4J43
2836A12k5k68K66n8l9LJ81o4j36P5k06J57p6J34P6q9O2J0q2J31j44j0l9K41l19
2861a07J88l20L38j1j64K9P8r6r7J59M2L29n99K84l5l5O1j16J11k87R2m1K01K2
2885B6p4K71L2l61Q6j29QoJ55MO6q7J68J32l75j6Q6n8J95n7lj44R1k6N5m5Q7j68
$$ y = [-138, -55, -76, -54, 35, 105, 160, 90, -71, 289, 73, -75, 134, 132, 87, 28, 19, -60, -20, -103, -45, -32, 118, -94, -59, -142, -119, 66, 0, 77, 17, 63, 96, -248, -142, 120, 154, 227, -80, -38, 322, -111, 100, 199, 82, -28, -305, -113, 43, -102, -115, -131, 109, 122, -227, 40, 111, 83, 61, -91, 287, -14, -109, 168, -100, 67, -31, -63, 51, 43, -176, 89, 55, 123, 54, 46, 61, 144, 233, -264, -146, -97, 3, -30, 35, 31, -228, -66, -147, -102, -86, -217, 193, 50, -145, 86, 201, 38, 89, -184, -64, 215, 205, 189, -315, 127, -64, 176, 49, 233, -163, -15, 233, 185, 105, 98, -248, -74, 132, 154, -76, -61, -125, -31, 112, 87, -181, 85, 27, -12, -9, 172, 108, -28, 47, -159, -2, -78, 56, 132, 43, 105, 115, 33, 164, 20, 10, -29, 212, -107, 81, -239, 99, 88, -76, -47, 31, -65, -162, -3, 39, 368, -231, 53, 18, -17, 44, -72, 39, -248, -156, -197, 4, 26, -48, 223, 255, -106, -20, -149, -141, -147, 8, 12, 78, -9, 159, 291, -84, -100, -14, -72, 123, 66, 63, -81, 10, -16, 39, -6, 81, -87]
2913h7J58k56L22Ml12M0J58j08K21j25k4R0j84J67J50k45o2J8q3K31q2LK1L4Q
2938E7j92j99L72p9J35p5j4K47k77J07M1k36j85M68l7j5Qp2p5j95R3R8K16j71
2962B0K55n09j04J93L2r5K54L3l82L58J87k08K04j88K7j64J18J7k0J42j45Q5k8
2985H2j93q8L23l1j85P3n8J57N2k95J80o3P5R8j43j23J52r9J83L4k6k63J96M4
3009H2j53K52l52Q5q0K18j95J92M6k81K02l51J25N13k12K4n8k20j8K13k79L81
3031A34P9l95J22J38m3J7R8l40Q0L2r5R1K86m63K23o3J42J24J63m66P7N2r2J06
3055Gj28J08j39Q4J4J68j35o6J3L56k93o8N6J48j98J2J54j04k6K49k85M25j91
3078A61o4j1r8L5p2K08k59P1J88j43J0J9k46J73O1J05k99K21j88k1J71m9j13J00
$$ y = [-87, 71, -185, 137, 141, -171, -131, 27, -81, 140, 15, -9, 81, -103, 64, 214, -31, -93, -75, -158, 73, -9, -6, 15, 49, 57, -135, -334, 38, -41, 94, 19, 5, 252, -25, 82, 123, -113, -298, 170, 133, 118, 126, 54, -21, -216, -123, -25, 191, 20, 275, -234, -338, -145, -113, -208, 46, 79, -303, 55, 242, 34, 238, 50, 77, -87, 31, 48, 28, 170, 25, 110, 82, -111, -199, 124, 93, -92, -19, -77, 80, 132, -163, 17, -46, 29, 127, -16, -139, 13, -86, 97, 131, 105, -158, 38, 82, -71, 181, -171, -86, -166, 52, -143, 49, 95, -186, 16, -335, -210, 303, 91, 115, 57, -163, -181, 32, -247, 134, 213, -182, -60, 78, 35, 52, 150, -190, -110, -78, -173, -82, 204, -259, -36, -99, 43, 167, 330, -136, -59, -7, -99, 7, -121, -13, -152, -68, -54, 114, -21, -87, -74, 282, -11, -79, -23, 125, -73, -61, 93, -11, -37, 212, -73, 352, 161, 97, 86, -12, 23, -49, 159, -100, -29, 159, 16, 26, 45, -201, -28, 33, 138, -161, 60, -128, -149, 22, -27, -140, -40]
3102d0j00K68j71J12Kj77J54j81KK19j42J54M1k51P0l6o4L87m82J32L94m49l4
3125a92J69p2N1J81o2p2J17l05K97k9j41KP0j32k02K47K00j73j17K14j80K09j7
3148F3k24K20j52m5J95o0Lj39J8J72o3Q0j41N0l8j7Q8lM5l41K47J38j25r3m1K10
3174D7Q0J70j50j80n1j45M27j93J25j07j49r7K61Mj39p5J4J75j33L1K37j52J0
3197A0j28J33L3K38j43q8k11J82r8o8M8P9k43K01j02K29p6l7J06q9j30L32k23
3220d5J41k05K05n6k21J93j28N9Pk03L8J61P4K21j28o3p1P4m3K89k09l98K00L89
3244B81j51R3j94k89N26l82R2k22L48k03J48N6J23k18l11M96m35P8K20J51k29
3265b2o4J37l6j85L5J37oj31J39N6P0j78J22l0Q5m12K37%K26k22J44r3L4J76l0
$$ y = [-40, -140, 128, -43, 69, 71, -106, 48, -133, -131, 88, -54, 100, 141, -110, -40, -76, -140, 247, -235, -103, 291, -158, -192, -23, -95, -44, 137, 75, 3, 120, -185, 112, 83, -58, -56, 14, -118, -320, -73, 127, -46, -163, 51, -129, 80, 63, -161, 59, -93, -138, 57, -3, 0, -139, -121, 51, -12, 68, -73, -23, -61, -78, 10, 7, 52, -289, -42, 96, -29, -122, -163, 47, 127, 297, 147, -33, -84, -229, 198, 5, 130, 23, -126, -223, 38, 42, -97, -172, -158, 17, -116, -85, 152, 0, 10, -118, 15, 48, 286, 143, 55, -156, 26, -72, -140, -92, -13, -256, -55, -157, 72, -4, -41, 65, -24, -154, 178, -45, 96, -109, 96, 40, -181, 12, -116, -57, -50, -253, -215, -54, 20, 241, 113, 50, -21, 53, 10, 299, 90, -308, -108, 281, 130, 223, 29, -260, 266, -116, -24, -246, 102, -101, 47, 103, 226, 8, -303, 193, -242, -164, 56, 207, -22, -86, 51, 15, -170, -135, 2, -4, -135, 4, 60, 130, -48, 74, 44, 129, -283, -46, -46, 180, -42, 102, 9, 43, 219, 189]
3290A89l64K53L6l13J00p9J06q0J22kK50r6J4j80j69J39K3K07r0J05l60L75j88
3313bQ7k4j75l3J0O3J30J26l79R0J93j74k39L02J8R9J24j01l26J41j34J53K05
3336A54j44M10m11K2o7j43K06m5j44L58l90L1K57j82j44N3L1R8m1K78j16R4j86
3359b1k4R0k25Q9K07m46M14k6k33M5J83L4O2j63R7n2J21k16j33J83o8K51k89J86
3383F6j63J7J04Q3oJ53l02O1k1j19J58m4J60j50n3j01L02k70J65Pm5J3j27O1Q7
3408C6j79J98n1k4M2Jn7k32K88p1J35j94K23j73K31m2j75n6J60J58r9M3k03p5
3432a16M8J04j12K96l67J15L10j69R3k52L98k50Jk11lo7K36o9RJ71j56J84K8m85
3456b64J22J21n7J99k47J13K60K7k38o6K9L7j29J74oO6k17J85l00L9j41j2K52
$$ y = [189, -175, 78, 114, -199, -99, -178, -72, -152, -30, -32, 218, 122, 136, -44, -213, -74, -51, 156, 66, 171, -189, 186, -2, 85, 61, -114, -147, -137, -74, 56, 182, -197, -107, 86, -88, -327, -25, -7, 92, 216, 115, -211, -70, -204, -51, 154, 10, 420, 9, 31, -36, -179, 27, -18, -162, 196, -194, -163, 94, -88, -232, -179, -148, -50, -91, 187, 71, 165, -21, -45, 45, -180, -91, 116, -330, 84, 58, -175, -130, 53, 87, 149, -14, 83, 31, 152, -64, -197, -14, -82, 169, -120, 66, -97, -80, 24, 107, 101, 254, -48, 13, -8, -127, 31, -13, 147, -3, -56, -157, 145, -125, 40, 47, 2, 15, -112, -51, 36, -143, 55, 4, -20, 22, 23, -34, -266, 22, -49, 86, -108, 115, -58, 173, 131, -44, -100, 60, 218, 119, 162, -41, -116, -68, 36, -76, 220, -147, -32, 278, 109, 202, -50, 348, 98, 99, -112, -115, -182, 54, -15, -6, 165, 9, 193, 221, -264, -142, -21, -78, 121, -126, -13, 247, 274, 36, -30, -1, 36, -93, 81, 75, 141, -76, 109, -191, -152, -293, -305, -53]
3479e3O3k25L01l6l87L71J29k89L20k36j27K12o6k5J9K0k03K04j36K71j8K70n21
3502a42J42j13K1J5K43J7J32k84M1j14j2R7M6j34j30q5K54o3O9p8J41J63k68J16
3526G4k16j75J52M30l05J43j66mnO2j81M6K8P9J34O9k71J15J30j36j7J12j64L77
3550C11j30j81j36J03p1j43N5J3J83N9p5k04K09J02l20K55K45k42r0K13j31k69
3572b44K34q0J56J62l41j11J95M6n6K06l50M03k31L7j41P0J4j15J09m1K20L8N0
3595B30q4j10M2k01P0mO0J6JJ29q5q3L3n9J01p0l8N7r1L7K27m56L26J64j61N3
3621A04k05K81K7k12L4l6j92K51p0M5j75L61k37N5j27K45m96J36Q7P4J2l2qq9
3645a67N6J0O1L9o5j6J12P4L0k6j07Q0J40ql78J75m68K06M74j86j8j46p5J83%
$$ y = [-53, 10, -215, 86, 50, -337, 34, 163, -126, 194, -42, -169, 43, -23, -48, -29, -9, -212, -8, -144, 127, 109, 379, -142, 0, -113, -92, -77, 166, 183, 315, 31, 72, -42, -54, 43, 89, -45, -175, -260, -6, -69, 0, -78, 63, 226, -42, 74, -142, -317, -165, 265, -40, 103, -63, -67, -72, -10, -191, -145, -117, -38, 96, 165, -106, 9, 139, 3, -14, 98, -66, 311, 181, 0, -136, -33, -104, -247, -192, -179, 4, 63, -12, -216, -7, 95, -225, 30, 275, 33, -57, 156, 25, -244, -10, -90, 66, 228, -113, -224, -29, 17, -39, 167, -183, 220, -11, 26, -115, -45, -31, -146, -37, -78, 142, 180, 230, 146, 36, 78, -123, -53, -57, 3, 19, 20, 149, 64, -19, 14, -45, 56, -14, -52, 5, -86, -49, 178, -278, 48, 212, 51, 104, -101, 180, 207, -5, 29, -7, -199, 52, -18, 27, -148, 213, -24, 31, -96, 149, -347, -211, -124, -50, -38, -70, -78, -167, -111, -101, -40, -1, -66, -82, 30, 104, 134, 108, 1, 81, 221, 213, -165, 10, -458, -252, 222, 36, 18, -128, -203, -20, -20]
3670b0j90K00J97K5J33m24L7KO1J57m32N40k98j67O0L81l90O0j86L01p7O7j07
3693g0J80n8j37L7j69J31JO2j38L86j91M3l7m2J29m4j67K9j33K77l2j75p4L97
3717B05j50k68M98k14M9J55j80J2p3J26k47J64j73k8K34j00j85K85N9j48j87n5
3739b21L56k26O3Oo1m6L34n5p4p1R8k55K26r4K87m99J5J66K64j10q1q5K40q9k
3764H6p4j10N03o73K90JM3m9J24Onj0J23k25J93l60n2L07k80K21j70K67k33j29
3788b06J8K97M8l66L13j83L43m84J66KP4j75K89J31l82K82k27N8j4J43J70m33
3810a36r1Q2M7J17m6q8J8r7J13L5L9J77k01p4J40k5Jq1K01k3J17m04J53J10J21
3835B05l58K3J58j76M35l23K8J45k20N2R5l05K97rj11j25J02K28n25N63j45k7
$$ y = [-20, -210, -10, 187, 212, 345, -79, -42, -40, 21, 178, -254, 286, -12, -179, -119, 262, -128, -68, -254, 47, -30, 37, -70, 110, 52, -85, -48, -217, -86, -85, -23, -161, 225, 34, 77, 40, -2, 127, 83, -84, -55, -188, 89, 57, -118, -192, 205, 55, -213, 285, 71, 120, 275, 95, 107, 34, 160, -87, 77, -96, -124, 110, 10, -175, 110, 169, 21, -166, -221, 135, -91, -28, -22, -83, -129, 205, 150, 76, 5, 103, -152, 74, -20, 267, -232, -217, -51, 213, 103, 22, -63, 177, 88, 86, 12, -98, 405, -268, 22, 23, 66, 17, 141, 147, 142, 132, 255, 30, 223, -137, -189, 118, -162, 59, -111, 156, -77, -206, -188, 109, 157, -209, 104, -79, 264, -220, -54, -52, 22, -153, 136, 267, -115, 167, -60, -2, -16, 127, 297, -136, -227, -145, -98, 19, -27, -115, -97, -194, -81, -46, -7, 170, -31, -105, 35, 10, 11, -70, 131, 108, 225, -179, -26, 84, 205, -153, -130, 28, -148, 287, -36, -8, 137, -83, -31, 64, -241, 56, 47, -64, -189, -87, 141, -384, 179, 34, 7]
3857Gj98K51j56M6Q4j82J59J80k68Oq8L33r9j8J33j17k40J65J46j60j51j52L42
3880B3j34J07M7j14Q5k19J50K56l8j84k05J38J97l1k81n8O11l45J19k97L44j76
3902ek92M31l02J7J91o7j55K30R8l07K98k18K7J94k28J60j99MK26p2l2n2Q0R5
3926A22P5k02K39k57n1J70k38K14k95N4m2K65L09k09j20j67O3K77k82N2K5J20
3948A22q1j34m7J74P5q3n4R2J00l71K61L1k16J30jQ8O3R2k60J28k22k52M50k62
3972a77L19K3j29j38J66l52M43j36k02R9J69K5l59L47j27J03l08K30r4RJ36L4
3994H1Q8K05n21M62n3k04k47O8J54J13M0k71K72qj55n1j80L24j75J53k52K15o5
4017gM0j26K59j45L5k12K03J30k56j03K20j92J5K22j7M3k94K91J84k75j03K16
$$ y = [7, -191, 60, -96, -50, 34, -148, 11, 191, -77, -71, -159, 174, 75, 57, 190, 73, -167, -2, 144, -16, -167, -319, 23, -111, -4, 43, -71, 14, -205, -55, 201, 163, -21, -226, -88, 109, 78, -203, -261, 350, 5, 124, -173, 171, -5, -297, 134, -168, -151, 40, -27, -182, 48, 146, -161, 137, -81, -54, 140, -88, 72, -127, -123, 103, 31, -1, -53, 27, 122, 197, -5, 234, -23, -74, 96, -142, 72, -223, -169, -211, 54, 363, 154, 34, -133, -70, 207, -75, -23, 2, 122, 41, -93, -140, 34, 109, 26, -28, 64, 164, -207, 54, 85, -131, -1, -2, 86, 149, 241, -19, 109, -113, -365, 85, -177, 142, 165, 36, -102, 64, -288, 155, 19, -183, -84, 85, 110, -249, 98, -29, 74, -234, -4, -98, -89, 47, 81, 169, 374, -147, 315, 262, 58, -189, -121, 33, 146, 186, -85, 187, 179, 24, -27, -207, 117, -58, 95, -157, 58, -7, 33, -93, 166, 21, 56, -156, 47, 177, -79, -182, 38, -154, -139, 83, 66, 109, -185, 106, 290, 15, -88, 128]
4039A28j3l23J88J23l4j18o8j6J86R4k55N8M3m4K6J22o7L3k5J31q3O5k47K6N2
4064a8j45j79K89J53k12K40j5j45n9J74k55K19j10j1N4O6L1k03L15k30r2N3J3
4087f7p7N1L0K98l60q5JJ30L0J66l06K31P0k06L75m44L19l06K55o6l2N7L0L6k3
4112A07L1k52j11l5N00j94mk49L49j88k6J70l91L21L7J38r5j69m2R1p5N4j9n7
4136a09M8j2K75k81j19M4L27j39j78L12k2j11p2n9M1k9l8L11l21N07j72l74L56
4159A85k59L20k54k9l9l38M38j12J92j12L2o8R0j51J5K32j05K19l84J70J97k63
4181b4l0K00k31K31K5o4l7M0r1L5Q4k44J51R2m3j30m5mL16l52k8K20j52j45K23
4206cJ79j27j12J93l6j26P7Kj54J6k22M89j70j04J06J44k05K1J1L2J09m5j64Q6
$$ y = [128, 115, -208, -20, 103, 69, -49, -117, -133, 53, 147, -108, -50, -7, -51, -25, 97, 30, 63, 38, 169, 86, 151, -96, -70, -18, -163, -342, -53, 100, -112, 128, 113, -32, -91, 83, -172, 47, -63, -74, -20, 46, 77, -126, 189, -41, -133, -80, -67, -144, -93, -63, 235, -125, -210, -209, -79, -49, 117, -189, 42, 112, -94, 281, -163, 156, -150, 105, 39, 7, 64, 94, 130, 107, 138, -114, -225, -260, 240, 46, 42, -207, 142, -46, -72, 98, -293, 28, 65, 203, 108, -61, -103, -12, -87, -33, -52, -109, -61, -73, 202, -79, -198, -154, 173, 34, -144, 168, 146, 35, -37, -96, -55, -84, -122, 189, -132, 375, 203, -171, 185, -74, 246, -8, -37, -76, -414, 24, -88, 104, -8, 24, -44, 46, -105, -90, 142, 37, 256, -128, 42, 239, -24, -54, 146, -85, 146, 171, 107, 70, 110, 19, 54, 138, -106, 45, 137, 94, -36, -81, -85, 231, -121, -149, 71, -81, -226, -3, 176, 49, -63, 130, 94, -32, 45, 47, -107, -91, -313, 176, 6, -98, 8, 152, -53, -32, -21, 11, 120, 75, -89, -3]
4230cL6J7p5K17j47j56K93m6j60J75k44K8J05jo1K06j75j01l3K07j56j21K79N1
4254A35k26R2R6j77M8r8K22j14M1l24L53J97k14j66J68M0j30j68J85k5K09K07
4276C51k83Pj51J40lj64O4j6L7k49K23J28j37J63Q1Q5j27J00l87K79j64j7j1J80
4300A29n2j94L34k05J46L5k46J19J57j60%k00J44R0j23K66k76K8%rr7L6o1R2J3
4325c4j0M8p5R5k90K39p9n9J38l9n9K24j75M1j45K05j78K82j23j66K68l25O0K61
4349A04J36j31l73M9L60j93L8K42k01J42j00o2L41l19j49J56L57m35J70j43q3
4370i4K47j42J93m37K85k45L36k43J10j1q4O7j06K23n3j02K3l9J13j74k6Q0Pn5
4394a27j07J59J33j02K56K1j92K2J19n9j79j15N9K44j23P0M1M5q4j3p3k5J06j64
$$ y = [-3, 33, 50, -25, 192, 45, -111, 182, 136, -24, 151, -93, -65, 40, 39, -22, 184, 9, -92, -125, 82, -74, -195, 84, 135, -91, 1, 97, -80, -32, -130, 92, -22, 19, -305, 48, 245, 31, -135, 33, 73, -57, -225, -40, -65, 144, 351, 68, 75, -76, 64, 61, -103, -39, -55, -18, -267, -44, 84, -53, 110, 191, 276, 149, 249, -138, 141, -23, -40, -51, 129, 77, -117, 217, 12, 158, 193, -53, 66, 223, 63, 63, -137, 7, 97, -26, 240, -36, -8, -8, -17, -114, -78, -139, -47, -34, -44, 4, -71, 24, -266, -27, -106, -165, -27, -66, -125, 99, -76, -35, -180, 25, -153, 129, 6, -160, 108, -217, -157, 104, 240, 109, -264, -215, 145, -48, -10, 232, 31, 173, 73, 11, 352, 33, -116, 40, 397, -38, 132, -11, -94, 153, 11, 204, -233, 52, -193, 143, -100, 10, -1, -85, -18, -124, 99, 46, -56, -33, -72, 41, -133, -159, -79, -72, -127, -234, -75, 58, -44, 212, 233, 41, 63, 182, 123, -56, -171, -112, 132, 9, 79, 120, 165, 81, 68, -5, -30, 76, -88]
4418h8j7O4j17L6J10j57J10LK3j1J09J02m57M18n2p6j0J05r6O8p8j49J06j07M10
4443B49j98K62l59J3J88k02j09K27k05K10m5L04k10l15J58N2J48q7m0j20L18j64
4465G5n6J1k66k4L06j1j43K21J49j47j59Q8j66J90K2n7P1k19j36L98j3l3K14m12
4489i7K29k53J12K76l25P7J30k27j8J37r2q8NOJ66j69K25p4N3j48J45j54K56q5
4513H7l9oq3M3J83k30j2J3p1J85j56J94k68J31K20q8L4j67J12K26o12J7K76M2
4537C1J24j05k16L59J2j95j95M4l1K18j76O1K30r9R8o3J11l14K58j11J89j34J19
4560B15k67J80M9k66J81j4O0o2J15j61n6R2j48Q3j28J77Q3j58J81m20L75j94J92
4583A09r6j48K3J59j22J47q1k00K71Kn8J82l25J28J94L6Kj99j00K90k61JJ67j66
$$ y = [-88, -105, -41, -158, -122, -12, -169, -59, -56, -33, -44, 65, 167, -290, 128, 76, 0, -10, 95, -1, 67, -11, -160, -54, -161, 249, 51, 313, -46, -33, 155, -47, -156, 71, -134, 76, 31, 335, 125, -190, -32, 20, 168, 81, 41, -79, 239, 75, 19, 30, -236, -260, 46, 35, -108, 113, 262, 115, -44, 44, -122, 68, 90, 33, 104, -115, -251, 147, 134, 101, 315, -97, 132, -121, -9, 267, -58, 19, 149, -78, -96, 41, -51, -139, -134, -128, 38, -131, 94, 20, 73, -75, 70, -84, 172, 87, 48, 42, -41, 2, 185, -45, -57, -44, -115, 70, -86, 108, -160, -29, 191, 103, 137, -30, 82, 308, -304, -287, -11, 31, 155, 50, -166, 193, 205, 10, -185, -141, -172, 46, -130, -69, 161, 62, 160, 97, 208, -106, 152, 41, 230, 96, 215, -52, 128, 177, -89, 92, 78, 138, 76, 191, 30, -26, 66, -82, 1, -127, 50, 133, -25, 156, -264, 111, -83, 109, 13, -135, -112, 47, -75, 72, -9, -209, 62, 64, 6, 188, -137, -9, 185, 221, 223, 24, -76, 214, -47, -46, 121, -45]
4607d5L6R1j97J17P6M1O5r6L9o3j97J6J35j94M23k39j16J56R3q7k81J05K01o4
4631A5q1k32K08K55k05k08K44j44J76KL6j4J81l39j10K57k46Q3J85j05L14m41
4653a69NM7J97o5j90K86pn8j60J57j64K17k64J65k25J55J35k08L93n21K73J79
4675A78k16R8L0l44K50J07j09J01k53J66J69l03M73o06K62n8J04q8j07L40j84
4696A0P1j67J2l5L57j00j51J39k32r3L34k01k3Q9N4j43j56J56L00j81N9j16J31
4719A14K1l5k96J41J8n2l2K15r6P5J63k12Q0P7r0j12RR5O0j5j22j9l1k3J12j76
4745a31L90l79j94L16n4M0J22j74J12n7k82J88j81M33k79l7N1K97k29j40J10j29
4767b07K09j06J56l4J64k81K06k13O6J57n5P3p1P5m2jJ5q3k80M76k74J31k00q6
$$ y = [-45, -9, 82, -115, 2, 78, 119, 184, 88, 127, 64, -133, -117, 18, -176, 247, 8, -108, 48, 141, 54, -227, -122, 79, 15, -66, -298, -90, 165, -40, -248, -4, -148, 28, 30, 66, 52, 233, -106, -216, 41, -205, -122, 63, -42, 272, -169, -164, -117, 80, 15, -175, 111, 104, 46, -114, 43, -121, 96, -168, -3, -228, -73, 62, -146, 247, -274, -1, 178, -38, 60, 90, -254, -4, 103, -6, 95, -158, 8, 177, -126, 347, -259, 3, -55, 49, -39, -146, 194, 10, 81, -86, -74, -109, 248, 148, -3, 136, -96, -189, 145, -56, -79, 10, 64, -79, -235, -79, 221, 40, 99, -17, 114, 135, 100, -196, -55, -37, -89, -121, 94, -2, 73, 236, 24, 104, 181, 91, -21, -12, 83, 143, 128, 6, -13, -44, -67, 45, -131, 259, -120, -314, 2, -52, -12, 110, -64, 48, -9, -291, -103, -284, 149, -130, -167, -116, 181, -48, -188, -78, -207, 2, -104, 52, 18, 182, -99, 107, -106, -40, 117, 62, 135, 64, 139, 97, 96, 111, 28, -252, 224, -50, 81, -119, -205]
4791b05N22k23k37J94j09J86j68L53l18l07M03L4J19l17K33k17J25j58R8K4j33
4812a01J63N5j45J06j52J76j26q3kp6M80k79J60j69l0j11M27k03j61J60j84J62
4834F7o6l6k8j12j15L23k7j38J23L8l7k15N9J59j73K46K4j33J69k67K3J7L84k35
4858E0j09L52l79j16J91K8n8J51J33l47J35K10l39K93j93R4J5o7O4M0k84L11m37
4881b62K26o6j06L84j68L66n06J75k5n4rk40L43J50l64Q6J95j54L9k35j0K98J07
4904A70k0q7M0p2M7lk12M49n00K56k16L7j7l0K54K2m2k42J05O0J67l19j2J44l5
4929e6J17o7j88J17Lo9L6K86m9j97n8j19M93k39o6K11j65j39N3Q4J12J2p9o4K99
4954B68k01j54R3j49l9K68j36L7M1n1k0Q3r8J28k33K22N0l27M35l16K22j93p7
$$ y = [-205, 317, 94, -143, 51, -58, 128, -40, 313, -5, -312, 91, 125, 244, -73, 160, -57, 68, -90, 8, 32, -101, 62, 117, -28, 78, -74, 102, -24, -107, -109, -185, 295, 16, 176, 7, -23, -134, 293, 90, -71, 89, -95, 67, 1, -35, -63, -175, -290, 33, 6, -132, -9, 29, -8, -223, -164, -5, -178, 68, 92, -41, 128, -139, -116, -99, 285, 50, -59, 293, -86, -202, -11, 17, -41, 110, 243, -104, 31, 241, -98, 195, 2, 96, 111, 44, 108, 148, -136, 175, -262, -36, -102, -208, 176, 8, 374, -132, 43, 18, -36, -45, -285, 58, 208, -156, -70, 125, -29, 10, -225, -235, 63, 170, 150, 63, 103, 31, 78, 75, -137, 312, -188, 68, -148, -111, -128, -158, 96, 118, 76, -166, -61, -1, 166, -153, -165, -21, -56, 61, -6, -194, -77, -74, -143, -107, 179, 130, -67, -125, -244, 249, 10, -56, 155, -10, -149, -96, -12, 100, 112, 33, -31, 268, 67, -87, 6, -143, -182, 86, -50, -13, 28, -23, -43, 40, -58, 70, -163, 59, 109, -218, 217, -99, 123, -70, -147]
4977a47J45On7L60k41J78P9l15l0o5P0K85j79o1j42J3K28O8J00k81L4j74J16J28
5001A18j72J00O1J27m92M52r1n3l4j9l75N16k11J31j62J02r3P9J85k48J54k46
5023a71J43M9l28K76L5j44K91K07m43N9J10j23L7j29J25J45j18l07K62J82l0k53
5045a25L40j70n1J23k24j02K08o4j22J48j06O4l5n2l2J01J23o7J92j17j6j34l8
5068a56K83j95q5R6J87L4l08O6K09P5j96k11K49o6K05j26k0L6j03Q4k82J94R2
5091F2j86j24M27MM6j00o8k75J32J26O2k26K10k4j47J83m1j47J72j82K23j65k2
5114f0J16k7k2k02K29j3q2J16J6J9j04j39K02k9K6J69n43K29M4j11M03l81K54
5137A10k05J59k07J73K5O5j76K33j91R9o5L09l31J16j5k91J42R1M3J11p2r7m7
$$ y = [-147, -2, 4, -53, 307, 66, 244, 323, 8, -22, -87, -17, 268, 89, 28, -114, -101, 127, 195, 295, 14, 48, -126, -10, 118, -54, 46, 107, 234, -258, 194, 103, 50, 16, -3, -378, 138, -73, 58, -104, -2, -95, -16, 169, -79, 75, -171, -28, 21, -307, -31, 4, -140, 151, 358, -85, -26, 84, -39, -2, -131, -6, 139, 21, -286, -24, 158, 128, -125, 215, 45, -6, 117, -107, -209, -1, -65, -187, -39, -145, -81, -116, -168, -200, -99, 24, -43, 149, 32, 16, -118, -156, 127, -68, -153, -57, 130, 164, -144, -78, 131, 206, 10, -201, 48, -18, 187, 61, 41, 77, -26, 58, -224, -30, 62, -124, -248, 179, 183, 229, 129, 61, -214, -82, 44, 106, -120, 90, 66, -81, 102, 61, -86, 86, -96, 127, -38, -60, 56, 29, 7, -195, 34, 21, -61, 55, 71, 90, -14, -153, 49, 20, 46, 215, -328, -99, -55, -166, 237, -144, 110, -95, 64, -143, 30, 55, 120, -56, 177, -14, 85, 20, 329, -2, 114, 99, -192, -50, 41, 84, 195, 123, 26, -21]
5160b1N9k0P0j16J89k03o9N9R8j47L63j57j13K72m41J70J90j59l7j87M7J28p1
5183i6N4nK00k66J10J51j42j81J96Q3k16J52l3K0j32j62Q6L00k71LK60l9j16Q5
5207D1p4r4J85O1j42J17P5k53J52p1K20k54R4K7J14k5j6k07L01l36o7M58j89q
5231A09p7J66k24m2k4J91k30K7Q1K4J95j65K56n58N16j04j51Q3j08k6k3J24J69
5254B09K2k12Jl74K84K51N3j78j19j04M17l20J71j7p7j15J5L56l34p4O5L0j12
5277a62L11j22Q6j99n2J33O5Ok55K50Q4L9P0j77J42j30Q9l2k54L51k64J09j76
5300h8K39j0j53J08j49kJ94j45J5J40j30k2j81M2N5O0K21l13r6K07l6J7P4j52
5324a05J44l2n9L7J97Q0l14J91p0j98qj1J88j15J48Q9j98Moo7J50r0L1R4j31k50
$$ y = [-21, 38, 18, 88, -28, 161, -42, -111, -52, 46, -101, 262, 105, -8, 264, -177, -7, 183, 24, -13, -200, -153, -25, -96, -42, -47, 153, -113, -3, 148, 6, -175, 21, 104, -112, 40, 7, 27, -105, -267, -181, 119, -152, -149, 111, 72, -44, 41, -33, -127, 58, 119, -23, 94, 169, -84, 68, -3, 217, -37, 57, 84, 198, 173, 157, -50, 251, -85, -152, 306, 117, 109, 32, 198, -26, -68, -92, 99, -131, -104, -23, 1, 196, 31, 287, -271, 245, 141, -10, 73, -35, -61, -84, 40, 209, 231, 19, 20, -354, -70, 181, 234, 56, -63, -167, 250, -70, 101, 84, 7, -108, -93, 263, -71, -145, -80, -50, -162, 149, 27, 113, -86, -138, -5, 60, 66, -189, 61, 145, 184, 254, 77, 219, 89, 178, 146, -108, 243, -21, 88, -88, 151, 141, -12, 96, -53, -55, 139, -6, 9, 149, 19, -3, -184, -142, -87, -27, 194, -119, -215, -8, -44, -27, 47, -105, 39, 7, -52, -15, 182, 262, -52, 139, 69, -129, -137, -148, 40, -75, 73, 162, -36, -32, -38, -105, 45, -45, -14, 80, -51, -301]
5350c01J82j2j31J31J07j79L82j88L1j11p3L24j64R8k51R2O5L34k04r0J33j64
5372A1j01Jp8L79k21J80j45j85R0m3J95O0j65r6m1o8K51K21j67j13Q7l13K27m8
5396h2n8P1QK60m16K45P1P5k83n6n6R2J72L7m3o5k3n3o7K39q6j39L06j17q4O6
5422A4J95k87K00k07Q6pL3j21R0k30J44l1l0J32K28k18j2K9M2j21J40nJ16j56
5446B4O0L0k44J62k07M58m20K41k39J45r3R2o6p2K5N5j5J0J1J49J70m00J7J04
5470ck42J53L7o2L7o5K06m0j1j48L06j58J85m8k22k0n9o2K87J9m5Lj32l1K15j34
5496c4o8q7K06j25K69k8j37J18r3l0r7K81l94J15l4k37K40L91n65L43J67j88j5
5519bP7J0r0l27L67P0k42J69j03M0J28j61K77j91j43M2J0j90K87M1K38m96K30
$$ y = [-301, -119, -131, -262, -131, -24, -203, 179, -9, 22, -89, -162, 162, -2, 96, -155, -63, 2, 336, 132, 42, 175, 11, -90, -89, -167, 212, -9, 171, 26, -159, -69, -112, 83, 143, -22, -118, -159, -227, 24, 245, 78, -35, 52, -261, -34, -82, -140, -69, -61, 199, -217, 28, 99, 174, -109, -165, -221, -129, 43, 80, 37, -28, -51, -104, -171, 68, -18, -157, 149, 32, -52, 14, 209, -78, 122, -85, 1, -6, 27, -94, -4, -234, -90, -121, -151, -19, 209, -9, -21, 8, 50, -71, 69, 64, 180, 24, 84, 114, -130, 32, -175, 283, -137, 104, -135, 10, -83, 9, -57, -129, -104, -49, -64, -54, -43, 106, 276, -124, -107, -3, -245, -92, -55, -117, -80, -145, 61, 21, 10, -138, 168, 10, 195, 147, -75, -95, -154, -216, 71, 90, 45, 48, -84, -115, 100, -34, -102, -189, 17, -108, 161, 133, -4, 114, 21, -9, -106, 175, -219, -104, -138, -375, -135, 256, -309, 34, 201, 13, -2, 75, 85, -5, -332, 35, 105, -137, 32, -71, -31, 97, -64, 213, 22, -121, -79, -69, -259, 28, 69, 307, -189, 41]
5542D1O8Kj6k09R3J92l64L42J31l34K52l70R4L1N1O3l35M15j13j53R7k34K63j06
5566i9p0Q9K50j71J25l46K41m7l2r2J57J19o8j27m8J36J2N2o4J7M3J03O4k31J90
5591B03k18k38N08j40j06N3L8j09r9K63k83N3M8J92k12p1K20j80j20J94k4J3j16
5614a31J74l09N38k68j90M17m20Q0J78k6q6j09J45J12r9pP5J1l08M19m86L01k30
5637b19J85p3Q2J14N1k47K09j11J50k08K03l07J66oo5J86j59J34m0k41J4o0M59
5660B17n8k43n3j94M99k71J70l00M06j12j05O2R7k64K06R4j70M4Q2j64M4j07J02
5683a8R6j7L0j31rJ86r9K37l89Q1R2j97K25K0j1j64p5J1P8M0p6K66m32J99L55
5708B98l39K64k96l6N6O4J81Pj46J07k81P0Kl2ln7P6l4K6j38N4N49m50rQ8j93
$$ y = [41, 109, 111, 95, -114, -21, 171, -193, 149, 280, -54, 198, -172, -78, -47, 4, 67, -268, 147, 34, -119, -22, -256, 7, -99, -169, -80, 170, -1, 124, -222, 19, -28, -60, -152, 5, 124, 56, -71, -119, 17, 29, 81, 17, 34, 77, 180, 244, 13, 203, -15, -253, 255, 115, 9, 62, 100, -9, -108, 155, -128, -75, -27, 165, -47, -118, 102, -78, -198, -4, -28, -15, -131, 43, -266, 272, 4, -186, 231, -189, -109, 69, 43, -43, -152, -7, 105, 6, -1, 74, 85, -223, 196, -290, 11, -219, -34, -107, -25, 89, 140, -107, 102, -9, 141, -67, 136, -171, -5, -11, -76, 110, -49, 85, 45, -196, -182, -242, 217, 159, -84, -137, -331, 168, -103, 67, -233, 173, 61, -44, 18, 115, -149, 57, 151, -19, 25, 107, -57, -13, -120, -18, 78, 61, 91, -40, -49, 137, 38, 275, -114, -33, 59, -138, 87, 107, 96, -68, -143, -132, -54, -14, -90, 176, -256, -57, 298, -41, 223, -73, -109, -53, 11, 192, 199, 53, 160, -121, -51, -49, -81, -84, -141, -65, -99, -73, -211, -157, 392, -58, -67, 21, -172]
5734a72K05J8j99J05K01k68K35j05J07j43J32j02J09k01K46j62j25J27J93j71
5754C0P3M2j03M1J4R4jO2j99j21J12j25J54j42J54l63K67J36l54k7n7L50N9m7
5778D9j2k6O6r7Q4j42O2L8kJ35p0o2k6J04j27p6Q7m1k1J28L7J86j0m51J50o1J92
5805I4J8k57J54k36L46n2L8p2m5j81K28j68R8o9K57J40j29m8l04K49K1J02k01
5828a7P6N9l35J05j02K50K77k25r6J73k46J12Q3pn5n0o9M9j38K44k23K13k81P6
5852a27k1K95k06Q5J47k37O4K00m02N7j32J52j10J96N9P7n2k42J40o1J40n3L4
5875CPK0k19J12J5J89q7J15l22K42P6q7j69K71j7J19q4j49K04k12j15K8L27k17
5899E0m91L00m3k4K19j63N8J88J79k99j9j02J80K9j18N1Q1k15K38j34K8J02Rl7
$$ y = [-172, 33, 51, -148, -43, 158, -110, 125, 20, 127, -16, 116, 14, 123, -78, 168, 6, -119, 8, 201, 30, 103, 145, 42, 83, 97, 191, 190, 252, 53, -68, 44, -81, 73, -69, 85, -278, -11, 125, -229, -256, -313, 37, 96, 49, 37, 11, 77, -20, 64, -78, -16, 22, 20, 155, 85, 23, -3, 101, -26, -102, -15, -56, -77, 51, 88, 274, 264, -187, -37, -98, 94, 112, -145, 9, -227, 119, 67, 105, 33, -12, -193, 35, -133, -35, -104, 153, 293, 164, 116, -188, 61, 82, 184, -17, 59, 118, -217, -112, -214, 36, 313, 88, -8, 165, -81, 31, 114, 107, 52, 2, -67, -18, -156, 88, -135, 78, -203, -127, -148, 147, -59, 26, 173, -64, 0, 200, -202, -145, -277, -125, -235, -39, 20, 97, 45, -197, -57, -118, 22, -31, 3, 10, 30, -189, -77, -62, 127, 40, 155, -167, 75, 151, 64, -105, 166, 149, 268, 184, 35, 239, 27, -88, -60, 267, 50, -441, -141, -184, -208, 11, -152, -94, 94, 273, -26, -45, -147, 33, 62, -56, -5, 76, -139, 99, -35, -7, 95, 104, 67]
5923F7p1P3j84K82n8k09N8MQ8r0J30nj28Qj49j19L48JK07j01l90Q0K3J56j50R0
5949c9J92j57J2j03K18Q0k44P9m4L96m47O8P1O5k21J23j16J6l3K74%l90L26N9
5973A85j33p2N3j11j71M12kj0k06J44j03j4J15l15P6L03l12J94L9J41J6k17p1
5996e9M9RK01m3l63M81l00J09j3J13j74J35k79J31K13j54m4M5l80N10o4l05QK82
6020A08m9N4l45J50j79L91l9j86n7L2J71j15J71j68p0R0K49k58r1M82j98l26K46
6043F3m9j17J13N4J08j20J5j84J56l4P0k05m8J47j08K05j2j04oJ79j50m8J25q1
6067c1n3J64r9ln4K16k85K70o1k98L38j03Q4kj87L70l45LJ62j71%L50l64J70k11
6092a40K98m2j53J78k64j44K07j61L13K90n45J79K01n26P7J08n9J56j29J49M4
$$ y = [67, -4, 69, -115, 167, 109, -100, -42, -38, 50, -40, 90, 85, -43, -35, -184, -303, 45, 46, 253, 152, -238, -158, -135, 21, -129, -39, 153, -4, 8, -95, 123, 203, -41, 38, -6, 390, -57, 11, 82, 147, -74, 49, -67, -51, -84, 190, 190, -200, 126, 185, 52, -20, 33, -78, -249, 163, 161, 151, -55, 89, -14, -28, 87, -228, -152, 151, -161, 33, 72, 213, 229, 12, -59, -10, -1, 200, 157, -206, 275, -25, 84, 71, 184, 10, 145, -134, -3, 210, 56, 12, 57, -323, 187, 123, -182, -174, 108, 59, 113, -232, -82, -261, 130, 91, -95, -152, -120, 51, -64, 107, -61, -131, -41, 208, -50, -141, 341, 143, -183, 63, 14, -103, 10, 64, 172, 52, 67, -117, 39, 5, 75, -130, -178, -31, -139, 66, 54, -50, -56, 123, -27, -75, 50, -31, -84, 80, -19, -22, -76, 140, -145, 125, 64, -234, 104, 1, 85, 83, -104, 266, -79, -76, 86, -85, -85, 265, -99, 71, -140, 158, 116, -37, 141, -123, -267, -60, -221, 92, 382, -163, 16, 217, -309, -232, -124, -183, -27, -156, -7, 37]
6113C7j54J92p8J00k34K71j78J9m9L2Q8q6p6J4M83l47J8j30p6K63j37J0p4j05
6137a97K76n9j92K17o5J3J45O6l28L96M5m56K97l73N09l37N8m73M32J58o01L55
6159a14K88j1l52L22j89J50J15l20K00L9l70K59Ml05L18J78k07k7j02M7R6q0r
6182g0R9J22k04j97L49L6j83J6%K41j64k16j0L01k01J08j14J28Q0l54K79l41K68
6205b7O7j30nJ54k37L47k91L5J08K2j86J58k02J24L0J32k54K92n91L82P9J77k37
6228e3L8n9M2nOJ07p7k1%j10J43Ok33K80p9Pl87N83j58m5J23k09L73j45k35L09
6254B01m2j74K4k0J57J54n26J95K28k19k5OL85l66K61o2k60J07R3q5pp9o9N6K79
6279B12j06r8m9j18j29N47k48Njp1J13K55k44k25K60mj01m4M9k1M0o5J16r5j69
$$ y = [37, -117, 75, -3, 97, -137, 134, -44, -25, -74, -42, 46, -40, -116, -102, 381, 34, 52, -78, -154, 109, -28, -18, -92, -197, 79, 20, -172, 45, -20, -7, 138, 204, -124, 272, 317, -139, 158, -215, 294, -43, 15, -458, -26, 132, -469, -114, 174, 163, -189, 133, -56, 94, 209, -111, 89, 128, -242, 17, 21, -284, 34, 212, 5, -22, -124, -77, 19, -61, -70, 29, 151, -53, -250, 99, 135, -48, -32, -32, 209, 45, -171, -181, 120, -81, 27, -87, 41, 121, -233, 46, -295, -27, 40, -90, -95, 59, -178, 169, -122, -87, 21, 43, -143, 15, -187, -63, -33, 99, -155, 137, -454, -72, 7, 184, -53, -15, -74, -32, -37, -31, 76, -1, -22, -22, -132, 11, 17, -216, 64, -15, -8, -395, 188, 30, -15, 108, -101, 272, 127, -108, 201, 159, -15, 9, -11, 146, 300, -226, -31, 197, -22, -47, -41, 344, -22, 239, 177, -83, 24, 117, 32, 25, -54, -123, -67, 212, 106, 8, -41, -159, -288, 259, 11, 16, 15, -56, 57, 312, 68, -157, 103, 99, -2, -46, 3, -18, 22, -43, 73, -22, -191]
6304a91Q9L12n5k88K91j52L1M3J60k53j1k1R8m1o0r1RJ43J51q4j8K1L8j25l8J32
6330I0k39J64k97M77L8P4m09K25j66j84L2K16L1j86J62j12j00K37L0J92j97j50
6352g2J59q5l5k47M34j09k29J84r8K8j65K57L3k9j35J82J37l02Q9J77j38k42J48
6375e8K50k73O5L9r6J5J38N1K3j57o2K17l56L06R1j23J06k29L22j34L4j77K4j21
6399a05Q1j25J60j6n4L20m36L01k57J72P6J38l79N7J55K5l76K74j38P9j35L79
6421A96j31P3o7n7j10J8J91j53K13k81l8J34j04J08J3J1j32R4j83J05R4J06j76
6444g6j04N21k42j19J57l9j43m6M22m99Q9J55k01LQ1l2o0K7MJ52j11k0Qj32J88
6469a7J37J07k88J46p3m9k67K57M1J75n9k09Q7J19k7J1J32k95j96K51j28J45p5
$$ y = [-191, -102, 210, 155, -133, 158, 6, 37, 80, 240, -13, -24, -45, 53, 12, -48, -139, -130, 13, 164, 80, 62, 83, 121, -4, -42, 90, -149, 15, -282, 195, 233, 307, -102, 123, -43, -227, -195, 21, 52, -134, 28, -84, -184, 53, 83, 275, 78, -72, 87, 2, -33, -280, 154, 45, -184, 0, -98, -70, -235, 22, 55, 26, -109, 73, 210, -92, -3, 174, 36, -206, -58, 192, -81, -16, 23, -73, -58, 80, 131, 154, -3, -65, 152, -204, 102, 193, 70, 176, -53, 269, 135, 169, -8, 16, -105, -24, -149, 11, -5, -59, 261, -175, 126, -131, 41, 117, 255, -124, -67, 88, 113, -263, 11, -127, -48, -183, 196, 65, 138, 71, 14, -96, -78, 113, -40, 173, -108, -146, -12, -116, -8, 5, 16, -116, -22, -205, -100, -6, 100, -76, -180, 341, 99, -20, 137, 98, -45, -91, 331, -168, -79, 76, -125, -122, -41, -73, -133, -106, -102, 50, -61, -81, -73, -205, -17, 120, 227, -61, 85, 12, -37, -304, -47, -6, 169, 110, -99, -12, 107, 80, 91, 223, -72, -268, -17, -145, 0, -75]
6492g5M2J36j09K65l25K32l22J69M2n58M80J69K2l27J66J46l17J83m2j17K38k86
6514a88J59J8j89J85N9j35L10l85Q3L31k4k85J71l06N0j15M09j36J60j36l52J14
6536b02O7nK21j47O0j35Q4R1O2j7q9k5R7Rj54r6K78j54j1K8j0J18q5K5N2l0k36
6563b04K74j25J49j57pK26j06j90N29l48q3R1l2mj5j5j8J97j68%l1J29j86R3N
6588Dm7L5j21J73L1J20l57N0L4J41j29K70l52O5k23K39K02j76L1l43O43m32J05
6611c7q4L81k95Pk77K33J48Ql68L02L07n39M41j45j46K22k13m3O0mR6n6o2r1L40
6636A85j85R4k05J78Q5J01k23K11k46r8K0K41k20N6K67k51M4J6j20J9P9K9J82
6659B59l03P1j8Pk5j0m3J89l8n1J6Nk63L09o3r8L4J03P1l21K93k1j24J39O4l13
$$ y = [-75, -33, 103, -6, 259, -66, 166, -156, 13, 55, -503, -23, 146, 168, -159, 7, 153, -164, 19, -23, -140, 98, -188, -29, -11, -200, -15, 44, -91, 219, -166, -83, 248, 224, -61, 110, -196, -146, -261, 148, 12, 172, 36, -316, -202, -135, -140, 81, -66, -6, -141, -57, 34, 96, 79, -10, -35, 62, 71, -83, -179, 99, -55, -66, -38, -48, 70, -15, 10, 62, 32, -204, 70, -55, 94, -63, -70, 156, 50, -140, 389, 41, -42, 49, 17, 13, -2, -17, -35, 162, -6, -6, -37, 92, -94, -1, 4, -43, -8, -129, 44, 75, 195, -162, -112, -78, 63, -66, 204, -148, -83, -306, -67, 135, -41, -10, -353, 290, -142, -37, -121, 260, -35, -28, -305, -72, 76, 84, -284, 18, 325, -214, 227, 82, -64, 158, -55, -98, -38, -42, 54, -2, -64, -155, 185, 0, 94, -111, 67, 152, 253, 30, 241, -5, -103, -83, 158, -62, -6, 261, 10, 54, 70, -50, -31, 48, 77, 259, -44, 27, 9, 16, -9, -19, -62, 127, 89, 38, 54, 59, -204, 105, 42, -56, -22, 81, 152, -169, 124, 103, -21, 118, 182, -131]
6685a31K77l56K72j93K02L8k31L28p9k49R9L15l19J50O1k41J8K01q2j3j16L32
6707B83j87n7J43o4j08N2J33j24k8O5j49R8k4k31J69j37J05J17j04K39j19O3j52
6730a7M9j6j05k24K88J58j98J22Q5k73M3JJ04L3j15J44l38L76n9L7j5mp5j78L91
6755B14k42J73j95J85j29KK1j61j38L04j53J79j9k42L50J34k55L7m1K2L6M4j21
6778EK61k15r8J39P6n40K32J22o1k7k50M04k17k2J90j44K37j77K2J71j31j58J66
6801a5K28l50J22M6j01j41L22Kj06K65l79k20M43k71J04m7L26k70J86j62p9K19
6823A22L2j43q2j0OL07l72R4J64k00J05N0O4p2j12J19j51Qq7o9K71J29k45K94
6847B22l82J39K37j88k92R5K09k02K28k04J39k55M05j38P6k11o1O8J20K49j97
$$ y = [-131, 146, -210, 62, -131, 71, 109, -122, 206, 127, -122, -23, 292, -27, 123, 184, -57, -39, 162, 80, 67, -49, 283, 96, 39, 182, 118, 10, 62, 195, 71, 43, 108, -41, 57, 33, -198, -29, -166, -61, 56, -48, 191, 72, 135, -17, 32, 16, -89, -313, -25, 133, -65, 57, 142, -131, -88, -87, 17, 50, -65, 79, -259, 117, 58, 95, 80, 76, 1, -177, 214, -28, 145, -50, 135, 6, 8, 29, -132, -270, 34, -119, 60, 41, -201, 149, 283, 28, 65, 24, 46, 82, 126, 5, 266, 51, -47, 92, 168, -372, -140, -18, -79, -106, -356, 48, -169, -191, -1, -145, 92, -85, -63, 108, -23, -181, -15, 213, -137, -15, 31, -70, -211, 111, 113, 7, 272, -107, -327, 116, -155, -51, -98, 228, -42, 144, -18, -97, 122, 154, 11, -71, -81, -75, 232, -140, -46, 118, -82, 23, 73, 137, 65, -47, 72, -79, -71, -158, -227, 44, 173, -72, 222, -160, -21, 216, 28, -264, -169, 40, -162, 66, -138, 1, -254, 151, 13, 89, -122, -183, -115, 5, 254, 57]
6868E7j25o9L56l62K52j20j61J87j20J54j25P9l14M15M3n6n3J53k13K8j30K20
6890I6j49K46k32j35J58o4j85K69R2r8R4j11P0K25l03O4l4J90k07J10m7j68j47
6913b66K86j36M7L82n09L30j4k42J70R9j07j47Q1j23l4J11J1J7r0J30k12O5J78
6936B7n8j80L59j85j1Q9o1J93k41K7n3K67J25o0q8m4o2k44K12j98M07k46q9J30
6960A6j56J13j04J43J21n39K52J82M7j37k44K85oJ3J51k11J8p0on2K81J8j76J25
6984F4q5J22l40J78O1j78M00m5k18j15j8J15L3p0Q6k47L81J65j69L06m36K06j83
7007A3k32M06k35J84Lk64K00k5K2j12r2m2j19J08K38l25L92j19k7K05l17K14M7
7030A23k36M2k4J3L27l72J04J06R5J35l59O8j60J25n7j38J88l5q4j25K56j61K70
$$ y = [57, -68, -137, 219, -143, 109, -11, -172, 15, -105, 49, -76, 3, -311, 104, 147, 91, 38, 191, -22, 6, -124, 96, -53, 193, -39, -174, -16, -80, -265, 4, 96, -2, 92, -19, 51, 276, -27, 37, 3, 193, -14, 96, 49, -119, -266, 20, -116, -69, 313, -196, 134, 120, -122, 48, 147, 40, -107, -26, -149, -183, -72, -61, -44, -134, -4, -216, -151, 27, -31, -211, 148, -37, -48, 41, -20, 173, -68, -41, -94, 173, 298, 238, 150, 106, 44, -200, 12, -186, 221, -25, -114, 16, -140, -27, -131, 12, 133, -406, -154, 28, 75, -62, -306, -21, -27, -14, 137, -74, -56, -126, -132, -184, 97, 115, -61, 64, -21, 101, -239, -61, 0, -178, 222, 177, -41, -156, -174, -59, -26, -96, -10, -257, 124, 289, 120, 426, -10, 196, 13, -219, 187, -48, 136, 139, -125, 75, 50, 72, -40, -132, -174, -293, -185, 53, -272, 120, 1, -26, 179, -138, 76, 123, -113, -71, -95, -82, 245, -127, -23, 83, 178, 313, -46, 22, -138, -13, -70, -208, -20, -55, -139, -264, -8, -169, 101]
7053A01j29j21L63l01k5R8j35K27q2k40N15l80K81k15O9k18J87K36l37J00J15
7074A09j3j04N0np3J72j61L6j13pJ64j7m1k26M59k92M2J48j81K64m13K17J02j37
7098b0r4p7L32j08R9l00K04L2j3j09Q2m5j00o5K58j32J09K2p7j45L76j34M3k3
7122A15l88N85m52R4J23qk56L92j90J4m0k0k94K71j35K27Rn1j63J09J3n9N4J50
7146A00k12Q0M5K50l25j06R2J81j58K69k83j3j43M13j90Oj3K78l30L19o6k92K61
7169A63j59K59l31J19rL0j92M0J81j74L10j07L33l38k11j9L89l35k17M00k32P7
7191b3Q8j83J76m7m34K72K67M7r7j99Q7M0p8J95m8j51N7O8p1J23j03j28P1K70
7215A99m01L44o6J28k72K46j33m8J9o8J80J1N5l51K52k53K90j52J70k44N9j15
$$ y = [101, -28, -149, 214, -87, -112, -14, -149, 78, -4, -244, 271, -109, 172, -43, 26, -192, -5, 231, -106, -6, 109, 96, -8, 42, 37, -36, 136, -25, 11, -102, -109, 55, 38, -3, -229, 230, -62, -20, 128, -53, 211, -202, 15, 117, -20, -114, -191, 141, 33, 132, -168, 36, 68, 55, -54, 28, -17, -117, -182, 76, -56, 53, 75, -2, -147, 229, 95, 138, 115, -273, 312, -140, -46, 77, 69, -187, 205, 15, 29, -11, -31, -325, -54, -189, 38, 47, -4, -167, -58, -45, -104, -50, 100, -112, -32, 13, 263, -62, -168, -76, 105, -53, 216, -67, -80, -223, 190, 0, 6, -7, 271, -59, 260, 194, -98, 163, 4, 263, -68, 51, 42, 72, -120, -80, 101, -73, 237, 130, 463, 125, -86, -105, 284, -51, -268, 132, -100, -23, 65, -118, 58, 11, -423, -151, 116, 163, 66, -133, -46, -6, -84, 111, 63, -88, -31, 37, -34, 89, -14, -142, -71, 199, -202, 142, 76, 204, -68, 178, 45, -3, 16, -52, 128, 139, 194, -157, 95, -158, 132, -20, 150, -94, -35, -150]
7237a50M7J8J35Q9k73q8R7J72P3J35l59J77k7m2J7R1j28K21k96JL4L2J20j26K84
7262B54k00LJ67k85j17K12O6o7k80L79K0r8j77K0k32L89j11J4m2l2J80k18K00
7285D5j80J09J18Q1L7q8K0j42o5J5J17j48L4k00O6J97K27l72J03M7n1J08k56J49
7309b9O5J04n7j48r4R6J83j69k5J28Q1l6Ll96L54O5j18q8j30L54j04o7O3J01l
7334A33r3p4j15Q3k63J44m7J55J90l58J94M5J17mj11q6K61j91k0J93q6K20k98
7357a1J4j46J00L7Q3p4j2k18j5L60M1l62K85m1k17J68j03L5J67l79L72j41J24
7380F7j84oJ12k74K81J22jk70J41J00l32N4J71Q7N9J14m99J26R4l9r9K82q8j01
7404h3N4L3J37k39J63m5J99m9j22j35M7O5K42m47J84O7K12k52K6j01J58j33j76
$$ y = [-150, -103, -85, 50, 139, -134, -222, -125, 47, 120, 255, -104, 73, 46, 4, 21, 112, -16, 205, -91, -90, -56, -24, 96, -30, 254, 54, 57, 224, -61, -178, 34, 100, 33, -247, 132, 152, 54, -123, -103, -335, 54, -57, -43, -85, -117, 63, -155, 45, -135, -26, 92, 173, 210, 122, 142, 0, -65, -50, 67, -81, -47, -247, -181, 16, 243, -129, -26, 21, -30, 78, -178, -29, 36, 140, 83, -65, -159, -63, 120, -49, -74, 54, 135, 99, 102, -294, 60, 125, 7, -81, -211, 143, 39, -28, 35, 136, 133, 40, -34, -149, -66, -329, -185, -232, -77, 113, -245, -51, -6, 111, 107, -4, -90, 171, -20, -40, 153, 67, 287, -11, 3, -143, -43, -6, 77, 3, -9, -227, -242, 118, 159, -203, 82, 41, -176, -8, -111, -76, 91, -288, 84, -57, 67, -117, -123, -11, -285, -4, 118, 117, -153, -12, 88, -244, -190, -19, 68, 127, 241, -258, -132, -38, -77, -176, 106, 18, -83, -29, 4, 141, -98, 65, 20, 219, 170, 48, -87, -40, 25, 267, -180, 4, 71, 283, 31, 57, -44, 114, -19, -195]
7427a95K32m5J00p0k8j13J20K4p8J36J25m29M04j25rO8o8J16j52j4mo9J26Q7j31
7452HJ05q9J80j46l0j27L3J8M5j97l3K63n2q3JJ6M8mk3K92n9k51J62J35j21j5
7478G6o4n0L9l45M18K4P5q8j89K55k3j20J39p5k63Q5K62j71M5O9l95J86L01l24
7502a33J16J77l01J3J31k5o0m8m8K33l3J4J3J91k82q0O1M5j14R4j03J24r9n3r4
7527b61J34K96J2j09Q1k26J19L2m4MN7o4q7N5J32j89q3MJ75j85M8p4J6J20j12
7552a49K67J27k35J50j06oR0k75K78k59N4Qm8Q3K5O0j38M0J08Q1K38l55Pl6m7
7577c8l2L43k07j94p5Q7R1O7j07L0o6L91l17Q3j40QL3K73k18J31r9M4j25j87L05
7602H1m1k20L20k60Q6r1K54j25r6N1M1n0J45j88J03J09p9r8K3o9K14O9k69Q4j71
$$ y = [-195, 37, -8, 92, 22, -6, -119, 1, 25, -53, 83, 208, -221, 183, 58, 49, 117, 49, 165, 13, -1, -5, -74, 52, 139, 8, 113, 24, 204, 58, 28, -99, -66, -48, -3, -200, -233, 30, -22, -105, -104, -88, -40, -44, -67, 225, 166, -85, 77, 212, 91, 76, 12, -38, 1, -344, 74, 98, 173, 85, -104, 151, 128, 8, 147, 72, -191, -106, 156, -15, 30, 99, -296, -110, 191, -133, -17, 160, -141, -128, 3, -22, -82, -130, -178, 55, 22, 36, 49, 240, -42, -122, -61, -16, -130, -36, -139, -15, -114, -167, -261, -127, 169, 181, 72, 153, -73, 46, 78, 34, 38, 95, 31, -56, -1, 131, -58, -141, -137, 38, -147, -99, -173, -157, -37, -149, 118, 245, 10, 160, 54, 48, 138, -137, 141, -118, -64, -56, -104, -21, 4, 64, -74, -34, 74, 155, 393, 38, 45, 9, -38, -70, 273, 66, -128, -203, -116, -25, 42, -65, -35, -101, 290, -27, 56, -84, -76, -43, 230, 12, 143, 44, 88, -37, -224, 81, 40, -180, 140, -120, -34, -125, 129, 4, -92, -41, 0, -50, 95, -93, 10, 119, 40, -58, -35, -104, 110, 179, -90, -6, -177]
7627a77J74k2J00m3j23K06J08k86M9Q1J36m24K45J17m02K02l1o6J30r5QJ52R0
7650A29j04m8j52j21M60n6q2j29J27q8p8J71L6j50p5K34j19L69l60J08k99L36
7672A09k90N0m1K66l89L01MJ03l25J52K29J0o8nL3l49j3M73k18j98p9M78l33o
7696a06o5K99j21J55k20K01m4j63Q6Qk8L04j59j05k6J2j96J35p5J67j8j38J3k7
7720a11L03j54Q0j75K0J48j10J9l2L16k34r1p6M0K37j61O0j07L2l05J51M9J79
7743G8N3r0N8q4L2k16J80J5k8N2J83l71K63m2n5j62n8J60J9p9J64j93K18L7j11
7768B3k00L05Kr3k43J74LM7J29o7J30j79m3K11Mj30o2n6R7j11P6p6J51k75O9J17
7794Ck36L07p5Q2J67l09K73m69K40k7K46m0J09k81Rj6Q3k4q3kj1MK23l52J92R
$$ y = [-177, -3, -25, 75, 32, -91, 115, 223, -63, -14, 67, 203, -221, 24, 141, -261, -59, -90, -156, -26, -121, -113, 39, 129, 25, -23, -175, -296, 164, 108, 26, -103, 24, -64, -142, 29, 65, -85, -160, 74, -45, 324, -36, 72, -227, 109, -181, -131, -172, 94, -295, 6, 10, 113, -212, -60, 169, 179, 111, 106, 139, -210, -223, 250, 32, -166, -245, 233, -100, -106, -171, 128, 7, 162, -58, 143, 99, -64, 22, 30, 2, 306, 147, 42, 16, 28, -168, -33, -108, 59, 41, -97, -84, -111, 192, 38, 118, -57, -37, 111, 1, 20, -12, 304, 70, -21, -97, -57, 180, 19, 79, -28, 4, -301, -150, -101, 78, 131, 41, 99, 15, 47, -169, 11, 26, -2, 50, 233, -138, 125, 83, 28, -134, -192, -32, -13, -92, 72, -121, 97, 134, 23, -177, 128, 130, 37, -206, -32, -29, 18, 147, 80, 210, 31, -12, 199, 203, 73, 11, -45, 52, -59, 17, -59, 92, -183, -114, 3, -233, 74, -1, 81, 248, -61, 212, -257, -17, -44, 202, 162, 271, -10, -1, -17, 66, 42, -41, -43, -54, -50, 173, -179, 13, 22]
7820B2o4J99k99j3K45p6p0J95j1k39P9O8J16m0j55J8k3K87l69M1j64J91k4J65
7844G9j24O0L09j07k57K03j92j36O6L4P6k45L87l11n9K97L6k08K34k51j44K05
7866d8J03O5m04K16m3K09K1o5Q0j66k3O9J24k70M39m98K57O1j7j26p0L36k38j16
7890a04K7j60M16O4j45j22J75R3j88P7l07Q3R0J09n1n40P02k25k6K47k9k73N8
7913b9r3K8R6j62K29m6J42k15k1K82m05K09j28K60J2k87K11k97J71o3J01q7j5
7936a07L58l10m3o1J35K56m01m1J50j4L30k42J61k61L06p8k05N3r0J20O5K9j50
7959d0J25L6j86O9K3k13K87j28J13q4p1J99k75K70j97K57j05J91k26k49J23J43
7981F2L8j60K38k52j04J83k35M48l96L05o7M4n8pj67J8KoL00p4kj37K3K07N8k35
$$ y = [22, -42, 157, -142, -155, 90, 14, -56, 139, 128, -111, -32, 36, 152, 112, -43, -25, -48, 239, -130, -89, -253, -62, -86, 79, -45, 15, 324, 217, -40, 163, -29, -165, -99, -65, 11, -234, 153, -158, -217, 80, 116, -92, 142, -109, -253, -48, 55, 120, -284, -68, -111, 98, 119, 54, 134, -32, -55, 14, 138, -132, 307, -191, 66, 127, 110, -16, -86, 250, 12, -104, -77, -237, 179, 243, 98, -24, 151, 244, 56, 133, -174, -91, -1, 108, 57, -483, 219, -6, -32, 215, 186, -87, -29, -122, -94, 2, -160, 69, 23, 165, -50, -71, 211, -194, 15, -113, 147, 159, -128, 83, -214, -43, -106, -5, -92, -107, 251, -59, -102, -163, -28, 228, -173, -214, -64, -78, 252, 10, 171, -90, 216, 138, -67, -14, -104, 16, 81, 110, -40, 85, 121, -65, 4, 27, -186, 101, -27, 86, 2, -69, 130, -145, 125, -72, 185, 80, 271, 45, -204, -81, 62, 100, -60, 178, -74, -178, 5, -230, 218, -178, 127, 60, 104, 46, 39, -128, -110, -108, -114, 186, 112, 110, -27, -4, 203, 261, 26]
8007B6K0j08N1J26l75M38l2m44N17k77q7J54r0J42j69K44m1r6J38k99L11M0j65
8030B4j82P2J74k82K53q5o8L62l71J94r0Q0k42K23l41L59l8o1L5J36j03J65j61
8053E3kj49J96k15J02K93m32M8p4J81J35j30p7J92k34Q9j0K03M7j02l63J64P4
8076a1j54L13L7j36pL8q9q4P3M5k09J39m1O3p2K84j28J18l02l4j0L52j38K2l18
8101b49P5Q2j14J74J3J32j02j35lP4n3n1K33l70N00k33r6J30m6K7k3j64K2J55
8125b2J5k8k6j19P0K31N6k83J11j65K81m8m5r3q0p4M2J74J3J49l33J45lM7N2k06
8151a39J45J09O9M9m87J75J93L8j20o6O9Q5o4R8k18M00m33O6o1J79k77M27l59
8174a22J61n1m5J20k39L16N3L1k79J3P5On9J3RJ25j61
$$ y = [26, 46, -62, -11, 115, -260, 178, 146, -298, 219, -58, -145, 9, -81, 61, -108, 136, 95, -1, 137, -162, 149, 189, 24, -158, -86, 88, -194, 59, -26, -94, 268, -103, 91, 1, 81, -161, 62, -279, 80, 42, -19, 16, 152, 49, 214, 53, 51, -98, 98, -117, -15, 278, -154, -106, -180, 1, 136, 6, -71, 121, -113, -24, -34, 169, 216, 114, -249, -85, -11, -165, 148, 185, 49, 42, 80, -9, -93, -20, 25, -184, -45, -86, -23, -95, 189, 61, 179, -123, -157, -167, 185, 47, 69, -249, -174, -92, -206, -32, -19, 113, 11, -124, -127, -53, -106, -157, 76, -294, 206, -27, -123, 7, -39, -12, -35, -199, -177, -22, -7, -35, -61, -180, -110, 121, 177, -106, 5, -160, 121, 73, 28, -65, -145, -219, -177, -3, 10, 159, -174, -29, -32, 15, 67, -139, 6, 115, 184, 233, -254, -79, 114, 152, 32, -34, 35, 120, 56, 154, -64, 336, -97, -31, -92, 87, -190, 237, -122, 39, -12, -57, 63, -176, 140, 193, 224, -55, -42, 33, 39, -20, -7, 2, 127, -34]
8191c4
$$ Imaginary data points
##PAGE= N=2
##DATA TABLE= (X++(I..I)), XYDATA
0@%%%%%%%%%%%%%%%qJ6j6J6j6K4l2L2m0M8n6O5p3Q7j00J14j30J46j64J87k09K34
37A25k64K95l29L65m05M50m99N51o09O72p42Q19r00R88j088J202j327J466j624
56h54J802k008K249k532K872l288L817m509N452o827R023j3067K2874r0253r3931
71a69180K15187K9342j04698L9566P4144m6960J5596L8900n5510l2794M2130l4098
83A1625m4877M6671K8065n2300j4927K6752n0l1753l0989L148M1039m557m6434
96f8587K6628P2307q665l6145K0593J0842k1585J4740J8462j6569N034K2367j4688
109B4734k397L3736j5595n9526k309L3736r982k4694J871N021K649O096j1787
122a8447j4835J1568L137k2861O899L8543O764j3814J5103K1454o109j1281m15
$$ y = [0, 0, 0, 0, 0, 0, 0, 0, 0, 0, 0, 0, 0, 0, 0, 0, -8, 8, -8, 8, -8, 16, -16, 16, -24, 24, -32, 33, -40, 47, -53, 61, -69, 77, -87, 100, -109, 125, -139, 156, -173, 192, -213, 237, -262, 289, -320, 352, -390, 429, -471, 517, -571, 631, -696, 770, -854, 948, -1060, 1189, -1343, 1529, -1759, 2058, -2451, 3001, -3826, 5197, -7870, 15004, -75249, -169180, 46007, 75349, -29349, 10217, 84361, 37401, 52997, 91897, 36387, 3593, 45723, 11625, -33252, 13419, 41484, -10816, -25743, 1009, 959, -30794, -61783, -58635, -17596, -22153, -68587, -41959, 30348, 21683, -14462, 6131, 16973, -4612, 10128, 28590, 12021, 17055, 39422, 24734, 22337, 56073, 40478, -19048, -21357, 12379, 2397, -22297, -20426, -15405, -12756, -6660, -18447, -33282, -21714, -18577, -41438, -34539, 4004, 10768, -3046, 12057, 33511, 27402, 16121, 15706]
135A5706J232J547m575j2634M978K1085k221k1726p524L96o620n214n694q537
149b9801O235R785n335M111K0223m971k2175R035K3325m000q893J1314J0035Q21
163A9709L149o68p724k664l161j0794m839P848L425o424m303N507L554j0600j1152
178a9137M105O584r506p603J4992J6021l113n029N601N215M59P1l161j894N955
193I560M235l909P81O348o351j3206j402N240m272j0747o48P915L520m302l389
208a0627M445L138n061m571M616P212K163P80K814N380L624k218m497J26J358
223H682n287n445M787N781m671o899J024L596l937o922k384K323J831j047P93
238g775M736M122j339k157K191L733q21k617J240N529K370k285j105K998J06n789
$$ y = [15706, 16938, 18485, 13910, 1276, 6254, 27339, 25118, 3392, -4132, -3736, -10356, -15570, -21264, -29801, -23566, -13781, -19116, -15005, 5218, 247, -21928, -12893, 10432, 6432, -2461, 8853, 18888, 19709, 22858, 22190, 14466, 11802, 8641, -2153, -6992, 856, 4281, -2143, -6446, -939, 2615, -7985, -19137, -15032, -8448, -17954, -25557, -10565, 5456, 2343, -2686, 2915, 8130, 8589, 8660, 5499, 3605, 9560, 13795, 9886, 10667, 17015, 10664, -2542, -3944, 1296, -2976, -13723, -14371, -6456, -2936, -7238, -10627, -6182, -3044, -8105, -12676, -8060, -848, 1315, 2095, 4909, 10289, 13913, 11695, 7198, 7324, 8682, 3395, -2050, 2737, 8518, 3847, -3052, -2028, 1568, -2369, -9291, -11675, -9352, -7521, -8568, -7775, -3039, 1083, -256, -2413, -222, 3511, 2690, 73, 1313, 6842, 9212, 6927, 5822, 8820, 8926, 3137]
254C137n262J490J748l644l051J948K952j126l310j164J746l35k634l66M204M165
270D98p3l30L171L700m67l357r76K958N49l181j150L473J252m108l021J261m33
287b34l065k916K4K132R98j526j92K936J737k065j682K866K004q16k3K496K733
304E407M1j712l22J890j029l679q07J860o30k065n15P99K51j332k508Q5J531n50
322c285j637Q19L387R47j355Q67K052N46q35l14Q13J442l68j023L30J138m7k460
340A017j233N51k5k294j258J458P60j619q75J139R86o37j073P25J643J083p09
357c61M98J744J078n51n35K68O54J21j815m80J452j49k718l07J480p46j961L90
375a938L29j09m73m10M58J585j27j145J218J561l21m62O89N58Q28K40j139L40
$$ y = [3137, -2125, -635, 1113, -2531, -5582, -3634, -682, -1808, -5118, -6282, -4536, -4871, -7505, -7871, -3667, 498, 425, 95, 3266, 6966, 6499, 3142, 2166, 5124, 5673, 2492, 1342, 4815, 6067, 1959, -1062, 199, -234, -3299, -6215, -6191, -4059, -3061, -4587, -4779, -1843, -106, -2171, -3853, -987, 1017, 201, 178, 2674, 5407, 5448, 3736, 3414, 5304, 4275, 596, -211, 1649, 1019, -1046, -1561, -762, -511, -1843, -4351, -4266, -2735, -3285, -4922, -4103, -716, 231, -1124, -257, 1795, 2341, 1506, 1192, 2005, 3447, 3079, 2056, 2386, 3524, 3477, 1017, -216, 335, 310, -1984, -3242, -1784, -1024, -2643, -3518, -2379, -1393, -2030, -3103, -2378, -735, 348, -361, 137, 1881, 2959, 2408, 1873, 2141, 2795, 2916, 1101, 621, 2073, 1924, -794, -1101, 379, -367, -2328, -1938, -1609, -1718, -2191, -2601, -2143, -558, -685, -1830, -612, 949, 628, 166, 855, 1413, 2241, 2481, 1342, 1682]
393A682R51o79j775Q0J010j276j023J39L57p80n25k09M18Q17n00j138J616P60
411g5m59k47Q64Q29L60M0k82M79R50q20j132R69K10j229p13R44k16j199o09L23
431a013J45nr16j61M61R58m49j08O76P62k27k31K30J166l09n32O56P32n8q88k27
452F62M30j9j168n98M41P7r2q59k09L45L60r7q92M42J23n5N23N81L69m05K59P84
474A002L83l71k82k74L63J07l85M9pK37o90j29n88kM1m56o27M81N59m5Q6M46l1
497a33m44K95N42K24J09J90j52M03N79j70n25m27P2m07k46J7k33O8l36Q0M41k48
519c01p03K11o2K92k59J26M00M14M14k14J7N74l01r8n25K48N41M4k9p1l90k21
541A07k14qp3n91n84K05P09K73m45M2K88rl23P8K26L60J87J55K60M02J88p19j43
$$ y = [1682, 2633, 1954, 179, 259, 1269, -7, -1030, -891, -534, -1314, -1839, -2048, -1630, -813, -1313, -2451, -835, -75, -534, -781, 83, 912, 1272, 1312, 1030, 1509, 2459, 1639, 507, 1476, 1686, 457, -256, 688, 472, -727, -1336, -1013, -868, -873, -1789, -1950, -1489, -531, -980, -1088, -412, 350, 123, -108, 122, 1288, 979, 447, 1103, 1835, 1777, 889, 662, 1092, 1073, -95, -693, -252, -175, -267, -1126, -1335, -990, -630, -727, -1619, -1177, -1054, -1109, -586, -5, 364, -41, 218, 1002, 1385, 1014, 732, 458, 821, 928, 543, 592, 585, 822, 132, 3, -585, -587, -546, -1002, -1629, -1148, -589, -634, -548, -102, -133, -577, -282, 260, 484, 593, 783, 631, 1034, 1613, 1443, 918, 491, 563, 156, -90, -73, -306, -238, -574, -494, -53, -301, -1004, -793, -855, -563, -822, -696, -296, 118, 532, 318, 335, 909, 608, 510, -15, 233, 774, 818, 789, 718, 328, 107, -107, -115, -188, -779, -1363, -1158, -449, -176, -621, -579, -291, -300, -623, -545, -319, 41, 228, 383, 643, 1045, 1233, 514, 371]
564C71k33K87m81k24N83j70j70l18J53J05n16m09l12N47J61K47K51J60M89m59
584F2LK77j39k07J68K08L58K30j67l07L4j4n15l98L09l45j64L01J66J28p2m62
606e46K8k16L50j95K5M19Q4J48M00K46L68p49j47j89K0L29K11l68K6J14j27l01
628g0q4l12m68J51K0L57K39j24m8M62l21p1J24q0%K47J99K76L05K09k77m31l35
651c2M4J23n57P3J47Q6J64r4r9r5m82K25j09p8J74K60K58M87Q8q6k45n4j18j05
675b5l6O03Rk24J3J90j92o9m67k29j48j19L09N2J7L44k23P9k89L11k41l4J21O8
699a80M37L25P9R7j54m34l25K81J13k23L02m35M42j42k20l19J01k37K00l86J02
720e76J63K79L21k36M24p4Pk19L3m1O9k76N43R1k17P3O6k73j29Rj23j57l9J54
$$ y = [371, 138, 425, -56, -280, 303, 133, -37, -355, -202, -97, -613, -1022, -1334, -787, -626, -379, -128, 32, 521, 62, 65, 342, 203, -4, 164, 372, 730, 960, 793, 486, 520, 506, -9, -407, -98, -443, -607, -306, -140, -12, -84, -546, -518, -734, -384, -579, -554, -135, -51, 97, 497, 743, 1111, 362, 215, 26, 46, 375, 586, 218, 244, 358, 231, -70, -154, -466, -934, -783, -763, -406, -167, -291, -339, 123, -198, -269, -145, -225, -225, 22, 221, 497, 802, 1011, 734, 303, -32, 12, 135, -422, -349, -202, -116, 48, -46, -145, -240, -722, -497, -606, -684, -510, -250, 8, 495, 583, 497, 252, 198, 80, -25, -61, 542, 551, 327, 340, 530, 338, 269, -198, -427, -575, -694, -385, -333, -316, 28, -195, -116, -405, -94, -335, -369, -248, -180, 257, 582, 661, 758, 604, 170, -155, 126, 239, 16, 318, -117, 325, 183, -37, -356, -255, -492, -292, -678, -576, -413, -134, 187, -49, 375, 301, 308, 89, 122, 81, 150, -126, 417, 508, 291, 364, 430, 157, 28, 37, -86, -243, -282, -128]
744a28k4K91l14o5O2J22j83l29L40J99L33j02J2L66l04j8j95J2P8j14k5l5L70
767C49R2j15m89J21j91l42J34J88J55k45J33N0L0K01P1k96q0N2J96K87j1n6j56
790G8J33J11j69k07J44k64OJ00n7J17j71J2p0l0j38K9K5KM19%o6m0M32l49J26
815A73m7j18r3M79l31K35J89l14k9k39j06P7l1J62j40l0L4J47K52n45k00K14L9
838b22j23J88K15K65j08P8M7k20K69j58k68j51K11m5KJ86m3R1j43j53K5l40o6
861d63M08l48N61K1j84P3j87P2p6R6l36M56K02o1r5J72q8J21k82j15m20K90j65
884c48J90L4R1K17m13J50k39K68j7oP1k84J79K59L04j65k91J25j7R6k30J12q0
907FK58k84K36l07J05j95L11j63k13M08k80J20l00R3K39k39lK13j06J22p7L11
$$ y = [-128, -152, 139, -175, -240, -178, -56, -239, -568, -228, -29, 304, 202, 214, 580, 276, 258, 63, 75, 153, 39, 14, -21, 349, 441, 326, -163, -42, -233, -575, -441, -253, -98, -343, -210, -160, -130, 71, 142, -154, -234, -182, 14, 301, 290, 234, 78, 211, 322, 153, -54, 90, -174, -168, -68, -125, -8, -179, -167, -237, -267, -405, -376, -351, -349, 70, 70, 4, -36, 396, 47, 173, 126, 8, -85, 394, 63, 298, 487, 173, 144, -95, -201, -124, -155, 7, -133, -163, -129, 18, 270, -275, -475, -261, -222, -345, -157, 58, 323, 215, 293, 340, 120, 389, 231, -37, -188, 23, -22, -20, 166, 123, 214, 71, -82, -57, -397, -463, -55, -403, 158, 179, -5, 68, -119, -47, -123, -27, -363, 93, 295, 234, 139, 311, 223, 344, 62, -53, -473, -183, -348, -158, -124, -33, 184, -229, -79, -318, -50, -67, -73, -2, -286, -107, 152, 456, 291, 0, 125, 108, 204, -26, 86, 6, 264, -20, 216, -91, 14, -181, 130, -33, -246, 162, -118, 2, -298, -205, 34, -205, -208, 5, -101, 21, -56, 255]
929B55Q6m9k89J60k73M7qK3J4J01k21K79j12o1k28Q6mK91j45K8O0l73L70m2J53
954A48l4L0l13J62K78k02J59p0l20J50J91k22j11M6J3O2L88m35R3j01k23J39J85
977A3j47J02Q9p8j54R1j2J09P6lJ0o8J08j33r4K74Pj89m6MJ88L0k29J87k88J19
1003c4j33N1J51j55j08K15N8m47J66J10P1J04J69n9m2j26J32n9J0J36J8j79q8
1026c9k30K58q8J61j09J88j17j92K34r6J52o6j84K3J96jj56o8N5J36j98K90j67
1049a8K4k8j42M6MJO9N5j78J79j2j99L63j89j65J74O1j66J68j6k2K87j65k21j3
1074a03J73J11o18M43m5n4K07k4k03J76L7j98j19J27P0l1k1n9k6O0j8j48K48J60
1098A45J2o1r8k8J57r9j4PK27r8O6pm16J15J37k51K80Qr8k21J58oj0K62m4l1j43
$$ y = [255, 341, 292, 3, 163, -110, -63, -71, -48, -34, 67, -154, 125, 13, -48, -276, -190, -194, 97, -48, -20, 40, -333, 37, -5, 148, 114, 144, -169, -7, 271, 69, 228, 158, -162, -12, 179, -43, -154, -108, -95, -33, 355, -80, 13, -88, -311, -172, 13, -134, -32, 57, -21, -175, -84, -96, 13, 89, 86, 96, 28, 136, 3, -91, 183, 190, 1, -45, -41, 147, 177, -52, 135, -153, -34, -167, -116, 35, -120, -228, -13, 45, -402, -236, -126, -55, 49, 218, 159, 117, -9, 123, 64, 74, 210, 228, 49, -39, -269, -11, -99, 62, -47, 141, 24, -168, 66, -30, 122, 56, -128, -105, 91, 90, -66, -134, -79, 57, -141, 149, -18, 6, -22, -164, -118, -114, -113, -44, 11, -167, 12, 0, -199, 164, -25, -190, -16, 45, -121, 47, 31, 9, 296, 131, -90, -103, 70, 181, -437, 6, -39, -93, 114, 90, -113, 63, 100, -98, -217, -90, -20, -51, -72, -131, -157, -97, -115, -263, -15, 145, 157, 96, -2, -30, 127, 28, 14, 21, 248, 150, 216, 209, -207, -92, 45, -206, 74, 82, -16, -237, -79, -85, -95, 167, 123, 92, -51]
1125e1K1j3J73M7k45K9L41k64j27L0K89l45J04R8l03q9K70J64j83J15k7J1K7k53
1149a81J41J57l5n5O4j62K5P7M7j45k8L73l87m9L72k36j71L27k17J54N6k00K13
1172A40q8j74J13j69J08J21L6l11K22J87j70J70k33K53j77P9K41m47M3R8R6k02
1194f4K4J48k62Q3j05o4R2p6jJ94K6K22k00j89L93m2j02M3j90o3K08J2n5N4m0
1219D6k32J63K46k9j07q5j01R6j69J06k18J38K50k25N9o8MJ30q2n2J39J4j48L02
1243A77q8J55q4r1k0j36K14j54J70l47K21N2K1o9l86K75K70l35K48Q6j89J23j02
1266A1k56K94j02K1J85k31Q4M9M4j79M3N1o8L8K0J22k72N4K87m10N2j0L02k11
1290h2N3P5Q4J7k01lN4J5l0J37j79j80M26k63j08K27j50L02k17M3n3J09q3o2K56
$$ y = [-51, -30, -43, 130, 177, -68, -39, 302, 38, -89, -59, 230, -115, -11, 87, -216, -305, -35, 129, -54, 61, 34, 45, 72, -181, -40, 117, 82, 27, 91, -71, -46, 31, 78, -67, -95, 278, -109, -158, 214, -22, -193, 134, -83, 71, 127, -73, 140, 52, -122, -9, -178, -70, 51, 87, -224, -2, 185, 15, 185, -48, 205, 28, 107, 348, -99, -56, 42, 138, -64, -40, 108, -154, -71, -176, -240, -148, -224, -225, -31, -5, 217, 17, -172, 221, 179, 77, 120, -70, -133, 75, 87, 32, 86, 46, -186, -23, 223, 194, 87, 2, -99, -3, -172, -66, -284, -146, 104, -121, -62, -130, -126, 4, -78, -130, 9, 23, -125, 177, 89, 244, 160, 69, 49, -87, 127, -27, 143, -204, 17, 69, 90, 21, -365, -90, 180, -155, 93, 179, -10, 113, 11, -245, 49, -53, -32, 153, -78, 6, 55, 99, -80, -37, 14, -54, -16, 4, 126, -146, -92, 195, -215, -163, -173, 129, -82, -29, 46, 130, 147, -54, -57, -3, 12, -18, 119, -60, -240, 186, -77, -185, 42, -108, 194, -23, 20, -33, 76, -7, -69, 187]
1315A87q7q7j17K51m32O8L24Kl50L63O9j36M2m3J49j67k6n6j21K35l4r1k83K93
1339d7K35j69J28p2J5m48R5K66J60l93K49q6L7K17m82L0M91l37k9J63M9j65k8
1362a21R2l4R4m1p0K77r0L31n67j0Q4O4Pk98N48l47j40mK84rp0j9k53K24J36j02
1388c4K34M8k29k8M2R7j63O6j65o9R0J38N7o5lJ01m2q3k4O1P2l52L56M8l06J24
1414b9J87m89L50J09m7j67K30k16j4O6J02J6K6l22J35n6L99m36P6m8K85k95J66
1437B8j3J62k78J83K75k97j4M2k13K34k19J99J25j09R6n2k34o8J17M8K58m56J87
1460Aj53J90m2r9j41K24K13k63J21K66n15O8J58j09j00J75q0K59J71l32l17J63
1482a42J72p2k64L23o1N7J20l09O7K00j61NQ4q2J73j55L79l59J12j96J49L1Q8
$$ y = [187, 100, 13, -104, 147, -285, -217, 107, 109, -241, 122, 191, 55, 97, 54, 203, 36, 10, -46, -167, 68, 34, -57, -340, -47, 188, 19, 147, 75, 90, -358, -263, 3, 163, -230, 19, -67, -30, 187, -295, -265, 226, -111, -140, 23, 72, -93, -121, -29, -63, 31, -10, -80, 197, 107, 438, -129, -139, -55, 9, 16, -282, 266, -81, -221, -225, 59, 50, -20, -39, -292, -68, 68, -34, 200, 248, 19, -9, 33, 130, -33, 33, -132, -201, -111, 27, 84, 19, 16, 117, 75, -8, -32, 29, 101, -251, 105, 153, -153, -29, 158, -331, 19, 128, 81, -86, 144, -72, -86, -20, 82, 98, 124, -198, -63, -119, 280, -156, -80, -128, 157, -138, 28, 15, 177, -101, 82, 357, 60, 46, 88, -125, 109, -110, 89, 214, 105, 201, 149, -85, -153, -36, 12, 270, -186, 1, -152, 38, -4, -103, -244, -20, 193, -70, 51, 317, -198, -130, 28, -81, -181, -6, -86, 173, 344, 12, -305, -142, 30, -42, -306, 17, -44, 13, 133, -176, -109, 91, -70, -65, 19, -63, 110, -45, 334, -25, 87, -109, 40, 71, 159]
1505A59j35m3L8k7J21m40L02j20K74l94J62J33j71m0N3J43j62L6N0J18j06km4
1528i5M6K48j18J3m6K50j93Q0l11R4J14l8j73J40J10K05m01L4Q3j47K27n6Q7j39
1552A4n5n8K70j12n7P9P1j63mj23J61r1J17q2R0J3L2m05M53k17L4K39k36N6q2
1577e6j0j27K71k56K75j87l09K80K97j68kp5L1J7J06k14J27%o4j58N59j69P8k70
1601b4p0J41l9k9O6J19m41K65J3j8r8K60k58j00K5K50j03k7J14k48K71j05M7J78
1625A89m17Q8J78N5o2L0k9j9k24L49R5q2k51K56l07J32K63l13J19P1j92J40n6
1648A3j57J28j37l5j1O7K34r2J9J9J26l46K15j16L03o5Mk26j88K23j4O6Lj30j18
1673b15L60k15K30j52J15j98K38k1l4O5k56K7O0J0L1j1J15k09J23k1p0J42j32
$$ y = [159, 24, -19, 19, -8, 113, -327, -25, -145, 129, -265, -103, 30, -141, -181, -128, 15, -147, -111, -61, 57, -49, -51, -95, -49, 199, 81, 94, 48, 298, 105, 185, -126, -32, 82, 44, -129, 11, 121, 326, -75, -41, 42, -105, 122, 66, 153, 14, -41, -99, 171, 59, 2, 81, 152, -11, -15, -138, 23, -68, 49, -33, 57, 70, 102, -303, 150, -67, -33, 206, -30, 26, -56, -66, -193, 78, -178, 97, -90, -399, -119, 178, 10, 8, -67, -36, -19, 87, -127, 0, 0, -64, -222, 337, 168, 246, -24, -94, 47, 8, -21, 45, 164, -277, -12, 1, -17, -115, 145, -113, -213, -188, 62, -41, -68, 46, -202, 69, -36, 11, 189, -228, -140, 38, 93, 31, 61, 32, 13, -211, 138, 233, 151, -100, 156, -151, -19, 244, -69, 50, 121, -71, 69, 13, -144, -16, -153, -188, -199, -132, 102, 10, 29, 48, 174, -172, 43, -73, 230, 165, 169, -57, -245, -22, -36, 30, 33, -97, -215, 145, -70, 160, 8, 123, -75, 163, 142, 108, 173, -83, -56, 4, 14, 45, 34, 149, -60, 63, 42, -28, 114, -18]
1696a8j6N3N6P9o2Q2k52j65M00jMj38Lk58K00j79J64J02j7J13n9j58j26Q4J85
1721G6N3J8M7j66J13P3l01j52K89N0J7o2k80L39M8r7l26L27j88L37l04J13k09
1744a85J95j3mJ10q0J77m21J85p4L5Q2K63m07K31J8m4m0N2k43O8J75r3J07j17
1768b3j16K65k42J13p6j25J65J5p5M0K00l47L18p6k73J59K30l14R9M7j22J6R8
1791b4O2j48J47k2P6l73L64j62L9Rp3L6R5m1o4j35L19m0j95J23K9M0j76R5L74
1816C55l42j3m0J64M9qj64k29N0J51n3J95o7q8R0m4j5K03k4j26n3K8k4J44j23
1841A6J44k60q0J31j2J04j91R2L5J76n8r8L70m01p9Q3J16k03K79o5p3k62L7m8
1865b47J97K75l20O3l8j32K48k11k1K53j79R9J07k57K23J43m28J79Q6K1J76j67
$$ y = [-18, -34, 19, 75, 154, 92, 174, -78, -243, 157, 156, 160, 22, 25, -233, -33, -212, -48, 54, 37, 150, 91, -67, -193, -109, 76, 129, 147, 194, 28, 141, 214, -87, -239, 50, 100, 117, 55, -225, 114, 162, 65, -261, 66, -122, 215, -89, 24, -185, 10, -3, -7, 103, 23, 200, -221, -36, -110, -75, 7, 270, -137, 94, 112, 68, 28, 80, -163, -95, 80, -13, 94, -23, -139, 126, -116, -3, -79, -204, -39, -24, -99, -59, 141, -206, 112, 36, -237, -78, 152, -162, -63, -16, -138, -122, -24, 38, -110, 37, 15, 91, -282, 82, -80, -41, -32, -105, -69, 26, -15, -79, -214, 105, 65, -130, -7, 22, 62, -114, -19, 355, 13, 0, -40, 124, 173, 165, 1, -228, -178, -27, -80, 115, 48, -40, 50, 6, -9, 194, 170, 44, -9, 19, -5, 139, 16, 160, -100, -180, -49, -61, 43, -148, -56, -21, 155, 97, -1, 369, -32, -111, -28, 88, -115, 164, 99, 26, -236, -199, -247, -50, 225, -95, -32, -70, -202, 46, -165, -186, 67, -112, -13, 94, -163, 60, 203, -225, -46, 40, 61, 237, 70]
1887G0j62J25o4J93k9j18O9p2n6j64J27m8K86ro5J33l83l7J99j38K93k84L61l22
1911i5O1J51p3O4j64m7l7N6m8J80L9l26K33M8L5j07J50O3Nk62n0J45k24J7Q5J21
1937B0j41l4Q3J62j42n4J62j5j39J09l1nJ67k84K04qj09k69L68j47j06K25k7r4
1961a05J39K7r2Q0J95k42%J54j20N8j24p0K28j16J24k73O5J73k12J92j8j58J96
1984A01p0k06L6j27L88j06j70J92J44j15J56j04j41K9L12m15K66l30K27l29L41
2005G9l14J23P3j70K90jj26K76l56o9L94j95j0n4L9L4j95N0J73K4N8k72K70j13
2029HK46j92j89K17j07j04K5P6J68k87K09j42J38J93o2m19M37k4j88k17K70q5
2051b9J43pl09J21p5R1J99j9l33J74L02k84k56L09r2k5K38q2j11m9j87M02r0j0
$$ y = [70, -92, 33, -31, 162, 133, 15, 84, 12, -44, -208, -81, -129, 157, 148, 83, 216, -167, -204, -5, -143, 150, -134, 227, -95, -34, 117, 44, 108, -56, -103, -140, -84, -132, 48, 87, -239, -6, 42, 77, -30, 120, 183, 188, -74, -124, 21, -203, -186, -101, 20, -121, -155, -72, 90, -52, -106, 56, 41, -98, 11, -20, -25, 142, -142, 62, 54, -55, -324, 44, -103, -209, 16, -11, -105, 34, 61, -31, 49, 244, 2, 2, 156, 36, 94, -30, -100, 128, 12, 136, -137, -72, 101, -111, 81, 63, -95, 101, 31, -175, -139, -266, 122, 16, -154, 38, 182, 67, 223, 119, -22, 7, 319, -96, 170, -160, 67, -262, 79, -235, -112, -39, -209, 81, 80, -46, 230, -126, -195, 199, 4, -6, -60, -21, 13, -182, -132, 41, 65, 123, -149, 121, 8, 254, 62, -127, 90, -17, -121, -96, -20, 148, -139, 70, -72, 66, 259, 197, -222, 215, 191, 3, -214, 56, -29, 114, 107, -202, -81, -156, -65, 134, 115, -218, -44, 258, -26, -282, 27, -65, -90, 148, 66, -45, -94, -281, 121, 31, 21]
2075B1J63k46P9k45J13K29J6k31n1J43O6j35K33p6K19k32K9J28j11k6l25K49l8
2098b8J9J24k54Q3l5P0n2j21QK62o3J7J15j88J65j84L12l05m4R3N3j58N1j3J03
2123C0J8Q8j1q3j09J23j22J00j45J30k11N1L66j9n4o5O3k75MK74l51J49L53m80
2147a76J99k7J63k00OJ85n48M11l7j4J18J17l60L3n2o8L56j82K06p0R4P4l70J62
2171B0K82k42k77M09m35L14l8Jj34j15J20M4K8Q2j4m8K37l39K98l69K36j0k33
2194a83R0q1K98J18j67j71R7J06l40K31j25L7j41k3K25P7k4lj25J12j38j1K33
2217I2k06L3J11P4N0o4k75K16J6p4K24m42N4L95k48K94k73o7J31m5j34k4K48k39
2241a53J43k95Q3j1K6Q7M6ML51k83l4K6j13oK0J33j97Q7J04J9K16l41nJ98q8K33
$$ y = [21, 184, -62, 17, -228, -115, 114, 130, -101, -152, -9, 57, -78, 155, 79, 298, 66, 95, 223, 112, 86, -239, 10, -28, -9, 115, -139, -56, -91, -21, -73, -194, -186, 76, 13, 30, 145, -43, 122, -62, 250, -55, -99, -6, 47, -111, -60, -73, 30, 48, 136, 125, 42, -67, 56, -66, 34, -111, 19, -192, -141, 225, 206, 152, 87, 150, -125, -121, 153, -198, -49, 304, -176, 23, -4, 159, -41, -35, 150, -398, 13, -24, -38, 80, 197, -163, -130, -182, -250, 106, -76, 130, 60, 154, 228, -142, 20, 302, 60, -217, 192, -243, 71, 33, 34, -100, -215, -95, -51, -23, 59, 45, -3, 234, -105, 193, -176, 60, 50, -183, -93, -174, 124, 242, 75, -96, 1, 107, -233, -2, -127, -90, -231, -254, -29, 48, 24, 21, -104, 8, -130, -141, 92, -114, -81, 30, 104, 154, 90, -185, 31, 47, -27, 197, -245, -191, 204, -44, 250, -23, -90, 41, -4, -138, -162, 86, -153, -10, -305, -222, -233, -207, -120, -74, -70, 281, -2, -36, -10, -123, -129, -109, 24, -173, -86, 18, 37, 253, -88, -93, 105, 17, 250]
2267B50l34O7L2J40k40J73J59m06L9p1J55L3j8R7j46k7l5K17n0Rl3j6k9J56n3
2292F9K43m02N2K70k92M7k41K21K8K42k11j07K61k9m4q0q2K26k59K02r0K6j28
2315g8k9K07k16K45n8n7k09J06k4J36K59k52j45q2J31L5P5q2J21j19j25J74n0
2338c7J29J23k00J83l70O9k3K36j50J69p9J49Ok01k91K45K26m43P2K31k04K12
2360E2R0j69J05pj99RL04j01r0k81Q3K07J5j3j21K26j66Q9j59k7M19k08j48M23
2384C33n04J00J13j82Q6j99N18j61N0L8n6j2k93L5Q5J55R5j67jj4p5Q2n4O7q9
2409e0P7n1N1j03N2j57M5R5L57j15o6L2k01J29n5M3J7k25M2jLK68l12K88k44K40
2435A59k97J84n6oj79J26J40j27P6n4P7j0J58k90M2J95k03J57P5j18J96k25k7
$$ y = [250, -84, -17, 15, 155, -85, 88, 247, -159, -120, -191, -36, -3, -21, 76, -70, -97, -132, 85, 35, 44, 11, -5, -34, 122, 69, 312, -90, -38, 232, -60, -13, -254, -33, -5, 237, 26, -81, 180, 151, 107, 27, -55, 171, -88, 114, 24, 50, -78, -107, 100, -116, 129, 71, 14, -195, -89, -113, 23, 282, 30, -115, -197, -66, -31, 44, -38, 83, -36, -161, 13, -37, 92, 215, 15, 198, -172, -103, -126, 110, -40, 129, 50, 199, 205, 4, -287, -42, 184, -259, -187, 44, -160, 52, 142, -27, 78, 71, -128, -119, 185, 84, -6, -287, -204, 3, 18, 5, -116, 110, -56, 33, -126, -153, 266, 58, -90, 333, -171, -71, 42, -140, -54, -253, 265, 104, 154, 192, 136, 124, -169, -134, -49, 106, 201, 34, 33, 19, -56, 26, -28, 39, -50, 27, -24, 27, -76, -24, -181, -136, -41, 316, 201, 135, 167, -34, 95, 40, 83, 100, -125, -83, -84, -81, 187, -125, 163, -81, 159, -138, 46, -10, -16, -195, -69, 71, -56, 20, -34, 43, 33, 191, -99, -57, 138, -65, 92, 167, 49, 245, 20, -7]
2458gJ10k65L16k04K27k96K63j34J24k0k74N4R4k43OL08j43L5K41k03Q2K98o39
2481b70J23J24J10n0r9%R0j39P9n8K28k51n6jj05M89j44Q3j13Q0P9k61P5j10k6
2506a23P8kK34k76K16J2L96o36R8r2l7QK62LK15k28n3OR4j73J3J50n81N32k19
2531a03k1q7J63J26M2k45Q6O6j83L07j52m8P0r0k0q2M30j67r2m4P0l9k41P7J93
2556A6k04j1J55L7K03j69R2O3k12k58L82j56r1L06k52l3J88L1j49p6K18o5K22
2579B37k19m5j0N3j2r2K48k62J5J56N0j09j09K51k92L19l79J94M4O8k78J33J21
2602H2k51L73l24P0j00L57l09q3L82k59J04k67J88r3J90Q4l46L9J94J08Ll7j68
2625f3j30K8J92n0N2j26J85r5J42K2r8j00K44j9j29o2K69j48Rk8l28K27j95J43
$$ y = [-7, 103, -162, 154, -50, 177, -119, 144, 10, 134, 114, -160, -106, -12, -255, -249, 59, -84, -49, 192, -11, 71, 369, -270, -147, -23, 87, 37, -62, -62, 28, -111, -32, -90, 138, -113, -169, -170, -275, 214, 70, 153, 40, 120, 199, -62, 13, -97, -123, -45, -47, 187, -89, 127, 139, 535, -101, -3, -95, -132, -124, 138, 141, 356, 128, 75, 81, 175, 2, 15, 165, -416, 116, -103, -124, -211, -48, 78, 120, -125, -39, 27, -156, 151, -1, -49, 21, -69, -89, -171, 259, 92, 0, -44, 26, -13, -254, -177, 16, -188, -199, -44, -7, 196, 27, 119, 182, -30, -288, 94, -62, -153, 153, -99, -132, 56, 87, -62, -138, 80, 15, 237, 18, -27, -37, 16, 4, -88, 160, -102, -87, 69, 119, 10, -99, 152, -140, 179, -200, -6, 38, 106, -172, -39, 82, -169, 204, -120, -50, -150, 207, -102, -185, 197, -62, 42, -225, -37, -130, 60, 144, -202, -163, 31, 139, 142, 105, -63, -193, -165, 27, -23, 29, -97, 88, -7, 135, 157, 59, -41, 203, 184, 55, -7, 262, 114, 123, 95, -233, -6, -201, -58]
2649e8M5K06k51J72k17rK53j21j27R7J6k4K9j0J7J6o4L1L2j73K15q8k31J96K05
2674A57j08Pj61J29M9k17J2K29m9J5j40J80J55k73M43o17j52K01L17j70L4K64
2696C05k74K3r1K35r8j53q7J30j24J24R7k71K85K1l88J00q0J65p0J49Q4j81J40
2719D1l4k68K43Q1O7j9Jr5l93L86Ql5J76k48pP3N7OnK5k51K71k8K77m85M3J11
2746bJ33j79m9L27j93P1r3ol1Q3j71Q5J49l07K24k88L43m5M0J75j32k79J77j06
2770g4K0J76j85L27q5k55R2N2j26L0N7K8N9J96m37J88j49j10P4K08%J09j44nj28
2795h2Q8k5K10l22R0J26l09K38k29J80M3J74k94O9Q1rJ54q4j98K01R8j26j06J16
2819H4p2K13k98m3J59j83K87J2n2j06n8k13M23k81n1K54K7k06J18Jq2k70K60M3
$$ y = [-58, -13, 193, -58, 114, -103, -112, 141, 20, -107, -10, 6, -18, 11, 1, 18, 34, -30, 1, 33, -140, 75, -13, -244, -48, 157, 49, 56, -105, 24, 73, -144, -132, 97, 48, 63, -77, 103, 258, -15, 428, -189, -341, -140, 177, 7, 41, 305, 31, 54, -37, 198, 100, -53, -140, -10, -134, -10, 87, -184, 101, 122, -266, -166, -246, -81, -151, -2, 82, -99, 41, 7, -261, -18, 63, 130, 111, 112, 17, -376, 10, 18, -17, 159, -89, -96, -23, 34, 40, 35, 60, -191, 80, 52, 329, -156, -113, -2, 131, -48, -97, 230, 37, 108, 15, 9, -22, 61, -110, -25, 124, -183, 41, -247, 96, 51, 91, 266, 134, -145, 32, -74, -54, 122, -63, 264, 179, -76, 16, 68, -58, -28, 29, 57, 116, 312, -125, 63, -86, -196, -122, 86, 86, 195, 51, 46, -82, 6, -19, 191, -131, -41, 85, -224, 14, -215, -35, 8, 182, -112, -43, 38, 29, 183, 99, -99, 102, 200, 74, -32, 84, 12, 225, -73, -116, 43, -140, 147, 159, 107, 1, -57, -270, 153, -128, -179, 75, 102, -104, 14, 15, -67, -337, -77, -34]
2843c4j01J81L0j16M2J23q6q5K2J03k8j06J58Ll50L57k3l7M6j72qP3J52L7j48
2868C3j93J75n5O5K30k96J36n4k23J97k02J82j48K52J1j45J02nK2k1L1j04j77
2891a87O2K02m8jj67J33n6K59j97J44k03K07j98J29j55J10O8l1L0k45J06M1L4
2914C7J3O1k3J5j87j28K35j47K60m5k7k47K61P6R9l35n3K47K3Pq0l9J8L6j28R1
2940D0l8P6m31M16j20J09J3p3O4j86R0O6j17K12k20K60j82K1j8n7K82l37J59l6
2964gO9K7j26m5j19J78J30j97k5R3N4m6L67l12l07J83j00K1J86j31L46l14j96
2987b71K4N29l91J18l4k79L90l08L37q8j27K37l59J24K30j46o3p4RJ18J08m09
3009c25K48q0l5L9K58j10%J56q6mJ4P8k62k2o1J22J7K33k39p2p5N25m41K5R3J15
$$ y = [-34, -135, 46, 76, -40, 2, 125, 39, -46, -24, 79, 51, -55, 103, 106, -244, 113, 90, 53, 99, -73, -81, -8, 144, 181, 33, -160, 15, -40, 25, 255, -41, 95, 41, -182, 15, -187, -5, -153, 99, 110, -35, 67, 62, 84, 63, 94, -10, -187, -125, 77, 29, 28, -139, -6, -62, 197, 0, 144, -59, 148, -50, 79, -76, 34, 102, 71, 101, -144, -38, 3, 37, 50, 111, 88, 103, -84, -212, 23, -124, 136, 91, 64, -183, 78, 154, 253, -82, -135, 112, 135, 142, 62, 23, 41, 77, -51, 40, 2, 78, -353, 63, -57, 52, 65, -8, 56, -130, -40, 26, -91, 121, -99, 161, -21, 0, -18, -75, 207, -130, 29, -7, 62, 89, -37, -82, -201, -23, 107, -90, -115, -22, 32, -14, 353, 41, -266, -83, -183, -162, 24, -107, 239, -75, -271, -247, 282, -109, 9, -25, -304, 86, -222, 115, 27, -100, 137, -222, -98, 132, -14, -77, -151, -142, -24, 84, -325, -77, -157, -192, -153, 105, -5, -5, 151, 65, 61, 75, 153, -109, -131, -192, -70, -53, 180, -59, -131, -206, 319, -122, -97, -4, 111]
3035A11n0k54K58Oj11m0l5L58j94j85K74L3j16j38J61k28k5L0P7p5J87k07K21
3058E8J49k15K88k53O1p3pr1J61j82K12j10R2j7N3Q1o9r0j03J1J80j09J33l1M0
3083A69j19j21j44L43p3l7m8n8J07Ok80O1L79m47K33J42j89J81j27j11N0J18K90
3106C25m24J4P4j01L90n46J73kj05J60J06J3N7M0j69j14L7Q1L3j55J89L5k59J33
3130a5J85p5j19K7M4q0M2J73j4o3j72K3J6J27mL2j81J54Nj46J14j64J01j59J29
3155b0n4m8j43J50L24l19l8J23l5K08m91L88k66J27o9J72o6q5rJ38j33L68R1l37
3179b4J49k76J55l38J12O5M4R0j38J2J0R9J28K31r5l11J96n9o6O6j34j5K00j94
3203i3J32j11P0J7j21M2K81l93K84M5r5q9J09k23k5J73J59j01lq7J31K7k40j0
$$ y = [111, 61, -193, 65, 71, -40, -80, -115, 243, 49, -136, 138, 171, 55, -83, 78, -150, -175, -145, -68, -143, 44, -163, 58, 207, -8, 280, 27, 88, 15, 8, -83, 78, -104, 108, -2, 90, 73, 126, 207, 138, 48, -55, -44, 136, 27, 160, 129, 169, 50, -71, -215, 128, 55, 18, -30, -88, 19, 25, -255, -194, 185, -262, -29, 113, -76, 105, -22, -133, -83, 35, 325, -99, -85, -11, -112, 278, -268, -95, -97, -202, -42, 64, 77, 134, 174, 5, -109, -72, 9, 42, -113, 76, 111, -148, -15, 170, 95, -24, 3, 47, -33, 9, 182, 168, 105, -67, -44, -28, 99, 95, 127, -54, 100, 105, -41, 73, -91, 10, -149, -20, -74, -122, -265, -115, 209, -110, -148, -25, -60, 148, -343, 45, -221, -94, -163, 9, -57, -142, -151, -13, -146, 222, 313, -24, 125, -151, 4, -334, -222, -157, -113, -23, -161, -149, -139, -40, 88, 319, 224, -87, 109, 50, -16, 50, -84, -99, 101, -93, 39, -72, -2, 15, -106, -64, 217, -176, 108, 153, 58, -31, 78, -145, -170, 3, 162, 61, 58, -29, 102, 129, -111, -121]
3227a21K49k94J90QQ5o6k1J00J53j84k19K28o6j45O9J08K51j90r0K10k99K2j2
3250c4k51M27Q7m19J66K96l38j18J58j17j1J87j53J03j67M12n7j84o8N5j15J0
3272a31K00p3j46L5K8P0j00K98k9l53L11j3l36K24l9Q9J08j08j63K61j40j06k33
3295c46M89l03J4K04M4p3l2l7l4R9R8j02K1j49Q9J88j74r0J22k09J72R9l62K45
3319b7j00KM1p2K96R5l90J06Kj31j01L12J25j95K90k38n4j39J30J55K33k64l22
3342b46p8L95Q2k09m8Q6MJ57j85J89r3q0J21j96J20Jj05j06K28N8j45m4j73M05
3366A38j59J40j32J91r8l6l47J97K69m20K71P4j41N2k02P0R6L7J6Q5r7N2K6k30
3390a48P9L4Q8p3R9Q2k05j29K84k18J57K31j88j17NL19n4j75j71K08J63j99j63
$$ y = [-121, 128, -166, 24, 32, 117, 51, 30, 130, 283, 99, -120, 108, 42, -103, -34, 74, 325, 135, 45, 255, -44, -22, -34, -285, 142, 229, -190, -24, 272, -66, -184, -26, -143, -154, 33, -120, -17, -184, 228, 171, -13, -81, -26, -141, -131, 69, -4, -150, -115, -87, -17, -117, 181, 152, -201, 110, 97, -239, -15, -54, 35, 143, 35, -128, 133, -7, -113, -346, 143, -160, -146, 58, 102, 29, -3, -40, -74, 25, 123, 21, 42, -107, -18, 170, -4, -94, 28, -181, -9, 90, -272, -27, -127, -125, -84, -156, 140, 235, -155, -49, -47, -178, -279, 33, 158, -37, 253, 15, -39, -178, -48, 107, 340, 76, -246, -324, 71, 153, -56, -104, -18, -14, 143, -42, 147, 54, -26, 95, -101, 19, 20, -85, -191, 37, 95, -50, -94, -267, 138, -21, 119, -13, 178, 80, 44, -303, -106, 163, -257, 14, 88, -53, -1, -203, -133, -37, 0, 16, 101, 4, 56, 82, -148, -69, -35, 53, -20, 79, 161, -44, -173, 111, -107, 50, 281, 93, -24, -19, 300, 246, 71, -100, 108, 271, 72, -91]
3413i1M5r2J7K85k71k10L23Q4N5j14o0k21M18j94p0M1R8J6j67mR3j42J0M90m75
3438a36K69r3j62L9J14m03M60k44L16j50o6n0K12p5k64J11J14J61j77P2jj38J51
3461F0k4n7k62K33q4o6j23K76J84j29J08j44k00J30K23j21K27j55q1N2J65k82
3483g0K91p5j06j42N5K26m3j7m6j92J2l5J44L4r1K19k71J24M2K6l51K06O3nJ56
3508A54p5j33m1j09M77k88q2Q2J6l46L05J9l2K68q6j31j36K04N8o8j59O2K33l82
3532a90J94Q7l9K6l5QJ61j78l72L76P1n1l43J10K00j27mO2O5M3q9R3l77K87j65
3557a87K34n5k8K59j28q9j69K77l68L51l87J95P1O4nj36K4k6K57l20J39J55r3
3580C5k15L9K88l4m7L5k94K91k34L61j12J10j97j65J37m1J73p9r9J83j74q6p9
$$ y = [-91, -46, -138, -121, 164, -107, -317, 6, 90, 145, 31, -29, -250, 168, -26, -96, -55, 43, 59, -108, -112, -19, -161, -151, 339, -136, 133, 40, -122, -83, 31, -372, 88, -156, 160, 10, -56, -106, 106, 31, -233, -122, -8, 153, -24, 48, 47, -91, 60, 36, -21, -283, -50, -134, -200, -323, -47, 137, 8, 116, -28, -228, -98, 125, 4, 231, 76, -5, 47, 212, -70, 221, 146, 40, -102, -47, 179, 136, 119, 73, -119, -107, -142, 2, 36, -55, 164, -107, 17, 59, 85, -266, -60, 3, -2, 154, 79, -54, -95, -204, 273, -15, -97, -15, 1, -345, -40, -21, -53, 215, 129, -2, -138, 66, 124, 56, -103, -41, 192, -190, 4, 91, 52, 78, 43, 51, 212, 34, -338, 38, 109, 58, -285, -175, 25, -102, -106, -44, 21, 64, -25, 68, -309, -22, -187, 47, -8, -36, 223, 95, 6, -163, 114, -254, 97, -290, -95, -24, 40, 35, -101, -77, -103, 154, -166, -27, 128, 35, -180, -141, 147, 113, 66, 101, -193, 98, -136, 225, 113, 223, 26, -139, -2, -43, 130, 51, -48, 135, -39, -125, -204]
3603b04K29J32m16L11p6M6P2j80N3J56K40l93N3p6J91lj14k3L5r3n5J4O6p7L86
3628B74l19J75l28M62k50J38nj17j66Q2K77k52j85Q6N1J99M3l13K98k14R6k40
3650b08K20K35k86J19N5k09J48K3Pj88N7qJ2K02J41m75M8k4J44j97K94l27K83
3673F6q5J9j39K65j29j87J2Q0K91k75J26rJ57p8j44J5j72R9r0K4J60j9O6j23J51
3698H1k31J35l5L6J37p2J60j85j3N6j24K24j96q6P7j14N0J36l4j50Q9n2jR5J54
3723A37k18R3l10L05J74l59K43j2n7L9o9j57L87k47K93k20LJ17j20N3J9j71kR
3747g0L13l16P2j26J10j2J20nj70K37k19MJ74j45l5J10Kk30K43J00k77J03L7j26
3771a06J86j88M0K24k38K8Mp3P2M70k96j68r2J07P2K13k53J72O9J23m77L98m48
$$ y = [-204, 25, 157, -259, 52, -24, 22, 94, -86, -33, 123, 363, -30, 23, -53, 138, 135, 21, -2, 33, -60, -115, -101, -35, -112, 274, -45, 130, -198, 264, 14, 152, 147, 30, -136, -54, 223, -29, -214, -128, -77, 122, 165, -148, 150, -64, 32, -208, 12, 247, -39, 80, 135, -74, 74, 97, 104, -84, -27, -35, -23, 179, 320, -155, -107, -131, 13, -184, 110, -217, 66, -19, 0, -139, 126, -3, -190, -178, -98, 193, -82, 44, 35, 192, 114, -30, -15, -187, -88, -178, -154, 6, -13, 53, -70, 81, -150, -15, -50, -14, 123, 51, 211, 26, 13, 69, -55, 169, -27, -113, -36, -150, -100, 36, 2, -148, -59, -111, -112, -17, 137, -81, 12, -298, 7, 181, -178, 65, 53, -4, 35, -34, -191, 196, -51, 242, 22, 25, 142, 22, 75, 94, -77, -79, -70, 243, -73, -1, -127, -17, -29, 91, 86, -84, 153, -66, -62, 112, -33, -68, 42, 44, -186, 57, 157, -120, -17, 20, -106, 80, -108, -68, 156, -82, -54, -50, -123, -51, 419, 123, -45, -137, -30, 42, 255, 2, 174, 243, 366, -111, 287, -161]
3794a61M50o3j74L34m64O8oj3j36J09K98k50J88j86j90M08n65L38J6J59r1J64
3816B33J02l46j52J46k72K19K66l59J51K53m09L69j4j87P0P4k14M6M9O8j25j82
3838b14M11l43J05J20j26J42o1O0k05K90j58K2j64K49k74n7J97k23L77k38J36
3859D6j83J39O0l2J48R5l68M80o47K85j68Q1O7j27M7J25P1N1k16K44r5j43l4J1
3883f3k03J95K07k30m6J74r2L06k19k2J6Kl0l12L04J64j35J07l56K35r9k57J85
3906a69R1J62k9r5k61L11K52r0m4k47L04k78M70l20P3m7l2R8k99J98J36k98J49
3929C5j21K11k00oJ41QJ05j31j49K41k24kR9k8J45O1l6j09j45K96p4k03K59j64
3953Il9nJ14j65j3J86O0l39L11k5l1l12L44k29J23r1j18J20J69j31J94l69M79
$$ y = [-161, 289, 226, 52, 386, -78, -10, -16, -29, -165, -56, 242, -8, 180, -6, -196, 212, -353, -15, 1, 160, 69, 233, 335, -11, -163, -17, -289, -70, 196, -163, -12, 241, -168, 201, 187, 0, 70, 144, -70, -24, 25, 93, -32, -214, 197, -146, -41, 79, -47, 95, 34, 94, -111, 179, 21, 43, -121, 128, -146, -203, -6, -229, 148, -90, 46, -137, 2, 62, 30, 178, 273, -95, 385, -262, 23, -145, -64, 3, -124, -77, 48, 119, 170, -46, 198, 103, -40, -74, -63, -266, -71, 136, -94, -140, 34, -58, 248, 29, 7, 23, 25, -5, -317, -13, 151, 16, 123, -233, 2, -97, -354, -169, -78, 84, 55, -40, -301, 10, 262, 172, 128, -119, 185, -93, 377, 57, 130, 83, 51, 149, -150, 48, 184, -114, 35, -86, 125, -75, -81, 60, 68, 173, 42, -107, 134, -90, -92, 7, -21, 124, 185, 149, 40, -105, 191, 117, -86, 173, 9, -30, -35, 79, -86, -99, 87, 147, -192, 119, 94, 63, -249, 95, -134, -11, -102, -220, -100, 69, -62, 132, -237, 242]
3976B42m98R2J10oJ35k40J38j45J65J03j12k8K11k41m4K36OR9k18J18k02K01K43
3999C65n74J07P3K2nJ11k03J02q1J85o9j10J23j55J29k38N0o3Q1K34m1J33k59
4022h3L24m30L48l48M81k79j66K21Q1k20K12l09M9J0J86J8n4k8J35k48J07J68
4044A75no3r6R3p8Q7M4j47J01l20J3K57J09Oj10K08m31J70l04K35J49r4k26L00
4068G3q9J73p9j13K44J21k10P2j87M7lk44J55J31o9J4KN7j1J03m7k79J21rJ29
4093A02l32J06J41r7r1n0K74J74m72M35L6k60L4J64k90K9L09j82q4K43n1p7j30
4116f9l8k3K00j13J44k97L5l2M7L23o5p6n0J9jk69M88j54j13j2j9J86l96J22j17
4141b80K29K0J68P7l45K03j72j35j41M11L9l4j26j31K76n0Q5j19N5k59J4L18j18
$$ y = [242, -256, -164, -54, -60, 75, -165, -27, -172, -7, 96, -16, -44, 167, -74, -118, 118, 124, 223, 5, 123, -79, 122, 365, -209, -102, -29, -7, -12, 99, -104, -2, -83, 102, 33, -77, 46, -109, 20, -218, -168, -231, -150, 84, 43, 176, -83, 241, -189, 159, -189, 292, 13, -153, 68, 149, -71, 141, -168, -119, -109, 77, 95, 41, 13, 148, -100, 7, 175, 170, 107, 11, 104, 26, 113, 157, 10, 111, -209, -196, 61, 170, 176, 66, 274, -157, 13, -291, -56, 93, -1, -227, 73, -16, 157, 78, -35, 209, 330, 120, 192, 5, 52, 49, -195, -40, 91, 22, 36, 38, 95, 84, 187, 140, -139, -18, -27, 102, -230, -124, 17, -80, -171, -221, 53, 227, -245, 190, 226, -34, 0, 164, -126, -97, 212, 30, -54, 189, 138, 61, -69, -107, -130, 70, -43, 101, -196, -161, -193, -146, 177, 112, 36, -14, 5, 4, -265, 223, 69, -44, -56, -75, 111, -285, -163, -280, -51, -31, 137, 214, -131, 72, -100, -235, -376, 35, 74, 40, -86, -217, 59, 9, 94, -25, 30, -229, -215, 103, -15]
4164a5K27L0k11p5N5P3m6j0j27j08J57L71l78o4J38k44L84j41j09L1j43K7j54
4187c32K60p2p9rM33l90P4J24J08j43Q4j09j28J05L7j9N2m2j9o4L50j56j75K60
4211A50j77L49l34J67n3kr4K23j71RJ48j57j47L33k58L22o90K77j6j49M34k17
4233e3J96l77K32Q2j50m1J09Rj1j34m8J40J16k09K58j34J98l08mJ55j77J22l8
4256f7k9j72L41j03K07j23k9j57L8K43Q6l84L01P2l54K64j93q5j12L76K8j23j19
4279i4Q2J80r8k44J75J17m33Q0J95n7M0l8j7J09q8K72l08J15J12l84L39l8n4J62
4303A25k6k75K74O8l35L06j2l21J70R0r3L9k4l0j88J70P0O5p5j99J69P3J7J69
4327B27j01k54L25M9k55J15j61j17J71j86Q8J76n6j14M6J82j39KK81j48l09J66
$$ y = [-15, 212, 242, 31, -44, 11, 84, 38, 28, -99, -207, -50, 321, -57, -121, 17, -227, 157, 16, -93, -62, -205, -178, -332, -72, -144, -223, -232, 201, -189, -115, 9, 117, -26, 58, -51, -179, -74, -37, -56, -4, -46, -65, -129, 221, 65, -110, 150, -27, 322, -12, 155, 102, 100, 6, 229, 58, 67, 215, 58, -89, 244, -14, 308, -382, -105, -121, -270, 164, -53, 143, -234, -2, 80, -70, -111, -2, 7, -4, -138, -186, -46, 70, -139, 119, -15, 183, -125, -129, 26, -151, -29, -67, -96, -268, 73, -30, 177, 54, 25, -132, -94, 149, 235, -149, 152, 224, -130, 134, -59, -144, -256, 120, 148, 25, -94, -12, 168, 70, -174, 1, 118, -315, -235, -40, -97, -57, -95, -112, -3, -91, 181, -127, -12, 100, -284, 55, 17, -37, 125, 99, -176, 98, 166, -169, 137, 125, -196, -26, 64, -29, 10, -14, -44, -232, -62, 8, 73, -2, -201, -32, 41, 58, 227, 126, -128, 197, 246, -9, 106, -55, -172, -1, -187, -99, 77, 21, -93, -47, 135, -4, -2, 279, 131, -178, -12]
4349a2m5J22j90K59M9j38O7%r2o0j0m7k2M8M05m32J49l68K27J34J79m49L32L4
4373A40o8k00J45o5K20j43lj07p6L62k79M8j29K44j73QL8J58j99L39p5n1j22Q2
4397I4J1J9j26Q8j69l5K35l52K12o9K39k84K31o3P1j15k29K64K79l71Q4k53m4
4420b83K60J05J23j11j05j30L03l29K11j94J09J22j97L2k2J60J37N8o2K3j69j99
4442a58K43J14k30P1J9R0K2J69o02J77O0N4l2j30L2p3J30R1L79m75Q3K30j57j29
4466b2R7o0J35k10R5m2R1j33N4Q4Q4k67K96j32r3k6k50R1j02L44k83N58l95J1
4490g5J06k6l8Jj8m7J05j29P3q4J14n3J48K41k85j30J24j24r8J98J87o1j23K2
4514B8p7OL00n42L81m10M52j67q5K44k4j62J27k0k32J01K44J54l08J07oJ57j40
$$ y = [-12, -57, 65, -125, 134, 183, 45, 112, 112, 20, -40, -50, -97, -119, -71, 334, -98, 51, -317, -90, 44, 223, -226, 106, 140, 72, -128, 17, -48, 172, 29, 26, -81, -157, 205, -74, -26, -155, 89, -84, -76, -38, 120, -79, 260, 185, 134, 12, 94, 105, 124, -2, 86, -83, -118, 117, -235, -23, -92, 147, -137, 94, 31, 102, -13, -242, 22, 301, -70, 14, -239, -283, -23, 82, 205, 94, -11, -141, 162, -167, 44, -150, -41, 81, -116, -84, -106, 54, 191, 249, 187, 210, 41, -158, 85, 199, -31, 40, 59, 149, 171, 340, -262, -85, -25, 29, -3, -133, -101, -174, -44, 47, 426, -49, 34, 264, 107, -22, 75, 15, 150, -60, 35, -7, 84, -49, 5, 89, 173, -94, 202, 70, -23, -49, -299, -208, -310, 34, -249, 309, -86, -75, 31, 5, -33, -32, -50, -97, 8, -121, -48, -132, -18, -71, 77, 318, 33, -97, 27, -97, -195, 3, 190, 129, 6, 28, -49, -43, 257, -285, 96, -314, 138, -29, -114, 130, 106, -56, 71, 51, -181, -80, 164, 318, 10, 117, 111, 268, 128]
4537A28o6p5j66k8rL3L1J07L7K22j77m7q6J16J57k39k13L39k4J64r9q0j00Q6k17
4562b06L55l08J88R3j33J29k02L06m16R7K25k02m1L1L6J32q1j76J24K9J22J2j15
4585aj22K83j66N1k2q2L03k63j08J19QO4K40k57j21L88k98j2J32j36k21K25j85
4608a81J4J04J35M0k66k2J05J87N7j07n1M8O6j04k65M16k02J17k45K32j68j22
4630b12J79l4J14K8O0k22Kj31K04j14J37j46J22J11m58M64m0N5N4k56J05k2J74
4653A74o5k58K17K88n24l2L91k99J4K8j02k6J01l2j4N4J37k25L6Q2K54m09K65
4676E5Kj4l9N8J22k78M8N3kp2q7K85r0j61J35j28J67M8l94J37K77l36L52k71o0
4701a93K56k11J71o4oqj09J65Q5j18J28k55L79l54O2P7J39l43J57J95l74J85j14
$$ y = [128, 62, -13, -179, -207, -216, -183, -152, -45, -8, 214, 37, -10, -96, 20, 177, -62, -275, 64, 40, 204, 105, 25, -75, 11, -206, 149, -159, 29, 122, -11, 118, -84, 222, -194, -97, 128, -74, -115, -84, -48, 84, 3, -173, -49, -20, 102, 114, -1, -123, 160, -6, 45, 23, -59, 244, -19, -127, -8, 0, 64, 304, 47, -74, 314, 16, 4, 136, 0, -221, 4, -181, -167, -63, 72, 112, -154, -176, -71, 116, 173, 66, 15, 63, 129, 25, -240, 176, -26, 91, -154, 78, -90, -212, -33, -67, 47, 75, 135, -87, -85, -216, -12, -126, 11, -135, -13, 98, -360, 104, 64, 119, 173, -83, 22, 0, 174, 109, -149, 68, 356, -168, -200, 191, -108, -94, -66, -168, -194, -93, -125, -139, -85, 52, -173, -137, -55, 199, -210, 55, 57, 43, 4, 62, 184, -94, -46, 7, 5, -67, -154, 131, 41, -120, 15, -113, 54, 102, -292, -155, 122, -214, 138, -133, -193, 63, -148, 23, -41, -47, -55, -164, 1, 86, -32, 96, -159, 220, -134, -72, 5, 144, -199, -42, 153, -221, -36, -150]
4724a50r9K1L28l78J53J52nr6j69K03Q4o6m7k2O1q7M7O4k40J46k4N6l5J03KL2
4750C4o0J25j93j87M32k06N5J11K26m19J37L4L5O1l57J31J13k7j18K89j73k07
4772a64k39J57K99k4p3J37M3k04K30j28K0k19L08k79J67p3p2J0N5j44L84j31j39
4795g9j44L13K3L5j18q8n0K42mj80q9J12J24k66lM52l32n2J88j66k6j22M10k3
4819A57N6k79pj78J18J25K4j39J39J66n1O0o0j10J66j4l86K53K24l54K17j87r6
4842a56M04k02j4J66l24J57K28m98J74J56J45l07K3p1j9K31m5k61L0R8q8k0K63
4865G0k51m8M65r2j86K13l18J64k3k78K65l2k50K78kOJ55Q0l71n9K60m1J55o0
4889A00J46j97p7L3k61K56J58l29P1N7K89j59j08K27k87q6J19J22j45K43l70L06
$$ y = [-150, -249, -228, 100, -278, -125, 27, 22, -74, -243, -40, 44, -22, -69, -91, -30, -117, -70, -6, -246, -100, -124, -68, -103, 0, 2, 34, -26, 99, -94, -281, 151, -55, 0, 111, 337, -82, 55, 89, 124, 185, -172, -41, 72, 45, -73, 216, 43, -164, -403, -246, 53, 29, -44, 93, 136, -68, 162, 34, 54, -165, 143, -136, 31, -42, -114, -104, -49, -193, 191, 60, -79, -223, 90, 113, 148, 30, -58, -108, 134, 130, -50, -139, -27, 97, -169, -172, 280, -52, -104, 84, -82, -108, -230, 180, 157, 213, -66, -73, -251, -133, -8, 16, -123, 16, 182, 131, 191, 131, 21, 187, 173, -213, 40, 264, -90, 127, -60, -156, 248, 46, 32, 198, -126, 31, 259, -239, -65, 91, 236, -71, -48, -119, -138, 93, 48, -213, -183, -85, -173, -193, 70, -181, -229, 236, 144, -42, 171, -147, 17, -6, -284, -19, -51, -301, -23, -25, -19, 136, 216, -155, -214, 46, 5, 160, 100, 246, 49, -28, 5, -256, 0, 158, -171, -100, -43, 246, 87, -21, 206, -81, -167, -48, 74, -71, 172, -198, 108]
4911A08j80K46ol60K6J77R7j36K2j64p0J87m2R0O6k00K59l03R8R9K4no5J98P8
4936B44m77M08m7k52J15P6p0J01j87m3K27j28j73J87l9j85K3J97J5k58M99q3j93
4959d3L9p5n2J96j99M56m72L10j49j10j8L9N6n2J54Rk15J42j05N6L4o0K5MR4n6
4985HL6J9j4k9k1N9K84l47k4K00j47K6j68k4K18j04J37j74p7o4P4p3L29p5mj41
5011i6j82K54m6j3o3K49k00K0K3K63m61J11O9R6O6K7l7M8q9n3J4L4mk9Mj0r3K7
5039g1l2m1mj0q2K17k4j68N20m47K40J0q4j41L21k32K32k09j2j08L73j86R3k32
5063g7J91J02n9l07Q5Q7j37J45p4J82l30J47RK12l59j7J21Q1L5L3k92K97j07q
5087d0j39OJ62j19K88k52K56j26l1p3P9K3l09N51k97J04l4Q2q4K5k14J92l49L09
$$ y = [108, -72, 174, 168, -192, -166, 11, 108, -28, -6, -170, -240, -53, -95, -5, 61, -139, 120, -183, -85, 14, 38, 33, -32, 166, 244, -233, 175, 128, -124, -9, 67, -3, 98, -89, -132, 95, -33, -206, -19, -58, -243, -220, -23, -8, -266, 233, 150, -43, -4, -79, -131, 65, -134, 322, -150, 160, 11, -99, -117, -78, -22, -74, 80, 89, -126, 16, -89, -33, 1, -59, -34, -30, 64, 8, 44, 63, 49, 20, -1, 58, 342, -5, -29, 171, 24, 50, -118, -142, 76, -28, 109, -65, -142, -206, -132, -205, 124, 49, 45, -96, -278, -24, -70, -83, -146, 103, -97, -77, -54, 209, -252, -141, -72, 24, 90, 117, 80, 128, 39, -14, 0, 34, 30, 1, 5, -5, -98, -71, -103, -144, -148, -158, -240, -23, -47, -215, 305, -142, 98, 108, 24, -117, 204, -28, 204, -5, -17, -125, 248, 62, 155, -77, 114, 216, 157, -150, -65, 22, -115, 30, -44, 138, -192, -45, -36, 176, -183, -200, -79, 2, 37, 70, -222, 75, -32, -40, -179, -173, -11, -130, 158, -94, 162, 36, 5, -68, 11, 34, -275, 276, -21, 83, 49, 131, 47, 72, -142, 50, -299, 10]
5111A0m3p7K06p4l18N14M2m71L29j87KN7L9j54L45j29l79M64j10m06L51J32l90
5134b47J20J47R6qo4p9j94L29j86q8Q4M8J52k64J20J58l77L20m4j22M9Q4J43j29
5158D8r7R4J29j75n8p6J8R2M9J08m2k2j88N7K48j68P7j99K37j11j66J19L1M3p6
5183b8Nj10o8K73j44L1p1N6K49l34L13Ml37P3r1O9J99J7j49j09M7P5L3j04k0k66
5209c87K04K38j19L2jJ74n5L2j30p1J77o0P9N2l46M27n01J12K6K04jm1j36M1K92
5234B42j20l03N9l9M1J53M0k49J99J97j46Mk14k4J96k7N2O4k14J92k72M70l24
5257b3J31k24k03J70K32M6j51K0R8o1k24L87k58M4l46L56l0J0L3r1P9j8K8n1J09
5282F3k04N0J80n3p1L46l03o3l3j61L86k75k5J10J78k56J69j00L81k68p9j36J41
$$ y = [10, -33, -110, 96, 22, -296, 218, 260, -211, 118, -69, -67, -10, 29, -125, 220, 91, -288, 176, 66, -340, 11, 143, -247, -127, 20, 116, 108, 44, -35, -229, 100, -86, -174, -90, -42, 110, -154, -34, 124, -253, 67, 23, -99, -50, 34, 177, 48, -49, 45, 174, -1, -59, -135, -117, -25, 24, 132, 90, 68, -120, -63, 185, 17, 94, -105, 132, 21, -145, -26, 5, 48, -28, -23, -133, -201, 72, -72, -41, -112, -56, 193, -141, 172, 176, -161, -88, -179, -110, 89, 106, -43, -152, -105, -30, 3, -101, -121, -387, -183, 55, -64, -32, -33, 141, 86, 118, -12, -83, 94, 34, 113, 165, -181, 246, -255, -143, -117, 87, 86, 45, -91, -50, 242, 122, -181, -122, -161, -120, 33, 73, -176, 23, 220, 74, 78, -136, -160, 36, 9, 61, 125, -89, 103, -169, 301, -23, 108, -116, -319, -149, 83, 129, -22, -2, 96, 35, -189, 198, -60, -16, -362, -6, -36, -26, 7, -84, -5, -23, 5, -46, 63, -141, -91, 89, 36, -35, 311, 8, -55, -88, -249, 137, -138, -163, -53, 125, -131, 38, -62, 319, 51, -28, -164, -23]
5305b3q4K9n4k3J50M3K25m27J58k3P0k57K83k12J73J90o0k94J47R7j45%M6K10
5329B19j51J7l15K26Mn5J57K4k95L6o8J68P4K6j32rJ35pj17M4L1J83j52k01L96
5354B38k53r6J19L05m04K7Qp7K39k01K46j86j69M14k49p2J9J87n9N6K4l14L57
5377A59l19L0K3m4L41J60k26p5q3OJ34L4k00J1m1k6J50P2m1o3o2k6K11k05K13
5402A33j42M3L15j47l1k66j01L04n0j05K24j24l07N12o46L93pk14J05J29O8j75
5424h9K13j63j32N0K9o5J86k10J59J77j82Q3Q4p4q9J00L7N2m3m11L01qJ05N2m07
5449b45K16J74k37p4K96j65M1O1j25M1j46L11k25n8J14k57K98j60K76j62j7J0
5471c3m3j18J02J02Q3k53K50k69Q8Q6L6k5K30L6o08J67K02l12m9L46poj20L1p3
$$ y = [-23, -107, -78, -132, -155, -5, 38, 263, -164, -6, -29, 41, -216, 67, -145, 28, 218, 158, -136, 11, 108, -37, -37, 9, 219, 68, 85, -230, -4, 0, -55, 102, 126, -169, -133, -201, -33, 41, 67, -65, -74, 61, 54, -63, -19, 12, 195, 43, -158, 238, -15, -111, 8, 313, -91, -64, -56, -133, 106, -95, 151, -35, -204, 210, -39, -111, -92, 95, 36, 92, 116, -198, 159, -160, -130, -107, -151, 190, 350, 124, 49, -34, -28, 106, 140, -60, -49, -90, -116, 34, 106, 65, 2, -60, -86, 125, -80, 133, -9, 34, 349, 202, 171, -95, -196, 108, 58, -47, 177, 53, -254, 258, -388, 5, -2, -216, -111, 18, 86, -89, 124, -39, -171, -121, -92, -157, 29, -181, -22, 155, -27, 56, 140, 66, -23, 77, 114, 166, 123, -288, 13, 5, 110, 162, -245, -29, 145, -92, -166, 130, -35, 6, 67, -58, -17, -163, 148, -77, -135, -21, -278, 20, -140, 136, -26, -43, -33, -76, -194, -92, 10, 93, -160, 90, -179, -91, -5, 31, 6, 236, 272, -336, -169, 33, -279, -328, 18, 11, 5, -115, -84, -157]
5496a57J02Q3p8J26j2J00l04K21j67l1M68n22R2j05K33O6k13K80P7o06J94J76
5518B3m0j00O8K24j69J9p1N30m12k14L00k12L7K0j10P0M0N1P4j06L95n70L4J44
5542B5n8K58m17J58J83j8Q7n4l98M60j43j41J72l78j45N12j01j78K96k88L31j2
5564A51L6k77qL43j48j11J20k65J65k7R9j8NK86l10l04O9L84q3j8j83N3j20rQ4
5589h6K57j85n5J12J10m50L15j86L76q4o8k3j85n5M20j99O0O8j61o7J12K2j79
5612a31J22J75l32K2K41j50J40J3m4J57J37k59j02p4L70j37j30j20J98K9k57J22
5634a0l9k0o3L16k3k12K45m02J78J41j90J01N4p6N1q8J8J60j59m8K87j38J1M6
5658A40j76J4o1J24k63K20J90k73Q4omL4j56J43O8l3j10n1O9lQ2k26K74J20L7
$$ y = [-157, -55, 28, -50, 76, 64, 164, -140, 81, -86, -117, 351, -171, -79, -184, 49, 115, -98, 182, 259, -347, -153, 23, -17, -117, -49, 175, 6, 25, -46, 484, 72, -142, 158, -54, -17, 3, -107, -37, 3, 54, 128, 22, 417, -153, -119, 25, -33, 225, -192, -34, 149, 131, 218, 164, -234, 226, 83, -58, 114, -264, -409, 103, 2, -176, 120, -168, 163, 151, 187, -90, -98, 245, 97, -14, 106, -159, 6, -21, 78, 60, 65, 351, 41, -263, -194, 190, 107, 89, -94, -41, -161, -170, -86, 171, -14, -69, 43, 153, -297, 18, -168, 208, 124, 56, 33, -152, -207, 213, 14, 74, 142, -19, -86, 26, 48, -131, -9, 166, -166, -144, 97, -53, 87, 100, 56, 213, 350, 91, -11, -85, 285, 148, 18, -102, 96, 125, -132, -10, -49, -69, -132, 184, 161, -51, 194, -208, -30, 111, -79, 22, 76, 0, 51, -37, -19, 141, -18, -66, 221, 83, 94, 140, -36, -22, -83, 41, -222, -2, 188, -85, -1, -7, -11, 23, -133, 10, 78, 45, -65, -116, -47, -50, 32, -194, 80, 200, 237]
5683B37n3n7l55M19j73J36j69p2Q1Q7L9j94K4K5o9L0L7j18M18k23r2q7K13j72
5707h8K45l81L43m5k77J08J12j5m1p4J51lJ7J30k8j94M4R8N8l79P5j26N4K09P2
5732F5m1p9q8R5j28L19M8l53J49n5k6j4J28Q1j27L34m52L84l67K20j71J11L7j51
5756h1P1M33m20o8J54R4j70K3m1o3J41j23l22L81l1O6K2l30J77M5n7J3J8J1K6
5781c1%q5J82j13j23K29O5o7m5MJ93k50P2m4m1K56q6l77L18K06m82K41j15N3m0
5806h0J46n07N34j88L77j53k17J14j63J95K73l66j16Q8j81K32j33M3K07J9j30
5827fO8l34K4M4J10O1j08K27j43K75l20m2K43k51J12QJ93P1n2k95j23R1K23j85
5851a09j0J34k64L45k53k9K2R1j40J80J01j92L18k36K4J74kk72j4K59m7j06q8
$$ y = [237, 184, 127, -228, 191, 18, 154, -15, -87, -6, 81, 120, -74, -50, -25, -94, -64, -27, -145, 273, 50, -42, -129, 84, -88, 157, -224, 119, 74, -203, -95, 17, 2, -39, -113, 38, 35, 52, 182, 154, -40, 4, 102, 160, -219, -144, -270, -216, -7, 65, 24, -55, -143, -48, -176, 143, 191, -162, -13, -68, -94, -108, 20, 101, -26, 308, -144, 240, -127, 93, -78, 33, 70, -81, -10, 423, 3, -65, 89, 183, 13, 36, -5, -68, 73, -50, -372, 9, -22, 44, 66, -264, -87, -42, -99, -86, -68, -57, -31, -31, -116, 66, -47, -170, 59, 124, 57, 12, 16, 209, -41, 31, -13, -54, 202, 116, -261, 57, 263, -219, 22, -93, -40, -80, 66, -441, 93, -95, 282, 129, -88, 26, -137, 58, 331, -35, -151, -63, -244, -12, -145, -102, 105, 124, -6, 62, -272, -248, -204, -94, -33, -141, 86, -57, 218, -102, -144, 99, -152, -40, -32, 161, 232, 180, -115, -238, -147, 76, -109, -119, 15, -249, 96, -157, -186, -164, -73, -213, -33, 68, -124, 194, -42, -18, 156, 154, -118, -132, 127, 80, -26, -114]
5874a14j06L73j32j95L76l27J41k52K10J15O8J00j70K8Lj90O3r4k9P0L03n1k68
5897g8o3mP7j28M85l53L6J99j88j55J81J74j30N5p9j84J60K80l60j03M22j28l83
5920b67K88R3J0L8o0pO2k41J87L0l27K7K30rl78L85J67m26J97n8n4J11l7j81J50
5945g0J11k14L63m09J03l8J51J44p6p7l16L15K02k40K34j21j01L54m83L66l02
5966a04n7L61j83o8q5lJ82J72j86j18O4l9J49o6%J16l3Q5j40Q9j39J95j24j54
5990h6J66Q7j11J7J08j65L01j47Q5l9m35L77l8l38K47j1k32L22k54J05K71q4j39
6013Gj1r6l1K6L08j80o8N4k68L48N3l34Q3n3j25K72J48k05%K33k65J6J32q1K19
6038A82l25J14j49n7J78q9J26J60l3j28j74J47J12n9J23j49Q5k20K07m8N6j46
$$ y = [-114, -220, 153, 21, -174, 202, -125, 16, -236, -26, 89, 157, 257, 87, 115, 118, -72, -9, -103, -132, -62, 241, 190, -78, -141, -145, -68, -196, 289, -64, -28, 171, -17, -172, 9, 183, 53, 108, 29, -155, 5, 285, -75, -178, 244, 116, -267, 21, 114, 124, 162, 102, 95, 157, -84, 103, 133, -194, -167, 63, 54, -324, 61, 228, -198, -1, -59, -113, -2, -39, -220, -70, 41, -173, 190, -219, -116, -154, -3, 141, 65, -12, -328, -13, 189, -51, 183, 62, -39, 315, -168, 198, -104, -161, 200, 17, -51, -136, -139, 43, 215, 29, -89, -25, -64, 85, 19, 19, 135, 102, 187, 47, 136, -3, 192, 68, -86, 80, 167, 56, 73, 181, 16, 317, 170, 255, 216, -219, 158, 120, -218, 29, 18, -214, 108, -146, -41, 230, 146, 7, -4, -100, -131, -105, 203, 23, -45, 9, -259, 89, 142, -192, -109, -162, -287, -15, 133, -72, -72, 161, -104, -88, 44, -37, 182, -143, -29, -178, -235, -57, -146, -20, 140, 107, -21, -195, -48, 64, 5, 128, -21, 64, -156, 51, 3, 59, -87]
6060h7J29j81K29j70R7nk47L25o0J89l90J28M4j19P4o8L05ql45K01J32k07rM5
6084BJ25l16L87m69L64m2Q2J23k00k25J56l01M27n2k95L26l81R4j4K89j48m4J47
6107C5j87O4L82k40J59k1k55k03K19K31j78J4j20L03k89P4O5l0M7j72j4O2P5r1
6131g0N6J2n0k8K15j32J38j77o4l0N32l6m44o3K52j20J90k08MOk1J60k06l3J33
6156A6j22j58L91q8j21M1q4L60k14j03k5K58k50Q4o3l3K54j89K7J2j33P9JQ2K90
6181C12m30K72j58r2K88Ll53Q5K80l5j26n6K5j97K61j46M3K64n05R6O2J91Jj26
6205d1J6j75K37Q5q4o5qk7m6K6j32J40P4R8O7l11n0kj13K96j30K64o0p6l03J52
6231a68K4K58j03n2j4J1N7M5j34K65j24l14J41K1j12K63j54J52M8r2P9j05N5j90
$$ y = [-87, 42, -139, 90, -80, 17, 12, -235, 90, 30, 219, -171, -43, 1, -118, -44, -112, 193, 185, -160, 41, 173, -34, -43, 2, 127, -189, 198, -271, 93, 51, 133, 256, 56, -169, -13, -314, 113, 61, -234, 92, -289, -195, -209, 80, -68, -112, 35, -152, -88, 294, 54, 213, 192, -63, -266, -47, 184, 6, 20, -100, 203, -86, -12, 53, 23, 70, -102, -116, -54, 21, -70, -14, -2, -52, -80, 135, 3, 141, -36, -100, -130, 402, 366, -78, -141, 111, -9, 181, -27, -23, -17, -38, 122, -84, -117, 16, -106, -264, 127, 39, -82, -41, -125, 235, 21, -82, -107, 151, -99, -15, -78, -111, 143, -46, -19, -7, -140, -61, -60, 22, 312, -118, 154, -4, -96, 192, 195, -158, -73, 207, 172, 46, -10, 15, -182, 79, -67, -24, 240, -265, -169, -107, 84, 85, -41, -25, -200, 37, 122, 38, -27, -35, -62, -108, -82, -214, -74, 0, 98, 165, -146, -196, -198, -311, -15, -145, 119, 59, -17, -320, -168, -144, 114, 11, -41, -55, -44, 13, 58, -76, 189, 65, -249, -108, -87, -199, 64, -90, 62, 110, 18, 97, -8, 47, -143]
6255a43J47J41l78n0J29J01k01M64o4m07l1J10R8Q8j14P7l2Q5J03k25J08K1N1
6278G8j85%J05N7J2%m3O2j08N4rK03j66O9l22j00K57m4r1j03L27k15K79k39L96
6303B74j33j48p1Q3m1j93J75on9K70j42j24J21L2m6K63k88J31j21L2R7k08K58
6326A56J26l33K24k11q6J02K08k70k1L02q4J58j44l10K34J77m58pK45j9K34k41
6348a8P8j15J33N9J38k51k5j03J3K31Nk89J08k52L76k90J04j34J91Q7l1P3j39
6371e1N0M6L2M7J77k17R3k25J67l15K43j39K22j27Nj18J60l6M1r2O1j49j51K95
6395A9j80p1J77l4m6K28l24J93n6Q7j82J90R2N5j24j54J69m2K33j16k40K33K4
6418A31q1j08J52M4j8l9k27K50o8o4m6K19j56R4j3k2l06L35q1J47q4n7J59j74
$$ y = [-143, 4, 145, -233, -283, -154, -53, -254, 210, 146, -261, -292, -182, -84, 4, -110, -33, -65, 20, 123, -102, 6, 27, 78, -107, -107, -2, 55, 67, 67, 24, 86, -22, 32, 23, 226, 60, 129, -193, -293, -36, -80, -171, -274, 53, -162, 117, -122, 274, 141, -7, -78, 5, -36, -229, -54, -60, -119, 151, 9, -115, 6, 38, -8, 255, -33, 98, -23, 9, 106, -102, 156, 282, -51, 173, -38, -124, -22, 186, -84, -105, 197, 113, 271, 127, -183, 51, 228, -230, -237, 8, -11, 223, -18, 60, -55, 78, 137, 275, 24, -1, -104, -91, 140, 145, -144, -36, -288, 88, -202, -98, -232, -41, 46, 15, 88, -51, -1, 45, 77, 124, 301, 84, 177, -48, 119, -196, 47, -92, 130, 3, 8, -110, 50, 14, 55, -37, 24, -125, -276, 19, -161, -232, -55, -89, -135, 93, -231, -38, -94, -7, -189, 1, 93, 148, 24, -130, 39, -3, 230, 114, -126, 107, 131, 50, -58, 94, 138, 120, 81, -146, 104, 36, -28, -74, 145, -11, 83, 70, 48, -258, 77, -4, 143, 59, 2, 161, -13]
6442a3qL2n4o9Q6J84k44J60j55K21l6k42Q7l47L58R9q8K5K47k11K13j17O1k14
6466b5K38n1r0jp9j27J93m6j85K17K9Q6l15K39P0k99J20J10r8K7L4l3J16m10K1
6491b59K75l7Jj45L55j09m3P6k1k73L16j02k73M62j78l9P1m2lk6j71M8J42pp3
$$ y = [-13, -21, 11, -43, -112, -26, 158, -86, 74, -81, 140, 104, -138, -51, -398, -40, 59, -29, -4, 243, 32, 245, 128, 189, -25, 213, 162, 72, 71, -8, -135, 58, 12, -173, 44, 73, 159, -156, 83, 153, -146, -26, 84, -14, 13, 47, 14, 130, -280, -259, 16, -21, -20, -165, 190, 81, 38, 114, 93, -180, 136, 34, -239, 223, 45, 6, 77, 35, 32, 6, -165, -117, 25, 18, -55]
$$ [...]
8191b88
##END NTUPLES=NMR FID
##END=
