##TITLE=1H_SR75-TFAAkw3
 CDCl3
 8 sc, 
 25.08.2022
##JCAMPDX= 6.0         $$ Bruker NMR JCAMP-DX V2.0
##DATA TYPE= NMR FID
##DATA CLASS= NTUPLES
##ORIGIN= UXNMR, Bruker Analytische Messtechnik GmbH
##OWNER= root
$$ XWIN-NMR		Version 3.5
$$ Thu Aug 25 12:09:19 2022 Russian Standard Time (UT+4h)  she@DPX200
##.OBSERVE FREQUENCY= 200.1313499994
##.OBSERVE NUCLEUS= ^1H
##.DELAY= (6, 6)
##.ACQUISITION MODE= SIMULTANEOUS
##.ACQUISITION SCHEME= undefined
##.AVERAGES= 8
##.DIGITISER RES= 18
##SPECTROMETER/DATA SYSTEM= spect
##.PULSE SEQUENCE= zg30
##.SOLVENT NAME= CDCl3
##.SHIFT REFERENCE= (INTERNAL, CDCl3, 0, 15.7039)
##AUDIT TRAIL= $$ (NUMBER, WHEN, WHO, WHERE, WHAT)
$$ ##TITLE= Audit trail, XWIN-NMR		Version 3.5
$$ ##JCAMPDX= 5.01
$$ ##ORIGIN= Bruker BioSpin GmbH
$$ ##OWNER= she
$$ F:/spectra/data/she/nmr/H-F/1/audita.txt
$$ ##AUDIT TRAIL=  $$ (NUMBER, WHEN, WHO, WHERE, WHAT)
(   1,<2022-08-25 12:08:25.01 +0400>,<she>,<DPX200>,
      <created by zg, POWCHK disabled, PULCHK disabled
       configuration hash MD5:
       00 E9 B6 7A A2 85 ED C7 34 08 36 98 17 FE 4E 26
       data hash MD5: 16K
       7D C2 45 96 05 29 C9 0E CD 9E 3C 7B 29 71 5F 4D>)
$$ ##END=
$$ 
$$ hash MD5
$$ 75 BF 9F 2E B2 76 8E 6D CB 59 64 4A 68 E9 7E D6
##$RELAX= 
##$RELAX= 
##$RELAX= 
##$RELAX= 
##$RELAX= 
##$RELAX= 
$$ Bruker specific parameters
$$ --------------------------
##$DU= <F:/spectra>
##$EXPNO= 1
##$NAME= <H-F>
##$PROCNO= 1
##$TYPE= <nmr>
##$USER= <she>
##$AMP= (0..31)
100 100 100 100 100 100 100 100 100 100 100 100 100 100 100 100 100 100 
100 100 100 100 100 100 100 100 100 100 100 100 100 100 
##$AQSEQ= 0
##$AQ_mod= 1
##$AUNM= <au_zg>
##$AUTOPOS= <>
##$BF1= 200.13
##$BF2= 200.13
##$BF3= 200.13
##$BF4= 200.13
##$BF5= 200.13
##$BF6= 200.13
##$BF7= 200.13
##$BF8= 200.13
##$BYTORDA= 1
##$CFDGTYP= 0
##$CFRGTYP= 5
##$CHEMSTR= <none>
##$CNST= (0..31)
1 1 145 1 1 1 1 1 1 1 1 1 1 1 1 1 1 1 1 1 1 1 1 1 1 1 1 1 1 1 1 1 
##$CPDPRG= <>
##$CPDPRG1= <>
##$CPDPRG2= <>
##$CPDPRG3= <>
##$CPDPRG4= <mlev>
##$CPDPRG5= <mlev>
##$CPDPRG6= <mlev>
##$CPDPRG7= <mlev>
##$CPDPRG8= <mlev>
##$CPDPRGB= <>
##$CPDPRGT= <>
##$D= (0..31)
0 1.2 0 0 0 0 0 0 0 0.06 0 0.03 0 0 0 0 0.0002 0 0 0 0 0 0 0 0 0 0 0 0 
0 0 0 
##$DATE= 1661414904
##$DBL= (0..7)
120 120 120 120 120 120 120 120 
##$DBP= (0..7)
150 150 150 150 150 150 150 150 
##$DBP07= 0
##$DBPNAM0= <>
##$DBPNAM1= <>
##$DBPNAM2= <>
##$DBPNAM3= <>
##$DBPNAM4= <>
##$DBPNAM5= <>
##$DBPNAM6= <>
##$DBPNAM7= <>
##$DBPOAL= (0..7)
0.5 0.5 0.5 0.5 0.5 0.5 0.5 0.5 
##$DBPOFFS= (0..7)
0 0 0 0 0 0 0 0 
##$DE= 6
##$DECBNUC= <off>
##$DECIM= 32
##$DECNUC= <off>
##$DECSTAT= 4
##$DIGMOD= 1
##$DIGTYP= 9
##$DL= (0..7)
0 120 120 120 120 120 120 120 
##$DP= (0..7)
150 150 150 150 150 150 150 150 
##$DP07= 0
##$DPNAME0= <>
##$DPNAME1= <>
##$DPNAME2= <>
##$DPNAME3= <>
##$DPNAME4= <>
##$DPNAME5= <>
##$DPNAME6= <>
##$DPNAME7= <>
##$DPOAL= (0..7)
0.5 0.5 0.5 0.5 0.5 0.5 0.5 0.5 
##$DPOFFS= (0..7)
0 0 0 0 0 0 0 0 
##$DQDMODE= 0
##$DR= 18
##$DS= 0
$$ [...]
##$SUBNAM2= <"">
##$SUBNAM3= <"">
##$SUBNAM4= <"">
##$SUBNAM5= <"">
##$SUBNAM6= <"">
##$SUBNAM7= <"">
##$SUBNAM8= <"">
##$SUBNAM9= <"">
##$SW= 18.0517283424941
##$SWIBOX= (0..15)
0 0 2 0 0 0 0 0 0 0 0 0 0 0 0 0 
##$SW_h= 3612.71676300578
##$TD= 16384
##$TD0= 1
##$TE= 0
##$TE2= 300
##$TE3= 300
##$TEG= 300
##$TL= (0..7)
0 120 120 120 120 120 120 120 
##$TP= (0..7)
150 150 150 150 150 150 150 150 
##$TP07= 0
##$TPNAME0= <>
##$TPNAME1= <>
##$TPNAME2= <>
##$TPNAME3= <>
##$TPNAME4= <>
##$TPNAME5= <>
##$TPNAME6= <>
##$TPNAME7= <>
##$TPOAL= (0..7)
0.5 0.5 0.5 0.5 0.5 0.5 0.5 0.5 
##$TPOFFS= (0..7)
0 0 0 0 0 0 0 0 
##$TUNHIN= 0
##$TUNHOUT= 0
##$TUNXOUT= 0
##$USERA1= <user>
##$USERA2= <user>
##$USERA3= <user>
##$USERA4= <user>
##$USERA5= <user>
##$V9= 5
##$VALIST= <valist>
##$VCLIST= <CCCCCCCCCCCCCCC>
##$VD= 0
##$VDLIST= <DDDDDDDDDDDDDDD>
##$VPLIST= <PPPPPPPPPPPPPPP>
##$VTLIST= <TTTTTTTTTTTTTTT>
##$WBST= 1024
##$WBSW= 4
##$XGAIN= (0..3)
0 0 0 0 
##$XL= 0
##$YL= 0
##$YMAX_a= 118440
##$YMIN_a= -116776
##$ZGOPTNS= <>
##$ZL1= 120
##$ZL2= 120
##$ZL3= 120
##$ZL4= 120
##$ABSF1= 10
##$ABSF2= 0
##$ABSG= 5
##$ABSL= 3
##$ALPHA= 0
##$AQORDER= 0
##$ASSFAC= 0
##$ASSFACI= 0
##$ASSFACX= 0
##$ASSWID= 0
##$AUNMP= <proc_1d>
##$AZFE= 0.1
##$AZFW= 0.1
##$BCFW= 1
##$BC_mod= 2
##$BYTORDP= 1
##$COROFFS= 0
##$CY= 11.3945322036743
##$DATMOD= 1
##$DC= 2
##$DFILT= <>
##$DTYPP= 0
##$F1P= 2.36226072786647
##$F2P= -0.459571619588291
##$FCOR= 0.5
##$FTSIZE= 0
##$FT_mod= 4
##$GAMMA= 1
##$GB= 0.15
##$INTBC= 1
##$INTSCL= 1
##$ISEN= 128
##$LB= 0.24
##$LEV0= 0
##$LPBIN= 0
##$MAXI= 10000
##$MC2= 0
##$MEAN= 0
##$ME_mod= 0
##$MI= 1.114404
##$NCOEF= 0
##$NC_proc= 0
##$NLEV= 6
##$NOISF1= 3.799351
##$NOISF2= 2.8
##$NSP= 1
##$NTH_PI= 0
##$NZP= 0
##$OFFSET= 15.70392
##$PC= 1
##$PHC0= -18038.44
##$PHC1= 18.20069
##$PH_mod= 1
##$PKNL= yes
##$PPARMOD= 0
##$PSCAL= 0
##$PSIGN= 0
##$REVERSE= no
##$SF= 200.130013532006
##$SI= 16384
##$SIGF1= 3
##$SIGF2= 2
##$SINO= 400
##$SIOLD= 16384
##$SREGLST= <1H.CDCl3>
##$SSB= 0
##$STSI= 0
##$STSR= 0
##$SW_p= 3612.71676300578
##$SYMM= 0
##$S_DEV= 0
##$TDeff= 0
##$TDoff= 0
##$TI= <>
##$TILT= no
##$TM1= 0
##$TM2= 0
##$TOPLEV= 0
##$USERP1= <user>
##$USERP2= <user>
##$USERP3= <user>
##$USERP4= <user>
##$USERP5= <user>
##$WDW= 1
##$XDIM= 8192
##$YMAX_p= 0
##$YMIN_p= 0
$$ End of Bruker specific parameters
$$ ---------------------------------
##NTUPLES= NMR FID
##VAR_NAME=  TIME,          FID/REAL,        FID/IMAG
##SYMBOL=    X,             R,               I
##VAR_TYPE=  INDEPENDENT,   DEPENDENT,       DEPENDENT
##VAR_FORM=  AFFN,          ASDF,            ASDF
##VAR_DIM=   8192,          8192,            8192
##UNITS=     SECONDS,       ARBITRARY UNITS, ARBITRARY UNITS
##FACTOR=    0.0002768,     1,               1
##FIRST=     0,             0,               0
##LAST=      2.2672688,     0,               0
##MIN=       0,             -116776,         0
##MAX=       2.2672688,     118440,          0
$$ Real data points
##PAGE= N=1
##DATA TABLE= (X++(R..R)), XYDATA
$$ [...]
1749I9J1j4K2j89k5K33L3j04k00J20J49j72L24k95j54J5L3N8k8j35K55o6Pr3K30
1774A14R4m89L98q4M9k66K42k48L0J89j25K00N4n1j67j0J03l01L80M8l20M64l68
1797f4J1J5K49l23qL73m58O6r8R4J37j24N6L31j05k09O7J06k41N9J37Q0j67p0
1821h6K64o0k03K32j53K83j80R4j16k30K60n7k94K48J60J88m04O6K94l91Jl3J89
1844G2K35l69R3N8j60L48k55Q4l74M3K10Q5k21L93j14N5k3r0o8k06k56N61l34
1867b33L03k56L40k6m7l5K17l5n05J58K25j63k0L5K96m30j4J86k8O5J36J08k58
1890A9n4kJ82j67l8p2L82j19r2J44j24j39K52k5m19J81L65k59J44lkj3pj30j85
1915a81K07J45l99P9P4K22k3k57J56j03J14m1j88K11P7j71O4K0J4L0k10O5Q2J21
$$ plain form
1749 99 110 96 118 -71 -96 137 170 66 -134 -14 135 -37 287 -8 -162 -147 -114 -56 -84 -219 36 -30 -23 -116 114
1774 114 208 -281 117 33 82 -184 58 -190 -160 29 -96 104 158 107 -60 -70 33 -268 112 160 -160 304 -64
1797 -64 -53 -38 211 -112 -120 253 -205 -139 -237 -143 -6 -130 -74 257 152 -57 10 116 -125 -66 71 151 -16 -86
1821 -86 178 118 -85 147 -6 277 97 191 75 -155 105 48 -246 2 162 350 -54 12 306 -85 -84 -117 72
1844 72 307 -62 31 89 -71 277 22 106 -268 -225 -15 70 -151 242 128 183 160 70 2 -204 -460 101 -233
1867 -233 70 -186 154 128 81 46 263 228 -277 -119 106 -57 -77 -42 254 -176 -190 -4 -32 33 169 277 19
1890 19 -35 -37 145 -22 -60 -132 250 131 39 183 59 -80 172 147 -272 -91 274 15 159 156 154 141 134 4 -181
1915 -181 26 171 -228 -149 -75 147 124 -133 23 -80 34 -7 -195 16 93 -78 -14 6 20 50 -160 -95 -13 108
1939A08j02p4M4J62k49o9L1M7K05p5j42P3J41j49J54p4k09K48k47L7J33J15j61
1962e3m6K75j08j18O1O5n5k20L25k33K02N7l35R0mK44o9k7J44r5l2q5k8P0n8L9
1988FJ31k34J77L8j98J46J44j55P9m43J43J03j9J04R8j98n6q0L77k51n2K73k03
2011g0K37k43lJ15Po4k72M02L1k77j0K02M5j33N2J56q6k25J86j31J58M9l8j75
2035h7P1rr4Q5P9j61K29j43O7j48K97k24O1Q3j71P6%j33L7J23n1k7q6K25j5j93
2061a09r4K79p1j6O9j66K87l35l7L35j47k1P0oN6K3r4m5O4j05%K77l01P6j05N2
2087f4J99j16Q8j55M0K03nk73J97q6l6J6k26L64k19O1M4j34q6M2J70M3n7j00K96
2112B06k55m1r1L90k23l8k85K51K95j94k14J67L1j94J44j33K04k04J60l8j20P1
$$ plain form
1939 108 6 -68 -24 138 -111 -180 -149 -102 103 28 -114 -41 100 -49 105 31 -178 70 -177 -140 -7 108 -53
1962 -53 -99 176 68 -50 11 76 21 -199 126 -107 95 152 -183 -93 -97 147 78 51 195 100 68 -17 -45 25 -33 6
1988 6 137 -97 80 118 -80 66 210 55 134 -309 -166 -63 -82 22 120 -78 -134 -214 163 -88 -140 133 -70
2011 -70 167 -76 -79 36 43 -21 -293 109 140 -137 -147 55 100 -33 19 175 89 -136 50 -81 77 126 88 -87
2035 -87 -16 -25 -119 -34 45 -116 113 -30 37 -111 186 -38 23 106 -65 11 11 -122 -85 38 -13 -40 -126 99 84 -109
2061 -109 -203 76 5 -11 58 -108 179 -156 -193 142 -5 -26 44 38 94 117 23 -22 42 -63 -63 214 -87 -11 -116 -64
2087 -64 135 19 107 -48 -8 195 190 -83 114 28 -8 8 -218 146 -73 -12 32 -102 -188 -146 24 67 10 -90 206
2112 206 -49 -90 -181 209 -14 -52 -337 -86 209 15 -199 -32 -1 -195 -51 -184 20 -184 -24 -62 -182 -111
2134a11o0K65l80K85J95k78L65j71Mj27P6r5p9K00J45j26p5m5P8N1m8p8j34rn3
2159b05J60pJ06k54M8Q8Q6J76N2j48k40J67k2K1nj62J73j66L14l82J74n4Q9k67
2183b58M4J42J01Qq9M0n2J98lj36pK54l59K37r9j64o9K97J6k85J46J56r5J31r5
2208E9j78P6j45L53r5j01Or8O7o9K19l3j30J1K73j81J06l96L36k32J67J23Ql27
2232a81P7R2j04P0J01Q8k79L6j5j83L98o2p5N0J84m05O5J30j7p2m9K52j30j06
2256a35J55q4j8J04o8m2J61J00j82M3j60L54j04r9J31J15j61j5r1P7J45k42L7
2279B1q2Op4K8K58k57Kj35L14R8r9r8J21J61j76k31K23M6O2m2R9j59p3M2l40K25
2305f0L8P6k0o6K6n1l6J9K23j40p7j26R8J5K84k91q2K85l0m06L75j62K0l1o0J73
$$ plain form
2134 -111 -171 94 -286 -1 194 -84 281 110 114 -13 63 -32 -111 89 234 108 33 -12 66 117 69 -9 -143 -152 -205
2159 -205 -45 -52 54 -200 -152 -64 22 198 250 102 -138 29 7 28 23 -139 34 -132 182 -200 -26 -80 9 -258
2183 -258 -214 -72 29 37 -52 -12 -64 134 131 -5 -12 242 -117 120 21 -143 -212 85 101 -184 -38 118 23 154 59
2208 59 -119 -43 -188 165 70 -31 -25 -123 -56 -125 94 61 -69 -58 215 34 140 -256 80 -152 15 138 146 -181
2232 -181 -104 -12 -116 -46 55 143 -136 -100 -115 -298 100 38 -37 13 197 -208 -143 -13 -30 -102 -151 101 -29 -135
2256 -135 20 -64 -82 22 -46 -88 73 173 -9 34 -126 228 124 25 156 271 110 95 4 81 226 -16 21
2279 21 -61 -55 -129 -101 157 -100 -98 -233 81 179 80 -18 103 264 88 -143 80 126 188 146 245 86 13 55 -285 -60
2305 -60 -22 54 34 -32 -6 -57 -93 -74 149 9 -68 -194 -96 -81 203 -88 -170 115 85 -321 54 -108 -88 -119 -179 -6
2331fO7o7J53k76J38j94O7M5j1L5J12j79k2K83j43J27Q8j82j35J72L1J49m06J81
2355B7Q0m32M45l41J51J42j15K5p3J29j91J62k8k28J99J21j97K6o7M79j97k36
2377a19L06j52K43l15r4N2J51n4m9j17l8LM7K09j63K5J42k09J58l2K9r1N8J25
2401A15k77K79k03R7k69J75j1o0K74k23J04J94l91K48lj5j10K23j02j82L07j27
2423D3J13m27k3K77R5j43MN0OK2K8q4m8K24k28K49l00r8M3K01M7l6j15l0j13R
2449b34M11k52J68Mj47J02n6or3J28j45R5k17J56L7j00J99l46K51L03l80L50m9
2472A79k47k10M59j16j8K55m26K03n8K3j78J86q0J31j52j55K1K38J08q7r5L21
2494C02k17k4j04L00j71j66J97l14J83Q0P6j36K62pk32R9j50K49k61O2q1QK36
$$ plain form
2331 -6 61 -6 147 -129 9 -185 -118 -73 -84 -49 63 -116 -138 145 2 129 217 35 -100 72 103 252 -154 27
2355 27 107 -325 120 -221 -70 72 -43 -18 -91 38 -153 9 -19 -247 -48 73 -124 -98 -165 314 117 -119
2377 -119 187 35 278 -37 -131 -79 72 18 -31 -148 -186 -183 -136 73 -90 -65 77 -132 26 -6 23 -68 -10 115
2401 115 -162 117 -86 11 -258 -83 -94 -154 120 -103 1 195 -196 52 49 34 -76 147 45 -137 170 43
2423 43 156 -271 -294 -17 78 -65 -61 -11 -5 17 45 -39 -87 137 -91 158 -142 -240 -197 4 51 15 -100 -130 -243 -234
2449 -234 177 -75 93 97 -50 52 -4 -10 -103 25 -120 -25 -242 -86 -49 -149 50 -296 -45 258 -122 228 179
2472 179 -68 -278 181 65 47 302 -124 79 21 44 -134 52 -28 103 -49 -204 -183 55 163 76 -19 302
2494 302 85 61 -43 257 86 -80 117 -197 -14 66 142 6 268 261 29 128 -22 227 -34 28 -53 -45 191
2517A91L7j90j38O6O1j02l0J43j05R0j53M11j49j96NJ58k6Q1j10l0J1J32k25j48
2541b16L34j79O6R3q5J12j47K1j57K46o4j08J48l08L53r9nJ9J13q7n7j2Q5l21
2565b55J13N9m0RL82l57K46K5j97J12l4k60nJ0L0K69p2j17J90p3r3Q0P7k33k8
2590a62K66q8k2m6R6l15L52j46j51J45k67J78J40m5K62j50J63j08j75o5J92L3
2612H7j4J34pj77p9l03K52Q0j12K74l94L21jq8p6L18j69j39q7o2K37k26L42l96
2636b85M40j99k33L19J63k61j35K03l9k5k31L32j94J99J10p7Q5r4k22J72m4M2
2658B6l52L96jo6J2j42J58j2J52RO9j82J81k08m7k05K51O8j93O6J59k70K28k9
2682F8j17j12J08p1J44N2j42J83o6Rn1ol28L28j75P0k6l4L49r0m9j62J49Q0k71
$$ plain form
2517 191 228 38 -100 -34 27 -75 -105 38 -67 23 -130 281 132 -64 -59 99 73 154 44 14 25 157 -68 -216
2541 -216 118 -61 5 98 13 125 -22 -1 -158 88 24 -84 64 -244 109 10 5 24 137 50 -7 -19 66 -255
2565 -255 -142 -83 -123 -114 268 -89 157 182 -15 97 63 -197 -202 -192 -162 107 35 -82 108 35 -58 22 99 -134 -162
2590 -162 104 16 -6 -52 44 -271 81 -65 -216 -71 -338 -160 -20 -65 197 47 210 102 -73 -138 54 87
2612 87 73 207 200 23 -56 -359 -107 -27 -139 135 -259 62 61 -27 -103 215 46 -93 -180 -242 -5 -231 111 -285
2636 -285 155 -44 -277 42 205 -56 -191 12 -27 -52 -283 49 -145 54 164 87 172 78 -144 28 -16 26
2658 26 -326 70 69 3 15 -127 31 19 171 180 249 67 248 40 -7 -212 39 107 -86 -20 139 -131 97 68
2682 68 -49 -161 -53 -124 20 72 -70 113 47 56 5 -1 -329 -1 -176 -106 -132 -166 183 93 44 -118 31 111 -160
2707a60Q4N3jM7k00o1K32k81J45L7n6K41N4j38J17O3j33o1J34n3j11L59l08jj52
2732a50J23j03Q9L1k9MN9M8k00K33j8q6J82j97m2J03q4k50K41J01m4j08K08o0
2756E1k9k1R8j86pL79m42K15J16j43j87L03k36Q6k8nm7P7m4J8L3J11k25J48l59
2781c24K58J10l01L57r8J30R1j45j24L3P3q5J00p9j11Q2J07j00j16o3R9O2K03
2804A59j95K3K59l39L28k97O2p0K29r8p3j5l6o6k2K97J03k58n2J53K2r8K9j09
2828f4J25K9k10J2J71n1q9M4J11O2Pj18j47m1K69k1r8n5j01J77n6l25L67J83l57
2853a76M4J58P1k48o7L29j86mj2R3J10k03l3J66J44m03J98QJ1K25o9j70k62K75
2877aJ50l00R0J9J15Q1r7Kl06K55l0qK43l11M1K2J68j99m5J22l6L3k27J24j53
$$ plain form
2707 -160 -76 -23 -24 23 -177 -238 -6 -287 -142 -105 -161 80 134 -4 113 176 43 -18 116 63 -48 311 3 2 -150
2732 -150 -27 -130 -41 -10 -39 -35 24 72 -128 105 87 1 183 -14 -56 47 -37 -287 -46 55 11 -97 111 51
2756 51 22 1 99 -87 -94 285 -157 58 174 31 -156 147 -89 -3 -31 -36 -83 -6 -50 -32 1 112 -113 35 -324
2781 -324 -66 44 -257 100 2 132 223 78 -46 -13 60 -25 75 -4 -115 -33 74 -26 -142 -205 -106 -44 159
2804 159 -36 -13 246 -93 235 -62 0 -70 159 61 -12 -27 -63 -129 -151 146 249 -9 -61 92 114 16 45 -64
2828 -64 61 90 -120 -108 63 12 -77 -33 78 140 147 29 -118 -159 110 89 -9 -64 -165 12 -44 -369 -2 181 -176
2853 -176 -132 26 97 -151 -218 111 -75 -79 -91 2 112 -91 -124 42 186 -217 -19 -11 0 225 156 -14 -276 -1
2877 -1 149 -151 -61 -42 73 154 57 59 -247 8 -22 -30 213 -98 -57 -35 133 -66 -111 11 -25 8 -219 -95 -248
2902b48Q0J35K77j92K9k42L48k64J35jj9K5k21j53L66o0L5J16o1j04j48J38K69
2925B40m87P3P3K85j16J00p4k98K05l5J16j1k6pN5j79K24j74l1J42j32q5J56o3
2949d9K58r3l3k54K7O36j90k91J51l50L20k23j6O4Q2M4J73j42j35n6j15J33J46
2972H7j2j06lm6L03k59j67L47j15J27j35R0j27R2L34n17K7M8K00k9l25J92n5j24
2996a73N9K60m62L71q3P5j1J0p3q9K72p9j69p3J13N6J63k41m0j01K09J70k25N
3020e6J92k71p5J61O6j65j47K14k43L09Pj26N5K68J50l04n8j27J27k42J14K94
3042A43l7K1J04J7k93Ok2K36j37j75P1J36k68L00l11L12j42J19O9k09J46J10j60
3065C6M8J6j78Q8q0p1j5J76k1p6rJ89L0o0j04J37j23N2j34K02k6r6J85m7J69j64
$$ plain form
2902 -248 -168 -33 244 52 81 -161 187 -77 58 57 38 63 -158 -311 55 -5 30 146 85 -19 -167 -29 240
2925 240 -247 -174 -101 184 68 168 94 -204 1 -34 82 71 45 38 93 -86 138 -36 -67 75 -57 -142 14 -49
2949 -49 209 116 83 -171 -144 492 302 11 162 -188 132 -91 -107 -43 39 83 256 114 -21 -77 -192 -59 87
2972 87 75 -31 -34 -80 223 -36 -203 144 29 156 21 111 -16 76 410 -107 -80 -32 168 139 -186 6 -49 -173
2996 -173 -114 146 -316 55 -28 47 36 46 -27 -116 156 77 -92 -165 -52 4 167 -74 -114 -215 -6 164 -61 -56
3020 -56 136 -135 -210 -49 17 -148 -295 -81 -324 -15 -8 -134 -79 189 339 35 -23 -150 -23 -265 -151 143
3042 143 106 127 231 248 -45 -39 -61 175 38 -137 -66 70 -198 102 -209 103 -39 80 149 -60 86 196 36
3065 36 84 100 -78 10 -70 -141 -156 20 -1 -77 -86 103 133 73 -31 106 -17 35 -99 103 77 -19 166 119 288 124
3091A24j34J07m5k67K20m5J44Jn46M92j00J18qj16J07m06M83j80N0j06J9J89o4
3114C7Q4j25j15J7K91l53J74Q6j01j9L4N1j49J04Q9J15j04l18p3K05n0l5P6q2
3138a61M1M37m30K62l38j01K70Q3j13q2J68N5K4l41J80o0J50J22J0Q4l7k02k52
3161b31L08J84k30M1K21l85O5J81k84J01j08M7nJ14l1J09l48L41k83K40q8j16
3183a57q1R2q1o2L89q1k27K23k76K59N0m32L75J48L4k50J56r8K73p5j21l72O03
3206B89l97Q1j43L7K08k9J81m25K60j19K51k00Q0J03k40N5k27K39R0j24J31J95
3228B96j07o7p8m4j90K05J20k59J66l7J05j78K45l3j07J39l62J6L79k06R6j61
3250f2L24n17J76l6L2L42j53n3j25J21J2k32L50m17L27K9k09K53L4k27J17P1m4
$$ plain form
3091 124 -10 97 52 -215 5 -40 104 105 -441 51 -49 69 61 -55 52 -354 129 -51 -1 -107 -88 101 37
3114 37 121 -4 -119 -102 189 -164 10 96 -5 -24 10 61 -88 16 105 220 116 -202 -275 -70 -120 -155 -79 -161
3138 -161 -120 317 -113 149 -189 -290 -20 63 -50 -132 36 91 115 -226 -46 -106 44 166 176 260 223 21 -231
3161 -231 77 261 31 72 293 -92 -27 154 -130 -29 -137 -90 -95 19 -12 97 -251 90 -193 47 -41 -157
3183 -157 -238 -146 -227 -289 100 19 -208 15 -261 -2 48 -384 -9 139 173 -77 79 -19 254 179 58 -314 289
3206 289 -108 -27 -170 -133 75 46 227 -198 62 -57 194 -6 74 177 -63 -8 -235 4 94 -30 101 296
3228 296 189 122 44 0 -190 15 135 -124 42 5 110 -68 177 144 37 176 -186 -170 209 3 99 -62
3250 -62 262 -255 -79 -115 -83 259 106 53 -72 49 61 -171 179 -238 89 118 -91 162 196 -31 86 157 113
3273A13k05N5J07k91L53j84J24J27m26K7O33m59j75L3J42q4k6NJ91j55l1J7K02
3296I3j12j31P6K26j44J47m00K46o9R0J6k3K75m61M06l40R1k40K89j45J23J68
3318A81j41m5n7O2m3PL20m25J42l37J97J95l3L03m91O4n2L29j24J8O0l31K88o2
3342B5K36m05R0n6j3J07J32k68k3K69k50O8L57k48k56K64N9k97Q5K22Nk18J65
3365E0j48R6J4j36J73k58L86j73j9m9p5J17J77j39k57K59K68m6k00P1j15ll5J19
3389G7j32m1L55j75q8J29J02k27l4j23K45k06L46p8k90L3J90J9j00j63K67j42
3411c6Qj13M1K35l8k5j48k5L26m52L92rk97k3J91K81k63R9r6l28R3L44J35k74
3435A8K2J53j19lj25l3K18j86L3N2J11o7p9k1J52k1m5J2l60K03K0J53q1j36P0
$$ plain form
3273 113 -92 -37 70 -221 132 -52 72 199 -227 -200 433 -26 -201 -168 -26 -110 -136 -131 60 -95 -126 -109 93
3296 93 -19 -150 -74 152 8 155 -245 1 -68 22 38 15 290 -171 235 -105 -14 -254 35 -110 13 181
3318 181 40 -5 -62 0 -43 -36 284 -141 1 -336 -139 56 23 326 -165 -101 -153 176 52 70 130 -201 87 25
3342 25 261 -144 -54 -110 -123 -16 116 -152 -175 94 -156 -88 269 21 -235 29 88 -209 -124 98 103 -115 50
3365 50 -98 -2 12 -124 49 -209 177 4 -15 -64 -139 -22 155 16 -241 18 286 240 40 111 -4 -7 -42 77
3389 77 -55 -96 259 84 -4 125 227 0 -34 -157 88 -118 228 150 -140 -107 83 102 2 -161 106 -36
3411 -36 -28 -141 -100 135 97 72 -76 -101 225 -227 165 156 -141 -164 27 308 45 144 48 -280 -187 157 292 18
3435 18 40 193 74 71 -54 -87 131 -55 -22 30 141 74 -5 -26 126 105 60 72 -288 -85 -65 88 7 -129 -59
3460e9j88J77K11l7J45k60k8P7J61j33j7pJ05j80j57J85K50j37n0No6K52m21j42
3484c14L95l68M02k23K5J14K19l16M5M9j72K19m5l7JJ8R0k23Q5J89j31P5L7j16
3508A8Q0j73r6J1K04n7j37L75j88N0k56J56K1n8j8J99j37O2P8j69p9kl8K85l6
3533I5j26p7q4L44k15Q7l9r8L14k57QK05O7k31K43j28j58K16k1j17nq2O0j27J54
3558B8J50m6j35mQ4J24l28K55M8j71O8j88N5j5P3J39j79k05K57J6o5j00J63p4
3582e0J1M7j34J78J7J93j52k44J12j19J11J94k6m2R2k99K91n06M02j60K49j65
3604@k03K49j49N0M4K10m09M73l16j1K65o2r8j5p4q6J45j39r3K48Q7j41j33K84
3628A26j33j53K29k30K01j84K80Mp8j66L03j46Lm9J57j17j43K1j17J01q8K24Q7
$$ plain form
3460 -59 -247 -70 141 104 249 -11 -39 38 199 66 49 42 147 -33 -190 -5 245 108 58 63 -3 249 -172 -314
3484 -314 81 -287 115 -108 -83 31 250 -66 -21 28 -144 75 30 -7 -6 12 102 -121 -36 153 22 97 134 18
3508 18 98 -75 -171 -160 44 -13 -150 225 37 87 -169 -13 8 -50 -68 131 -6 56 134 -35 -114 -116 -154 131 95
3533 95 -31 -108 -192 152 -63 24 -15 -113 201 -56 -48 157 224 -7 236 108 -50 166 145 28 23 -59 1 -126 28
3558 28 178 132 -3 -7 77 201 -127 128 176 5 73 -115 -60 -75 -2 137 -42 -247 10 26 -39 -139 24 -50
3582 -50 -39 8 -126 52 69 262 110 -134 -22 -141 -30 164 138 96 188 -111 180 -326 76 -84 165 0
3604 0 -203 46 -103 -53 -9 201 -208 265 -51 -62 203 141 43 28 -46 -132 13 -126 -219 29 116 -25 -158 126
3628 126 -7 -160 69 -161 40 -144 136 140 62 -104 199 53 56 7 164 47 -96 -75 -192 -91 -179 45 132
3651A32lk05K12k17l6J16J41k11J37o2m9r3J99J72l15J02r8K42kk38l67J26M50
3674A33l65J15K01l42R0L63k0j15k01L36l71Q7LQ6J4k78L03m6m7j8J96J1j02r2
3698e9J13n7L0K94r7m07J51o8J58j04J05m1J23j22k9j00Q0Q6j65J05J58l32L24
3721A46j50J39o25N71m9MJ13j30p1J19j4P4k91J72j12J39R2j61K45l76K46n0L3
3744F4J59N3l15j0j4j83M62m5l77Q7K39j99j03J91k17L44k1j42N0L2m56N32q4
3767D7Q8o5J48n4J10j06k05K32j45J1r9K01r8Q2L9l48R8J42l32L69o2j22K6K08
3791A65k19o3K59l23K13j05J63j99R9J50o7k61L54j35R2j5j17J57l10Q0K33N7
3813B08j15jm18K31J96j76J45k29J32n7N8l8J72K0j35m1J25P0j39r1J37j1j13
$$ plain form
3651 132 129 -76 136 -81 -117 -1 140 -71 66 4 -45 -138 61 233 -82 20 -78 164 162 -76 -443 -317 133
3674 133 -232 -117 84 -258 -168 195 175 60 -141 195 -176 -89 -86 0 14 -264 39 -7 -54 -72 124 135 33 -59
3698 -59 54 -3 27 321 224 -183 -32 -100 58 -46 59 18 141 19 -10 -110 -30 56 -109 -4 154 -178 146
3721 146 -4 135 -490 81 32 36 149 19 -52 67 53 127 -164 8 -104 35 127 -34 211 -165 81 31 64
3744 64 223 276 -39 -49 -63 -246 216 171 -206 -119 120 -79 -182 9 -208 136 115 -27 23 55 -401 131 47
3767 47 135 70 218 164 274 168 -37 195 50 61 -38 163 65 147 186 -162 -64 78 -254 115 53 -69 -43 165
3791 165 -54 -117 142 -181 32 -73 90 -109 -10 140 73 -188 166 31 123 108 -9 148 -162 -82 151 208
3813 208 93 92 -326 -95 101 -75 70 -159 -27 -84 -26 -64 108 128 -7 -48 77 147 8 -83 54 43 -70
3836g0J66k26p8R1J11k38K23l9K72k49O2Q5k15Q5N9m5O4m67N12j1j1P7l0j5j12
3861AL4k40K69k23K42n1k9J9r3l3J2R9L7l2n8M5p2J41L07k61r7j83L23j97J56
3886A16m9p9j51M24k36J22l81J76J55p0J8R9k69J27J73l10M67l24n6J50j09n4
3908f1J30m6j85j10J23k07M60lK5J0p3N9l27N40l29j31J69ok26Q8k0K95l17K0
3932a22Q7M6K2J1j89J39N4J53m6l92K13J65l34k9J75r8J47k01J44R5r7K4j16P9
3956g0J14J40k01k2J91M5k51j50M03l18J23j19R2j20P7k16J42K00j95Q0J53o3
3978C5N2j66k62M66j05p9L5j14J8L5K40m17J89j24J90n8M5M5p6J44M7j97J21j54
4002i0K46j92m2J56l6o4k3N9j96J77j40J47O4J1k13J63J87k41J66pQ1k49J66k06
$$ plain form
3836 -70 96 -130 -208 -117 -6 -244 -21 -60 212 -37 25 110 -105 -20 39 -6 58 -409 103 92 81 158 128 113 1
3861 1 35 -205 64 -159 83 32 3 22 -71 -104 -92 7 44 12 -46 -1 -73 68 375 114 17 -166 157 -40 116
3886 116 67 -12 -163 261 25 147 -234 -58 97 27 45 144 -125 2 175 -135 332 8 -48 102 -7 -61
3908 -61 69 23 -162 -272 -149 -356 104 101 126 136 63 122 -205 335 6 -125 44 38 -188 -100 -120 175 -142 -122
3932 -122 -35 11 33 44 -145 -6 48 201 155 -237 -24 141 -193 -222 -47 -145 2 -199 -55 40 -57 -33 -149 -70
3956 -70 44 184 -17 -39 152 197 -54 -204 199 -119 4 -115 -23 -143 -66 -282 -140 60 -135 -55 98 35
3978 35 87 -79 -341 125 20 -59 -24 -138 -120 -85 155 -262 -73 -197 -7 -65 -20 25 -51 93 140 -57 64 -90
4002 -90 156 -36 -78 78 42 -22 -45 14 -182 -5 -145 2 66 77 -136 27 214 -27 139 132 213 -36 130 -76
4026g6MK9K1J6q8L2J80k99L76j37j47P5Q9j46O2P8o1O8m9r9L4J97k17j50J85j15
4052a38L35l26K45j62J07j24nK10q4n4p4o4K11J18k10l6M2O3p8J5J89n3O7l44
4076a50k2K20r4J5J10k20J62K27j93q4M2j17j95J43j3K05o6o7J50jk66J17j1J31
4100B3K6o7O8K33k26p1p8J40j50J0pR2r4p8O7QJ91r7j77J24R6J24j25j01Q8Q7
4126A06n4O4j97j95K82MJ13k27J63l6J7N8K08j82J2l17O6p0ML19k19M2R2m7L89
4151C95k05l04J32J12j78N8k56L01n6k34K27J58M9k27L9k0l3l7j3J13N5j64n0
4174a38m7K49Q2J9r7j53k9L3p1J51J7n9M6J99j00k59L17j04n7Q2r7n5o7J18L7
4199A7R5p0j88J47l2p6K75O0m53L83l60L78k91O3k07L75k39J32J83j71J08k8j28
$$ plain form
4026 -76 -72 -43 -22 -6 -94 -62 118 -181 195 58 -89 -14 75 -71 -9 69 8 76 27 -72 -38 159 -58 -208 -23 -138
4052 -138 197 -129 116 -46 61 -63 -68 142 58 4 -70 -134 77 195 -15 -51 -9 54 -24 -9 180 127 194 -150
4076 -150 -172 48 -46 -31 79 -141 21 248 55 -29 13 -104 -299 -156 -169 36 -30 -97 53 52 -214 -97 -108 23
4100 23 49 -18 50 283 57 -14 -92 48 -102 -92 -99 -7 -101 -179 -112 -104 87 -10 -187 -63 33 157 32 -69 19 106
4126 106 52 116 -81 -276 6 10 123 -104 59 23 40 98 306 124 136 -181 -115 -185 -181 138 -81 -39 53 6 395
4151 395 190 -114 18 130 -48 10 -246 55 -1 -235 -8 150 199 -28 11 -9 -42 -79 -92 21 76 -88 -138
4174 -138 -185 64 146 165 68 -85 -114 -81 -152 -1 16 -43 3 202 102 -157 160 56 -1 81 -16 -71 -138 -20 17
4199 17 112 42 -146 1 -31 -107 168 228 -225 158 -202 176 -115 -52 -259 116 -123 9 192 21 129 101 -27
4222b7m8K06J8l46M0K3K51l8o6j22J46j8J01j58p5N8P2K00k49r7lL03n28M40j81
4247i8J26k02o6L77j61P5J33k97J92j89J05p9L19n02J47j4L4j09J44L7K18O5k72
4270a7L90m25N5k35K35j29K90k93O8J6J69L4l63L65l48K63o9J20l75J18K18k14
4292a27J80lr8J92N7j74j38K4J61lK00k77o3J10j06M68m26j61K43O5l02K1K78
4315A21k6j4k72L52k61K70k86K20j63K80m17Q5N1j22M82q8k47O9l95K88J12LL7
4338G9Q7k98Q9P8K02k14J54R5k74Kj7j26k6J43l6J93q9j44J9L4J01k05Q7k61J35
4363a92K94j44K18k78K77j52k7J0m4r3J89K7L3J9j44Q8l23K77J42j96K49k46N1
4386C5o6J47m9j4n7k3P0l28M74l65K49M5J9k03j6L32l41kL16r3p0o2n5P1P2j04
$$ plain form
4222 -27 -75 131 149 -197 -157 -134 117 79 13 -109 37 19 120 -38 -113 -55 17 217 -32 -129 -132 171 -357 83 -98
4247 -98 28 -174 -240 137 -24 51 184 -113 79 -110 -5 -84 235 -267 -120 -134 -100 -209 -65 -28 190 255 -17
4270 -17 373 -52 3 -232 3 -126 164 -129 -61 -45 124 158 -205 160 -188 75 6 126 -249 -131 87 -127
4292 -127 53 50 -48 144 201 27 -111 -87 74 71 271 -6 -69 41 -65 403 -23 -184 59 124 -178 -157 121
4315 121 95 81 -191 161 -100 170 -116 104 -59 221 -196 -111 -60 -182 300 212 -35 34 -361 -73 39 42 79
4338 79 166 -132 -43 35 237 23 177 272 -2 0 -17 -143 -169 -26 -62 131 42 -102 -83 -49 52 -153 -66 -327 -192
4363 -192 102 -42 176 -102 175 23 -4 6 -38 -131 58 85 118 137 -7 81 -242 35 177 -19 230 -16 35
4386 35 -31 116 67 53 -4 -27 43 -285 189 -176 73 118 137 -66 -82 250 -91 -93 223 130 60 -2 -57 14 86 -18
4412a8M3M4k72J17J36k14K88r4J2J04k84J0r1K70l1l5N6Q9l54K04J50P1o1k29
4436h9K7M7nJ23m7j02n3q7J66j85L21j09K51l79P8k19R0M02k93J2O6K0n6j49J51
4461a9q5L57k73j6j9R5J63j56KJ05p5J10M1k21J48j93j7J88j74K07p0J91l11l0
4485e2K99k71J74o6j51R8k5L3p7j42K52k19K05j57N6n0rj2j10K33L7L5k59J15
4509f3j42K54k05L9J95j65K19k43K84o4j9l26K75j15L02k12J7m4K04q2k21M7L37
4532B72j60j29j37J5K88O2j45k59L28k86L90pn03K81k3O1R6j08K20j40o3j72p5
4555a94J25N1K3O8n0j26K51l49M39j90P8p8lL0J05j61k5J23L0j32j0K34k66L2
4579El2j42K85l80L32m1k33J65p9L72k41j51J22O3j17J35k91L49k15J36Q6k0J00
$$ plain form
4412 -18 25 69 -203 -86 50 -164 124 30 42 146 -138 -128 -219 51 20 -15 41 130 -224 -20 130 201 140 -89
4436 -89 -62 -15 -20 103 56 -46 -99 -186 -20 -205 116 7 258 -121 -43 -262 -172 230 -63 -51 15 35 -21 -170 -19
4461 -19 -104 253 -20 -36 -55 40 203 47 49 154 79 189 230 9 157 -36 -53 135 -39 168 98 289 -22 -52
4485 -52 247 -24 150 84 -67 31 6 39 -38 -180 72 -147 58 -99 -43 -93 -102 -114 -224 9 46 81 -178 -63
4509 -63 -205 49 -156 -117 78 -87 132 -111 173 109 90 -236 39 -76 226 14 31 -13 191 109 -112 -65 272
4532 272 112 -17 -154 -139 149 211 66 -193 135 -151 239 232 -271 10 -13 48 144 36 256 116 53 -119 -194
4555 -194 -69 -18 5 73 23 -103 148 -201 238 48 126 48 45 75 180 19 -6 117 147 15 5 239 -27 5
4579 5 -27 -169 116 -264 68 27 -206 -41 -120 252 11 -140 -18 45 -72 63 -228 121 -94 42 128 108 208
4602B08k20R2j85N1O1l93K28O0j9K49j87j04J14K13j29m7N5J3j34J87K50n20R1
4625f6L11k62j33R2o4J21%N7j83o9K97K3J17j81K55k99J95j09j63k5K00J63n42
4648b65K28J11r8j20L84n3n1j69J72l1o5l4qR7k09K1J21J05j37j55J53K3K39j22
4672A37M9j45k02K39k13Q8L19l24o8j36J16K69K8j54k4J68j83N3J96k74l5k3k30
4695c49L67J09J5j31m2J22J87m28M36m30K15n0o5J18K15k45j69K24J8mJ65k81
4717cr6J01j02R4m3J94j41j85K81n6J25k24k9K50k92J33k42L86j4j25j28O4Q7
4740C5k8k60K25K08l09q2j1M23j70m1j51J65n2N6k9n8L7o5J11k5K6o5K64j0jL1
4766B24k32jJm2L51k75M1q2o9K8J50l53K07R5N5m1K52k42L4N2o1J40n9n0k98K31
$$ plain form
4602 208 -12 80 -105 -54 7 -386 -158 -98 -117 132 -55 -159 -45 168 39 -8 47 60 -74 113 363 -157 -66
4625 -66 245 -17 -150 -58 -122 -1 -1 56 -127 -196 101 124 241 60 315 16 211 102 -61 -86 114 277 -265
4648 -265 -37 74 -24 -144 240 187 136 -33 139 108 43 9 1 98 -111 -90 31 136 -1 -156 -3 20 259 137
4672 137 186 41 -161 78 -135 -47 272 -52 -120 -256 -140 129 157 3 -21 147 -36 17 213 -61 -96 -119 -349
4695 -349 18 127 142 11 -31 91 278 -150 286 -144 71 21 -44 74 289 44 -125 99 117 113 278 -3
4717 -3 -99 2 -100 -6 -49 145 4 -181 100 44 169 -55 -84 166 -126 7 -235 151 137 12 -116 -52 35
4740 35 7 -253 -28 180 -129 -211 -222 201 31 -10 -161 4 -48 8 -21 -79 -42 -107 4 -21 5 -60 204 194 193 224
4766 224 -8 -9 -8 -50 301 26 67 -15 -84 -56 94 -259 -52 43 98 57 309 67 101 153 92 232 173 123 -175 56
4792E6k71J48J08j23J69o4k03R1J05K11m9o2j07l36L69k31m4K24k65L01Q5l60
4814b48K45J31l49M09k43Q5j60K44l29R4J62j07J78j81L3L95j97n6k8j48j16K25
4836C9Q7j00j07j4J49j63r0J69J96p6J85m66J15M8K15l15K48j70J03j45P9K00
4858A87l07J28j92Qk7L84l41k9P5J15rJ02j46J10j2J5q8R4o0N9k1l7j68J42j00
4883a18J46o9Mj6M0M2o0L2Pl9J99l50K34j78K06O3k01J37j29Kj9J79j64L98m30
4908h4P7J75M7l30k8K17m6j16K30p5p2k3r4j3r6L25k51K36m9J19k80L66j69k08
4932a42L89l04j28L89M3l52J18n6J57m66L98r7j22K80P1l53K85k5Lj5j18Q4J26
4955A65r6k44J58m4J5K36k34r3k58K82J16J06j32l7J0j4N6J19j31j36K42k72J80
$$ plain form
4792 56 -215 -67 41 -82 87 23 -180 -89 16 227 178 116 9 -327 42 -189 -233 -9 -274 27 112 -248
4814 -248 -3 128 -221 188 -55 30 -130 114 -215 -121 41 -66 112 -69 -36 359 162 106 78 -70 -186 39
4836 39 126 26 -81 -95 54 -109 -199 -30 166 90 275 -191 -76 -28 187 -128 120 -50 53 -92 -13 187
4858 187 -120 8 -184 -176 -203 181 -160 -189 -114 1 -8 94 -52 58 46 61 -27 67 7 66 45 8 -160 -18 -118
4883 -118 28 -41 -37 -53 -13 29 -31 1 8 -31 168 -182 52 -126 80 143 -58 79 -50 -48 -67 112 -52 346 -84
4908 -84 -7 168 215 -115 -143 74 28 -88 142 67 -5 -28 -122 -135 -231 94 -157 79 30 149 -131 235 66 -142
4932 -142 247 -57 -185 204 247 -105 13 -43 114 -352 46 -51 -173 107 178 -175 110 85 88 73 -45 39 165
4955 165 69 -175 -17 -61 -46 190 -44 -137 -395 -113 3 109 -23 -60 -50 -64 -8 111 -20 -156 86 -186 -6
4978fN6k6K26j87k6j20j28K98Mp0Lk59J76K69j72J39k33J8k6k12L51N9j64J77
5002A47j65o8O8pr2K54N4p0k59K63k75K65k49O2KQ4o5m0j11K24jr3Q4j89lR2m9
5029a37N5j56K17j20K5J85j57Q5L4O9m0n8j09K45k09K5J45p6k31L30l31J65j14
5052a58K24j25J3j85J11oo5K14Pl4j10L29m3k40J60k19Q9j1m6L88j60k9J31m73
5076b38Q5M7J65l84L70J1j84K9j5K8J6k2L4L3K56l67K95J4j32J38k9j08r2O7O9
5101H6j6L3k9P3k97K75Qj4p7l7J05J86j69P1k06j57J93j49M9K27j79k66L66j27
5125e1J20J40l38M4O9J0O2ML1j95p4K64j7K4L0j87Q1po6J66k02J15j7k26K8K57
5151F5K29j84j33r6K84j66j7J08M8M8l22K27j01j29Q6J29j04r9J51J40k16L8K57
$$ plain form
4978 -6 50 24 250 63 37 -83 -211 87 91 21 24 -235 -59 210 38 177 -56 -38 -64 -276 75 134 -30 147
5002 147 -18 -86 -18 -25 -117 137 191 121 -138 125 -150 115 -134 -72 -70 14 -51 -91 -202 22 21 -72 12 -177 -180 -88 -137
5029 -137 -82 -238 -21 -141 -116 69 -88 -3 31 100 60 2 -107 138 -71 -46 99 23 -208 122 -209 -44 -158
5052 -158 66 -59 -46 -231 -120 -126 -191 23 30 -4 -114 215 172 -68 92 -127 -38 -49 -95 293 133 104 235 -238
5076 -238 -153 -106 59 -325 45 56 -128 -99 -114 -86 -70 -92 -58 -25 231 -136 159 173 41 179 150 42 -50 17 86
5101 86 70 103 74 147 -150 125 133 119 42 5 110 296 127 198 -8 -165 28 -121 -72 155 -24 -290 76 -51
5125 -51 69 209 -129 -85 -16 -6 56 60 91 -104 -178 86 69 93 123 -64 17 10 -56 110 -92 23 6 -220 -192 65
5151 65 294 110 -23 -119 165 -1 -18 90 138 186 -136 91 -10 -139 -53 76 -28 -127 24 164 -52 -14 243
5174B43k76j36L56k46K32n5k5k27K7L19m42J73K1j25O09m42j8k5Q1l6j00J44K55
5197C07j49k31N3j00O6k5O3L00m83L26j52k6J1J6P0J77l2k91q6K67o8k63J69o0
5221a41P3q0J52N5O0k73J45L3K01p1l01J90k61L68j46J58k16l2qj67M79k36j06
5244a24M62k47m08O8J98L40j45k42Ml8O2J35k65L64j65J64k03J24q4m3JJ91k90
5267a41L9L61l19K08l7k3N3Ln6j88J77K45l81O8l5P4j60K8L2o7O9q5K34O5p3j41
5293e0J10pL1l25J70K21m09K31LJ3q1j7K97j68n0N5J49j23J66l24J66j49q2M10
5317B37n07K90j88j7J31o9j4L7K79j89J03k42L8K43k0k49K35j80o9M24l69J51
5339E5j48Q3j56n3K11j77J97K8p4K9k04J80j17J11J04j49n2L03l52K32Jk04K62
$$ plain form
5174 243 -33 -169 187 -59 173 118 93 -134 -107 212 -230 -57 -36 -161 448 6 -12 -37 44 8 -92 52 307
5197 307 158 -73 -20 -120 -54 -79 -16 284 -199 127 -25 -51 -40 -24 46 223 191 -100 -186 81 13 -250 -81 -141
5221 -141 -68 -148 4 59 119 -154 -9 24 225 154 -147 43 -218 150 4 162 -54 -86 -94 -261 218 -18 -124
5244 -124 338 91 -317 -249 -51 289 144 -98 -94 -132 -70 65 -200 164 -1 163 -40 84 0 -43 -42 149 -141
5267 -141 -102 259 -60 148 111 88 141 144 88 -100 77 322 -59 9 -26 48 -112 -84 -52 -119 -50 -135 99 164 91 -50
5293 -50 60 53 84 -241 -71 150 -259 -28 -25 -12 -93 -110 187 19 -31 24 173 50 216 -108 58 -91 -173 237
5317 237 -270 20 -168 -185 -54 -123 -137 -100 179 -10 93 -149 -111 132 112 -137 98 -82 -151 273 -96 55
5339 55 -93 -10 -166 -219 -8 -185 12 40 -34 -5 -209 -29 -146 -35 69 -80 -132 171 -181 51 52 -152 110
5362A10k41J14Q6k60P8R2J31j87q2K09k14m4J57J58j45j08P3K7K72k41l3J67j86
5385f7o2K3n2J68Q9k43J98Qj98J92J0l18J28kj5L14Q8m89J12m4L13J8j28q5j91
5410b33O9J66k67J94M8J61j81j30K33L1k93L85l06J14j72K3K57j54N8k31L45k05
5432h8J68l81K31k95M07j67R3O5j3K05j82n4o8J35j95L65j82r8K6Q3l1j51mP1
5456f0J61j43J09j82J56Opp3J60l22K60r7J56k59P6j9O4Q2K2K9l2l5k22KQ2J00
5482A4M8j29R3o2o7j71K52m4p4K86j9J28l46M3P0p9L24k06J34k67L0K18j42j2
5506B2K01l10J88N8k22m8M9K36m11K07N5M7k51M52k07j20J44K8k83J67j13n5L19
5529A53p9j40j05K32p1k41K05J75M5l52M34k29k70K07j74K31p9o0K03j86J35L
$$ plain form
5362 110 -131 -17 69 -191 -113 -21 110 -77 -159 50 -164 -208 -51 107 -38 -146 -73 -46 226 -15 -48 119 -67
5385 -67 -129 -106 -158 10 99 -144 54 62 -136 56 66 -252 -124 -126 -141 173 261 -228 -116 -160 153 171 43 -42 -233
5410 -233 -164 2 -265 -71 -23 138 -43 -173 60 91 -202 183 -123 -9 -181 -158 99 -55 3 -228 117 -88
5432 -88 80 -301 -70 -365 42 -125 -32 33 20 225 43 -11 -79 56 -139 226 44 -54 -28 55 24 -127 -131 -60
5456 -60 101 -42 67 -115 41 47 40 -33 127 -195 65 -32 124 -135 -59 -78 -14 68 90 119 87 52 -170 -168 -86 14
5482 14 62 -67 26 -36 -103 -274 -22 -66 -140 146 127 255 -91 -48 22 -57 267 61 195 -72 -42 176 34 22
5506 22 223 -87 101 159 -63 -111 -62 174 -237 -30 25 72 -179 273 66 -54 90 118 -165 2 -111 -166 153
5529 153 74 -66 -171 61 -10 -251 -46 129 174 -178 256 27 -243 -36 -210 21 -58 -118 85 -101 34 37
5551C7M4k1J73j02Oj9P1o4l08J82kj12J04J70m8l09J39j4J23O9Pj86jL67m97J53
5577c8k89M34n6p0Q1q9M6j10J66k80R2J83o4o3J82k81K7J84M2j40j99J48j19P9
5601a34L06K24m15j48M17l2k34J01l9k50N24j49k58K7K3Q7q6L47l53J4K90j06
5623A56J42l80K12n3j15O6k06j05M52l23K90k85L35j61j28L77j98j74j55K11K
5644d0o1K32p8J16j72m3NN4J23j78K20j17r5p8K80l68M4J93K01J3k34p7Q2j4N5
5669F3J20k22K0k6j01m2M08M9m71J91J26l34R1K86pp1k51O0n6R9K09l64N1j15
5693b87J14J91j7Q0Q0p8k30P0J36L0l6p6N4l4k2j06J75J82j68J05o8J1j10j5L7
5718A8J40k30m8K10k59K35o8R4j06j54j01J59J40j84oK83k75K01J88j62j63J7
$$ plain form
5551 37 81 60 233 131 137 118 189 125 -183 -1 -3 -115 -11 159 111 -198 -59 -73 50 119 126 -60 -61 306 -191 -38
5577 -38 -327 107 51 -19 62 -27 19 -91 75 -205 -113 70 6 -57 125 -156 -129 55 97 -43 -242 -94 -213 -134
5601 -134 172 396 -19 -167 250 218 -16 85 46 -204 320 171 -87 -60 -37 50 -36 311 -42 -28 262 156
5623 156 298 -82 130 77 -38 28 -178 -283 169 -154 136 -149 186 25 -103 274 76 -98 -253 -42 -40
5644 -40 -101 131 53 169 -3 -46 -41 13 136 -42 178 61 -34 -112 168 -200 -156 37 238 251 17 -60 22 8 63
5669 63 183 -39 -19 -45 -146 -188 220 269 -202 -11 115 -219 -128 158 151 80 -171 -111 -167 -68 141 -223 -172 -287
5693 -287 -173 18 1 81 161 83 -147 -77 59 89 53 -23 31 -3 -25 -131 44 226 58 163 95 106 -4 -19 18
5718 18 158 -72 -120 90 -169 66 -2 92 -14 -168 -269 -110 30 -154 -160 123 -152 49 237 75 -88 -71
5740g1J35j96Q3K9q7K14M7k78J36j06J88j7k51j51K99l8j56L46O9j94j7k27L02
5763E9j8j31j49L31o8l0j4Jk36K38P0j66R4j34N6k44K57K51l42L32m73K95O7k14
5787a68K4Q8R7m8J37P0j97p3K2J34K9j61J35l60K97k30N6K76l3J2k41j1L16k78
5811a07j51K37r8J43m7N1p0J74J8k94K52J00r8k17L60k76q0K02k8l2J5j11k4K38
5835A57j11J23p7j07J00k13j7J91j13J37j11K44k11M2J30O8k46j65K71O8o4m5
5857E1j43R5j16j93K32M2J90l23M33%k97q3P0j38J07Q9J09k75L10J2k92L6l4R9
5881a9K29O2m35j88M42O7j23J26j25L5J14r1k01K10j46R5j54M10k95J93l34K26
5903I8q8j20J08l10K23jL8J01j71P6J8l52J88R3q1J82k34K32L1j75K12K5Q1j0
$$ plain form
5740 -71 64 -132 -49 -20 -107 107 154 -124 12 -94 94 77 -174 -325 -26 -64 -220 126 195 1 -16 -243 59
5763 59 41 -90 -239 92 24 -6 -20 -19 -255 -17 53 -113 -19 -153 -97 -341 -84 167 -175 157 -316 -21 46 -168
5787 -168 -144 -56 41 -7 130 200 3 -70 -48 86 115 -46 89 -271 26 -204 -148 128 95 107 -134 -145 171 -107
5811 -107 -258 -21 -119 24 -23 28 -42 132 150 -144 108 208 110 -107 253 -23 -103 99 71 39 54 -57 -81 157
5835 157 46 169 92 -15 85 -128 -145 46 -67 70 -41 203 -8 34 164 232 -14 -179 92 160 96 51
5857 51 -92 3 -113 -306 -74 -32 158 -165 268 268 -29 -112 -42 -180 -73 16 125 -150 160 172 -120 -84 -118 -19
5881 -19 210 272 -163 -351 91 158 35 161 36 71 185 94 -107 103 -43 52 -102 308 13 206 -128 98
5903 98 10 -110 -2 -312 -89 -90 -52 49 -122 -46 -28 -380 -192 -99 -180 2 -232 0 31 -144 68 93 174 164
5927A64j15j06L6J05o9J75j80J00M0p0p9j65KK56l27J78k00L19K4J21l98L25P2
5950B08m04K24l5lJ38j82P6j6R4j10O8L9P5k20m17L84J4J44j61q7L04k32lN4M6
5975bk81J43K58k08M2p5J89K01l32K2R0j32K03j59K96k00J74m22K50k03J98M6
5997I8j34j24J02J3j76K04j89R8P9K37j80m5j6j06L36k0k39o2P5J11J65j80J97
6020B44l55j36P8j4J50m5L3N9J89m67N5J34K85Rk70o5q0K17j17j5J46M6q8m6P0
6045A7m3o6L0l3J54r8J60j79J73j06j34J11N7Pr0J11J28N2j43j60J08r8LK4r5
6070a10Q2k2L6k4k0J64qj57N2r6O5R6p5l1K40k2l42K08j27Q1J27q5l9J36j52j04
6096a27o5J39J33J78j78j55Q8J8K03l88J98%j55o9L33j88j7J23k8K15l45J63k25
$$ plain form
5927 164 49 -57 -21 84 15 190 10 110 150 80 1 -164 -162 94 -233 -55 -255 64 88 209 -189 136 208
5950 208 -196 28 -7 -10 128 -54 22 6 100 -10 58 97 172 -48 -465 -81 -67 77 -84 -171 133 -99 -102 -48 -2
5975 -2 -283 -140 118 -90 -48 -123 66 267 -65 -43 47 -85 118 -41 255 55 229 -193 57 -146 52 98
5997 98 -36 -160 -58 -45 -221 -17 -206 -108 -29 208 28 -17 -33 -139 197 177 -62 -124 -49 62 227 47 244
6020 244 -111 -247 -169 -183 -33 -78 -45 14 203 -264 -209 -75 210 219 -51 -116 -196 21 -96 -111 35 81 -7 -53 17
6045 17 -26 -92 -62 -95 59 -39 121 -58 115 9 -125 -14 43 50 -40 71 199 251 108 -52 56 -42 -39 -15 -110
6070 -110 -28 -50 -14 -38 -58 106 98 -59 -7 -103 -38 58 -17 -48 192 170 -172 36 -91 -10 117 32 -7 129 -23 -127
6096 -127 -192 -53 80 258 80 -75 13 31 234 -154 44 44 -111 -180 153 -35 -52 71 43 258 -87 76 -149
6119a49J48k54L3P6L46j35rJ78l74K54K7k11k41J74K07k33J65J39l9n05K41R2
6141g0l2K40j30LK6qJ4J98j73n9O5Q8o5j79M8o3J56j14K3K70J5l25pK21N5j54
6167D3jq6k89K30J50n9m7J20M9j54n3R3j83J68n0P8l8l7j00J80q5J56J2j92J2
6192h3J79j01m3NpJ96j0j45o6PR7k47k6M37j75Q7l07p1K41p5L73l76O7J43k19
6217a19J57j8j7N3j62J81M6j64m3j42K98O1j76J87j83J49l8o3j42j98K95k00J69
6240f9M1K1m4J23j23P6l15R4R9j70M24k52J78l0N0p1M8j29l87O06j22q5k5m7J47
6265C8M6j39O0q2J99j56k34M42l21l7J55l6K8Q4p3k8m1J87q9J37m27L01l7j48
6289a71K27Lk20J19r8J70j29K1J08J2J30l28M5K72k16l4J66k96R0K83j32j17M99
$$ plain form
6119 -149 -1 -255 -222 -146 200 65 56 234 -140 114 141 -70 -311 -137 70 -163 2 141 102 -403 -162 -70
6141 -70 -102 138 8 11 37 29 43 241 68 9 74 162 97 -82 -34 -97 59 -55 -32 238 253 -72 -79 142 197 43
6167 43 42 -44 -333 -103 47 -12 -59 61 110 -44 -97 -4 -187 -19 -69 9 -29 -66 -166 14 -71 85 97 -95 -83
6192 -83 96 -5 -48 -43 -50 146 136 -9 -75 -68 29 -218 -244 193 18 105 -202 -273 -32 -107 266 -110 -43 100 -119
6217 -119 38 20 3 56 -106 75 121 -43 -86 -228 70 131 -45 142 -41 108 70 7 -135 -333 -38 -238 -69
6240 -69 -28 -7 -51 72 -51 25 -290 -196 -97 -267 157 -95 83 53 103 32 80 -49 -436 170 48 -37 -62 -109 38
6265 38 84 -55 5 -77 122 -34 -268 174 -147 -184 -29 -65 -37 47 -26 -54 -95 92 3 140 -287 14 -23 -171
6289 -171 56 59 -161 -42 -140 30 -99 -78 30 42 172 -156 -111 161 -55 -89 77 -219 -129 154 22 -95 404
6312D04m24J54q7L2p7J11l10r4L20o6kk01K42R7j33J00o5j43J64j24J34N2o8j10
6336i4J20M8qj43M8P3p4K1P5p7Q3K23j67O4j70J70j83J8j37j35O9K83o1j34OJ57
6362G5j90J47o4K3J35o7K97m20k10J88L8O8k9j48q4J29J9j9K36l30J16O5K56j76
6386E5J63k27J9j46l3M66j60j29J13MJ65l8m56M80m29K15p8r6J68j52L34k47K44
6409B35q2j65j20L36j10l4o9K1Q1L1k08K17l39K33n5M2m4J35j19P8n9or1K78L4
6434B20l18K39K9j05k48K57j92J49Q8j76O9j53K9k6J00N8j52l3J93J33j32L07
6456C36k21j93R9K2k18M4L8L12k0j72j19J43NJ01r3l7j7m2l8k7J0J08J85k22Q7
6481G1J49j70l6NM3K7J6l10K02L6L31j29m23N7J01p1J28k35J73O8n8J45r0kMj65
$$ plain form
6312 404 -20 134 47 79 2 113 -197 -291 29 -37 -39 -240 2 99 -34 66 1 -142 22 -102 32 84 16 -94
6336 -94 26 74 66 -77 -29 44 -30 -9 66 -11 72 295 128 192 22 192 9 27 -110 -245 -176 107 46 -88 -82 75
6362 75 -115 32 -32 -9 126 59 356 -64 -274 -86 -48 20 -9 -157 -241 -112 -93 -112 124 -206 -90 -25 231 55
6386 55 218 -9 10 -136 -169 297 137 8 121 125 290 252 -204 276 -153 62 -16 -112 56 -96 238 -9 235
6409 235 153 -12 -132 204 94 60 -9 12 93 124 -84 133 -206 27 -28 14 -30 105 -14 64 5 -1 -92 186 220
6434 220 -98 141 170 65 -183 74 -118 31 119 -57 12 -141 -112 -138 -38 20 -132 -165 28 161 29 336
6456 336 115 -78 21 43 -175 -131 -93 219 199 27 -92 51 56 157 64 27 10 -32 -70 -97 -87 21 206 -16 71
6481 71 220 50 14 19 62 89 105 -205 -3 33 364 235 -188 -131 -30 -101 27 -208 -35 33 -25 120 30 28 32 -133
6507a33J77k71M31k44J6K8J1QL1l16K27n9o0j03K93o7J61j31M5K4n4m6J8l0K31
6532A87l62L40l00L1J39j18K58j10k44K06M4k85J11K32k03K53j62k58K14N0k03
6553a80J63l3j07L34j43p3r4J65k07J10J92J48k30k04ML11j69j27J56j34P3N3
6575Hq2j60L30k09j3R9j22K31j97l4J70k17J78L7KP5j24k5k86L60M0j0k29K42
6599F4L7j09Q3Mk52J31j05N2J37J24j40N7q3L2m6j18K75Kk11m2J03j16J78r3R4
6624E8j58J51l9Q7p7r1K41k77M3N5J24k38Q8j98L72m26L87j04K75j26l9j25n4
6647g1nj62M61k20k12L68j13K6p1L30n38K97j95m8L38l49K21j04m4j58J73J05
6669B9o0J02j18QK00k42l9O0o5L8J97o3J10j49j50K01k3oO5l63K52l3j58J38K66
$$ plain form
6507 -133 44 -227 204 -40 -24 4 15 23 54 -262 -35 -94 -154 -257 36 -31 130 -1 44 68 14 -32 -14 -44 187
6532 187 -175 165 -135 -104 35 -83 175 65 -179 27 71 -214 -103 129 -74 179 17 -241 -27 23 -180
6553 -180 -17 -50 -157 177 34 -39 -133 32 -175 -65 127 275 45 -159 -155 156 -13 -140 16 -118 -45 8
6575 8 -74 -234 96 -113 -126 -27 -149 82 -115 -149 21 -196 -18 19 21 96 -28 -53 -339 21 61 51 -178 64
6599 64 101 -8 75 79 -173 -42 -147 -95 42 166 26 83 0 32 -14 -132 143 145 -66 -108 -5 -121 57 -36 58
6624 58 -100 51 12 99 22 -69 172 -105 -62 -7 117 -121 -33 -231 141 -285 102 -2 273 147 108 -17 -71
6647 -71 -76 -238 223 3 -209 159 46 72 1 331 -207 90 -105 -153 185 -164 57 -47 -91 -249 -76 29
6669 29 -31 71 -47 -39 161 -81 -120 -60 -125 -87 110 47 157 8 -142 59 36 30 95 -268 -16 -49 -207 -69 197
6694A97K1k38k17J53L97n23K71K6R8j15J02k6K48m47J60n0j57R1k0J62k1j80R8
6717C0P8j76m4K42k1j72P0K08l9k9l31RO8j2R3n6QL82k82j7o7j74J23J77r9J60
6743A29j8q5l6p9P0k20M65r5k20m8M90m64o8J90J86l85J79R5j33N6K62k29j35
6766i3L18l92J25j63J73J93j61LnR1k89J16J79o4rq2J15P5k97J40r6J58L2j03
6790c6J26k24J88k63L18j79Q1R3k79J7K31O5k59O8K40k44K61l59L39j92J04j15
6812a9j34J07J4R8L6k76K51J1j48O0r7n8N6M3K07k80J06o6J9J89l58J72j45K34
6836B2j96O5J26K3M8rj06J16k15M0L0K13j81j02k17K56N3J08l8j37J35n0j47N9
6860a04K60J6J6j92q4O4r5j25J38L08k06k8J63Nk14J46Jj58Mj21L67j19r0J30
$$ plain form
6694 197 218 -20 -237 -84 313 -210 61 87 185 70 172 146 394 -53 107 57 -100 -9 -29 133 112 -68 30
6717 30 108 -68 -112 130 109 -63 7 215 176 147 -184 -175 -107 -119 -26 -82 -74 308 26 9 -58 -232 -109 68 -31 129
6743 129 111 26 -10 -89 -19 -239 226 131 -89 -137 353 -111 -179 11 197 -188 -9 86 -47 9 271 42 -93
6766 -93 225 -167 -42 -205 -32 161 0 3 -2 89 -200 -84 95 31 22 -60 55 130 -167 -27 -123 35 67 -36
6790 -36 90 -134 54 -209 109 -70 11 104 -175 -158 73 138 -121 -53 187 -57 204 -155 184 -8 96 -19
6812 -19 -153 -46 -32 66 102 -174 77 88 -60 0 -97 -155 -99 -56 151 -129 -23 -89 -70 119 -239 -67 -212 22
6836 22 -174 -109 17 40 88 79 -27 89 -126 -86 -56 157 -24 -126 -343 -87 -34 74 36 -101 34 -16 -163 -104
6860 -104 156 172 188 -4 -88 -24 -119 -244 -106 202 -4 -32 131 136 -78 68 69 -89 -85 -206 161 42 -48 82
6884H2Ok52J17N8P4m3j12J41R4j97j23J08l0K73k54J23Oj99Q4O2O0j57K05j98
6908g2o4J18J16lj01K61j20j83J45J6N1Pk62J80l4N1R4K0k38o5oJ87k30L7L9R9
6934D3m8N0k15J25p8Q3J72l36J96K05o8j48k42L31J0j83J63j03N32m04j17N3l6
6957a5O6J89l29m3K85o1l9k4K6n1q5R9N7o5r7J66j65j65L28NJ09m42J69K69k21
6982c4M7q4J08M5o8pl4L5Q8p9K0k17L83j61j66J8O8L7n8j42M94k14L8n1J0p3k9
7009b6J83k08K05J73m01K09j34j85K08m5L02n38M86l98R1L87l35L4K53m13K08
7030E6P8j45J67r3L0j97j14J08J50LO0J5j05Mj01K14Pk12JJ38j70J42j15k26K26
7055g9N8K14j87l13M44j45R5M0k43j86N90l22J24j63K02P6k77K23j05P9l05K55
$$ plain form
6884 82 88 -164 -47 11 85 42 -70 71 165 -32 -155 -47 -77 196 -58 65 71 -128 -44 18 78 -79 126 -72
6908 -72 -136 -18 98 95 -6 255 135 -48 97 113 164 171 -91 89 55 106 200 220 -18 -83 -89 98 -132 -95 -56 43
6934 43 -5 45 -170 -45 -123 -40 132 -204 -8 197 129 -19 -261 70 80 -103 60 -43 489 85 -32 21 -15
6957 -15 51 240 -89 -132 153 92 53 29 55 4 -81 18 75 10 -87 79 -86 -251 77 82 191 -251 -82 187 -34
6982 -34 13 -71 37 82 14 7 -27 8 96 17 37 -180 203 42 -124 -106 -38 -1 -59 -201 293 79 117 66 76 3 -26
7009 -26 157 -51 154 327 -74 135 1 -184 24 -21 281 -257 229 -169 -78 309 -26 8 261 -152 56
7030 56 134 -11 156 63 93 -104 -218 -110 40 43 103 118 13 17 -84 130 137 -75 -74 64 -106 36 -79 -305 -79
7055 -79 -21 193 6 -307 137 -8 87 127 -116 -302 288 -34 90 -73 129 205 -72 151 46 125 -180 75
7077G5j04J7l9K4N6r1J14J56k60o6K99l3l90O8J6K3J12j35L70j26K0k87J46p8
7101a13K71j81k6K06j90n6k53L15p4L0j5J84j24J55k01k55K84j57J22K23K7J3
7123A85l24K33l42K80j11R1j43J53M3O0j35J26o6j25Q8K2rk4K07k18N3%J49l46
7147a53O3J98j2P7j96J27k74M1K9M26k80o0L5j70K8J50r9J39Np3j13P6J02p4j32
7172a40K06j80o6J70l56M54k35K64k34L76j22j13Rl4k19J77Q2O3k64L7J05J7J82
7195A79j63L2o7K5j35L0M1O5o9J19l1j94J88j00J29Oq9j6k09J01L32m16K05J0
7219b7j20L1J24km7l6L19l20kQ7k49L90k40J2J2n3j6q7K58j81K05p8M2k10KJ52
7245c4m9L11l36K01p3m0K34k66P8J49n14L44p1J20M0k3L34k07j33j76J24K06j
$$ plain form
7077 75 -29 -12 -51 -27 29 -62 52 208 -52 -118 181 148 -242 -174 -158 -135 -23 -158 212 86 106 -181 -35 -113
7101 -113 158 -23 -49 157 -33 -89 -342 -27 -101 -71 -86 98 -26 129 -72 -327 -43 -200 -78 145 172 185
7123 185 -139 94 -248 32 -79 12 -131 22 65 125 -10 116 50 -75 13 35 26 2 209 -9 44 44 193 -153
7147 -153 -90 108 96 173 -23 104 -170 -129 -100 326 46 -14 21 -149 -121 29 -70 69 74 1 -112 -36 66 -8 -140
7172 -140 66 -114 -180 -10 -366 88 -147 117 -117 259 137 24 33 -1 -220 -43 39 102 -162 -125 -20 -3 179
7195 179 16 48 -19 6 -129 -99 -58 7 -62 57 26 -168 20 -80 49 55 -34 -50 -259 -158 174 -242 -37 -27
7219 -27 -147 -116 8 6 -41 -77 242 -78 -80 7 -242 148 -92 -80 -68 -121 -137 -224 34 -147 58 -20 22 -188 -186 -34
7245 -34 -83 228 -108 93 20 -20 214 -52 26 175 -339 5 -66 54 94 71 405 198 65 -111 13 219 218
7268B18m96L37j9J8j78K71lO1J11k76J8Lr3j35M0M5J04j19L06l67J80j4J55M9
7292B16k85N7n9RL63l37J19J32j92j83K45l13L63k04j04r7L11K44l92K27J46j99
7314F7N9J5Onq8N0P7Jj81j93K05j93J7J81r4P3QL34l06J01q2k5j59j76L52j88
7340a44J83J90l45K87K5j47j10n8Q8J78k05j10J94K01l30K06j63q8K23j8j2k33
7362a88L33j68k3J78k09O8M6J51k94M40j16m07n5K91J53k32K08l50Q4J58J24j51
7384D1q9J44l45K27J28j53J39j99M12l14J66r7l9O5k23K05N7j36J78j66Q0k14
7406a33J08P7j07K17l78J89N9J8j49OJ69Q1k61J69q8K18l20L03l52P7j54K71r3
7429g3n7K71j44N8j61k3p6K98p8M7J01k56J02M1j44J04j17J47j13J84j49n4J77
$$ plain form
7268 218 -278 59 40 58 -120 151 148 209 320 44 62 65 -28 -163 -123 -78 26 -93 213 -154 26 12 167 216
7292 216 -69 -12 -71 -62 301 -36 83 215 23 -160 85 -228 135 -69 -173 -270 41 285 -107 120 266 67
7314 67 126 141 147 142 54 104 181 182 1 -192 13 -180 -163 18 -76 -3 5 339 33 134 52 27 -132 -308 44 -144
7340 -144 39 229 -116 171 196 49 -61 -119 -31 147 -58 -168 26 227 -103 103 -60 -148 75 57 45 -188
7362 -188 145 -23 -46 132 -77 -9 37 188 -106 334 218 -189 -244 47 200 -32 176 -174 -90 68 192 41
7384 41 -48 96 -249 -22 106 -47 92 -107 305 -9 157 60 21 86 -137 68 125 -11 167 1 81 -133
7406 -133 -25 52 -55 162 -216 -27 32 50 -99 -93 76 157 -104 65 -23 195 -125 178 -174 -97 -251 20 -73
7429 -73 -130 141 -3 55 -106 -129 -205 93 15 62 163 -93 9 50 -94 10 -107 40 -73 111 -38 -92 85
7452H5l51M24l67m1L91k4r2k02L5J41L7R1j25JJ00P4k76O4J82J7j97j65K71n4
7476A9J36j61k00K70j4m04M03j06O3J99j6j81J12l51L9J04J41m8r4j09L27j40
7498a1M5J95l23Q1j75nJ49J03J44m04L37k82p2L3O1L57k63N3k6J3j82J57J33k3
7522I5m6j97J51m9j08J80j85K09k93K68o6J3J2L15k94M4L9R6l4j45q5r2p9J46
7546a05M8J78J0n1k51j56M93j34kK0k59J65K69j27o0J24j57J13j23R5j2j72r0
7569a84P4K58k90J57J03j7j2P0j76J82k44K74k64M3L73n05K26j07Q9j15J11j59
7591a13J09k37J37K87J57k52j68J96M3k21K8K48l9k56K78k91k4J02q6K37qj82
7613e5k1J13Q2j54j48K19k2q2J07J72q6p9j78K89l40J33J8k2p6K55N3l61L83l54
$$ plain form
7452 85 -266 158 -209 -250 141 117 25 -177 -142 -1 36 127 2 3 103 177 -99 -35 147 164 -33 -198 73 19
7476 19 155 -6 -206 64 50 -354 49 -57 6 205 189 8 120 -231 -192 -88 53 5 -89 -198 129 -11
7498 -11 34 229 -94 -13 -188 -193 -44 59 203 -201 136 -146 -218 -185 -124 233 -30 23 -3 10 -172 -15 118 95
7522 95 49 -148 3 -46 -154 26 -159 50 -243 25 -41 -28 -16 299 5 49 88 184 150 5 -80 -172 -251 -105
7546 -105 -57 121 131 80 -171 -327 166 32 30 50 -209 -44 225 98 38 162 5 118 -5 90 78 -94 -184
7569 -184 -110 148 -142 15 118 101 89 159 -17 165 -79 195 -69 -26 347 -158 68 -39 50 -65 46 -113
7591 -113 -4 -241 -104 183 340 88 -80 116 159 -62 -34 214 175 -81 197 -94 -118 -16 -102 135 127 -55
7613 -55 -76 37 119 -35 -183 36 14 -68 39 211 125 46 -132 157 -183 -50 -32 -54 -130 125 178 -183 200 -154
7637a54K68p9j0p8k7j12K21o3M5J73m7k00n0J42j59K64l34K1J20Q0q7J4J5o9K24
7662A18P8m08Q4m7L56j74K32j02m7l10K19j82L24j78k38J68J32LN5j80J6Q4M2
7685D5j60J57k0k0N5P4j46M0j29K03L4ok14K01J37l86L42j75j24N0n1o2L45k06
7709a6K4M5O9j44k3j85K14L11o43K17J63J30k99k8K78j20J29o3K6j40Q1m2n6%
7733g2K18j3l55L00l45N55m03M4l2J88r5R6Q2k69L29l51L25o6j80n0r1K88Q4j14
7757G3O5j38J82k31q8J06j04k54L41K45m11K23j00K37k25J26l9J0R4M5l13J38
7779a8J35L2J11j46q6l7J16p6Qj80K92q5j31J31j99J6J29m9j3p0M3R3k4J09n4
7804D7l2Nk16L41k12J53M6j11k96J04K67l8p6K25j80n0n4lK61k88J23l8J93k76
$$ plain form
7637 -154 114 35 25 -53 -80 -192 29 -34 11 184 137 -63 -113 29 -130 134 -200 -179 -59 21 -66 -52 -37 -106 118
7662 118 196 -212 -128 -175 181 7 239 137 90 -220 -1 -183 141 -37 -275 -107 25 28 83 -97 -81 3 45
7685 45 -115 42 22 2 57 131 -15 25 -104 99 133 127 -87 114 251 -135 207 32 -92 -42 -93 -155 190 -16
7709 -16 8 53 122 -22 -45 -230 -16 295 -348 -131 32 162 -137 -165 113 -7 122 59 85 -55 26 -16 -72 -72
7733 -72 146 133 -222 78 -267 288 -115 -71 -103 85 -10 86 168 -101 228 -123 202 136 -44 -94 -185 103 187 73
7757 73 138 0 182 -49 -137 -31 -135 -389 -48 197 -214 9 -91 146 -79 47 8 18 112 157 -156 -18
7779 -18 117 149 260 114 28 -9 107 31 39 -141 151 66 -65 66 -133 -117 12 -37 -50 -120 -77 16 -8 101 47
7804 47 15 20 -196 145 -67 86 132 21 -275 -171 96 58 -18 207 27 -23 -77 -80 181 -107 16 -22 171 -105
7828a05J17j36R7l9R1j60m9K53k19K75j18p2m1K55k02Rk7j01K05j2J6j36K7J52
7852H0j07Q9r1j9J66k72J21j53J43J50j16K9l6o2O8q9J29k6K05l43N2L51j97k07
7876a35J02p9L31j58J48L5k46j12L47k47K19k31K01n0l31PL20%j10j9j05KK90
7899A79m31N95o53M05j11J58k15P9k3n9J64M7kj78J16j89Q2P4j53J51m8lk01J62
7923e4K07k79L39k72l4J00Jm7q2K02K6k17J94j39k3j78K47q7J02O1p5lP6j14K60
7948B11k36n8L3J01m1J61n7l26K43j87P6K12j50n9K76j73J81k06L4k53K20M3k85
7971b40J74L86m42P6k08J35p6J66j77J03R2J87m94O7J10K61j20O3J00r1k40K5
7993a43P0K03l06j08L02Qj08MJ64Kl7J88j12j77k3r0J80k06L14j12K79k45k0K73
$$ plain form
7828 -105 12 -124 -27 -66 25 -135 -184 69 -150 125 7 -65 -106 149 -53 -44 -71 -172 33 21 37 -99 -72 80
7852 80 -27 62 -29 -48 118 -154 -33 -186 -43 107 -9 20 -16 -78 -10 -99 30 4 209 -134 -82 269 72 -135
7876 -135 -33 -112 219 61 209 244 -2 -114 233 -14 205 -26 175 125 -206 -199 121 121 11 -8 -113 -111 179
7899 179 -252 343 -310 95 -16 142 -73 6 -17 -76 88 135 133 -45 71 -118 -36 38 -115 36 -12 -15 -216 -54
7923 -54 153 -126 213 -59 -93 7 8 -39 -121 81 107 -110 84 -55 -78 -256 -9 -96 6 67 -8 -11 65 -49 211
7948 211 -25 -83 -50 51 10 171 114 -212 31 -156 -80 132 -18 -77 199 26 207 1 35 -218 2 45 -240
7971 -240 -66 320 -122 -46 -254 -119 -195 -29 -206 -103 -11 176 -318 -251 -141 120 0 63 163 72 -168 -143
7993 -143 -73 130 -176 -284 18 26 -82 -78 86 88 51 239 127 -50 -73 -163 17 -189 125 13 292 47 27 300
8017C00j18n4J1k71j05K51n6%K56k43N6j79M13k39j24J43o2p9j16L62k6O9j79
8040A0j52J12K29l20K9o9J4K73k84Q0K26m6k27K05j95m1K15k4k0l77N24j22j91
8063a51L49j19m7j8l5K7o5K2o9n0J01J70r2N0K49l35k37J71K0J63n9r6J47j23
8087b7j68j4M36l04N5j45m1J5K11L0J09k21k5J72M9j06k85J76r3J05L5J06N3m4
8111G9p7K40k51p2K30k62nK21l5r3k21J07J52J27j33L1n2M8j3j29k7K46j83K9
8135d3m7K34q4mJ05k48j30J55o4K12k33K48L7%J09j41k34J38qj12N1j10rq3J64
8160i7J09J15j52j83Q5J48o8J5j03J78p8q1L49m05J54N7QJ01q8K1k25K3K82k42
8184g7n3K43k98K80m32M08K45
$$ plain form
8017 300 182 128 139 -132 -237 14 -42 -42 214 -29 27 -152 261 22 -102 41 -21 -100 -216 146 120 189 10
8040 10 -142 -30 199 -121 -92 -161 -147 126 -158 -78 148 102 -125 80 -115 -156 59 35 15 -362 162 40 -151
8063 -151 198 79 32 14 -21 6 -59 -37 -106 -156 -55 115 23 73 322 -13 -250 -79 -59 104 45 -51 96 -27
8087 -27 -195 -209 227 -77 -22 -167 -208 -193 18 48 157 -64 -89 83 132 26 -259 -83 -176 -71 -36 70 123 79
8111 79 2 242 -9 -81 149 -113 -118 103 68 -25 -246 -139 13 140 7 38 -14 34 21 -108 -135 111 -72 -43
8135 -43 -90 144 60 56 161 -87 -217 -62 -126 86 -147 101 138 138 247 106 -128 10 2 -110 -59 -169 -178 -261 -97
8160 -97 12 127 -25 -208 -123 25 -43 -28 -131 47 -31 -112 237 -168 -14 43 51 152 64 85 -140 -117 165 -77
8184 -77 -130 113 -185 95 -337 71 316
8191C16
$$ Imaginary data points
##PAGE= N=2
##DATA TABLE= (X++(I..I)), XYDATA
0@%%%%%%%%%%%%%%%lJ1j6J6j6J6k4L2l2M0m8N4o2P2q3R1j04J20j36J55j76J97
37A04k21K48k78L10l44L81m22M68n18N70o28O94p64Q42r27J021j127J244j375
56g22J525j698J896k126K400k736L153l689M411n432P008r792J6188n8122l3256
71h0992M9427J5750O8717m896n0861L6097Q5198m8910p0908N6214N0376r0846
83A4366o2763M4810J3846m0344K4986K7768n7173m0665M0826M575m4429J4017
95f0180L9111k8255j1626O6695L5370k9759J5567M7923k0173m1066K1414J5153
107E0174l4042m526K8222k1714l4387K3802J5922m5710k5532K5346o308l6884
119f5637R306L0119q348m48L9438J2971k0497J0720K5286j3075j2783K2329M416
$$ plain form
0 0 0 0 0 0 0 0 0 0 0 0 0 0 0 0 0 -3 8 -8 8 -8 8 -16 16 -16 24 -24 30 -32 40 -43 48 -56 64 -72 83 -93 104
37 104 -117 131 -147 163 -181 200 -222 246 -272 298 -330 364 -400 442 -485 536 -591 653 -722
56 -722 803 -895 1001 -1125 1275 -1461 1692 -1997 2414 -3018 3990 -5802 10386 -47736 -80992
71 -80992 -31565 -15815 52902 48006 -2855 33242 118440 69530 -1378 54836 105212 14366
83 14366 -48397 -3587 10259 -30085 -5099 22669 -34504 -75169 -34343 -29768 -74197 -60180
95 -60180 -21069 -49324 -60950 5745 41115 11356 26923 74846 54673 13607 35021 50174
107 50174 16132 11606 39828 18114 -16273 7529 23451 -22259 -47791 -22445 -28753 -65637
119 -65637 -56331 -26212 -34560 -35008 4430 17401 -3096 7624 32910 19835 7052 29381 33797
132C3797k5305N687K4553j4946k1956J4452L944l4253j6544J3952m762j5770J2214
145b4937J1716j3035K092K4835J460j4220J0641J3805j2224m064J8962O766r241
158A2556P435J0607j3028j0703R261k642k0973m842P706q155r569J0702O669j0005
172a4981p63J0292l448p657Q315Q722n863J570J3581K991l800Q207O697j0163
186A3700p036N406k892j1301L66N158o755n870N500J14q241L36M056n959m335
201a7753P153N626j858M711R661M24k706N629L559n745k257L027k507n227K356
216D093K637m260k712J689l870p258j0K052m023k368N071L465p40M072N617k70
232C185j008L192N16l574P48M036j170j973K707J764l424k060P9l486m749l13
$$ plain form
132 33797 8492 14179 38732 23786 1830 16282 20226 -14027 -30571 -16619 -21381 -37151 -24937
145 -24937 -13221 -26256 -24164 671 2131 -12089 -1448 12357 133 -3931 15031 21797 12556
158 12556 19991 30598 17570 6867 16128 13486 -7487 -12329 -4623 -12778 -22347 -11645 -4976 -14981
172 -14981 -15744 -5452 -8900 -16557 -8242 480 -5383 -3813 9768 12759 8959 17166 23863 13700
186 13700 6664 12070 9178 -2123 -1757 3401 -3354 -9224 -3724 -3610 -11851 -11515 -7459 -13418 -17753
201 -17753 -10600 -4974 -6832 -2121 7540 7964 5258 10887 14446 8701 6444 9471 6964 1737 4093
216 4093 6730 2470 -242 1447 -2423 -9681 -9691 -7639 -11662 -14030 -8959 -5494 -6234 -2162 3455 3185
232 3185 2177 5369 5885 2311 3059 7095 5925 3952 6659 8423 4999 2939 3018 -468 -5217 -5530
248e530Q3k754O7L576J114j009K728K544j609j255J778L86r70J820K688q5L56
265C928K423N15k501p43m50k673l080j53O72j135lJ958j7r79J361l3j705p31J232
284b114K5q15K539K386K09K97J786m25j198p56j73j737j408J243J94q54P35J111
302A045p24j286Mn32j041k52O99k20M91K236P70k4P30M31m37j168r9q7n80K8O68
323F52k21M0O09M10j230q78l80m79q49J45R03L16J95J288K62j12L47j7n11m94
343dK87l07JK96O98N4k6j34j94p90m51m01m78n74P26M50K89K80Q97r1m91K52K10
366D99p60J39K35L38J37L91P95l50j92j15p22n93o73j12j92j14K16L20K08K99
386b46J91k38j57k9o3J18J64M49O39K32M20M11m38l09M4m62o95l38j1j60j62L77
$$ plain form
248 -5530 -5447 -8201 -8134 -4558 -3444 -4453 -1725 819 -790 -2045 -267 119 -851 969 3657 3572 3928
265 3928 6351 6866 4365 3622 3172 499 -2581 -2734 -2062 -3197 -3200 -1242 -1259 -2238 -877 -910 -2615 -3346 -2114
284 -2114 -2089 -2904 -365 2021 2230 2527 4313 3888 2690 1934 1761 24 -1384 -141 53 -801 -66 1045
302 1045 321 -965 -961 -1493 -2534 -2786 -2087 -2307 -1816 420 1190 1166 1896 2327 1890 722 623 536 -44 -16 652
323 652 431 471 1080 1490 260 -618 -998 -1477 -2326 -2181 -1278 -962 -767 521 783 671 1018 1001 490 -4
343 -4 283 -24 -23 273 971 1025 999 865 671 -119 -570 -971 -1449 -2023 -1297 -847 -558 -278 619 528 37 289 499
366 499 -261 -122 113 451 588 979 1774 1424 1232 1117 395 -198 -871 -983 -1175 -1289 -1073 -753 -545 -246
386 -246 -55 -293 -450 -479 -542 -424 -260 189 828 1060 1480 1891 1453 1144 1188 726 31 -307 -318 -478 -640 -263
408b63J22l59n2P9o52j91K44LJ00L72O70M37o2O67R6K15j56m05J8n03J70N5pk28
432C70k3k14n21q0j6n40l36L6J54Q7K93N95J57K82J91O9j61K67m0k99J63M25J81
455A040l20K23k81k52m13l79K8n43n4k15J39J23N14o2P5j05L02K66J43n34N85
476B80J73Q1J80J98r4n7j6l57k36m54K99k78k51J33K97Pj37j68J3J23J64l03L46
499e7k32J2N43J06K30R5j99J36l51L1k12j13j44j37j03L86j54J29o8Mj87k6J55
522a56nM2J77j8J17J48M51l50K25m51J04m11K47n41qK44R2m0j53K1K12k74r4L63
546e8j67J35j27L05K38NJ14J46l40J52m0l29k0o5J35pj6l9l28o4L9j04j74R6J2
571e01Q6k13L44K75J26J95K2j9n4N1j68J90j6r4K19l0J36k44n75L4j89N4j74j40
$$ plain form
408 -263 -141 -500 -552 -473 -1125 -1316 -1072 -1069 -969 -597 73 510 448 1115 1211 1426 1270 865 883 380 550 605 598 370
432 370 347 133 -388 -468 -484 -1024 -1360 -1324 -1170 -1083 -790 -195 -38 244 435 504 343 610 570 271 434 859 1040
455 1040 720 943 662 410 -3 -382 -354 -897 -951 -1166 -1027 -904 -390 -452 -377 -482 -180 86 229 -305 280
476 280 453 534 714 912 818 761 745 388 152 -302 -3 -281 -532 -399 -102 -95 -232 -400 -387 -264 -100 -403 -57
499 -57 -289 -277 266 372 602 697 498 634 283 314 102 -11 -155 -292 -395 -9 -163 -34 -102 -98 -285 -311 -156
522 -156 -161 -119 58 40 157 305 756 406 631 180 284 -127 120 -421 -429 -185 -93 -133 -286 -265 -53 -327 -421 -58
546 -58 -225 -90 -217 88 326 331 445 591 251 403 363 34 14 -51 84 77 61 22 -306 -370 -331 -435 -609 -513 -501
571 -501 -415 -628 -284 -9 117 312 334 315 261 312 144 334 318 224 443 413 549 305 -270 -236 -425 -371 -545 -685
595f85L08L1N7P0RJ58r0L05N7l79o9J75L88m42O04K92m55Q9o0M9m32J25m93J69
619b19J38j83J57L7lj59J9J76k73J65O0P1K59r1J5j35L14m49L28j34j90K22K1
642A46p1K62j95j12k8j32J99l84L61J85n29J05p4j77M30j63p0M42l62K51p0j81
664a67mL56k14M7j22L54k41r3j64K03J10j9k3l6J34k98J46J00k20L18L7k39p6
687a11L5Oj12J65R4j99q2J69l1m7Q8j37R0oP6j38K40l8N8o6l2N8O8q8L7J52n6
714A93l86l7K49k20J48N7m1q6M9j22K44j56J41j75N0J96j99K00K10k93k59P9L66
737B08%j48M0J35k23N7k32L63m06Q0J53k35J94j47q5j78M53k22k8K17q6R3Jk5
761b1o1L5k36L20M7J18j9j80j20R7j23k3J87R9k78L44k3j11j43q0N3n5Q6J33j32
$$ plain form
595 -685 -377 -346 -289 -219 -210 -52 -142 163 220 -159 -228 -53 335 -107 497 789 334 423 363 412 -20 105 -388 -219
619 -219 -81 -264 -107 -70 -73 -232 -213 -37 -310 -145 -85 -14 245 154 169 34 348 -101 227 93 -97 125 146
642 146 75 337 142 30 2 -130 69 -315 46 231 -298 -193 -267 -444 -14 -177 -247 195 -167 84 14 -167
664 -167 -171 185 -29 18 -104 250 9 -84 -248 -45 65 46 23 -13 121 -177 -31 69 -151 167 204 -35 -111
687 -111 -76 -70 -182 -17 77 -122 -204 -35 -66 -113 -25 -162 -72 -78 -2 -140 100 62 120 54 22 80 148 60 97 249 193
714 193 -193 -230 19 -201 -53 4 -37 -123 -74 -196 48 -108 33 -142 -92 104 -95 105 315 22 -237 -158 208
737 208 208 60 100 235 12 69 -163 200 -206 -126 27 -208 -14 -161 -246 -424 29 -193 -221 -4 -90 3 4 -21
761 -21 -82 -47 -283 37 84 202 183 3 -117 -20 -143 -166 21 120 -158 186 163 52 -91 -171 -118 -173 -87 46 -86
786h6j72J86K82k42K06j01J5j87J91k56K47j00J67k7j81K8J45l43K67o2k17K77
808C7p7m12L15J94j40Q5n6JK04j96M21k99o4R7J63j14M6J79k86R8m62K97M4J65
832B40r6J2j10Moj06r5l1K7j5M3p8n8J02K80j60O7j7j7N0l1Mj17O1L79k80l26
859b74J62K9L84m68J02pNJ04k80K35r1J70q4r4Q7oj00J67j48o0n4L1K82j37K21
884A76k23K73k99L15k10l3L4j11J25L19l28l1L3r4K02k32mJ21k27J11J83j91q5
907a76K31R1j62k15N3J52k50J77L9k5J35Mj3j41M2J84M2l18J45K18l01O4R2q4
931a6j82L07J35l19K50l37P5J76j72J86n5k4m11L57N0o2k65M31k11k03K99j3o9
954g3J89q9O8R6j68j18J08L5j20j8J72J74n38J59K10j73N4j50K35K9M9k66L01
$$ plain form
786 -86 -258 -72 210 -32 174 73 88 -99 92 -164 83 -17 150 123 -58 -30 115 -228 39 -23 -240 37
808 37 -40 -452 -137 57 -83 2 -54 -53 151 -45 376 77 13 110 273 159 205 384 98 196 -266 31 75 240
832 240 144 156 46 50 44 -62 -157 -188 -161 -176 -133 -211 -269 -167 113 -47 20 3 -14 36 5 9 -108 -47 332 52 -274
859 -274 -112 -83 301 -167 -65 -72 -67 37 -243 -8 -99 71 -13 -107 -20 -26 -126 41 -107 -167 -221 -190 92 -45 176
884 176 -47 226 -73 242 32 -1 33 -78 47 366 38 7 40 -54 148 -84 -88 33 -194 -83 100 -91 -176
907 -176 55 146 -16 -231 -178 -26 -276 -99 -60 -85 50 54 41 -100 -58 126 168 -150 -5 213 -88 -24 68 -16
931 -16 -198 109 244 -75 175 -162 -87 89 -83 103 48 24 -387 -30 20 -42 -307 124 -87 -290 9 -4 -73
954 -73 116 27 95 191 23 -95 13 48 -72 -90 82 256 -282 -123 87 -86 -32 -182 53 82 131 -135 166
977A66l9q9J45j40L3q4p1J30K8j2Q1k00j59O9L11j5j47k5r8K67j77L0o7J30j66
1002i9J00J00j03j0J92j69M2p7J19l6j75L05k46Jj24M71q9j19k04J53j79L13j92
1025b6K7K4l8%J23j75K31l59J90Q4k6j21J13k73oLK35J99m59M63l72K30J34j90
1049A1K05m94M14r7o5J80P4k16N0kj32J92J15k68K6J39n7j76J16K82n12K08k2
1072b9j57K7M07l6n4j61J40L3j88K3j1J72j60m0J08n9K48m86K69j7r2K36m4j17
1096A2j0M7j6j15J1J63o9J67j64j11K06k96J68J40k40J31Q9j24r3P6J1J15J3o5
1120D6K4k03K93q6j0p3o1M83m23K1l9j9J75k55J83N7o0k62J72l40M20k05K76J8
1144A32j98K11k48J42k50L30k59k02L58p2L61k76k28M03l85L39n37M80j37mN5
$$ plain form
977 166 127 38 183 43 76 -8 -79 51 79 67 148 -52 -211 -142 169 154 7 -18 -116 151 -26 4 -63 67 -99
1002 -99 1 101 -2 -12 180 11 53 -24 95 59 -116 189 -57 -56 -180 291 202 83 -121 32 -147 166 -26
1025 -26 1 25 -13 -13 110 -65 166 -193 -3 81 55 -66 47 -226 -232 -229 6 205 -254 209 -163 67 201 11
1049 11 216 -278 136 39 -26 154 228 12 62 60 -72 120 235 -33 -7 132 75 -101 15 297 -215 -7 -29
1072 -29 -186 -159 248 212 158 -3 137 170 -18 5 -6 166 6 -34 74 15 263 -223 46 29 -63 173 129 12
1096 12 2 49 33 -82 -71 92 23 190 26 -85 121 -175 -7 133 -107 24 113 -11 -104 -28 -17 98 111 46
1120 46 70 -133 160 74 64 -9 -70 413 -10 11 -28 -47 128 -127 56 113 53 -209 -37 -377 43 -162 114 132
1144 132 -66 145 -103 39 -211 119 -140 -342 16 -56 305 29 -199 204 -181 158 -379 101 -36 -40 15
1165A5j22J08k04K85J59j22Lr4j05K19j81K04j48Nj89N4m2o2K35M6o6k51L67j8
1189I6k66k7P2o5J90p0k4M6l54M07K13m73L07j00J49j58o7M37k07j75J59o9mp
1213A0mJ0j27R5L7R4o2q8qj4k4P6M4L0j02p3K9o2L60l46L61k06j5L3J45j43l2
1240A8j62J53q0L0R2j21J18j04n3K8K22q4k37J99K21l61J06J32j42NQj58j2Q2
1264a00J15kk3k33J78o4K40r6J79k39o4k37K60O3J48j73l4K37j98J80O6j94l6
1287b7o3J03k2j34O3lK75n20J96J7K58J09J8k59l32K78O4p0L39j78m43K48j41
1310b24J76Q4%pK09j42m9o8nl5O2r4j20J96J06j94J89o5j36J6R4k9L97n55K24
1335C0j27J44J09j06l8k0j22J05Jp6J33J55l95L58l21K9M42l74K01n6n9j02K61
$$ plain form
1165 15 -107 1 -203 82 241 119 122 28 -77 142 -39 165 17 22 -167 -113 -155 -217 18 64 -2 -253 114 96
1189 96 -170 -197 -125 -190 0 -70 -94 -48 -402 5 218 -255 52 -48 101 -57 -124 313 106 -69 90 21 17 10
1213 10 6 16 -111 -16 21 115 53 -35 -43 -57 -81 -5 39 69 -33 -106 -77 -139 221 -125 236 30 15 48 193 50 18
1240 18 -144 9 -71 -41 51 -70 48 -56 -109 -81 141 57 -180 19 240 -121 -15 117 -25 -20 -12 -170 -182 -100
1264 -100 15 13 -10 -243 -65 -129 111 15 194 -45 -109 -346 -86 -23 125 -48 -82 155 -43 137 203 9 -27
1287 -27 -90 13 -9 -143 -80 -83 192 -328 -132 -115 143 252 270 11 -321 -43 21 -49 290 112 -331 -83 -224
1310 -224 -48 36 36 29 238 96 47 -21 -26 -61 1 -93 -213 -17 89 -105 84 19 -117 -101 -7 -36 361 -194 30
1335 30 -97 47 156 50 12 -8 -130 -25 -24 -100 33 188 -207 151 -170 -141 301 -73 128 72 13 -89 172
1358A72k14P2k8j80K02K35m30J88K34q6k68J17j48J60J21J20m35J02Q9j25K29
1379A27k29r4JJ74l2K11l26L33p8j86J43j51J76l06L11M1j15Q7J17o6k89mL36
1402A81o5k67K22j36q4L40k55M7o9j09K76r4j18L17j53r7P8M6j34J79N6J0N4m55
1426b30K74k65J31J00pJ09q5j64J47R3j72M9Q1p9o2j01M5K38j29J9m9J29j04J5
1450a7J95l25J80j47j25L67j75J43j47J38j7k23J30l3Or3L27k47J36j64o9J37
1472b3NK34j92j10J65N4j75R3q4RR8k47L10k2k34K20M8l22L54l66O8K03K6l03
1496a91L06l54rL63j50J77j97K35k50J04j14K25m21J69P5O2K9j53J64l8k6o7q2
1519a43J4j7M13n58J66PK25p3j19P0q4NqK00k62M1N7R5K5Q1l9J55l44J8J09J82
$$ plain form
1358 172 -42 30 2 -178 24 259 -171 17 251 165 -103 14 -134 26 147 267 -168 -66 23 -102 127
1379 127 -102 -196 -195 -21 -53 158 -168 165 87 -99 44 -107 69 -237 74 115 0 87 204 138 -151 -155 181
1402 181 116 -151 71 -65 -149 191 -64 -17 -86 -195 81 -13 -131 186 33 -64 14 60 -74 105 161 171 225 -230
1426 -230 44 -221 -90 10 3 112 27 -137 10 103 -69 -20 61 -18 -80 -181 -136 102 -27 -8 -57 72 -32 -17
1450 -17 178 -147 33 -114 -239 128 -47 96 -51 87 70 -153 -23 -56 -50 -143 184 -63 73 -91 -160 -23
1472 -23 -18 216 24 -86 79 133 -42 51 -33 -24 74 -173 137 115 -119 101 149 -173 181 -185 -117 86 112 -191
1496 -191 115 -239 -248 115 -35 142 -55 180 -70 34 -80 145 -276 -107 -32 30 59 -94 70 32 6 -61 -143
1519 -143 -129 -146 267 -291 -125 -118 107 34 -85 -15 -99 -94 -102 98 -164 -123 -66 29 54 135 96 251 -93 -75 34 216
1545B16j42j69K32j26j34M13k51n8K86m29K95j24R6l64L22J13k86J4J92L9l51
1566b16J78J55k13J13k70K40R7K11k69P7j71M8K76j28j40J02Pk99K77N1m77L15
1588c6p9J22Q5Q8k75J63j57J22P3J1M9j40J2kj18k05N48m07J65l8NK06l0j92p
1613c7q7L17O6N0k44r7J69j39J79j49k05N51l40j67J14R5j34M6J55k18j86L05
1635D4P3k45K70rk82n8Q7J84P3k17K8m8K5J03j42J71P3J49q8K6j22r2k5J07o9
1660A6Q8r6l0K11k18K9j83K00J55Rj30L6L1j72J0jj91K87J16j01kn9K09m29L17
1685A02N9j14k18K82l25J61J60j76J29L6J43l53K05m24J92P6j12K67Kl15K16o7
1707g4O2K7Q4j80KK95j52l86J94Q6P6j19K16nj03j42O4O6O8k52L32n2j72j71P0
$$ plain form
1545 216 74 -95 137 11 -123 290 39 -19 267 -162 133 9 105 -259 63 176 -110 -96 96 135 -216
1566 -216 -38 117 -96 17 -253 -13 84 295 26 103 -68 -20 256 128 -12 90 97 -202 75 126 -351 -36
1588 -36 -115 7 92 180 -95 68 -89 33 106 117 166 26 38 36 -82 -287 261 -146 19 -19 -14 192 162 -30 -37
1613 -37 -124 193 259 309 65 -32 137 -2 177 28 -177 374 34 -133 -19 76 -58 -12 143 -75 -261 44
1635 44 117 -128 142 133 -149 -207 -120 64 137 -80 -52 -100 -75 28 -114 57 130 279 191 217 95 3 -22 85 16
1660 16 104 8 -22 189 -29 0 -183 17 172 181 51 87 118 -54 -44 -45 -236 51 167 66 64 5 214 -215 102
1685 102 161 47 -171 111 -214 -53 107 -69 60 96 239 -114 91 -333 -141 -65 -177 90 92 -223 -7 -74
1707 -74 -12 15 99 -81 -79 216 64 -322 -128 -42 34 -85 131 126 23 -119 -55 11 79 -173 159 107 -65 -236 -166
1732a66K35J1j17K6j3J00pj46J4J30k10J05k93J62J6R4k25L73K10k66J2j11q5
1755a51J62J71l42l2K41N4k32M73l17O9R4j56L6j27R0L5l5J21k45K2M0K0J8O4
1779G3p4K3q2R9j58j01K36K30k78J57j68m7K65j69J29k37L78l71n8Q9R5K3j14
1802f0n3J82K40j08l6k75k22K75L3n9k10M03j43l6J01M8j51k5J35Q1k02j01N1
1825a32j46L25j59Q7n6j07L53KJ1k45K72k36j6P5K3k93L07o8N3J51k24n7k0K66
1849A66n65M44M4n6L8p4k10K44Q1K4k90K64o1l9r7n6P0J01n9J50k09j5K04N4j96
1874d3l1L4K06o7m2J01j67Q1j34K23r4l0j64j47N57l17j41K9M6o1J20L52l78k7
1898i4K07rl6j01k7J03m2L1k36L58l49J35l1Q1j82N1J89k23J80j75L07m64K60
$$ plain form
1732 -166 69 80 -37 -11 -24 76 69 -77 -63 67 -143 -38 -331 -169 -153 -59 -284 89 299 33 45 -66 -151
1755 -151 11 182 -160 -192 49 103 -129 344 27 96 190 34 70 -57 33 68 33 154 -91 -69 -29 -9 9 73
1779 73 -1 22 -60 39 -119 -220 16 246 -32 125 -43 -90 175 6 135 -102 276 -95 -153 -64 31 54 -60
1802 -60 -113 69 309 201 165 -110 -332 -57 -24 -83 -293 110 -33 -69 32 80 -71 -96 39 120 -82 -183 -132
1825 -132 -278 47 -112 -25 -81 -188 165 167 178 -67 205 -31 -47 28 51 -242 65 -3 50 201 -23 -80 -100 166
1849 166 -399 45 89 33 71 -3 -213 31 112 136 -154 110 49 10 -87 -143 -73 28 -31 119 -90 -105 99 153 -43
1874 -43 -74 -40 166 99 57 158 -9 72 -62 161 67 37 -127 -274 283 -34 -175 -146 -100 -161 -41 311 -67 -94
1898 -94 113 104 68 -33 -60 43 1 32 -204 154 -195 -60 -91 -10 -192 -141 48 -175 5 -170 137 -327 -67
1921f7j0J36L5k81L65k6k94J41l3o0Q3m3J90j48R3j61K4K28k65j12L58l90K53
1944A6K52l84J55J00l27K49k64L0J70R8o0J75k51J34j93Q5N4o8j22oL07j23j87
1967a60K30m09M62j07l6J69J3j07r2J21p6P8p0k33kQ5K68j39j4M4l1N4j6M5j01
1992b4N8p2j05J57K2J82j62l9k09J03J44k54J72M2l4K34k26k00N7J96J65p3j43
2015ik65L85k16J37K2o5J80j34r5L19K3l75N9n2L47m65J35o5J74q5m2o8M68l93
2039h0j4O9N1J02j34K6k0Oj39J20J2j60J26j46J46J5J1Q0q3Rk65K57J0k6R1q1
2065a7n1K1J62J41k59p7J90k63K06k07J64j04J02j2p1P4K2J05j16M6Lk18o3M78
2089B56j10o3j65RJ27k53K92l43M90k29j63M4K70M8j43K1R2k6j01M7n6J34l5L
$$ plain form
1921 -67 -77 59 94 -187 178 152 -142 -1 -34 -94 -11 -54 136 -12 81 -80 -56 172 -93 -205 153 -237 16
1944 16 268 -116 39 139 -188 61 -203 -173 -3 95 35 210 -41 93 -100 -15 39 -29 -151 -157 150 27 -160
1967 -160 70 -339 123 16 -20 149 162 55 -37 84 8 86 16 -217 -219 -134 134 -5 -19 25 -6 48 32 77 -24
1992 -24 34 -38 -143 14 36 218 56 17 -192 -89 55 -199 -27 15 -19 215 -11 -211 -154 42 207 134 -9
2015 -9 -274 111 -105 32 54 -11 169 35 -60 259 282 -93 -34 -86 261 -204 -69 -134 40 -45 -87 -155 313 -80
2039 -80 -94 -25 26 128 -6 20 0 6 -133 -13 -1 -161 -35 -181 -35 -20 -9 71 -12 -3 -268 -11 -1 -27 64 -17
2065 -17 -68 -47 115 256 -3 -80 110 -153 53 -154 10 -94 8 -4 -75 -1 21 126 10 56 59 -159 -222 256
2089 256 146 83 -82 -73 54 -199 93 -250 240 11 -152 -108 162 210 67 88 180 154 53 100 44 178 143 146
2113A46N0j24k51J80j78K32J25J0m31L80k65K32q1p6L53m56J38K18o1j00k26J31
2135e4J44J4j82J52j28o4Q1J28J75k16K5k03l7J28R6Kl8M7l1J44k08J2Q2k94Q9
2160a36M2p4K03L0K81k92K2n8k79K66J38k18N5k2P3J28j45n5K40l00K41j5L9j40
2184B4j85J18o1J73k15L54j90P0j54M9k2L73j30l50J69P8j1j04j82R4J27O7J4
2207A06M6L6j80J58j21Qj95K82j92K51k27l4J87m01L28N8k21J16m0J11P4r9k6
2230B5r7J30j04k7J81K2k8j73J84k26j59K71oP7l06K55j02r1L5J21r6K27r5J5
2254C3r5J44k99K4J74O5k26J78j51j98J83J70j71J92K54l20J79k33J47oKL55l53
2277D8m1k2K5M9l94M73q6k8k8r3J70J8j81P9l8K25n6O6k32L56k89P6l93L73l63
$$ plain form
2113 146 196 72 -179 1 -177 55 180 190 -241 139 -126 106 25 -51 302 -154 -16 202 141 41 -185 -54
2135 -54 90 104 -78 74 -54 -118 -37 91 266 50 75 -128 -165 -37 59 61 23 70 39 183 -25 -13 69 -225 -136
2160 -136 -94 -168 35 65 346 54 76 18 -261 5 143 -75 -20 -42 31 159 14 -41 199 -101 140 125 164 24
2184 24 -161 -43 -104 69 -146 208 18 88 -66 -17 -39 334 204 -146 23 101 90 -14 -196 -102 25 92 106
2207 106 152 188 8 166 45 53 -142 140 -52 199 -28 -62 125 -276 52 110 -111 5 -35 76 150 51 25
2230 25 -72 58 -46 -73 108 130 102 -71 113 -113 -272 -1 -7 70 -236 19 -83 -174 -139 -18 -114 113 18 33
2254 33 -62 82 -217 -193 -19 46 -180 -2 -153 -351 -168 2 -169 23 277 -43 136 -97 50 44 46 401 48
2277 48 7 -15 10 59 -335 138 52 24 -4 -97 73 91 -90 -11 -49 176 120 186 -46 310 21 97 -296 77 -286
2302b86L60J39l21L03k57J94j71L33k33mj75j44K14PJ41j31r3M9M0j61J40J20
2324F4j66K16j55k07L2K29O7j12J37m06J75K96m10M34j69o4L34j85r5K9k41L41
2346A44l3p2j06j44r0K16k51K79j12J58j23m8K78l09K48O6j69m8R6k5L1J01k0
2369F7N8k04J32J0J00j20j28n4J19N6n1J07o0j62Lq1J60r6K44r8J00no4k32N5
2394a44l6J32J2P5j26J07K21j90r9K50k21L60m80K06j07J86r4k80J91J64j06o6
2416d5J02j59J62j14O9j47J73j15K54k50q7L37r2R4j50J8j63Q9R2k20j03L43J31
2439B19j65L7j75K59L9l70J2J38L06j68L6j37O3o4n6M8j9L2MJ93j14o7J11M0k48
2464d6N6k65K45j39K40J27l19O7j9J05j06Q5k8r2L2O0N9k1P5k78K06k16J19N6
$$ plain form
2302 -286 74 213 -108 195 -62 132 -39 294 61 57 -118 -262 -48 -41 100 -31 -124 -75 -35 -196 -56 64
2324 64 -102 114 -41 -248 -216 13 80 -32 105 -301 -126 170 -240 194 25 -39 295 110 15 44 -197 144
2346 144 111 39 -67 -211 -301 -85 -336 -57 -169 -11 -134 -182 96 -213 35 101 -68 -116 -20 -45 -14 87 67
2369 67 125 -79 53 63 163 43 -85 -139 -20 36 -15 92 32 -130 -127 -208 -48 -144 100 2 102 97 33 -199 -144
2394 -144 -180 -48 -36 39 -87 20 241 51 -48 202 -19 341 -139 67 -40 146 52 -228 -37 127 21 -45
2416 -45 57 -102 60 -54 15 -132 41 -74 180 -70 -157 180 88 182 32 50 -113 -24 68 -152 -255 88 219
2439 219 54 91 -84 175 214 -156 -144 -6 300 132 168 31 94 30 -26 22 3 35 39 232 118 51 162 202 -46
2464 -46 10 -255 -10 -149 91 218 -101 -34 -53 52 -54 31 3 -89 -57 3 62 41 116 -162 44 -172 -53 3
2488CO6p7j09J84m08L59lJ37J62n11K53R1j4r7q1K5J34j13J56j48k13L2l8J99
2512a1j86M88l78k07Q9J95l8l57L08j11J32J17j97q3K78k9j00lp3M04j30p1K25
2535B62m18J16j19K61M7l2l44L42n8%m1J33j2j43J31q4j1o1r5J79n9Q5J64j29
2559A14k30L52m74K01J16j22J1k25K08l7j7O8J06k43J5N4L21l18j3J0J42j46k6
2582a33K20q4q0J0p8K4M5J73J1K7j17k76M46l40oK89j70j45N4L8N6m3k61L89P0
2607A19LK1k25M11l51MK33l41n3K08j28k8J9J08N8J78l65l1J27J43p2j74o0J86
2631a0Ll4K0k3p7J30J03J9K6j56p3l6O8J29l3J07k02J27J61l62J72l28J63n8k5
2656a89J24j79M5J72j5n4J09O7k49L70k93K37j81j06J76o4K53l29J41L1J06l10
$$ plain form
2488 3 69 -8 -117 67 -341 18 15 152 314 -197 56 147 133 36 -45 -20 114 1 157 9 -204 -172 -210 -11
2512 -11 -197 291 -87 -294 -205 -10 -48 -405 -97 -208 -76 41 -156 -239 39 10 -90 -93 -166 238 108 37 262
2535 262 -156 -40 -159 102 149 117 -227 115 57 57 16 149 137 -6 125 41 30 -31 -126 53 -6 79 243 114
2559 114 -116 236 -238 -37 79 -43 -32 -257 -49 -86 -103 -35 71 -172 -157 -103 218 -100 -113 -103 39 -107 -133
2582 -133 87 3 -77 -67 -145 -121 -76 97 108 135 18 -258 188 -152 -158 131 -39 -184 -130 -92 -36 -79 -340 49 119
2607 119 122 143 -82 329 -22 -18 215 -126 -179 29 -99 -127 -108 0 58 236 -129 -160 -33 110 38 -136 -196 -10
2631 -10 -7 -41 -21 -44 -121 9 112 131 157 1 -72 -108 -40 89 56 163 -39 88 249 -113 59 -269 -106 -164 -189
2656 -189 -65 -244 -199 -27 -42 -96 13 80 -169 201 -92 145 -36 -142 34 -30 223 -106 35 66 172 -138
2678a38O5J57j40L3k26J64L9n6K10l7j22J37r8J21l10N8J65p5m0M72l16k4j29
2701i0K14j29qj10J34L4m9m6NP2j61r3J17L55l34o7J05J2j45Q2N9j01K08j47j03
2726a86K86K36n00K69j8J99k60J12k51K02k80K8k4J24J97j44K58l4j13m8pp4p7
2749a05oL62k19o7J54k68O9J66r3j66l5J13j29L32k49J81J52l14M5J45LJ22l82
2772a89k8L5P5qj7J40l9L51l40OL1k21J68J01p2l7M4Q5Q4r2k7j25K31r2K78k20
2798A22l20L2K74p7r7q0n6K16O1J32j88K13m6n0j85l8J47q5R9n1J7K04k93j77
2822b26L46j80k1L65m88m9N56j38j24K7j78K8L1K38k38K48k31n8R7R3o4R7j14
2845A7r9L9N2rJ9J31k70K0j29K63j01k50L89n9K28l59N7L12k54J02m6k90M94k25
$$ plain form
2678 -138 -73 84 -56 -23 -249 -85 -46 -102 108 71 -51 86 -12 109 -201 -143 22 -53 -93 379 63 39 -90
2701 -90 124 -5 -13 -123 11 45 -4 -50 -45 27 -134 -227 -110 245 -89 -156 -51 -39 -184 -102 -43 -144 64 -83 -186
2726 -186 100 336 -164 105 87 286 26 138 -113 89 -191 -163 -187 -63 134 -10 248 214 101 53 46 -28 -105
2749 -105 -111 251 32 -35 119 -149 -80 86 -7 -173 -208 -95 -224 108 -141 40 192 -122 -77 68 71 193 -189
2772 -189 -217 -182 -107 -115 -132 8 -31 320 -20 -14 17 -204 -36 65 -7 -44 0 85 169 77 50 -75 156 64 342 122
2798 122 -198 -166 108 31 -66 -146 -202 14 75 207 19 232 186 136 -49 -87 60 -25 74 23 40 244 -49 -226
2822 -226 120 -60 -81 284 -204 -253 303 165 41 68 -110 -82 -51 187 -51 197 -34 -92 5 98 34 131 17
2845 17 -82 -43 9 0 19 150 -120 -100 -229 34 -67 -317 72 13 241 -118 -61 251 -3 99 53 -237 257 32
2869C2r2R0j8k9l3j20K78k47J17J53k13K71l73M43j23k09P2k8J3J47j53J71k03
2892e4j93M13j23j6o1q8J01K11k11k9k4R1j0o8J07j16N9J42j80R6PO6p7K30k60
2917A3j8J53M1n6j62N5j17M0K15l32K9N6R4j54J47O2k2M2J04k20N2j74L1J52Q6
2942A17o1j7J3Qn7J83j46n9o3P7J37k12J46k24J52R6p7q1j84N20m04Q7O5J41j12
2967D5j49k44K76M60j64j50m7J58j13j02K6J90j83n7J05K10m27n1J61N3L0j97
2989a70K71k24Q3J52O3j68K2J20j03m6k01L22k23KP9j13p4M33k70k00J54J02k49
3012b38L27j08R9r1K5j0k01J67J62j80L21l08r8L06M0j66O4q8k06P0K19j5j94
3035a03j79M33K5o7j14j01p6K35L1l90L38j78K88j60KJ58j84J09k93j37J55K56
$$ plain form
2869 32 -60 30 12 -17 -50 -170 108 -139 -22 131 -82 189 -184 259 136 -73 -1 -29 -16 131 -22 149 -54
2892 -54 -247 166 43 27 -34 -122 -21 190 -21 -50 -74 17 7 -61 46 -70 -11 131 -49 47 54 120 43 273 13
2917 13 -5 148 189 133 -29 26 -91 -51 164 -168 -139 -83 11 -143 4 66 44 86 190 -30 22 -152 -121 31 117
2942 117 56 39 52 60 3 186 40 -19 -82 -5 132 -80 66 -158 -6 90 13 -68 -252 268 -136 -49 16 157 45
2967 45 -104 -348 -72 388 224 74 27 185 72 -30 -4 186 3 -54 51 261 -166 -217 -56 -3 27 -170
2989 -170 101 -123 -40 112 175 7 29 149 46 0 -201 121 -102 -100 -21 -134 -208 225 -45 -245 -91 11 -238
3012 -238 89 -19 80 -11 14 4 -197 -30 132 -48 273 -35 -133 173 213 47 111 23 -183 -113 106 91 -103
3035 -103 -282 151 176 109 -5 -106 -182 53 84 -306 32 -146 142 -18 -16 142 -42 67 -226 -363 -208 48
3057D8j3N2M3m6m3K93l63P6m4o5J47j39Q2k4J56j16k29J75J30r1j77K73j29Pl1
3082b8O1m1n5K17k31J29J63k84O7n7M7K52n2j52J77k44R0k5j49J34j14K44j82
3105c3K9j31J91m3q0l2J23k58K85R0j43R2P2lk84K26j88J33J45m35J46J04q3k56
3129c33K13M18n32L97j31j73M4m6pL02k87J80n4r1L46k30KL3k20J45J12m6k29
3152a87K12m03M05K4r7J59j44j70J54K61l06J3K55l34M18j82M5Q8l07oJ32n6o9
3175i5Lo3L33k01po9R2P1O1j3n0J3j47L66l30J26m8r0m1J23K4j88J91n9q5j38
3201b21K12J15Q7j67j46j68J77O4J68l78L69j23J97k00j57K77k09K80l37q6K81
3222C5j81k9P3N0K56l15M3J31L5j12k3j80L02j28j11M00m65M59j34k01J26J99
$$ plain form
3057 48 35 87 130 84 41 334 -29 47 3 -62 85 -54 28 4 160 44 -185 -10 120 29 -148 125 -4 3 -28
3082 -28 33 -8 -63 154 -77 52 215 -69 -2 -59 -12 240 188 36 213 -31 59 34 -115 19 -95 149 -33
3105 -33 -4 -135 56 13 -67 -99 24 -234 51 141 -2 90 162 159 -125 101 -87 46 191 -244 -98 6 -77 -333
3129 -333 -120 298 -234 163 32 -141 -97 -143 -150 152 -135 45 -9 -100 246 16 18 51 -169 -24 88 42 -187
3152 -187 25 -378 27 51 -46 113 -31 -201 -47 214 -92 -79 176 -158 260 78 123 211 -96 -102 30 -26 -95
3175 -95 -92 -155 178 -23 -30 -99 -7 64 125 112 62 75 -72 294 -36 90 42 -48 -89 34 58 -130 61 2 -83 -221
3201 -221 -9 106 193 26 -120 -288 -111 -47 121 -257 112 -11 186 -14 -171 106 -103 177 -160 -246 35
3222 35 -146 -175 -102 -52 204 -111 -68 63 98 -14 -37 -217 85 -43 -154 246 -219 240 106 -95 31 230
3244B30j10l3j22j72K29L3k53J02kJ63m7l5q6J62R3k5r5j79M89l6m74L08J0j96
3268d6oJ9R5p9L6K61l79o7K53p1Q7P7k90pJ67O1j96J58p0k60K95k7K5j34j3L13
3294B02j63Kp1Q7j00r3J38j61K34r9K41l32J33k06J76K21k38K08k68l18L39K80
3316B12j61j47O1K36k96J30j35K2J31j05k92K38J66j00J84L8k82j3J74j26R3L
3338C1J03j17j5J27j66J98n5l00J28p4K35p3n6k05M63k26j32J12J60k23R5oJ06
3361A10j79j27M02l15O0J45j90J22O1n0j02J4K84r0j81qK31k83J0Q3m9J18j00
3384c4J17l48R3M5J00Q1J01r4l6k35J23L2Q2j90K05l68M70j71j5m4l9J81n8R6
3408I4j47J85m08K04J85j01l03M09m00K68n5L56m84K62R3j65O7k53P1K53m7k38
$$ plain form
3244 230 120 87 -35 -207 22 55 -198 -96 -98 65 18 -17 -103 59 152 127 32 -147 342 306 -168 140 150 -46
3268 -46 -52 -33 62 -17 19 280 -99 -166 87 16 103 180 -110 -117 50 111 -85 73 3 -257 38 11 36 -98 -111 202
3294 202 39 41 -30 57 -43 -136 2 -159 75 -24 217 -115 18 -188 -12 209 -29 179 -89 -407 -68 212
3316 212 51 -96 -35 201 -95 35 -100 -78 53 -52 -344 -106 60 -40 144 182 -100 -113 61 -65 28 31
3338 31 134 17 2 129 -37 161 106 -194 -66 -140 95 22 -34 -239 224 -2 -134 -22 138 -85 10 4 110
3361 110 -69 -196 206 -109 -49 96 -94 28 89 39 -63 -49 235 145 -36 -44 187 -96 -86 -3 -52 66 -34
3384 -34 83 -265 -172 -127 -27 54 155 61 25 -210 -87 -55 27 -163 42 -326 144 -27 -42 -86 -125 56 -2 94
3408 94 -53 132 -276 -72 113 12 -291 118 -282 -14 -69 287 -197 65 158 -7 60 -193 -122 131 84 -154
3430a54K08r5n3J69K7k15L39l60J11J86j72J83j27J38l69j81L29K82k56n0k6J44
3452E8J20l00L18l23J66O3j57l6L06m15M46j21Lj18Q3j25K9j02KK58n6O0m6j14
3476aj09J12J97k08M3J2M7o5r9L75k00j51J42q9j74K80N6j34j9J29o1nq7k31L17
3501G7l56L12r4j5K71j28m8p8J21n1j72K20j02n9K2r7L23J40n01K67J07l66K62
3524E5j51k8K04k46N76l34l5q1L8Pk77K55p3L31l09l2J06K04l10K5J29J78l1l
3548A98j98J39j13Q3J8l4l78M33J38j89r7q1M2P7j68K35J20l16J9J21n3n4R8l2
3572Hk8k08K70j34R1p4O6J78j2j81Q3k79L53k59J29J10j18K49k14k04P6J58k59
3595a99L48k32n9M0K22j95K64l25J77n7j07Q0RJ6o5O9m6M1j57K3P9n9Q4J52j7
$$ plain form
3430 -154 54 -41 -94 75 102 -113 226 -134 -23 163 -9 174 47 185 -184 -365 -36 246 -10 -60 -86 58
3452 58 178 -122 196 -127 39 102 -55 -91 215 -200 246 125 128 10 93 -32 -3 -105 -103 155 99 159 113 -1
3476 -1 -110 2 199 -9 34 46 93 28 -71 304 104 -47 95 6 -168 112 168 34 15 144 83 78 -9 -240 77
3501 77 -279 33 -61 -76 195 67 19 -59 62 11 -161 59 -43 -102 -80 -177 146 286 -215 52 159 -207 55
3524 55 -96 -124 80 -166 410 76 41 -40 -2 5 -272 -17 -90 241 -68 -100 6 210 -100 -75 54 232 201 198
3548 198 0 139 26 109 127 93 -285 148 286 97 0 -81 -39 38 -130 105 225 -91 -72 49 -4 -58 40 8
3572 8 -20 -228 42 -92 -1 -75 -9 169 157 -24 59 -220 133 -126 3 113 -5 244 30 -174 -98 60 -199
3595 -199 149 -83 -142 -102 120 -75 189 -136 41 -16 -123 -43 -34 -18 -83 -14 -60 -19 -176 -153 -74 -133 -49 103 86
3620H6k94J94p9J21Qo6O6J4l3q4M0n4J66j08j68J00J22N1K6l92K47J07pRl50L73
3646I5O3j12k22J81O9q7O2k72K40q0J44j79k5R9O4k20K89r1RJ27j15J43j47l51
3670c16L28P4l41R6K65m89M74j06J12k63L5J49LQ3j58J13o0r3P3J16r7k45J16
3693a31ML13l24K75m5j08r3J84j41l9q9J72j24K47l7k70K89m7J57k94k01M05k00
3716i7J20j27K3J26J6R5m7j75J87j01J21j01j7r9L3K5J0J74l56J30O5J5j92O8
3740a04j77N34j72q8lM7J19m89M11l56L48%N5j50O1J92k05m38L51J17k35L1J27
3763b4J53Q5n7L0l04L79k20J5P3O5p6j95K08l17M73k52N0%p3O8J38j96k9J16k51
3788a41J47l7J51o2p1K84k33r9j25L09r4mj61K46j76J83M1l42J72K33r4q6p6m7
$$ plain form
3620 86 -208 -14 -93 28 36 -30 36 50 17 -67 -27 -81 85 -23 -191 -91 31 82 108 -284 -37 70 63 72 -278 95
3646 95 158 46 -176 5 74 -13 49 -223 17 -63 81 -98 -123 -24 40 -180 109 18 27 154 39 182 35 -316
3670 -316 12 86 -255 -159 106 -383 91 -15 97 -166 -131 18 21 104 -54 59 -1 -94 -21 95 -2 -247 -131
3693 -131 -127 186 -138 137 92 -16 -109 75 -66 -105 -194 -22 -146 101 64 -206 83 36 193 -101 -302 103 -97
3716 -97 23 -104 -81 45 61 156 109 -66 121 20 141 40 23 -76 -43 -18 -8 166 -190 -60 5 20 -172 -104
3740 -104 -281 253 81 -7 -10 37 156 -333 78 -278 70 70 125 -25 36 228 23 -415 -64 53 -182 -151 -24
3763 -24 129 214 157 187 -117 262 42 57 130 195 119 -76 132 -185 288 36 86 86 13 81 219 23 -6 110 -141
3788 -141 6 -31 120 58 -13 271 38 -61 -186 123 29 25 -136 110 -66 117 158 -184 -12 221 127 41 -35 -82
3812h2p5N83l41r2p7K02mN1r8n5p9P4J23k80JmL1J56r1N7%k55L71o6r7m9n8L30
3840A76j25j29J08j28N6K6N1J17p0l44K76j0j1L8J42j57r7q9P3K72j30mj6J49
3864A74k42j12J00J10q3J91j0k19J28J45j28k34L62j53m0no7n0jk34M68j77L2
3887d5K8K51l41K79q0j17R9j43J53j23K49k37j13kL6K02k6Nk75Q2J39rJ52o4n3
3912D7j41Q2P4J11j80J6k26K44J6j52K09k2j63J61p8j2k20L25J9r9r8J88j36J53
3936A18j79k55L64q9jp5L04j72l0o6j0j7nN6J49k09J48j26J97j34J81m04K22K3
3960a0k6J51P3j47j25k7N4J6j9K12K4k9r8J64j72K1Jl27J26J6J80k19J09J53j22
3985b1j53L9R5l9k16M25l46M59l30K1j5J2N4J8J6j42J21O2j62j19J17L03p7l46
$$ plain form
3812 -82 -157 426 85 -7 -84 118 114 165 67 12 -67 7 130 -150 -149 -153 -122 34 -57 0 0 -255 116 50 -47 -96 -154 176
3840 176 51 -78 30 -98 -42 -16 35 152 82 -262 14 4 -7 31 173 16 -81 -170 -97 175 45 41 25 174
3864 174 -68 -180 -80 30 -53 138 128 -91 37 182 54 -180 182 29 -11 -16 -83 -133 -134 -368 100 -77 -45
3887 -45 -17 234 -107 172 92 -25 74 -69 84 -39 210 -27 -140 -142 -106 96 70 75 -200 -118 21 12 164 100 47
3912 47 -94 -12 62 173 -7 9 -217 27 43 -109 100 78 -85 76 -2 -14 -234 91 110 11 -87 101 -35 118
3936 118 -61 -316 48 -41 -42 -117 187 15 -15 -81 -91 -108 -113 -57 92 -117 31 -95 102 -32 149 -255 -33 -10
3960 -10 -36 115 188 41 -84 -111 -57 -41 -60 152 176 147 49 213 41 62 63 -264 -138 -122 58 -161 -52 101 -21
3985 -21 -174 -135 -40 -79 -295 130 -216 243 -87 -66 -81 -69 -15 3 19 -123 -2 60 -102 -221 -104 199 122 -224
4009b24K75p8l5N5r2P8j04J80J34k27K5J32m47K61L29k74p3J83O3P9k70K2j05
4032a13J10N8j49L2K9j31R0j96J31J60p5J85j65J38j39P7j61O8J72J28k70K40
4054B19n5k19J0J70o9k37M07j87R6j60j81K45R7n7j99Q4J38k8j22j11J81j42P6
4077d4k62K82N2J07r1r5j18K37l09L58r6m1j86K30J58k56K00k78J78K00lk04j40
4100a21P7N5K90l24M6l9P1n5J19k67M8J49q4N7Jj19K33M5l13R3j01J94j21r5K30
4125F9J16l61oM64m34J17j20R0J16np8n1j07J6J28m6j9L88k78M2j77J97j05p5
4149a19k4O0K13k46O7k46K49K19k77J70rJ1j67O2O8k05L14j38j1J22l28K53j07
4172f9k4K12j34m4m4J03q2J68j28N06m48n1M6j22J37K1K50l48j25J03J59j75J33
$$ plain form
4009 -224 51 -27 -62 -7 -99 -21 -125 55 189 -38 -13 119 -328 -67 262 -12 -85 98 161 240 -30 -8 -113
4032 -113 -3 55 -94 -62 -33 -164 -74 -270 -139 21 -54 131 -34 104 -35 42 -119 -51 121 249 -21 219
4054 219 164 -55 -45 125 56 -181 226 39 135 -25 -206 39 136 79 -120 -36 102 74 -48 -159 22 -120 -44
4077 -44 -306 -24 28 135 44 -51 -169 68 -241 117 21 -20 -206 24 182 -74 126 -152 26 226 223 19 -121
4100 -121 -44 11 301 -23 23 -16 55 0 119 -148 -100 49 -35 22 23 -96 137 182 -131 -38 -139 55 -66 -161 69
4125 69 185 -176 -182 282 -152 -35 -155 -65 51 46 -32 -83 -190 -174 -46 -92 -111 277 -1 41 -136 61 -44 -119
4149 -119 -143 -83 130 -116 -49 -295 -46 173 -104 66 57 68 -99 -37 31 -174 140 2 -9 113 -215 38 -69
4172 -69 -93 119 -15 -59 -103 0 -82 86 -42 464 16 -35 11 -111 26 47 297 -51 -176 -73 86 -89 44
4195D4J0mr2K08rm9n1p3J32R3j21l53N02j10j66N1k92K54K59j11M9k18pJ9r3P1
4221e7L27j75k93L08k37L49Nj21p3j04r5n9L89j84L30k09m7j87J5J30r6n0O3J64
4245I3j57J00k63J88mJ80K3m83M30n3M5m9J2k41L35j07M8j43j52J73j9K59M5l99
4269a39j2J47mj61J3j80M57j54r2n8O8K78k27JO6L0k03J3R1j3K39k00J94P7n5
4294A76l39n9M49k90J14m8K3K1r4j81K17O5j96R1J88j64R7j14j45L33n1j66L33
4317B60k9k43q1R0r2N9J18J52m08J76j30J60J7J39l30J88K3Oj36j75kL04J17l39
4341a56K19jk4l9Mk07J67q0J30pJ2j41K55l38L71k17j02M7K3o6j0J03J96R5l24
4366i0K43j89l7J65R2j92j53O5J31p6P6J43k76O4M5J7O2o4J27n9J9L6j29O6j0
$$ plain form
4195 44 54 50 -42 166 157 108 57 -16 116 209 88 -265 237 127 -39 12 -280 -26 233 122 171 -47 -54 -35 -128 -57
4221 -57 270 95 -198 110 -127 222 227 106 33 -71 -166 -225 164 -20 310 101 54 -133 -118 12 -84 -134 -71 93
4245 93 -64 36 -227 -39 -43 137 160 -323 107 54 99 50 62 -179 156 49 97 -46 -198 -25 -44 215 260 -139
4269 -139 -151 -4 -8 -169 -156 -336 121 -33 -125 -183 -115 163 -64 -63 3 33 -170 -157 -66 -79 160 -40 154 231 176
4294 176 -163 -222 227 -63 51 3 26 47 -47 -228 -11 54 -142 -51 137 -27 70 -44 -189 144 93 -73 260
4317 260 231 -12 -93 -3 -95 -36 82 234 -174 2 -128 32 49 188 -142 46 69 75 -61 -236 -238 66 183 -156
4341 -156 63 62 38 -1 3 -204 -37 -117 13 6 18 -123 132 -206 165 -52 -154 -107 -84 -150 -160 -57 139 234 -90
4366 -90 153 -36 -73 92 184 -8 -161 -96 35 -41 35 178 -98 -34 11 28 90 26 153 94 113 149 20 86 76
4391G6l72M24k78L8J40l5J2J74j71j11J81j53N9k48L46l37M29j18J57k69k3k57
4413c36L35l0R6N4k63J29l9L00k99QJ69J84l00k08q6L45O2l50K40N6N9J2P6j57
4437E7J08k26l5O5n8Q8P9k57PJ8O1R5l37M63M8l23N74m13J53k65n7J04O2O9j59
4462g9J57k3K2j89J5Q4k09L75l00O7Q6j3J95k60L08j43m01m0J84J05JL5j80M74
4486B71l43K16j11j37L17k0m22L15q5L9j2j3K40m74L45O4l40J87J36K9k60j24
4508a82M2J63k44K49O2j83J38j08k5O3lJ6j97K40M8L10l09k03N19m50J46k10J54
4531C6j61K12r2J78k14j54K97m4K84m54L59j87k44L26o3m9J51j47k5J2j85J75
4553A1j45J81m9j8P9o5P3j22Q4j45K33j07N7j30Q8K8L8p8M5j00m4OP4P3O1k36
$$ plain form
4391 76 -296 128 -150 -112 28 -7 5 179 8 -103 78 -75 -16 -264 82 -255 174 56 213 -56 -79 -336
4413 -336 -1 -31 65 119 -144 -15 -54 246 -53 -45 124 308 8 -200 -286 59 121 -229 11 67 126 138 214 57
4437 57 165 -61 -96 -31 -89 -1 78 -179 -172 -154 -93 2 -335 128 176 -147 427 14 167 -98 -155 -51 11 80 -79
4462 -79 78 55 77 -112 -97 -13 -222 153 -147 -80 6 -7 188 -72 236 93 -308 -348 -164 -59 -58 -23 -203 271
4486 271 -72 144 33 -104 213 193 -229 86 1 40 28 15 255 -219 126 190 -150 37 173 202 -58 -182
4508 -182 -140 23 -221 28 90 -93 45 -63 -88 -25 -28 -12 -209 31 79 389 80 -123 396 -54 92 -118 36
4531 36 -125 87 -5 173 -41 -195 102 58 342 -112 247 60 -184 142 79 30 181 34 9 21 -164 11
4553 11 -134 47 -2 -20 59 -6 67 -55 29 -116 117 10 67 -63 25 53 91 13 58 -42 -86 -80 -6 67 128 -108
4579a08l1j51M08q5R2j94j08K92j34lo3J21K9j79J2J37j1j2k37L77j38P1J13j56
4603D2M3n7o1J14Q0l25Q2K89j11j27J37r9j71J08m9pO8j47J18J84j15r2J25j15
4627h6r0J62k1M5M5j46k11K74J29k02K79l4j69M8r4P9m7r7K0%J20k45L58q1J4
4652E0j52K52p7o5mJ8nk08K20n9O2n3MJ36k1J09l89N9j31j0L43J05j3j63JJ25
4678A34L9L5j99j78L47k45O7P2q0R1J8Q3j02j44j04M68j40j63pj00J69r6J48o4
4702D9J97m67L78j35J21j77N7J01m06J69L4K69n8j03r4k2J89r9P6p1L6j94j14
4725b64L05m1n7l1J45j92k0j5L37j43j02qR1J9J11k04J91j83K09j82R8J21l11
4748a26K58l40L81j04j27O7kk04m7N97m93Q0K22n0n0q9Q2j57Km9j38L5M00k4l4
$$ plain form
4579 -108 -139 -290 118 33 125 -69 -177 115 -19 -22 -85 36 65 -114 -102 35 24 12 -225 152 14 85 198 42
4603 42 85 28 -33 81 161 -164 -82 207 96 -31 106 7 -164 -56 -105 -112 -44 -191 -73 111 -4 -96 29 -86
4627 -86 -176 -14 -35 10 55 -91 -302 -28 101 -101 178 144 -25 23 -71 8 -39 -136 -116 -116 4 -241 117 36 50
4652 50 -102 150 73 8 4 22 17 -191 29 -30 32 -21 -17 119 98 207 -182 -123 -254 -264 79 184 171 8 9 134
4678 134 173 208 9 -169 178 -67 0 72 -8 83 101 184 82 -62 -166 302 162 -1 -8 -108 61 -35 113 49
4702 49 246 -221 157 22 143 -34 23 124 -282 -113 -79 190 132 29 -65 -87 102 3 79 8 44 -150 -264
4725 -264 41 0 -57 -88 57 -135 -155 -170 167 24 -78 -86 5 24 135 -69 122 -61 148 -34 64 185 -126
4748 -126 132 -208 173 69 -58 9 7 -197 -244 353 -140 -60 162 112 62 -27 55 -102 -100 -149 -287 -252 148 124 90
4773I0l6j59J67ql6j69K13J8k03J25O4m2L5J17k11J45j40M3O9N8o6P9k72J13J33
4798A27R6l9q9k79K18M2j40R6J3n7O6j85r8K9K73j37j72J86J3M3r8K32k61L18
4822A97j54j15l7P8k0K61k55o2k9L15j77j09J74K9l30M34p2k31Q4R1r0J24J41
4845B47l02M6O0j37K81p2N2m16K31J48k25J43l3j49L6K17j61k54J97M1K14l3p2
4868E9r9rO8q5j41K76j1j92o3K32j2l8k8J58r0j15K60k43J07Oj06M8L5j26J22
4893A3n3J90q2J12l53K05j04KK06j02r9Q6J36j53j90J96p5j1K3k06M02k57K22
4916A08M0m6r2K41j1m34J61q8J75j95J54Q1M0m20M19l19J78N0K33j58j61rO6r5
4940h2k2L10k55PJ60k02J2O6J18j01j30J14P0J74m17R2J17K91l38M9J7j69J70
$$ plain form
4773 90 54 -105 62 54 18 -151 62 80 -123 2 66 24 59 176 -35 110 -30 13 82 140 74 153 -119 -6 127
4798 127 223 184 95 -184 34 76 -64 32 45 -12 54 -131 -229 -200 73 -64 -236 -50 -37 6 -92 140 -121 197
4822 197 43 -72 -109 -31 -51 210 -45 -107 -136 179 2 -107 67 96 -234 200 128 -103 -19 72 -18 106 247
4845 247 -55 -9 51 -86 195 123 175 -241 -10 138 -87 56 23 -126 -90 127 -34 -288 -91 -50 164 131 59
4868 59 -40 -49 19 -66 -207 69 58 -134 -197 35 23 -15 -43 115 25 -90 170 -73 34 40 -66 -18 17 -109 13
4893 13 -40 150 68 180 -173 32 -72 -70 136 34 -65 21 157 4 -186 10 -65 -76 -53 -259 143 -114 108
4916 108 148 102 10 251 240 -194 -33 -121 54 -141 13 94 134 -286 133 -186 -8 42 275 117 -44 -53 13 -82
4940 -82 -104 206 -49 -42 118 -84 -72 -6 112 11 -119 -5 65 239 -178 -86 31 322 -16 33 50 -119 51
4963E1r5n8K1R9k02K62J07n7j35j6kkJ94j42k09K72j40P3K38j77m6q1j4J97j05
4988C3j38p4J0J44j26K40q7m3J1j64J76n7N6M3OM1m04M04j37O9J21n4k3J14k42
5013h1j41K46k3Q4k4J00k48J57o9m7Q0J56l52l1K54pj73OK09m8l5K56l78k88J44
5038b53K61j78J71O9j73l04J51L86J13m16K08K03l60J38o7j56K14q0Q2m2J93L
5060A63j22j7k36K45J0j4o6J01j54L9J11M2J01l35R2M0m0J67j97Q1J46l19j35
5083b97M02J74j80l28M29j74J20L6k76Q4K2J5K59j87r0M6M7j46K12j59P0N8j33
5106DJ34k45l15M26k30J85L17n34L54q1%j33J13k24L49j69J73l5p7M7l3M04l99
5129C1l3J06j73J06l8l9j26J02J96j71O5J40j42J27O7O9n11J76J40k1k43q1L75
$$ plain form
4963 51 -44 -102 -81 18 -184 78 185 128 -7 -23 -25 -27 167 25 -184 88 -52 21 259 82 36 -45 -59 138 33
4988 33 -105 -179 -169 -25 -151 89 2 -41 -30 -194 -18 -75 -19 24 30 71 -333 71 -66 3 124 70 47 161 -81
5013 -81 -222 24 1 85 61 161 -87 70 1 -46 34 190 -162 -193 61 54 -119 -113 96 48 13 269 -109 -397 -253
5038 -253 8 -170 1 70 -103 -407 -256 130 243 -173 35 238 -122 16 -51 -207 7 -73 9 -33 160 163
5060 163 41 24 -212 33 43 29 -37 64 -90 -51 60 102 203 -132 -40 0 -40 127 -70 11 157 -162 -297
5083 -297 105 279 99 -229 200 26 146 182 -94 -10 12 27 286 99 9 55 102 -44 168 9 79 137 4
5106 4 138 -107 -422 4 -226 -41 276 -258 96 15 15 -118 -5 -229 120 -49 124 89 12 59 26 430 31
5129 31 -2 104 -69 37 -1 -40 -166 -64 132 -39 26 166 24 151 218 287 -224 -48 92 71 -172 -253 122
5152A22k25pJ12J13K28l29pm7Q9M8k39p6L49k4l07Q0j62L04k8k2k5R8j89K85N
5177A46m8j68J65k6o2j70J74j40J21J37K9k30O7qJ74k65l9J19Q4p4o8j23L85M8
5201B28q2N9j94P0k01j3R8K75j52j54m5J65k8r5J62o4l2J4L5K2P6l67M31l11J8
5226h5O1j43O4K46p7R9k80j04M3P0K40j54J78k24M56k47m08J73J90q0Rjn1K12
5250A87R3l35qm9K36q7j39J17k58K45O9j83J32q7J47k03K94l08J7K83k5j57K83
5273B64j0j50o3j22Q0j01M0J34k64J16q1N9J22K3O4J3k20J04J62l8o9o5q1K52
5297A69r7k6j43K85l59J32n7J56j44k00L34J5k66J10j1M27j86l9P9j26J50j73
5319C0K54l71j27J21J04q7q4M20k67j29J24J36j01j34O9l8k32J63J11J66N8k68
$$ plain form
5152 122 -103 -110 2 115 343 14 7 -40 49 97 -142 -218 131 107 -200 -120 -282 22 -6 -28 -53 45 -144 141 146
5177 146 98 -70 95 69 7 -163 11 -129 -8 129 158 -72 -5 -13 161 -104 -143 -24 60 -14 -82 -205 180 228
5201 228 146 205 11 81 -120 -133 -35 240 88 -66 -111 54 26 -69 93 29 -3 11 46 68 144 -223 208 -103 -85
5226 -85 -24 -167 -103 143 66 165 -115 -219 -176 -106 134 -20 158 -66 390 143 -265 -92 98 18 27 26 -25 187
5250 187 280 -55 -63 -112 124 37 -102 15 -243 2 71 -112 20 -67 80 -123 171 -137 -120 163 138 -19 264
5273 264 254 104 41 -81 -1 -102 -62 72 -192 -76 -157 -98 24 47 111 124 -96 8 170 132 63 -2 -83 169
5297 169 72 46 -97 188 -171 -39 -96 60 -84 -284 50 65 -201 -91 -102 325 139 100 179 53 203 30
5319 30 284 -87 -214 -93 11 -76 -160 260 -7 -136 -12 124 23 -111 -42 -80 -312 -149 -38 128 186 -82
5341h2J85k39J11K2r0K41J06k88J82j33Q5q5l72K47J37k7j41K06m38M06kk23J07
5364h5M5J8o9j16j47N39J00k38k25K13j51K47l52K12m3j47K97j93K49k09N6nL6
5387C2n1o9O3j32K02J10o1k13J80m0n9J11l15J98k31M35j55M9L6j88J74K6j40
5410c8r0J2R0R8k18O8K20j81M4k6O9j33K64K6n7j03QP6j76J5j21L34j28K0j20
5435d7J08j25J92j64J84J11k92R6j17q7J38M0r1J80Q0l3l70J32j33N9lJ25j81
5458a98Q7L8J88J70k67j5J44k90K99J00l84j4k5K99n7j09m5j16J82j17K25j23
5480b8QN9J3m6j32J55L8Qj89J18K36j84n0m6M0J87j30m8q7J16J0L8j18Q1j87N8
5506h0K11O3l22o4R8qM0Q2J53j93J99m00j11L43N1j42J32K6l7J23l62J81q6N2
$$ plain form
5341 -82 103 -136 -25 -3 -93 148 254 -34 148 15 100 15 -357 -110 27 0 -141 65 -373 33 31 -192 -85
5364 -85 -40 -22 -91 -207 -354 185 285 47 -178 35 -116 131 -221 -9 -52 -199 98 -95 154 -55 1 -4 32
5387 32 -19 -88 -25 -157 45 155 94 -119 61 21 -38 73 -242 -44 -275 160 5 54 90 -98 76 102 -38
5410 -38 -128 -116 -26 72 -146 -78 142 -39 5 -21 48 -85 179 205 148 45 53 129 -47 -32 -153 181 53 73 -47
5435 -47 61 -64 128 -36 148 259 -33 63 -54 -141 -3 37 -54 126 206 173 -197 -65 -198 -139 -142 -17 -198
5458 -198 -111 -73 115 285 18 3 147 -143 156 256 -128 -142 -167 132 75 -34 -79 -195 -13 -130 95 -28
5480 -28 -20 39 52 6 -126 29 67 75 -114 4 240 56 6 -40 0 187 57 9 -78 38 48 86 -32 49 -138 -80
5506 -80 131 194 -128 -192 -94 -102 -62 20 173 -20 179 -221 -332 11 62 -80 52 78 41 164 -198 -17 -103 -51
5530e1K0M2p4o2J01l5J26q3J08m5m2n7k2k1J30o5k61L95r8m3K0J6j08O3j17J76
5556A3pl16O60l14q7j63K94l71L42p1K91k10oJ74l05QL9l2Rj01J51J08j06j04
5580a04m8J71j39K6L12l34L97J16m12m2k12K54j11J72j06L0J29j81M0j09L4J75
5602E8m5K12j50P7j4j60O7o5K09o2N1j0n24L35jj42LJ09j63L64O3k47L36l33K9
5627co1M4K9J24l36K70j8j16J65n5M6j56j4k9n2L3m2K12P0J77l81P7j22J55Q0
5652I7p5J08l47K44R6J05j69P5K7j47j31J11j05J34k28L36j64L8k07N4O06k02
5674B56n82K62p3K00k2k03J78p5L6oN6k70L05p4R3k00QQj28M24l04J16Q3j66P9
5699Ap5Q3r1M2O0L7k34N1J31K1J39l07R0K97l58k02K01K23k20L92k86qk44K19
$$ plain form
5530 -51 -31 11 -63 -125 -24 -59 67 -16 92 47 5 -52 -74 -95 35 -30 -291 104 6 -37 -17 -1 -109 -46 -163 13
5556 13 6 -310 350 36 -51 -214 80 -291 51 -20 271 61 55 229 -76 -68 -29 -61 -52 -153 -2 106 0 -104
5580 -104 -152 19 -120 -94 218 -116 281 397 -15 -57 -269 -15 -126 46 -60 -30 99 -82 -42 -151 -117 58
5602 58 13 225 75 152 138 -22 45 -20 189 127 178 168 -356 -21 -22 -164 -161 -52 -215 149 212 -35 301 -32 -3
5627 -3 -64 -20 9 133 -203 67 49 -67 98 43 89 -67 -81 -110 -162 -129 -171 41 111 288 -93 -16 -138 17 97
5652 97 22 130 -217 27 123 228 59 134 161 14 -117 -6 -111 23 -205 131 -33 5 -202 -148 458 256
5674 256 -326 -64 -137 63 41 -162 16 -59 -23 -29 27 -243 62 -12 81 -119 -111 -103 -231 193 -111 5 88 -78 1
5699 1 -74 9 -82 -40 20 57 -177 -126 5 26 165 -142 -52 245 -113 -315 -114 109 -111 281 -5 -13 -257 -38
5723c8J41j27q0J69K78m17j30K9L62k21j95J00J95j66P1J04m28J65K94j24q9J22
5745A5m6j44J05K65j29J2j72L0K66k28Nj14J86J76k82P2o8N1J26j98J63k71M4
5768a36M1q2K37r8N3J60j30N6q3n3Q0r0J95l65J91J32k26J26q1j30J88J33J61
5791B79j67p1k3M6l9J20j34l8j10j59L25q8j07J42J2m0k17K76J8K34l27J26O1
5814A19j51J76j94Q2J63j98J50j76J90l87J85j76J28J81l4k9n4m8O1j13j78M47
5836A44Ok33K04k26J69m1L8m9k24L83J6j28p4L00k38j19J63L3M4k5m84J77J80
5859A6M3j23l3J12l9rr8J72j49K40k22%J61R9J68k61m9J05r5l7qQ6P9l79K07o6
5885h0O3J9J59j6k47rJ07J89k69K30l60K33J16l01J25L18l53J15m7J18m9k6j83
$$ plain form
5723 -38 103 -24 -104 65 343 -74 -204 -175 187 -34 -229 -129 66 -100 -29 75 -353 -188 106 -18 -107 15
5745 15 -31 -175 -70 195 66 78 -94 -64 202 -26 -21 -135 51 227 -55 17 -51 0 126 -72 91 -180 -136
5768 -136 -95 -177 60 -38 15 175 45 101 18 -35 45 -45 150 -215 -24 108 -118 8 -73 -203 -15 118 279
5791 279 112 41 18 64 25 145 11 -27 -137 -296 29 -59 -166 -24 -12 -52 -269 7 25 259 -68 58 119
5814 119 -32 144 -50 32 195 -3 147 -29 161 -226 -41 -217 -89 92 58 29 -25 -73 -12 -125 -303 144
5836 144 150 -83 121 -105 64 23 61 12 -212 171 187 59 -15 285 47 -72 91 124 168 143 -341 -164 16
5859 16 59 -64 -97 15 -24 -33 -131 41 -108 132 -90 -90 71 170 338 77 28 133 38 1 -7 79 158 -221 -14 -80
5885 -80 -17 2 161 145 -102 -111 -4 185 -84 146 -214 19 135 -166 -41 277 -76 39 -8 110 61 35 -148
5908a48L92k70J90m40J06L05j86%N6J04k62K39k15j02Q0o5L60k79K58Nj57Jj2
5931d0J28r9L9P2j76K59j76l4j06j86M54r1n3P5N0n3q2K01r7j72J48j58J06j64
5955a55m2K85j4k40M8k7J38N5k5RQ2q4r2J32j54L1J00j91K97k6p4k13L01m9k01
5980a09O0L9k32K20P4NL6Mo9J47j94P0k54K58J04k69M2K64j00k51K26j46P3n4
6004e6J43l69J79J05j50J30o3k5M4K67k36l39O27m96L13L3j18nk69K68PJ24k5
6027H9k42J40P4m37K47P4l6j72L11j36j4M2O5J85j44j35J42j53K50k99k5J03o5
6050a36J11p3%J92k60J93k02J65Q8K7j39K16l45J76k7J88k06J7M9k6j21Q8K2j72
6074a75rN36l08j65j1K20M4j51k07J60Jm8J65n7r5r0L18l93L05P9N4R3j24J26
$$ plain form
5908 -148 244 -26 164 -276 -170 135 -51 -51 5 109 -153 86 -129 -231 -151 -216 144 -135 123 128 -29 -28 -40
5931 -40 88 -11 28 100 -76 183 7 -27 -133 -319 135 44 -9 66 116 63 -19 182 85 -87 61 -97 9 -155
5955 -155 -197 88 74 -166 -118 -145 -7 48 23 32 114 30 -62 70 -84 -53 47 -144 153 127 53 -160 141 92 -109
5980 -109 -49 -10 -242 -22 52 57 93 97 28 175 -19 51 -203 55 159 -110 -68 196 96 -155 71 -75 -2 -56
6004 -56 87 -282 -103 2 -148 -18 -81 -106 -62 205 -31 -370 257 -239 74 107 -11 -16 -285 -17 -10 114 89
6027 89 -153 -13 61 -376 -129 -55 -91 -263 48 -88 -102 -60 5 190 46 -89 53 -100 150 -149 -174 -71 -136
6050 -136 -25 -98 -98 94 -166 27 -175 -10 78 105 -34 182 -163 13 -14 174 -32 -15 34 8 -113 -25 -3 -175
6074 -175 -184 352 44 -121 -132 88 132 -19 -226 -66 -65 -113 52 -5 -100 -190 128 -265 40 119 173 266 142 268
6098B68l06j95L31r0l1R3J06j51J6L4o8%k35O0L2L55j28qk29J68LJ26p7j95j3
6123a34J42l2j58K46j21K34o5k6P3j9k01j62L21j12r4O3M9r7J8j69K09Q1j1J69
6147B04l65N52m28l0J05P9j6q8j55L30k15J2P5M9k10j71J27P2l28K71K58k18J0
6170h0m9K67J20l73j82L57K5O7j68%N8j88J51M8n1j92K97k45N4P4K34l25K83j29
6194E3O3j35j44L02o4J16k44k32K59O0j54J71m9P0j57M20l50P7Q4j72K1K65k86
6217b6J88j5n4j13q9J85J05j29k4P8j64J94Qj41J7J56j87J11l4r3j2J62l81J29
6241a29Q6K46r5k13k0J62k69K59R5R1k22KL26n41M37k32N0J86j57k9j16l6J7J36
6265C4J54j20M0k11J31j01L2J81J80l49K50Lj58j21k1M29j47l70K05J94l04K59
$$ plain form
6098 268 -38 -233 98 8 -23 70 176 25 41 75 7 7 -228 -168 -136 219 91 83 -146 22 25 151 74 -121 -134
6123 -134 8 -24 -182 64 -57 177 112 86 159 140 -61 -223 98 -14 -108 -45 4 -93 -75 -244 -35 46 35 204
6147 204 -161 391 -37 -67 38 117 101 13 -142 188 -27 -15 60 109 -101 -272 -145 -73 -401 -130 128 -90 -80
6170 -80 -129 138 258 -115 -297 60 85 152 -16 -16 42 -146 5 53 2 -190 107 -138 -84 -10 224 -101 182 53
6194 53 116 -19 -163 139 75 191 -53 -285 -26 34 -120 51 2 72 -85 335 -15 62 146 -26 -5 260 -26
6217 -26 162 147 93 -20 -109 76 181 52 28 106 -58 136 144 3 20 176 -11 100 66 -27 -39 123 -258 -129
6241 -129 -43 203 108 -105 -125 37 -232 27 122 213 -9 -7 319 -222 215 -17 33 219 62 33 -83 -119 -102 34
6265 34 188 68 108 -103 28 -73 -41 140 320 -29 221 224 66 -55 -76 353 206 -164 41 235 -69 190
6287A90O6Kj08l35L16q9j42M8m0K58n7N1k79L4L02l71R9o3R0l4J50k23P0k59L51
6312B7o6J47R4j15j87K21p9j17j01J69k1J3k07J75O2O8n5j3jR9m7j02K05n5lk77
6338a66L20k71NJ30q6m6J22K07m74p2K29K26J33j77j04k24K57M4j97K75j00j01
6360g0m6O1r6M41l73j01L40N6l54K42k62J39O0k9J63l11K09k6p7Q1j0m11O39k96
6384c1J33k24K5n8J34j84M6K77j42J13l40N8J6L44j52j89Q6J84k99K20L9l56R7
6407b03K05qj45J25K11m4lj87RJ39r0M5K58j57j92q0J20j39L15k93J44k6j53K94
6431A45j83R4k24K80p6k14K07k06K05k23J17m5J79q0rK2j6r4K06k27M09k95P7
6454D9J96j55l5r8N5k19N76o03M57m53K23O0n8N2k35J71r0J22J14J34k95n0J92
$$ plain form
6287 190 256 258 150 -185 131 42 -100 -52 -92 166 109 160 -119 -85 217 -154 -55 -118 -28 -62 88 -135 -65 -324 27
6312 27 -39 108 202 87 -100 121 42 -75 -176 -7 -28 -15 -222 -47 15 83 28 15 14 113 66 -36 169 114 111 -166
6338 -166 154 -117 -112 18 -68 -114 8 215 -259 -331 -102 124 257 80 -24 -248 9 53 -144 131 31 -70
6360 -70 -116 -55 -151 290 -83 -184 156 212 -142 100 -162 -23 37 8 171 -140 69 43 -34 47 37 -374 265 -31
6384 -31 102 -122 -97 -155 -21 -205 -159 118 -24 89 -251 -193 -177 167 15 -174 -88 96 -203 17 56 -300 -203
6407 -203 2 -6 -151 -26 185 141 138 -49 -40 99 9 54 312 155 -37 -117 3 -136 179 -114 30 4 -149 145
6431 145 -38 56 -168 112 36 -178 29 -177 28 -195 -78 -123 56 -24 -33 -11 -27 -121 85 -142 267 -28 49
6454 49 245 90 55 -43 12 -207 369 -234 223 -230 -7 53 -5 47 -188 -17 -107 15 129 263 -32 -82 110
6477A10o9J3m6K40j99k29J37J90j29K5j73P9J76p5K2M4j27J2OJ12k25R2p7O8k8
6502e1P2K91n33L17Q1l40j45K28O4Pq2P2j10m2K48j56K0j2j66K81k05K25q0K14
6526A98o2j10L7M4r7qR2j16q4K01l28L14j21PJ01J42j70k21L33k37r6rj11K46
6550e5j18N6P9k2K37M4j85p5J41j73o9K04m1m2m6J24oJ8j20J28l04K22LK4j06
$$ plain form
6477 110 41 54 8 248 49 -180 -43 147 18 43 -130 -51 125 50 72 116 -11 1 7 119 -106 -14 -91 -23 -51
6502 -51 21 312 -221 96 177 -163 -308 -80 -16 -9 -91 -19 -129 -171 77 -79 -59 -71 -237 44 -161 64 -16 198
6526 198 136 26 63 107 10 2 94 -22 -106 95 -233 81 -40 -33 68 210 40 -181 152 -85 -181 -190 -301 -55
6550 -55 -173 -117 -38 -60 177 221 36 -39 102 -71 -140 64 23 -19 -65 59 53 71 -49 79 -225 -3 0 24 -82
$$ [...]
8191C68
##END NTUPLES=NMR FID
##END=
