##TITLE=1H_SR73
 d2o, 8 sc, 
 3.08.2021
##JCAMPDX= 6.0         $$ Bruker NMR JCAMP-DX V2.0
##DATA TYPE= NMR FID
##DATA CLASS= NTUPLES
##ORIGIN= UXNMR, Bruker Analytische Messtechnik GmbH
##OWNER= root
$$ XWIN-NMR		Version 3.5
$$ Tue Aug  3 13:02:36 2021 Russian Standard Time (UT+4h)  she@DPX200
##.OBSERVE FREQUENCY= 200.131506
##.OBSERVE NUCLEUS= ^1H
##.DELAY= (6, 6)
##.ACQUISITION MODE= SIMULTANEOUS
##.ACQUISITION SCHEME= undefined
##.AVERAGES= 8
##.DIGITISER RES= 18
##SPECTROMETER/DATA SYSTEM= spect
##.PULSE SEQUENCE= zg30
##.SOLVENT NAME= D2O
##.SHIFT REFERENCE= (INTERNAL, D2O, 0, 15.7039)
##AUDIT TRAIL= $$ (NUMBER, WHEN, WHO, WHERE, WHAT)
$$ ##TITLE= Audit trail, XWIN-NMR		Version 3.5
$$ ##JCAMPDX= 5.01
$$ ##ORIGIN= Bruker BioSpin GmbH
$$ ##OWNER= she
$$ F:/spectra/data/she/nmr/H-F/1/audita.txt
$$ ##AUDIT TRAIL=  $$ (NUMBER, WHEN, WHO, WHERE, WHAT)
(   1,<2021-08-03 13:01:28.15 +0400>,<she>,<DPX200>,
      <created by zg, POWCHK disabled, PULCHK disabled
       configuration hash MD5:
       00 E9 B6 7A A2 85 ED C7 34 08 36 98 17 FE 4E 26
       data hash MD5: 16K
       A7 39 E9 AF 1D 54 76 97 F7 54 50 F1 07 2D 8D 71>)
$$ ##END=
$$ 
$$ hash MD5
$$ 92 68 05 42 55 65 37 84 FF F1 75 77 BC BD C8 62
##$RELAX= 
##$RELAX= 
##$RELAX= 
##$RELAX= 
##$RELAX= 
##$RELAX= 
$$ Bruker specific parameters
$$ --------------------------
##$DU= <F:/spectra>
##$EXPNO= 1
##$NAME= <H-F>
##$PROCNO= 1
##$TYPE= <nmr>
##$USER= <she>
##$AMP= (0..31)
100 100 100 100 100 100 100 100 100 100 100 100 100 100 100 100 100 100 
100 100 100 100 100 100 100 100 100 100 100 100 100 100 
##$AQSEQ= 0
##$AQ_mod= 1
##$AUNM= <au_zg>
##$AUTOPOS= <>
##$BF1= 200.13
##$BF2= 200.13
##$BF3= 200.13
##$BF4= 200.13
##$BF5= 200.13
##$BF6= 200.13
##$BF7= 200.13
##$BF8= 200.13
##$BYTORDA= 1
##$CFDGTYP= 0
##$CFRGTYP= 5
##$CHEMSTR= <none>
##$CNST= (0..31)
1 1 145 1 1 1 1 1 1 1 1 1 1 1 1 1 1 1 1 1 1 1 1 1 1 1 1 1 1 1 1 1 
##$CPDPRG= <>
##$CPDPRG1= <>
##$CPDPRG2= <>
##$CPDPRG3= <>
##$CPDPRG4= <mlev>
##$CPDPRG5= <mlev>
##$CPDPRG6= <mlev>
##$CPDPRG7= <mlev>
##$CPDPRG8= <mlev>
##$CPDPRGB= <>
##$CPDPRGT= <>
##$D= (0..31)
0 1.2 0 0 0 0 0 0 0 0.06 0 0.03 0 0 0 0 0.0002 0 0 0 0 0 0 0 0 0 0 0 0 
0 0 0 
##$DATE= 1627981287
##$DBL= (0..7)
120 120 120 120 120 120 120 120 
##$DBP= (0..7)
150 150 150 150 150 150 150 150 
##$DBP07= 0
##$DBPNAM0= <>
##$DBPNAM1= <>
##$DBPNAM2= <>
##$DBPNAM3= <>
##$DBPNAM4= <>
##$DBPNAM5= <>
##$DBPNAM6= <>
##$DBPNAM7= <>
##$DBPOAL= (0..7)
0.5 0.5 0.5 0.5 0.5 0.5 0.5 0.5 
##$DBPOFFS= (0..7)
0 0 0 0 0 0 0 0 
##$DE= 6
##$DECBNUC= <off>
##$DECIM= 32
##$DECNUC= <off>
##$DECSTAT= 4
##$DIGMOD= 1
##$DIGTYP= 9
##$DL= (0..7)
0 120 120 120 120 120 120 120 
##$DP= (0..7)
150 150 150 150 150 150 150 150 
##$DP07= 0
##$DPNAME0= <>
##$DPNAME1= <>
##$DPNAME2= <>
##$DPNAME3= <>
##$DPNAME4= <>
##$DPNAME5= <>
##$DPNAME6= <>
##$DPNAME7= <>
##$DPOAL= (0..7)
0.5 0.5 0.5 0.5 0.5 0.5 0.5 0.5 
##$DPOFFS= (0..7)
0 0 0 0 0 0 0 0 
##$DQDMODE= 0
##$DR= 18
##$DS= 0
##$DSLIST= <SSSSSSSSSSSSSSS>
##$DSPFIRM= 0
$$ [...]
##$SUBNAM2= <"">
##$SUBNAM3= <"">
##$SUBNAM4= <"">
##$SUBNAM5= <"">
##$SUBNAM6= <"">
##$SUBNAM7= <"">
##$SUBNAM8= <"">
##$SUBNAM9= <"">
##$SW= 20.0188882624521
##$SWIBOX= (0..15)
0 0 2 0 0 0 0 0 0 0 0 0 0 0 0 0 
##$SW_h= 4006.41025641026
##$TD= 16384
##$TD0= 1
##$TE= 0
##$TE2= 300
##$TE3= 300
##$TEG= 300
##$TL= (0..7)
0 120 120 120 120 120 120 120 
##$TP= (0..7)
150 150 150 150 150 150 150 150 
##$TP07= 0
##$TPNAME0= <>
##$TPNAME1= <>
##$TPNAME2= <>
##$TPNAME3= <>
##$TPNAME4= <>
##$TPNAME5= <>
##$TPNAME6= <>
##$TPNAME7= <>
##$TPOAL= (0..7)
0.5 0.5 0.5 0.5 0.5 0.5 0.5 0.5 
##$TPOFFS= (0..7)
0 0 0 0 0 0 0 0 
##$TUNHIN= 0
##$TUNHOUT= 0
##$TUNXOUT= 0
##$USERA1= <user>
##$USERA2= <user>
##$USERA3= <user>
##$USERA4= <user>
##$USERA5= <user>
##$V9= 5
##$VALIST= <valist>
##$VCLIST= <CCCCCCCCCCCCCCC>
##$VD= 0
##$VDLIST= <DDDDDDDDDDDDDDD>
##$VPLIST= <PPPPPPPPPPPPPPP>
##$VTLIST= <TTTTTTTTTTTTTTT>
##$WBST= 1024
##$WBSW= 4
##$XGAIN= (0..3)
0 0 0 0 
##$XL= 0
##$YL= 0
##$YMAX_a= 103498
##$YMIN_a= -166648
##$ZGOPTNS= <>
##$ZL1= 120
##$ZL2= 120
##$ZL3= 120
##$ZL4= 120
##$ABSF1= 10
##$ABSF2= 0
##$ABSG= 5
##$ABSL= 3
##$ALPHA= 0
##$AQORDER= 0
##$ASSFAC= 0
##$ASSFACI= 0
##$ASSFACX= 0
##$ASSWID= 0
##$AUNMP= <proc_1d>
##$AZFE= 0.1
##$AZFW= 0.1
##$BCFW= 1
##$BC_mod= 2
##$BYTORDP= 1
##$COROFFS= 0
##$CY= 11.3945322036743
##$DATMOD= 1
##$DC= 2
##$DFILT= <>
##$DTYPP= 0
##$F1P= 2.36226072786647
##$F2P= -0.459571619588291
##$FCOR= 0.5
##$FTSIZE= 0
##$FT_mod= 4
##$GAMMA= 1
##$GB= 0.15
##$INTBC= 1
##$INTSCL= 1
##$ISEN= 128
##$LB= 0.24
##$LEV0= 0
##$LPBIN= 0
##$MAXI= 10000
##$MC2= 0
##$MEAN= 0
##$ME_mod= 0
##$MI= 1.114404
##$NCOEF= 0
##$NC_proc= 0
##$NLEV= 6
##$NOISF1= 3.799351
##$NOISF2= 2.8
##$NSP= 1
##$NTH_PI= 0
##$NZP= 0
##$OFFSET= 15.70392
##$PC= 1
##$PHC0= -13354.88
##$PHC1= 7.000992
##$PH_mod= 1
##$PKNL= yes
##$PPARMOD= 0
##$PSCAL= 0
##$PSIGN= 0
##$REVERSE= no
##$SF= 200.130013532006
##$SI= 16384
##$SIGF1= 3
##$SIGF2= 2
##$SINO= 400
##$SIOLD= 16384
##$SREGLST= <1H.CDCl3>
##$SSB= 0
##$STSI= 0
##$STSR= 0
##$SW_p= 3612.71676300578
##$SYMM= 0
##$S_DEV= 0
##$TDeff= 0
##$TDoff= 0
##$TI= <>
##$TILT= no
##$TM1= 0
##$TM2= 0
##$TOPLEV= 0
##$USERP1= <user>
##$USERP2= <user>
##$USERP3= <user>
##$USERP4= <user>
##$USERP5= <user>
##$WDW= 1
##$XDIM= 8192
##$YMAX_p= 0
##$YMIN_p= 0
$$ End of Bruker specific parameters
$$ ---------------------------------
##NTUPLES= NMR FID
##VAR_NAME=  TIME,          FID/REAL,        FID/IMAG
##SYMBOL=    X,             R,               I
##VAR_TYPE=  INDEPENDENT,   DEPENDENT,       DEPENDENT
##VAR_FORM=  AFFN,          ASDF,            ASDF
##VAR_DIM=   8192,          8192,            8192
##UNITS=     SECONDS,       ARBITRARY UNITS, ARBITRARY UNITS
##FACTOR=    0.0002496,     1,               1
##FIRST=     0,             0,               0
##LAST=      2.0444736,     0,               0
##MIN=       0,             -166648,         0
##MAX=       2.0444736,     103498,          0
$$ Real data points
##PAGE= N=1
##DATA TABLE= (X++(R..R)), XYDATA
$$ [...]
2043D22J17k06m65l57J69N04M31J10j82q73l68N16L23K89J92l63m87k60J72K00
$$ 422 539 333 -132 -489 -320 184 615 725 543 -330 -698 -182 141 430 622 259 -228 -488 -316 -116
2063a16M24J80m3m86l82j05K31P88L94n54o10j19l71O37O83k6J26p24l48r5L68
$$ -116 308 488 445 -41 -423 -528 -297 491 885 331 -279 -398 -769 -132 551 525 651 -73 -421 -516 -148
2084a48P58K1k26n08l76j16L04O40K22%o63l03j73Q0P79K33o1k59k62o00L35M19
$$ -148 610 631 405 -103 -479 -595 -291 349 571 571 -92 -395 -568 -488 291 524 463 204 -58 -658 -323 96
2106I6L75N1l67l53m00J98L86K75L99m30p08k38K63N97K27K16n76k25k95n1P27
$$ 96 471 522 155 -198 -598 -400 -14 261 660 230 -478 -716 -453 144 371 587 11 -214 -509 -560 167
2127A67K87K36l06o32j11k7M43j0N64j45o86k86J76K12L63M23j33o93j42k76L27
$$ 167 454 690 384 -248 -359 -386 57 47 611 466 -220 -506 -330 -118 245 668 535 -158 -300 -576 -249
2148b49M83K27k29l2o86pL17J1O19J09l97m12k29q2M25N76J00n38m37j52M44p
$$ -249 234 461 232 200 -486 -493 -176 -165 454 563 166 -246 -475 -557 -132 444 544 6 -431 -583 -139 -146
2170a46O97Q9o77l24p0M3K49N66M3m1q38O7l12K87O94M31k54l72l92r9P5M75L23
$$ -146 551 640 -37 -361 -431 -388 -139 427 470 429 -409 -342 -654 -367 327 758 504 132 -260 -359 -284 191 514
2193E14m4o86o1m67M21N31M31k92k17n53j81L02L09N49j94l38m51k68J49O56N72
$$ 514 470 -216 -277 -744 -323 208 639 347 130 -423 -604 -302 7 556 362 24 -427 -695 -546 110 682
2214F82l07j83n73m7J19M47R1L83k77o39j62J4N36K16J67n11l5l49P9K99N32o8
$$ 682 375 192 -381 -428 -309 138 229 612 335 -304 -466 -452 84 300 467 -44 -79 -428 -349 -50 482 414
2236D14j56m44l36K46o2L43L74k39n35J23Q6p2M90P1J0j85n20o3R5M61L93J6n16
$$ 414 258 -186 -522 -276 -338 5 379 140 -395 -272 -186 -258 232 303 313 128 -392 -455 -360 101 494 510 -6
2259fk78k59J85J86Q72k92k83n29mj39P02J45J92l74l83m1j79N30K46L52n27q8
$$ -6 -284 -543 -358 -172 700 408 125 -404 -408 -547 155 300 492 118 -265 -306 -485 45 291 643 116 28
2281B8m39K25M5K89N45n00m46l89L54K87J58K75l68j08j10l54K46L53J23J73k69
$$ 28 -411 -186 -141 148 693 193 -253 -642 -288 -1 157 432 64 -44 -154 -508 -262 91 214 387 118
2302A18l54m43M42M0N23L47n06m76o7K42M37J9J28m15l86k11J51L55L74J78n09
$$ 118 -236 -679 -237 -197 326 673 167 -309 -376 -134 303 322 450 35 -351 -562 -411 -56 318 496 -13
2323a3m15n3K52K85K69K10l58k76n35J29L40L36L63j63m82l36J22K87R6L48l82
$$ -13 -428 -481 -229 56 325 535 177 -99 -634 -505 -165 171 534 371 -111 -447 -325 -38 58 406 24
2344B4m5j31j46K19K09J09r8k58l90Q6M59J70J27K07o33j37l21N67R4J28j81Q0
$$ 24 -21 -152 -298 -79 130 239 141 -117 -507 -421 38 208 335 542 -91 -228 -549 18 112 240 59 139
2366A39l69r6J25p3N23K16l36l18l68K3O53R6J54on71k20K06K39L05K11j83o55
$$ 139 -230 -326 -201 -274 249 465 129 -189 -557 -534 119 215 369 363 -208 -428 -222 17 322 533 350 -305
2388c05M0m1J07M47L62l47l92k65K52q4O34O6k90Q4m88k44K55L32L52j16k58n58
$$ -305 -265 -306 -199 248 610 263 -129 -394 -142 -226 408 474 184 268 -220 -464 -209 123 475 359 101 -457
2410d57m4Q7K45N39J01m46k98k09K58J65J69L83n01k24k39L36K93P4J61j48l46
$$ -457 -501 -414 -169 370 471 25 -273 -482 -224 -59 110 493 -8 -232 -471 -135 158 232 393 245 -101
2431a01l39p8M83M92k8k46k62k80J78O2J37K78J73n62k71J8J90L23m9J97k78k36
$$ -101 -440 -518 -35 457 429 183 -79 -359 -181 -119 18 296 469 -93 -364 -346 -156 167 118 315 37 -199
2453a99j47J02K53J79L48k58m20m07N75O3N0M1K19m94l24o2O01N2J22j57l26k44
$$ -199 -346 -244 9 188 536 278 -142 -549 26 89 139 180 399 -95 -419 -481 120 172 294 137 -189 -433
2475d33M2M91K99J30l28l84k51K2L69J38K43j25k96n20J80K42K64M78l34K4n48
$$ -433 -391 100 399 529 201 -183 -434 -412 -43 95 338 213 -83 -603 -423 -181 83 561 227 251 -297
2496b97N5R2J09L28j88j43n9l22L26J01K73J47l42m06j06L50J09L18Q4m7n87q9
$$ -297 -242 -150 -41 287 99 -44 -103 -425 -99 2 275 422 80 -326 -432 -82 27 345 429 382 -205 -294
2518b94j9K03M04J22r3n38j30q8J69M94j8R6m63p0j88M27M76j08m7l37k40j44
$$ -294 -313 -110 294 416 323 -215 -345 -433 -264 230 212 308 -155 -225 -413 14 490 382 335 -2 -242 -386
2540c86%L43J72L27m29n39M09jj5M69j54l67Q1j94q4L52N30jn96k69J58l06L77
$$ -386 -386 -43 129 456 27 -512 -103 -104 -119 350 196 -171 -90 -284 -368 -16 514 513 -83 -352 -194 -500 -123
2563a23M98J03k99k00l67J10K40K99o0o9l14l84R0M38K75L86j49o87j54j37M32
$$ -123 375 478 179 -21 -388 -278 -38 261 201 132 -182 -566 -476 -38 237 623 474 -213 -367 -504 -72
2584g2K83O7j01j40n53R7K59P8N99k15k86k45n0L79k3M45j08j69n13K2J60K20
$$ -72 211 278 177 37 -516 -419 -160 -82 517 302 16 -229 -279 100 77 522 414 245 -268 -246 -86 134
2606A34L50k15j76p2l83K25Q9M26J3j45k23n14K2M17J32K55k22j57l35k28N90
$$ 134 484 269 93 21 -362 -137 -48 378 391 246 23 -491 -469 -52 80 335 113 -44 -379 -607 -17
2627a7J47M44l99j00m43K21%N53l18J77k88l70l6K81J53M39k64l60j39j75L84
$$ -17 130 574 175 75 -368 -147 -147 406 88 265 -23 -393 -429 -148 5 444 180 -180 -319 -494 -110
2648a10L42J04P8o25j17K28j23N06k3K23k49l45m09J56K84O05j46j3m71l41n9
$$ -110 232 336 414 -211 -328 -100 -223 283 260 483 234 -111 -520 -364 -80 525 379 366 -105 -446 -505
2669e05M70K50P1l84k35k07J40R5O05O2k13j54n34K39R7N75q2p4l62Jk75M98K95
$$ -505 -35 215 286 -98 -333 -540 -400 -305 300 362 149 -5 -539 -300 -203 372 290 216 -146 -145 -420 78 373
2692C73j75k2k71k68r4L37L52j86J09l34k93J40M50J34K44k19k10m54R7R6M02
$$ 373 198 176 -95 -363 -457 -120 232 46 155 -179 -472 -332 118 252 496 277 67 -387 -290 -194 208
2713B08Q9O9n59N8r4J18P3J18J52j71m51O3K26J91J5R9j40k86r6l75O95J92J94
$$ 208 297 366 -193 -135 -229 -111 -38 80 232 61 -390 -327 -101 90 105 204 64 -222 -318 -693 2 194 388
2736C88j18m38r7j40K61M99j73K3m42kk57O11K77l26J12k06l17M5n2M01J55j75
$$ 388 270 -168 -265 -405 -144 355 182 205 -237 -239 -496 115 392 66 178 -28 -345 -300 -352 49 204 29
2758B9L71o08k1K82m3K53k23j46q1k2k05M10M62k19l44j26O9q0K43J80K0k58O3
$$ 29 400 -208 -229 53 10 263 40 -106 -187 -209 -414 -4 458 239 -105 -231 -162 -242 1 181 201 -57 6
2781Fm10J65L07J24j26k49N5m34L65O6O82q3l63m97K2J81L44L0k59M1K2l21n3
$$ 6 -404 -239 68 192 66 -183 -128 -562 -197 -131 551 468 105 -392 -370 -189 155 185 -74 -33 -11 -332 -385
2804c85N17r1M03m45k03p7l13O93J42k21k98L88m14L9J77J49o3J86j44l80N2J45
$$ -385 132 41 444 -1 -204 -281 -594 99 241 20 -278 110 -304 -265 -88 61 -2 184 40 -340 -288 -143
2826a43K65R6J22k77k89J17r3K43M45j23k91k80q7J58M72o6j86k01P7j66J64L59
$$ -143 122 218 340 63 -226 -109 -202 41 486 363 72 -208 -295 -137 335 269 83 -118 -41 -207 -43 316
2848C16k67K66M7n49K06Q4j6J10J46l78k05J72l69J76N53J24r8m67n5J57J7K76
$$ 316 49 315 362 -187 19 103 87 197 343 -35 -240 -68 -437 -261 292 416 318 -149 -204 -47 -30 246
2870B46m2m2l86L2l2J66K09L67k15j80m84M9M33j45K78k8l00k71Q7J9J45N79l53
$$ 246 204 162 -224 -192 -224 -58 151 518 303 123 -361 -312 121 -24 254 226 -74 -345 -258 -239 -94 485 132
2893A32j31j89k12K17K58K19k45K94n11l9k4M42j90K45k95k81J79J39o8K60j55
$$ 132 1 -188 -400 -183 75 294 49 343 -168 -207 -231 211 21 266 -29 -310 -131 8 -60 200 45
2914D5J46l66l22K32n8N60J62n10r4j33J94K11K24O5k03m2k26k03M68J57j55P5
$$ 45 191 -175 -497 -265 -323 237 399 -111 -205 -338 -144 67 291 356 153 111 -115 -318 150 307 152 227
2936B27k64k45J39J27K53J26m66j23j5J43L12j49L81k04k27l12K93l32M95J53
$$ 227 -37 -282 -143 -16 237 363 -103 -226 -241 -98 214 65 446 242 15 -297 -4 -336 159 312
2956C12L0l30k78m49O37K4P8L8j1l01j59P5M39J99J90m90l30k12L25L89k67M24
$$ 312 342 12 -266 -715 -78 -54 24 62 51 -250 -409 -334 105 304 494 4 -326 -538 -213 176 -91 333
2978C33k60kn63K59N6M42M1j48n18K28l8M4L15L02l87j49k20QK85K11L01l26m62
$$ 333 73 71 -492 -233 -177 265 306 158 -360 -132 -170 -126 189 491 104 -45 -265 -257 28 239 540 214 -248
3001b48j43j30M45K13l0J51k55l16q6J60J76K57K5k16n15M19J42K0K76k75o8l05
$$ -248 -391 -521 -76 137 107 258 3 -313 -399 -239 -63 194 219 3 -512 -93 49 69 345 70 2 -303
3023c03J30N3J89J96M2j2m36j67J5K81M02r6N5n32j33K03P8K34P1p1q2l54p8L12
$$ -303 -173 -120 69 265 307 295 -141 -308 -293 -12 390 294 349 -183 -316 -113 -35 199 270 199 117 -237 -315 -3
3047cK94J00k51j45k32J32M48j21K20k43m06k4K1M6K00m8k6J44m46L22m68P64
$$ -3 291 391 140 -5 -237 -105 343 222 442 199 -207 -231 -210 -164 36 -12 -38 106 -340 -18 -486 278
3069B78p9K73l88j08p5k55K06L14o6M4p07ML84L70R6o3j63j25n9J0L4O0L43j57
$$ 278 199 472 84 -24 -99 -354 -148 166 100 144 -563 -559 -175 195 291 228 65 -60 -119 -109 -75 -15 328 171
3093A71q2m37j21P12q5M48l50l80j38K20l72O98j1j85Ko57p0M81M44K2l49J12
$$ 171 89 -348 -469 243 158 606 256 -124 -262 -42 -414 284 273 88 90 -567 -637 -156 288 310 -39 73
3115G3m56L6QM28K84k54j66om37M46K80j0p5J33m76j93PN91J16p4k38k99j05J70
$$ 73 -383 -347 -339 89 373 119 -47 -53 -490 -44 236 226 151 284 -192 -385 -378 213 329 255 17 -282 -387 -217
3139b17L46ojK07m12m17nN29L44n0k40n45J20K46N4L59K59n40P3o03J99J45J11
$$ -217 129 123 122 329 -83 -500 -505 24 368 318 78 -467 -347 -101 -47 312 571 31 104 -499 -300 -155 -44
3162d4K34K54n05j98J00n0O98o8J12l54n79k7K93N77l25O9l42j72J96m6m7M71
$$ -44 190 444 -61 -259 -159 -209 489 421 533 179 -400 -427 -134 443 118 187 -155 -327 -131 -177 -224 247
3184B47q1k09K00o05L52K18L51lk35l26l44k0L54M51K2j27m71j47K61L2K91rO6
$$ 247 166 -43 157 -448 -96 122 473 470 235 -91 -435 -455 -101 350 372 245 -226 -373 -112 -80 211 202 268
3207B68m94j30K53l5N53R9P2n13l98k5J57O32N0k72k85l7j94k22J005o0J7n03
$$ 268 -226 -356 -103 -138 415 514 586 73 -325 -350 -193 439 489 217 -68 -105 -299 -521 484 424 441 -62
3229f2k94k7M52K1L19K12m85m69k59L03K89L99J03m79l60l17J81N88J30K38l07
$$ -62 -356 -383 69 90 409 621 136 -333 -592 -289 0 399 502 23 -337 -654 -473 115 245 483 176
3250A76m05o55N42K02O71k31J46q08j64J14M93J09L91m92n58J46L0L96O2Q6K45
$$ 176 -229 -884 -342 -140 531 300 446 -362 -526 -412 81 190 581 89 -469 -323 -293 103 165 251 496
3271D96l07o74J94K14K01K09r4k17n13l2N05O9M44l95J59l62m66K24K63L04L12
$$ 496 189 -485 -291 -77 124 333 239 22 -491 -523 -18 51 495 100 259 -103 -569 -345 -82 222 534
3292E34m13l55j42j67P27p6J78j63n71J26K33J01N07p8j16m20l57L81j35L60K2
$$ 534 121 -234 -376 -543 184 108 286 123 -448 -322 -89 12 519 441 325 -95 -452 -71 -206 154 176
3313A76K33o95j61J6L44M23j4l49q1m79K80L3N50l5K07o65l6k35L40M40J53J40
$$ 176 409 -286 -447 -431 -87 336 322 -27 -108 -587 -307 -274 276 241 448 -217 -253 -488 -148 292 445 585
3335E85n43n16J18P9M53L64l71m14n0q0R0L96N64m41j70l98R6M0K77R6L5l0m12
$$ 585 42 -474 -356 -277 176 540 169 -245 -295 -375 -285 111 675 234 64 -334 -238 -198 79 175 210 180 -232
3358b32m84L86J43P12P4m97n13P1OJ47M09n1R3n21k61J55K14L22K00j26j90n32
$$ -232 -716 -330 -187 525 599 102 -411 -340 -334 -187 222 171 264 -257 -518 -363 -149 173 373 247 57 -475
3380d75K01J30L04P9%k85o04M24j2L24N51n71k62j04l6K69L67p5k2j84j57k62
$$ -475 -274 -144 160 239 239 -46 -650 -226 -238 86 637 66 -196 -300 -336 -67 300 225 203 19 -138 -400
3402d00P5O55p0N0k22k61l91K56K40M51L5m80K2m65J76K84M74j07On08p0r0L81
$$ -400 -325 330 260 310 88 -173 -564 -308 -68 383 418 -62 -40 -505 -329 -45 429 322 328 -180 -250 -340 41
3425D1L52Q3rp60k56K17L14L17J48o8p35Oj3K92J55L45l11k32o05K26K76M04L65
$$ 41 393 476 467 -293 -549 -332 -18 299 447 379 -356 -350 -363 -71 84 429 118 -114 -719 -493 -217 187 552
3448E52j56m71k48J0L9K91L55j11k59k94pJ57K97J85L20n33m48l43L84N12K33
$$ 552 396 -75 -323 -313 -274 17 372 261 2 -292 -299 -142 155 340 660 127 -321 -664 -280 232 465
3469D65q0k70l13k49J30M46K04P3j10p82J06j13Q31j03K40m79k82r5j78N39L31
$$ 465 385 115 -198 -447 -317 129 333 406 296 -486 -380 -493 338 235 475 -4 -286 -381 -559 -20 311
3490C11o3j07l19k72N2N90p6M06M5n80n84j21O37M66J71k77k28o30J78l9N07K74
$$ 311 248 141 -178 -450 -398 192 116 522 567 -13 -597 -718 -81 385 556 279 51 -579 -401 -440 67 341
3512C41J42l62k17j55j35M47K0L41r8l62k12n1M13L75k01j77l16j37j65O07K29
$$ 341 483 121 -96 -251 -386 61 81 422 324 -38 -250 -301 112 487 286 109 -207 -344 -509 98 327
3533C27L4j89j74l45K77R5J16L44k03j65p76K73K79N49j10j21m09k18j00N87M36
$$ 327 361 172 -2 -347 -70 25 141 485 282 117 -659 -386 -107 442 332 211 -198 -416 -516 71 507
3554E07K67m60j70o80L16LL54K77j50O9p55L18k65K85M79J05o97j4k18K85L07
$$ 507 774 314 144 -536 -220 -217 137 414 264 333 -422 -104 -369 -84 395 500 -197 -211 -429 -144 163
3575A63O8J22k81l65l17L62M96K21j45k11l63j23M7N21O8M8j59m56j38K1N80K00
$$ 163 231 353 72 -293 -610 -248 248 469 324 113 -250 -373 -326 195 263 311 152 -304 -442 -421 159 359
3597C59K97k70m08m59m2L87O31K1j78l75k51n6L14K76j4j16j27k38r5L92J6mJ18
$$ 359 656 386 -22 -481 -523 -136 495 516 338 -37 -288 -344 -30 246 232 116 -11 -249 -344 48 64 60 178
3620A78j43k85k40K10M46L02k65r5l92O9l3L89j2K06j8p61J31r2O14o6O9Po12
$$ 178 35 -250 -490 -280 166 468 203 108 -284 -215 -248 141 129 335 317 -444 -313 -405 209 143 212 219 -393
3643c93l5L12J62M04P2l47n39K0Q6N6M97%j94k59m15K81J52J44N27j49l99m20
$$ -393 -428 -116 46 450 522 175 -364 -344 -258 -202 295 295 101 -158 -573 -292 -140 4 531 382 -17 -437
3665d37m7L85K62L85o84l8r7l81Q35j9K07j0k43l69m1J01O41j03O0j91o30r0R5
$$ -437 -484 -99 163 548 -136 -174 -271 -652 183 164 371 361 118 -251 -292 -191 450 347 407 216 -414 -504 -409
3688d09L62O29k27l83j18o3jJ86O60l17j18l90j11j38K51L39J95k70j30k91k8
$$ -409 -47 582 355 -28 -146 -209 -210 -24 636 319 201 -189 -300 -438 -187 152 347 77 -53 -344 -372
3709c72O14K17Nm06q7k79k30N27M79k96J24m24m2l22L55J08M52l03k45k97p7M26
$$ -372 242 459 464 58 -29 -308 -538 -11 468 172 296 -128 -170 -492 -137 -29 423 120 -125 -422 -499 -73
3731g3J65N96n21j95l27r4K82K97p1K06k74j44k75M86k33O34q5k46k59k80L8K06
$$ -73 92 688 167 -28 -355 -449 -167 130 59 265 -9 -153 -428 58 -175 459 374 128 -131 -411 -373 -167
3753a67M75Q6k11n11q9K06L31K07P7o30M3q9l8K12L97N6J25n02k62k58N19L25
$$ -167 308 394 183 -328 -417 -211 120 327 404 -226 -183 -272 -310 -98 299 355 480 -22 -284 -542 -23 302
3775C02m2Q2j6o72j73K74N43J0J88p74K86m86M49J90L8K56o52M2j31P0K69J47
$$ 302 260 342 326 -346 -519 -245 298 308 496 -278 8 -478 -29 161 199 455 -197 -155 -286 -216 53 200
3797B00lj94k53j78J94K65O39m64l62m3l12K84K14L93q4j76l41l0J16M1L39r1
$$ 200 197 3 -250 -428 -234 31 670 206 -156 -199 -511 -227 -13 380 296 120 -221 -251 -135 -94 245 154
3819A54J11o05j4J88J05K30L82k47o01j74P7M35M7K55k03j82j61L8J16J88J16
$$ 154 265 -340 -354 -166 -61 169 551 304 -297 -471 -394 41 88 343 140 -42 -203 -165 -49 139 255
3840B55N2k73j95j52K42L44M1q3o9k98l16L96L73r4J59k09m84k9K25L38j16L17
$$ 255 307 34 -161 -313 -71 273 314 231 162 -136 -452 -56 317 223 382 173 -311 -340 -115 223 107 424
3862D24m43k63J2k0L10L83p0m08p8j52k85O14J94O0l7n94j38P2M68L60j67j27
$$ 424 -19 -282 -270 -290 20 403 333 -75 -153 -305 -590 24 218 278 241 -353 -491 -419 49 409 242 115
3884A15n5l55j79L63O43k53m4m67j7K20j32L46R5r5k36j88j10o4O77J48k12k35
$$ 115 60 -295 -474 -111 532 279 235 -232 -249 -29 -161 185 280 185 -51 -239 -349 -413 264 412 200 -35
3906c5m51J89L13K21j8k3n0m61q6Q1L02M49k05k59k69O7M4L56K26Q7k01l31l69
$$ -35 -486 -297 16 237 219 196 146 -315 -401 -320 -18 431 226 -33 -302 -235 -191 165 391 478 277 -54 -423
3929d23M2M42L83m9k97m45j57K15M70O9l8j93j57k02L58j44M66k59K14k85k11
$$ -423 -381 61 444 395 98 -347 -504 -289 181 250 212 19 -138 -340 18 -126 340 81 295 10 -201
3950b01k4R6N58jl21k09l65nL41L67M94m89j81m54Q2L54K31J27l1k22l52j91L52
$$ -201 -225 -129 429 428 107 -102 -467 -472 -131 236 730 241 60 -394 -312 42 273 400 369 147 -205 -396 -44
3973d4J94p8K49k87l42R9k95O21M0R9r2k86j36O1N14Kj93J64l71k63K56k23K96
$$ -44 150 72 321 34 -308 -209 -504 117 157 256 164 -122 -258 -197 317 319 126 290 -81 -344 -88 -311 -15
3996a5M22k94j06l89j06M52K69Q3k4m32r3n0M77r2K23o5m60j93J52K00K77K53
$$ -15 407 113 7 -382 -488 -36 233 316 292 -140 -233 -283 194 102 325 260 -200 -393 -241 -41 236 489
4018D89l84j00j50k61L02Q7L18O7k89m12p7J28N18K49nl48p74M96j75K83K51J98
$$ 489 105 5 -145 -406 -104 -17 301 368 79 -333 -410 -282 236 485 480 132 -642 -146 -321 -38 213 411
4040D11k68r1j46j24K98J36K6k70l7l32J23N4N85J50j88k77n55J63J08L84J58
$$ 411 143 52 -94 -218 80 216 242 -28 -65 -397 -274 -220 365 515 327 50 -505 -342 -234 150 308
4061C08k06j63k77M30k29K20K17N8o18J18q4N04k96K94j02k14l66n0N38n5L56
$$ 308 102 -61 -338 92 -137 83 300 358 -260 -142 -226 278 -18 276 174 -40 -406 -456 82 27 383
4082C83j95k69j52j83L79L58j54k0R0n62L45o8k23L26J62q6j26m71J77M48J19
$$ 383 188 -81 -233 -416 -37 321 167 147 237 -325 20 -48 -271 55 217 131 5 -466 -289 159 278
4103B78o9p8j52m01K13J10L77O7n04J51l16K17K58M4j51L2j73k44J45q1M20J62
$$ 278 209 131 -21 -422 -209 -99 278 345 -159 -8 -324 -107 151 195 44 76 -97 -341 -196 -277 143 305
4125C05k0m11k65k00L90L44J57kk49m93J5N00N8Q9J12k91m20R9R4K68K63n2k73
$$ 305 285 -126 -391 -591 -201 143 300 298 49 -444 -429 71 129 218 330 39 -381 -282 -188 80 343 291 18
4148A8m58J29N5M78J79Ml69l49L3k15M32L44J03m64k86Q2o1L33K9K17l46J25m57
$$ 18 -440 -311 -256 222 401 405 36 -313 -280 -495 -63 281 384 -80 -366 -284 -345 -12 17 234 -112 13 -444
4171d44K85K39J01k7J9l26k49R9L27J58j2mk70l69J39K95J12L5k9Km33KJ52J35
$$ -444 -159 80 181 154 173 -153 -402 -303 24 182 170 166 -104 -473 -334 -39 73 108 79 81 -352 -350 -198 -63
4195f3K23j58m3l94L19o6K68L45L6k46j88o33N53k1L20J36l61n0n61L19K91J52
$$ -63 160 2 -41 -435 -116 -182 86 431 467 221 33 -600 -47 -68 252 388 27 -23 -584 -265 26 178
4217A78m5J76n63k51M17o0K67L86l51l61m04O56K9J55O5j24j1p00M16K80K04p1
$$ 178 133 309 -254 -505 -88 -148 119 505 154 -207 -611 45 74 229 294 170 159 -541 -125 155 359 288
4239B88J20n96j34L2L28P5N13k86m84R2k63M20j15K41l4rk45m48M33L38k14M51
$$ 288 408 -188 -322 -290 38 113 626 340 -144 -52 -315 105 -10 231 197 188 -57 -505 -72 266 52 503
4261E03o11Lm10L63J71M54m95K54l05m68L39L17l1J58j01k93k29k9M91K04j80
$$ 503 -108 -105 -515 -152 19 473 -22 232 -73 -541 -202 115 84 242 141 -152 -381 -410 81 285 105
4282A05K77k91k62o4j28Q39k8m67j85l39K40L04J6J87j97k23O1J1j64N25k37L10
$$ 105 382 91 -171 -235 -363 476 448 -19 -204 -543 -303 1 17 204 7 -216 -155 -144 -308 217 -20 290
4304B90m03k61J69Q0M40j58J44j36l36l16J07L37R1K96k89j49k87M25j45M08k16
$$ 290 -113 -374 -205 -125 315 157 301 165 -171 -487 -380 -43 48 344 55 -94 -381 44 -101 307 91
4325I1N5n26N4J35K03K70R0m27k46L4J35o4N29k58M00m28k41n3J80L55LL7m81
$$ 91 146 -380 -326 -191 12 282 372 -55 -301 -267 -132 -196 333 75 475 47 -194 -247 -67 288 291 328 -153
4348a53j46K03j36L13M40n20M0m21Q0L09k37M21q3k48k39K08j14M62J23j95k7
$$ -153 -299 -96 -232 81 521 1 41 -380 -300 9 -228 193 110 -138 -377 -169 -283 179 302 107 80
4369H0k24J5l94P00M5j83j8k15J73n3J39L21j99p3k94j80K55O2K06L12m83j11
$$ 80 -144 -129 -523 177 222 39 21 -194 -21 -74 65 386 187 114 -180 -360 -105 -43 163 475 -8 -119
4391a19l14l0N37M02k92m3k10r9j8L72k5K24l47M6n85L65J99J32L22m80j50p8
$$ -119 -433 -463 74 476 184 141 -69 -168 -186 186 161 385 38 84 -501 -136 63 195 517 37 -113 -191
4413a91k7L73P8jm9k17k11J3J00J85L12k57k28rl50K99L74Qj8o5n29J17K99m5
$$ -191 -218 155 233 232 183 -34 -245 -232 -132 53 365 108 -120 -129 -479 -180 194 202 184 119 -410 -293 6 -39
4437c9M93l84m46J81M8J61m6L15J72n40n9l13J12J19N14m2l39j48o8J47J3L01
$$ -39 454 70 -376 -195 -147 14 -32 283 455 -85 -144 -457 -345 -226 288 246 -93 -241 -309 -162 -149 152
4459A52K68j87k44j74k06K01K48J10R8j30n12m8J48O91j40j47k63p1J59J46l3
$$ 152 420 233 -11 -185 -391 -190 58 168 266 136 -376 -424 -276 415 275 128 -135 -206 -47 99 66
4480F6J78j82j45r7p3L10JM16l49J99o74J44k34K86K71P4k50j32j6j23P76m03
$$ 66 244 62 -83 -180 -253 57 58 474 125 324 -350 -206 -440 -154 117 191 -59 -191 -207 -330 446 43
4502D3L61l84l97K12j24L71k25N43l88M1l97J03J50P4K95l54L0n0m4J63K69j60
$$ 43 404 20 -377 -165 -289 82 -143 400 12 53 -344 -241 -91 -17 278 -76 -46 -96 -140 23 292 132
4524A32q3k08k10L52m4J98J01n3l30k29K26j60P33j23k8p0m80J42k41K83L71j42
$$ 132 49 -159 -369 -17 -61 137 238 185 -145 -374 -148 -308 425 302 274 204 -276 -134 -375 -92 279 137
4546A37N7l04k18L69j7J73K33l98l31L9k6M09L16l48Km78L00K06l9O2L27k97k1
$$ 137 194 -110 -328 41 24 197 430 32 -299 -260 -286 123 439 91 93 -385 -85 121 82 144 471 174 153
4569A53m65P7J74J12R0k37J41l05k7J97J04K42k32j35Jk39K04K42M9N5n9k10m88
$$ 153 -312 -235 -61 51 141 -96 45 -260 -287 -90 14 256 24 -111 -110 -349 -145 97 146 201 142 -68 -556
4592e56L80K69J60j49m9j69j82j24M83M2n1J8j77q1J03j1K02R5rl46k86M32L5
$$ -556 -176 93 253 104 55 -114 -296 -420 63 105 54 72 -105 -186 -83 -94 108 203 194 -152 -438 -6 29
4615B9K17r4o6j52l54L10K1K2Q2j8J2j79k2K1N51j89K7l74q3J60K8K53M8o3k27
$$ 29 246 152 86 -66 -420 -110 -89 -67 15 -3 9 -170 -192 -171 380 191 218 -156 -239 -79 -51 202 250 187 -40
4640d0j46J75J99l24L31L67l67j00j63m5M31l6J33j53n36nO4K05M1K60j92l36
$$ -40 -186 -11 188 -136 195 562 195 95 -68 -113 318 282 415 262 -274 -279 -215 -10 31 291 99 -237
4662b37J51J8l3L81p2n80L87l7j46K94k0Rl5r9K08m86M9M84k03J45k83l0P2J03
$$ -237 -86 -68 -101 280 208 -372 15 -22 -168 126 106 115 80 -19 189 -297 -248 236 33 178 -105 -135 -63 40
4686D0K32nl55j28Q7r1R0K55K5l7k54K18k98K74JK39k53P2l71m0K74K80k44J97
$$ 40 272 267 -88 -216 -129 -220 -130 125 150 113 -141 77 -221 53 54 293 40 112 -259 -299 -25 255 11 208
4710B08p0m08L12j31J5N07j40j61k84M0jJ58L58k30k6j08k22j0O1k0L28k51N0
$$ 208 138 -270 42 -89 -74 433 293 132 -152 -112 -113 45 403 173 147 39 -183 -193 -132 -152 176 -75 -25
4733b5j94M1M40k19L59l00m01R2l41N57K88k9k1l17m6J36l44N76J81j69k90l55
$$ -25 -219 -178 262 43 402 102 -299 -207 -548 9 297 268 247 -70 -116 20 -324 252 433 264 -26 -381
4755c81J19L52r7K56l28J19l11K54m1L10Qj19j73J5p1k28O11J67j11k74k76Q6
$$ -381 -262 90 -7 249 -79 40 -271 -17 -58 252 260 141 -32 -17 -88 -316 295 462 351 77 -199 -113
4777a13J9L10j08N8j3l00o5j5K96oR1m02k79J85M20O3j52P4J36k40k7J00O6J20
$$ -113 -94 216 108 166 153 -147 -212 -227 69 63 154 -248 -527 -342 78 141 -11 63 199 -41 -68 32 98 218
4801B18Q7q4l02Jj2J98j4j0N1j30k38J8K60K5K22OKo06J38J47L84j73Q7k56k95
$$ 218 305 221 -81 -80 -92 106 92 82 133 3 -235 -217 43 68 290 296 298 -308 -170 -23 361 188 275 19 -276
4826b76OK40J1J77J1l65J15l32J81L50j05j18K46j70j56j03L66J7j59o0J80k58
$$ -276 -270 -30 -19 158 169 -196 -81 -413 -232 118 13 -105 141 -29 -185 -288 78 95 -64 -124 56 -202
4848b02j70L54M26j92Mm55J81L2J5J24PJ21m55J65k01M53j21J02l3j20j51j60
$$ -202 -372 -18 408 216 220 -235 -54 -22 -7 117 124 245 -210 -45 -246 207 86 188 155 35 -116 -276
4870b76r1M97K52k71j15k4K21l91L50K70m89K42l73J72PP4L8q8K29o41Q0K92R
$$ -276 -367 130 382 111 -4 -28 193 -198 152 422 -67 175 -198 -26 -19 55 93 5 234 -407 -327 -35 -26
4893b6J40j70jl24o9J91K48M02j90q5k25j05KM69o1Kk26j30k50L28J67K14j33
$$ -26 114 -56 -57 -381 -450 -259 -11 391 201 116 -109 -214 -212 257 196 198 -28 -158 -408 -80 87 301 168
4916A68k88R8j80j42O01j48J5rj48o9j08Q3L87k67K05l78j53R5Q9L15K41j60l26
$$ 168 -120 -22 -202 -344 257 109 124 115 -33 -102 -210 -127 260 -7 198 -180 -333 -238 -149 166 407 247 -79
4939g9k11K3N14l94N02l0l04k73J87o3P8L41k70K67m70Op0K8M71n0j10j89J0N8
$$ -79 -290 -267 247 -147 355 325 21 -252 -65 -128 -50 291 21 288 -182 -176 -246 -218 253 203 93 -96 -86 -28
4963b8q7M61j5k69k05j55M36k86L89K8j52l9k80j5J17K83qL5k80j5m8O2Q6M28
$$ -28 -115 346 331 62 -143 -298 138 -148 241 269 117 78 -202 -217 -100 183 175 210 -70 -85 -133 -71 15 443
4987D43m76J52k73j5N02k15J27r8k40j82K19j29L39j01K39k82j22P3J57j49Q1
$$ 443 -33 119 -154 -169 333 118 245 147 -93 -275 -56 -185 154 53 292 10 -112 -39 118 -31 50
5008E0M14k77j25j80R7K03jj88J4j20k48J83K47J00j51L15l25n1j02K25P3J15
$$ 50 464 187 62 -118 -21 182 181 -7 7 -113 -361 -178 69 169 18 333 8 -43 -145 80 153 268
5030B68j76o3m21K93k95M70L38k57J13n33K37k09K16L05l02J85k57KL35k26M7
$$ 268 92 29 -392 -99 -394 76 414 157 270 -263 -26 -235 -19 286 -16 169 -88 -86 249 23 70
5051G0O5m4r6k48J71k90N95n4j74k67m6J17M51j50j44J05m6j35J4QR7K53m84P0
$$ 70 135 91 -5 -253 -82 -372 223 169 -5 -272 -318 -201 250 100 -44 61 15 -120 -106 -98 -1 252 -232 -162
5075a62J33k37M6M02r5r6k24J56q0j16M18mJ9k36k09L6M33J04j25j52l77L90j82
$$ -162 -29 -266 -220 182 87 -9 -233 -77 -157 -273 145 141 160 -76 -285 -249 184 288 163 11 -366 24 -158
5098a58L67l4m3l1n5k55M46m04L04j66K15k25K15m36K91j83L58J01l33p5j16j2
$$ -158 209 175 132 101 46 -209 237 -167 137 -29 186 -39 176 -260 31 -152 206 307 -26 -101 -217 -229
5120b29L57J42m07J52k75j39J18J48K13J73j99j31k67K07J37O7j28N6j60L45l51
$$ -229 128 270 -137 15 -260 -399 -281 -133 80 253 54 -77 -344 -137 0 67 -61 -5 -165 180 -171
5141a71J82Q7J98l38j38J97m32M29J7J14J10k05r4n3J26j38J62R2j65j58L5J29
$$ -171 11 98 296 -42 -180 17 -415 14 31 145 255 50 -44 -97 29 -109 53 145 -20 -178 -143 -14
5163a4Q0N2k39J51l42L28j18M18k26p3k03J6J79O2R5N1j80P3k22J11q9P8R9j89
$$ -14 66 118 -121 30 -312 16 -102 316 90 17 -186 -170 9 71 166 217 37 110 -112 -1 -90 -12 87 -102
5187a02K15r6o1r4LJ68K2o8p7k17O9K22K49q7k19k44M52l51J21J45J71j82k36
$$ -102 113 17 -44 -138 -135 33 55 -13 -90 -307 -238 -16 233 146 -73 -317 135 -216 -95 50 221 39 -197
5210a97Q1R2j73K95j88J98j01r1K33l13M14k5O1k40l24J30j72K79J86J19k10k40
$$ -197 -116 -24 -197 98 -90 108 7 -84 149 -164 250 225 286 46 -278 -148 -320 -41 145 264 54 -186
5232a86K31j75L12j08k12J97k32K0K09n6J68k74P7J25J31k52P1j15k4J82k15j16
$$ -186 45 -130 182 74 -138 59 -173 -153 56 0 168 -106 -29 96 227 -25 46 -69 -93 89 -126 -242
5254b42Q3l2K84j49p1Q6J68l56L72j17J10q0k17n3J76J03p8J07j84L1R7k99J7
$$ -242 -159 -191 93 -56 -127 -41 127 -229 143 26 136 56 -161 -214 -38 65 -13 94 -90 -59 38 -261 -244
5277b44K49O2p4l5j63j15L56K55k0j74p8k71K97PO7m7j36j18N3nM0K13K00j41
$$ -244 5 67 -7 -42 -205 -320 36 291 271 97 19 -252 45 52 119 72 -64 -182 -129 -134 -94 119 319 178
5301A78r5l53Q3q3M30K3N8m18K41k64j20L30L0J82l67M8J51P8l18L51j37k58K78
$$ 178 83 -270 -187 -270 160 183 241 -177 64 -200 -320 10 40 222 -145 -97 54 132 -186 165 28 -230 48
5324D8L0J60p4n4j08l5K60o45L48K4M7O5o1j64K74k67o2K85m4Q9l56M85l61j04
$$ 48 78 238 164 110 2 -33 227 -418 -70 -46 1 66 5 -159 115 -152 -214 71 27 116 -240 245 -116 -220
5348b20L19k2m5j83J56n3j49K44L9J32n16j0L32p1J24J44J66m77K45k70Q7J28
$$ -220 99 77 32 -151 5 -48 -197 47 86 218 -298 -308 24 -47 77 221 387 -90 155 -115 -28 100
5370A00p5J94j79K1m17L78j16L6J77k8k15j89K26Q1K05J26n13J28L07j59k8j26
$$ 100 25 219 40 61 -356 22 -94 -58 119 91 -124 -313 -87 -6 199 325 -188 -60 247 88 60 -66
5392f6l3q6J09j48r8J82K76l77M39Ol70K69j19n8n3J67o5l05K03Q4r5L31l79R1
$$ -66 -99 -185 -76 -224 -322 -140 136 -241 198 204 -166 103 -16 -74 -127 40 -25 -330 -127 -43 -138 193 -186 -95
5416i5J42j54J0k2K67K1K7j79n7n7P2N4j14J54m61M32r9Q4%j1l17N70k96J36m66
$$ -95 47 -107 -97 -119 148 169 196 17 -40 -97 -25 29 -85 69 -392 40 -59 25 25 14 -303 267 -29 107 -359
5441c59M32J22k49k2N7j98N5j10K08K69l52R7J47k80J24Q3K43j50l61K23M0J70
$$ -359 73 195 -54 -76 -19 -217 -162 -272 -64 205 -147 -50 97 -183 -59 24 267 117 -244 -21 19 189
5463A89J2j39l68J64LK41j62Q0l6p5J03j93K92P4k97K11j58l23J68n6K58J58k21
$$ 189 201 62 -306 -142 -139 102 -60 20 -16 -91 12 -181 111 185 -112 99 -59 -382 -214 -270 -12 146 -75
5486g5Q8J01k21J62p8J37J50j50j52k42K43R1j43N17n34J32j69J4K47J7j6r3m0
$$ -75 13 114 -107 55 -23 114 264 114 -38 -280 -37 54 -89 428 -106 26 -143 -129 118 135 119 26 -14
5509a4K02k6j21K50p6k39K17k27p1l2L23j68O3k28R2J5M3Q9j08J32k24K00j60
$$ -14 188 162 41 291 215 -24 193 -34 -105 -137 186 18 81 -147 -55 -40 3 92 -16 116 -108 92 -68
5532f8j97J91M07k20l72N07k78j15K45J2J4j41j68J6J04n6J99J24k44p0J41Q9
$$ -68 -265 -74 333 113 -259 248 -30 -145 100 112 126 -15 -183 -167 -63 -119 80 204 -40 -110 31 120
5554A20N7k12P7k49J50k3O9k03J26j81J93L2k87L62n7K75j15N1j82n33N90O2j58
$$ 120 177 -35 42 -207 -57 -80 -11 -214 -88 -269 -76 -44 -331 31 -26 249 134 185 3 -530 60 122 -36
5577c6j8L31k64m69L05J36L75j66k00J61m40J17L00Qj66K45m31J19N4m6J99J73
$$ -36 -54 277 13 -456 -151 -15 360 194 -6 155 -285 -168 132 140 -26 219 -212 -93 -39 -85 114 287
5599B87k64O5Lj18O7J77l38K55qj15J41j98K61j58J96j9m35k4J84M80l62Jm6p4
$$ 287 23 88 91 -27 40 217 -121 134 126 11 152 -46 215 57 253 234 -201 -225 -41 439 77 78 32 -42
5623d2k60J39J41N0K85m53j14J31j81J73J70P4J98k74K47l62PR2k05Q8K36o4k81
$$ -42 -302 -163 -22 28 313 -140 -254 -123 -304 -131 39 113 311 37 284 -78 -71 21 -184 -96 140 76 -205
5646b05R8M8J00n0J48O1k58J57k77K85K30l42J03j00N4L9j19J59k80J24q6j20
$$ -205 -107 -59 41 -9 139 200 -58 99 -178 107 337 -5 98 -2 52 91 -28 131 -149 -25 -111 -231
5668b31K98M0k38M90k88k87R1Q0J88k35RJ36J75k99K13j73K3J05k48K46p1o2J20
$$ -231 67 107 -131 359 71 -216 -125 -45 143 -92 -83 53 228 -71 142 -31 -8 97 -151 95 24 -38 82
5691H2m8J87k51mJ26j68K45O4m6pk95K56mk99L33l6j22j04L3j20L16k60K21l45
$$ 82 34 221 -30 -34 92 -76 169 233 187 180 -115 141 137 -162 171 135 13 -91 -58 -178 138 -122 99 -246
5715b46L05j31L11k26J36M7l32R2J0j21j43L36n9m7q2L8J89P6j84J70j66P5r6
$$ -246 59 -72 239 13 149 196 -136 -44 -34 -155 -298 38 -21 -68 -150 -112 77 153 -31 139 -27 48 -48
5738d8J18J20j06j79K83q0k52r6K17m9K31M16n59q4k28K18J57LL9j90l6M36k79
$$ -48 70 190 84 -95 188 108 -144 -240 -23 -72 159 575 16 -68 -296 -78 79 82 121 -69 -105 331 52
5761E2k74M30k86P3k90K36l1Q0Q5J85k27o9K8j74M75l07j32K01j0j20L4L02j99
$$ 52 -222 208 -78 -5 -295 -59 -90 -10 75 260 33 -36 -8 -182 293 -14 -146 55 45 -75 -41 261 62
5784F2r7J94j23k14J96j33J87o7J9k75l84O74M3J71k58M16p03K46m9M8K44k2r4
$$ 62 -35 159 36 -178 18 -115 72 5 24 -251 -635 39 82 253 -5 411 -292 -46 -95 -47 197 175 81
5807H1j82RJ21o7L04k85M71o15j63M56K7o5j47J13r4k25l3J94L27k27k31R5%K24
$$ 81 -101 -92 29 -38 266 -19 452 -163 -326 130 157 92 -55 58 -36 -261 -294 -100 227 0 -231 -136 -136 88
5831H8k31J01J08L69o23oK06j41J29K87k27J80l72O9J58r0J32N8l18Q5j55J69
$$ 88 -143 -42 66 435 -188 -194 12 -129 0 287 60 240 -132 -63 95 5 137 195 -123 -38 -193 -24
5853b4l20M43J21j67m3K3l91K28L60k17j53J28k25J47M0J77M0r6M1k50j56P9N12
$$ -24 -344 99 220 53 10 33 -358 -130 230 13 -140 -12 -237 -90 -50 127 167 71 112 -138 -294 -215 297
5876B97j06l46J19j99Q9PL84j41n3p4k4k93M81l43M44j02j82J15k46L2K58N2o
$$ 297 191 -155 -36 -235 -146 -139 245 104 51 -23 -47 -340 141 -202 242 140 -42 73 -173 -141 117 169 163
5899A63mk80m8J98r6J12n5Q6l34L07j82L63j49j60J00k59K34n7K16p0M4N3k08
$$ 163 159 -121 -169 29 -67 45 -10 76 -258 49 -133 230 81 -79 21 -238 -4 -61 155 85 129 182 -26
5922b6J1j91M7L06q8K18l42KJ59l7Q5M8J29p6j98l4Q6l7J49j09j79j33j67j67
$$ -26 -15 -206 -159 147 59 277 -65 -63 96 59 144 192 321 245 47 13 99 62 211 102 -77 -210 -377 -544
5946e44N54J49p8p9m2j31k09L47L7p3q9K72l07K65Q1j10kL16k96k94K30J50j87
$$ -544 10 159 81 2 -40 -171 -380 -33 4 -69 -158 114 -193 72 153 43 41 357 61 -233 -3 147 -40
5969d0J26J24k90L7K02j31j34J87l0L7j41m5l1K02R8q0K11k15R4l79J38k6K49
$$ -40 86 210 -80 -43 159 28 -106 81 51 88 -53 -98 -129 73 171 91 302 87 181 -198 -60 -86 163
5992A63l9l47J09L46j89J4m1J29j36k26L53j83M9K45j97j84J61K5k91L84j45K16
$$ 163 124 -223 -114 232 43 57 16 145 9 -217 136 -47 2 247 50 -134 27 52 -239 145 0 216
6014B16l47J98o2k20L54M8j04j12l42M07P3O8J34k10j11L4Q7p4N6l1j0o9L2o0
$$ 216 -131 67 5 -215 139 187 83 -29 -371 36 109 177 311 101 -10 24 111 37 93 62 52 -17 15 -45
6038d5J06m8J48j53J8m1l4k72L83N3k12N04l23k80j8L73j90PJ64j37k31J66J31
$$ -45 61 13 161 8 26 -15 -49 -321 62 115 -97 407 84 -196 -214 159 -31 -24 140 3 -228 -62 69
6061F9J71l42R5M9k01q0Q5M84l35J46k24o8K38J18k81R1J25j89k31L9L03l8j86
$$ 69 240 -102 -7 42 -159 -239 -154 330 -5 141 -83 -151 87 205 -76 15 140 -49 -280 -241 62 24 -162
6084a62L14o9nk55O4K17J4R0j08j55j05J56k21K90J12k09K5r0M0J49j96l38K47
$$ -162 152 83 78 -177 -113 104 118 208 100 -55 -160 -4 -225 65 177 -32 -7 -97 -57 92 -104 -442 -195
6107a95R6j05K60j15J29L38j90j62j18J9J10jJ18o7j92N3o4P8J9j42J20J54k7
$$ -195 -99 -204 56 -59 70 408 218 56 -62 -43 67 66 184 117 -75 -22 -86 -8 11 -131 -11 143 116
6130A16m9J54k44K31k48j17K09r3P7p5Q0j44J64j63j6k3J45l8n4K3O8N2n0r0K53
$$ 116 67 221 -23 208 -40 -157 52 -41 36 -39 41 -103 61 -102 -118 -141 4 -34 -88 -65 3 55 5 -85 168
6155A68P2k27N3k53J79K29k65K59k08l69Q3J26J18J66J21p4m82N04j82n1J47J86
$$ 168 240 13 66 -187 -8 221 -44 215 7 -362 -279 -153 -35 131 252 178 -304 200 18 -33 114 300
6177C00j22j58o1l3j09L05q5l11J62l99L93J93J32j40K98k69k92K30k06K07K35
$$ 300 178 20 -41 -74 -183 122 37 -274 -112 -511 -118 75 207 67 365 96 -196 34 -172 35 270
6198B70k49k7J32m06K94J65k24K23k98J33K23k98K6J81o5j39o8J01J75n6J90k17
$$ 270 21 -6 126 -280 14 179 -45 178 -120 13 236 -62 -36 145 80 -59 -127 -26 149 93 283 66
6220F6M2Q0k65k02L27r2J24k34K26j9j45j32J63j2k33Q1N5%L69m57K20J40j74
$$ 66 108 188 -77 -279 48 -44 80 -154 72 53 -92 -224 -61 -73 -306 -225 -170 -170 199 -258 -38 102 -72
6243g2l1k0J44J66k78Q8j49J11k78J61lL8J83j54m2K6K80j46J5k25K00k18j9M26
$$ -72 -103 -123 21 187 -91 -3 -152 -41 -319 -158 -161 -123 60 -94 -136 -110 170 24 39 -186 14 -204 -223 203
6267B03L0l08J80K8k78J25L0R5J78k04q0m1K4j65k6J70Q9J09l13L33j32n2J17
$$ 203 233 -75 105 133 -145 -20 10 105 283 79 -1 -42 -18 -183 -209 -39 50 159 -154 179 47 -5 112
6290A12j02J24J72m44M55k10j99L46l86J34R3j93k9J27N3Q7m5J5m39M30k02R4
$$ 112 10 134 306 -138 317 107 -92 254 -132 2 95 -98 -127 0 53 140 95 110 -329 101 -101 -7
6312gK83o79K28J21O6O4N3J53l89J67n1J41J7m4j26K16j82j22o1K34Q4j33j62
$$ -7 276 -403 -175 -54 12 76 129 282 -107 60 9 150 167 123 -3 213 31 -91 -152 82 166 33 -129
6335a29L7J83n49K54L09k16J0NK87q5k85M04k03j05k37L3J79M42k03J0r9j34J41
$$ -129 -92 91 -458 -204 105 -111 -101 -96 191 106 -179 225 22 -83 -320 -287 -108 334 131 141 42 -92 49
6358D9j42L29l15J22Ll15L12j9l14N55j86N2m9j64J63j76J99J13N9n29K75Q7j40
$$ 49 -93 236 -79 43 46 -269 43 24 -290 265 79 131 82 -82 81 -95 104 217 276 -253 22 109 -31
6381c1QK29j47j48l2K36o66M48R0j49P1J30O3j12n3m5K47j72Q8k58K00j67K13
$$ -31 -23 206 59 -89 -121 115 -551 -103 -13 -162 -91 39 102 -10 -63 -108 139 -33 55 -203 -3 -170 43
6404D3j92J09Qk08L11J6r5J94j7k45n6nM29m85J39j27N01l09j22j3M9K5K82k52
$$ 43 -149 -40 -32 -240 71 87 -8 186 169 -76 -132 -137 292 -193 -54 -181 320 11 -111 -124 -75 -50 232 -20
6428b0r1J12j94K59o3J33l02l5O7M7K90j56j2J0j71K58j18j24L79k79M7N1k89
$$ -20 -111 1 -193 66 3 136 -166 -201 -134 -87 203 47 35 45 -126 132 14 -110 269 -10 37 88 -201
6451b01k1K61K12j90o9J98j85l06L09J00j83K56k37l91K52L94j11N4l77L45k3
$$ -201 -222 39 251 61 -8 190 5 -301 8 108 -75 181 -56 -447 -195 199 88 142 -235 110 87
6472H7m1k65L19P7j07j91NQ5K23j02l84O72n84L76j81j81M17k84Q6j55O1k3M8
$$ 87 46 -219 100 177 70 -121 -116 -31 192 90 -294 378 -206 170 -11 -192 225 -59 27 -128 -67 -90 -42
6495d2K19j60ll20K88j64J54J15j5p8k6p9j54N2J62RJ96k55Q0P7k18K90R7l34
$$ -42 177 17 14 -306 -18 -182 -28 87 72 -6 -32 -111 -265 -213 -51 -42 154 -101 -21 56 -162 128 225 -109
6519a09K49j16j88J93J51k34J16j0k29nK03Q4o0m0q2L14m32L04j16NN1N0k97j80
$$ -109 140 24 -164 29 180 -54 62 52 -177 -182 21 105 45 5 -77 237 -195 109 -7 -2 49 99 -198 -378
6543c78K00K27K9l8m7N5j27K49k18k0J85N4j30Q5k81J34K78k4j64J9l52K03L3
$$ -378 -178 49 78 40 -7 48 -79 170 -48 -68 117 171 41 126 -155 -21 257 233 69 88 -264 -61 -28
6566b8K03j29J75J25j92m36J43J54r6j13K17Nm7j79J13L03j68qj11J66j53J06
$$ -28 175 46 221 346 154 -282 -139 15 -81 -194 23 28 -19 -198 -85 218 50 42 -69 97 -56 50
6588E0k40M12l10K48l93K62j63L07J03j98l2k90K56q5j48J83K75l49J21N4K2q8
$$ 50 -190 222 -88 160 -233 29 -134 173 276 78 46 -244 12 -73 -221 -38 237 -112 9 63 85 -3
6610cJ91j48J00l80m5J8M25j70qj12r3Q9J6K34j25J69l45J39Q2j64J07m4K16r7
$$ -3 188 40 140 -240 -285 -267 158 -12 -20 -132 -225 -136 -120 114 -11 158 -187 -48 34 -130 -23 -67 149 52
6634E2k6M4L6j47r4L20n17K92j75R6M9J35j56J15m4P0l21K11r5J23J74k19oK17
$$ 52 26 70 106 -41 -135 185 -332 -40 -215 -119 -70 65 -91 24 -20 50 -271 -60 -155 -32 142 -77 -83 134
6658A34j30L93l16j71K80l48K19m21O05k92L51k38j19K9lJ65j77K6R4l60m2L85
$$ 134 4 397 81 -90 190 -158 61 -360 245 -47 304 66 -53 -24 -27 138 -39 -13 81 -279 -321 64
6680F4k02m1L02r9j56K10P1k12J66J98j65l7k99L2K52k14L32J49k56k18p5K35
$$ 64 -138 -179 123 24 -132 78 149 -63 103 301 136 99 -200 -168 84 -130 202 351 95 -123 -198 37
6702C7k99N1J77R2j45o1K20J1L9l8J44l91N6J59N9j50N9k33K61J24k25K0K66n
$$ 37 -262 -211 -34 58 -87 -148 72 83 122 84 228 -163 -107 52 111 -39 20 -213 48 172 -53 -33 233 228
6726B28k15J84J58j97krq3q8l6Ok75K44K78j10j62j35M57p2o2j12Qj41L47k66
$$ 228 13 197 355 158 156 147 64 -24 -60 -54 -329 -85 193 83 -79 -214 243 171 109 -3 5 -136 211 -55
6750e5l08O42l70K08J59j9m11J56j23J06K8K49m58K70j09o0M6PJ58K8l33j24K70
$$ -55 -363 279 -91 117 276 257 -154 2 -121 -15 13 262 -196 74 -35 -95 -49 -42 116 144 -189 -313 -43
6773d3k02L94J3m12K03J34N7L8O2p8j75L8l90K70J01l4P4Lr1L28k22k63M48R2
$$ -43 -245 149 162 -250 -47 87 144 182 244 166 -9 29 -361 -91 10 -24 50 53 -38 290 68 -195 253 345
6797C45k35o8j12j37J97j69J35Lm1L7j21J00O4M1Q1l43K79m5l70M29q8j63j31
$$ 345 110 42 -70 -207 -10 -179 -44 -41 -82 -45 -166 -66 -2 39 120 -223 56 11 -359 70 -18 -181 -312
6820c12K73J58k03k4L65j05j14L5j6j44J95KPp1qP2o8L0j81K10k0l3J7k52J76
$$ -312 -39 119 -84 -108 257 152 38 73 57 -87 108 110 117 46 38 110 42 72 -109 101 81 48 65 -187 -11
6845a1l68K62p3J25p1M9O1r9L22k56l0l1pj68M49K29k72r7k34L84p0l36Q2L72
$$ -11 -379 -117 -190 -65 -136 -87 -26 -125 197 -59 -89 -120 -127 -295 154 383 111 14 -220 164 94 -242 -160 212
6869B12J59m47o5N11k23k15QO1J07K5L1j72K58k04r8J54j8k55M40l63L39j52j37
$$ 212 371 -76 -141 370 147 -68 -60 1 108 133 164 -8 250 46 -52 102 84 -171 269 -94 245 93 -44
6892d4J88j52j09J23Q7K1r0j29j0l2M18k06J6J4k4o6p8P8R8J13l83K16P1j05J36
$$ -44 144 -8 -117 6 93 114 24 -105 -115 -147 271 65 81 95 71 5 -73 5 103 216 -167 49 120 15 151
6917A51j67n7J4k39NK43r6L22k82j56lK47P2j72J19O2j21j39l5PK04M3j95J21
$$ 151 -16 -73 -59 -298 -293 -50 -146 176 -106 -262 -265 -18 54 -118 1 63 -58 -197 -232 -225 -21 22 -173 -52
6941e2L8o6m1N8M2n4J63j01J04k90J64K72k87j44K63j26K31l37j11M56l13J21
$$ -52 -14 -80 -121 -63 -21 -75 88 -13 91 -199 -35 237 -50 -194 69 -57 174 -163 -274 182 -131 -10
6963a0j54J21j01k3K79Om49K71k9o6N4J82K9L8k73j09J27J67Lr4J84j54k80N0
$$ -10 -164 -43 -144 -167 112 118 -331 -60 -89 -155 -101 81 110 148 -125 -234 -107 60 63 -31 153 -1 -281 -231
6987b31K35j43L19l61K4l5J20q7K85J19m22j44K89j32K14J47m89M80o10L99q2
$$ -231 4 -139 180 -181 -157 -192 -72 -159 126 245 -177 -321 -32 -164 50 197 -292 188 -422 -23 -105
7008a05j11J58K05l43N74o33J27M2n6K90j15K52n03K93J7R0ol30K82Ok05j80M57
$$ -105 -216 -58 147 -196 378 -255 -128 -86 -142 148 33 285 -218 75 92 182 176 -154 128 134 -71 -251 206
7031B06l8k53K25J00l64K6%M7O1j72j53L48l6N8n5J12Jj45j82J28q4R7L30k68
$$ 206 168 -85 140 240 -124 -98 -98 -51 10 -162 -315 33 -3 55 0 112 113 -32 -214 -86 -170 -73 257 -11
7055a1l4J37n6J0j42K68j11J84k77J03P4Q9l11p4J08j49N4K40j9k39M30l14P2
$$ -11 -45 92 36 46 -96 172 61 245 -32 71 145 234 -77 -151 -43 -192 -138 102 83 -156 274 -40 32
7078C2J21l6L7j5j50j46j16L10r6j85M84k76K74j92j83K00j07o4P4J07l14K16
$$ 32 153 117 154 139 -11 -157 -273 37 -59 -244 240 -36 238 46 -137 63 -44 -108 -34 73 -241 -25
7100b5J78k51N34m86L3l4J55p1k12K62j99K48k67L0J74J22n3k17rJ37r3j67K77
$$ -25 153 -98 436 -50 -17 -51 104 33 -179 83 -116 132 -135 -105 69 191 138 -79 -88 49 -44 -211 66
7123F6R3k25ll2j5L79m46L72k44j7K08k18J65r7K14r5m41O78n03R2j03J39N3P7
$$ 66 159 -66 -69 -101 -116 263 -183 189 -55 -72 136 -82 83 -14 200 105 -336 342 -161 -69 -172 -33 20 97
7147I7j08k01P9K8q2J23M1n1K89j97l21N51k21R5Jj9m1j67r3M17Nk01J18k42J80
$$ 97 -11 -212 -133 -105 -187 -64 -23 -74 215 18 -303 248 27 122 123 104 63 -104 -197 220 225 24 142 -100 80
7172H0r3p5R9J63k94K96l38K2L02j14J81j43J4k80M4M34j44j25Q5Q9k68k14J58
$$ 80 -13 -88 11 174 -120 176 -162 -140 162 48 229 86 100 -180 -136 298 154 29 114 203 -65 -279 -121
7195a21l2RJ82j77O2M0j11L70j12l3l1j59r6L30K98k57j53l0j19J92m2P8j42L6
$$ -121 -153 -144 38 -139 -77 -37 -148 222 110 77 46 -113 -209 121 419 162 9 -21 -140 52 10 88 -54 -18
7219a8j75J02J24L7R0m6j59Pl3L5Q3n5K74j74J29l65q4L57l01L52k01j24K09r7
$$ -18 -193 -91 33 70 160 114 -45 -38 -71 -36 47 -8 266 92 221 -144 -228 129 -172 180 -21 -145 64 -33
7243c3j25K03J05j69M32l96j66J6J05J88j0K3q2k07J6K29j41p9K73j5Q8l88J20
$$ -33 -158 45 150 -19 413 17 -149 -133 -28 160 150 173 91 -116 -100 129 -12 -91 182 167 255 -133 -13
7266a3o2n7N3K28k47J30k5J2K62k31j33J00j98J59RK32P4k06l85K23K15j99M0
$$ -13 -75 -132 -79 149 -98 32 7 19 281 50 -83 17 -181 -22 -13 219 293 87 -298 -75 140 -59 -19
7289a9m4k28J71K40j32m6o4PK81j3k90k05L62L4J37P5o5j20l43N28r9l1j9j39
$$ -19 -63 -291 -120 120 -12 -58 -122 -115 166 153 -137 -342 20 54 191 266 201 81 -262 266 167 136 117 -22
7313b2k93L11k71J50P4M5M3k98K37nN9j06P1k74L03j5l05J70K90k75J71j00l6
$$ -22 -315 -4 -275 -125 -51 -6 37 -261 -24 -29 30 -76 -5 -279 24 9 -296 -126 164 -111 60 -40 -76
7336g6j71O1K57j00nM35n54R3kJ63o1j48J52j95R3l5O8j26K74J51k76m4J51j29
$$ -76 -247 -186 71 -29 -34 401 -153 -60 -62 101 40 -108 44 -151 -58 -93 -25 -151 123 274 -2 -46 105 -24
7360b4l69M64j46J4R2m1p7K05k62MK44j58k7p7L4R9j8m7K79j79j15K37O1L8k48
$$ -24 -393 71 -75 -61 31 -10 -87 118 -144 -140 104 -54 -81 -158 -124 -25 -43 -90 189 10 -105 132 193 231 -17
7385a7O0J94k3k15k0j94J62j72J40J01L06o20N62k90P2N9nL5j35L9j28Q0J32j91
$$ -17 43 237 214 -1 -21 -215 -53 -225 -85 16 322 -298 264 -26 46 105 100 135 0 39 -89 -9 123 -68
7409f8j16K91k76L9J28o2K72L7k27k2n0j03Q5LJ62j86j0k9j66Q0M26j2l43J92
$$ -68 -184 107 -169 -130 -2 -64 208 245 18 -4 -54 -157 -72 -69 93 -93 -103 -132 -298 -218 208 196 -147 45
7433D5r9j32L52k61K00j13j2J51k82K25N1o1kk5j4q7K2j32O3L28n01J97O4r1K04
$$ 45 -54 -186 166 -95 105 -8 -20 131 -151 74 125 64 62 37 23 -64 -42 -174 -111 217 -284 -87 -23 -114 90
7458I0j15L84l09K6lJ0k79N2K04k76J50J27N6m10M82j82R7K3j65Kk2K07m6j96
$$ 90 -25 359 50 76 73 83 -196 -144 60 -216 -66 61 117 -293 189 7 104 127 -38 -36 -58 149 103 -93
7482i3K29j84RPK61n00L37J43l08J03k15oK33j51L35l5l20j6K19J14l54L24j70
$$ -93 136 -48 -39 -32 229 -271 66 209 -99 4 -211 -217 16 -135 200 165 -155 -171 48 162 -192 132 -38
7505c8K01p7l25K23J81p6q8p7J12r3J06rJ94k25p9M01m30J66J77m65O9k63L20
$$ -38 163 86 -239 -16 165 89 1 -76 36 -57 49 40 234 9 -70 331 -99 67 244 -221 -152 -415 -95
7528i5K78mj16k29K45j5j51j30Q6J14K76j85m0Qj51K42Q5p2o1j25J0J20J09m70
$$ -95 183 179 63 -166 79 64 -87 -217 -131 -17 259 74 34 42 -109 133 218 146 85 -40 -30 90 199 -271
7552b71O0K24J54l74J08j31L31O8l95N7L0j52L18l47M76k75K65n9k32J97k33L22
$$ -271 -211 13 167 -207 -99 -230 101 169 -226 -169 -139 -291 27 -320 156 -119 146 87 -145 52 -181 141
7574A41j64k2j60J40L21k06q4j86J23P7k43K25J65k6P5R6l24oO0Qj23K08j80J37
$$ 141 -23 -45 -205 -65 256 50 -34 -220 -97 -20 -263 -38 127 101 176 272 -52 -58 2 10 -113 95 -85 52
7598E2n9J18n09M30K10k12P9j37l0O0j40P8K04q8j8j82O1j89R7L34k86J10J12
$$ 52 -7 111 -398 32 242 30 109 -28 -58 2 -138 -60 144 56 38 -144 -83 -272 -175 159 -127 -17 95
7621I5l7j25K73j20J22j15l25J74L55l16r1j47K92K9k89J01K60k6L3j48m6r4K04
$$ 95 58 -67 206 86 208 93 -232 -58 297 -19 -110 -257 35 64 -225 -124 136 110 143 -5 -51 -145 59
7644E9J51o3j9J12l59J80j48K25k10K8or6R1Q9K16j83R1K29o39L17r5J16K04k10
$$ 59 210 147 128 240 -119 61 -87 138 -72 -44 -50 -146 -55 34 250 67 158 387 -252 65 -30 86 290 80
7668H0j94q6J43j44RL04j06k31R9J47j96N03j64J48o54L16J88k34M7k9J38J28
$$ 80 -114 -200 -57 -201 -192 112 6 -225 -126 21 -175 328 164 312 -342 -26 162 -72 -25 -54 84 212
7690B12n5Q8k42j80L63j45o3j8K78l42J54q7N8N3K2j66k49J09R0K9K18j62j30
$$ 212 157 245 3 -177 186 41 -22 -40 238 -104 50 -37 21 74 96 -70 -319 -210 -120 -91 127 -35 -165
7713a65q9L76O3m84L81J50k82m52O89R5k41j11J84l04J83k21K43L41k95r3j30
$$ -165 -254 122 185 -299 82 232 -50 -502 187 282 41 -70 114 -190 -7 -228 15 356 61 -32 -162
7734a62L7k3K48m2j54K55l19M87n15K90k1J9j02j19K07l74K68K72k28j63p5J55
$$ -162 -125 -148 100 58 -96 159 -160 327 -188 102 81 100 -2 -121 86 -288 -20 252 24 -139 -214 -59
7756e9L39l39P5J70m43K59r4Q9L5j01K27r2O6k40p4L08j49L8q3R0k6J35L7k06
$$ -59 280 -59 16 186 -257 2 -92 -3 32 -69 158 66 132 -108 -182 126 -23 15 -68 22 -4 131 168 -38
7780c8M5n4K93m13j02L28j99l7J70j27J82m37N18q4N0J86r8j71k30rlK42J13R6
$$ -38 7 -47 246 -167 -269 59 -140 -177 -7 -134 48 -389 129 45 95 281 183 12 -218 -227 -230 12 125 221
7804B21l40r0J92N5p4J94j92p9n6n7J62K08L2k31j99K36o0l4K53j6m56K53o1J38
$$ 221 -119 -209 -17 38 -36 158 -34 -113 -169 -226 -64 144 176 -55 -254 -18 -78 -112 141 125 -331 -78 -139 -1
7828aj29R3L90k84o7k21J25K72k44p2N8j58K20Q1j91L06n9P6l71L54l08L54k77
$$ -1 -130 -37 353 69 2 -219 -94 178 -66 -138 -80 -238 -18 63 -128 178 119 195 -176 178 -130 224 -53
7851e3J76m7J10k75M6l6O0J30l9O9k04l6o9J89k52J87J85k26J29Q4j17JOk15K45
$$ -53 123 76 186 -89 -43 -79 -19 111 72 141 -63 -99 -168 21 -231 -44 141 -85 44 128 11 12 18 -197 48
7876D8m1j45J21j65K69L25n63J81p0K14j62l9k76J55L9j5J26j1j06J85l02L18
$$ 48 7 -138 -17 -182 87 412 -151 30 -40 174 12 -27 -303 -148 -109 -124 2 -9 -115 70 -232 86
7898H6o5m8j2q8M6kK77j36k67K01j5K00k07K48o1l8k38M8L93m77K93l31o5L09
$$ 86 21 -27 -39 -127 -81 -83 194 58 -209 -8 -23 177 -30 218 157 119 -119 -71 322 -155 138 -193 -258 51
7922E1k5J56k97L34k77J29m1M1j41K20Pk19j26M63k90K6m2L80l08K79l86J78m43
$$ 51 26 182 -115 219 -58 71 30 71 -70 150 157 -62 -188 275 -15 11 -31 349 41 320 -66 112 -331
7945c31M42k80K35l02R6J16j2K34n75M33M5J47k73k4j20J61Q7j92O0J89k8M2r5
$$ -331 111 -169 66 -236 -140 -24 -36 198 -377 56 101 248 -25 -49 -169 -8 79 -113 -53 136 108 150 55
7968E5p7K7r3L34m2j15M2j90J98o7k00K25j69K95q4j73J9j30J65o9J89k41J03
$$ 55 -22 5 -88 246 204 89 131 -59 139 72 -128 97 -72 223 139 -34 -15 -145 20 -49 140 -101 2
7991Bj85J25Pl0M58m56j13L2O1L08o3J19j18j54r4J52j43M7K23O7j74j88K12j6
$$ 2 -183 -58 -51 -81 377 -79 -192 -160 -99 209 146 265 147 -7 -101 51 -92 -45 178 245 71 -117 95 79
8015G9J22j35m2l0k1j10j8K05l9R1k67M3j9p0K59J20k55j52J37J4M6O8J12m08
$$ 79 201 66 24 -6 -27 -137 -155 50 11 102 -165 -122 -141 -211 48 168 -87 -239 -102 -88 -42 26 138 -270
8039b70J34k4o4J01O5K32l00J37J3k33L17K0l61L98j47j14l4J11K01N6r7k33Q1
$$ -270 -136 -160 -224 -123 -58 174 -126 11 24 -209 108 128 -233 165 18 -96 -130 -19 182 238 141 -92 -11
8062a1qK43l16m5K57k93M47l61L4M74l11q7R9j94rO7kn8j03K62j46J87j84M5l
$$ -11 -19 224 -92 -137 120 -173 274 -87 -53 421 110 23 122 -72 -81 -14 -16 -74 -177 85 -61 126 -58 -13 -16
8087a6k55L41o8k8o1L98k46o2j29J56m4lqJ13Rk38J44K48k15j21J81r8j82J66
$$ -16 -271 70 2 -26 -87 311 65 3 -126 30 -14 -17 -25 88 97 -141 3 251 36 -85 96 -2 -184 -18
8111a8j32K8L30p9j48J37k57J18Q9q7%j9qM5J18L6k76J92J5nJ40k49n8n9P9N0
$$ -18 -150 -122 208 129 -19 118 -139 -21 68 -19 -19 -38 -46 -1 117 153 -123 69 84 79 219 -30 -88 -147 -68 -18
8137a8J47k16j38J33J56MM1n5m8M00o02J52J19L7J25l09J75k50J85j52K52Lm19
$$ -18 129 -87 -225 -92 64 68 109 54 6 406 -196 -44 75 112 237 -72 103 -147 38 -114 138 141 -278
8160b78J24J87L9%K0N5k04K22Pk73K55l87L84j08j22P0L6l97M31j34K34j31j48
$$ -278 -154 33 72 72 92 147 -57 165 172 -101 154 -233 151 43 -79 -9 27 -370 61 -73 161 30 -118
8183a18K3K10P8m8q8j37L6J24
$$ -118 -95 115 193 145 57 -80 -44 80
8191H0
$$ Imaginary data points
##PAGE= N=2
##DATA TABLE= (X++(I..I)), XYDATA
0@%%%%%%%%%%%%%%%%Qj6J6j6J6j6K4l2L2m0M8n4O2p2Q3r1J04j20J36j52J70j90
$$ 0 0 0 0 0 0 0 0 0 0 0 0 0 0 0 0 0 8 -8 8 -8 8 -8 16 -16 16 -24 24 -30 32 -40 43 -48 56 -64 72 -80 90 -100
38a00K11k35K63k92L22l58L98m39M82n31N87o48P14p86Q66r56J056j170J299j445
$$ -100 111 -124 139 -153 169 -189 209 -230 252 -279 308 -340 374 -412 454 -502 554 -616 683 -762
58g62J618j823K069k370K750l248L932m932O534r509J6851o8437j09321J27930
$$ -762 856 -967 1102 -1268 1482 -1766 2166 -2766 3768 -5741 11110 -57327 -166648 -38718
72c8718R0280j951L183L673q5247o0808L6726N6034K0511L9140J6377p3070r8259
$$ -38718 51562 49611 52794 56467 -28780 -89588 -52862 3172 23683 62823 79200 6130 -92129
85i2129l942P6836P9206L0894l7265q3738m4499K3948L6920L0949M3120P827o0652
$$ -92129 -96071 -19235 59971 90865 53600 -30138 -74637 -50689 -13769 17180 60300 68127 7475
98G475o2959j2212K0946N6557P3931J454q9561o7357J0496L5605L6261M7332J0635
$$ 7475 -55484 -67696 -46750 9807 83738 85192 -4369 -71726 -61230 -25625 10636 57968 68603
111F8603n6646o1234o298K1786K7574M7650L5120l7346q0302l5209L0036N2432
$$ 68603 11957 -49277 -55575 -33789 -6215 41435 76555 39209 -41093 -76302 -46266 6166
123F166M3937J3364l4392n6159l3563R092M6613N2550J0615l3017l7349k8622
$$ 6166 50103 63467 29075 -27084 -60647 -51555 -4942 47608 58223 25206 -12143 -40765
135d0765j7570K7537O9701L6371l7060n8705k8959J76K6316N1922L5019k4879
$$ -40765 -58335 -30798 38903 75274 38214 -20491 -49450 -49274 -22958 28964 63983 39104
147C9104n2929k5613L63R974L5074M7655M301n0356n1464j3431K4188M9329M1634
$$ 39104 -13825 -39438 -39075 -29101 5973 53628 57929 7573 -43891 -57322 -33134 16195 57829
160E7829p007n0062m1439m070K1201K9719K7776J1660k0808m4970l3781Q513M6496
$$ 57829 50822 760 -40679 -44749 -23548 6171 33947 45607 24799 -20171 -53952 -45439 1057
173A057M5514P844l5453m6765k2526J4705L9457L3157K667k0935k6683k5740j1914
$$ 1057 46571 54415 18962 -27803 -50329 -35624 3833 36990 39657 18722 -7961 -33701 -45615
186d5615K5537N1167K5825k5102m6500l0309K399L1985M0787J6441k1175l4693
$$ -45615 -20078 31089 56914 31812 -14688 -44997 -42598 -10613 30174 46615 25440 -9253
198i253k2372l125J4294L2226L1138j764l7536m0435r958K4956M0511K5388q989
$$ -9253 -31625 -34750 -20456 11770 42908 41144 3608 -36827 -46785 -21829 18682 44070 35081
211C5081l3676l1621q523J6864L0540K5275K967k2671l5589k3007J1595L9021
$$ 35081 1405 -30216 -38739 -21875 8665 33940 36907 14236 -21353 -44360 -32765 6256
223F256L2709J313k7733l4827j8252J1240L2999K8255L569j9920k7949k2055J69
$$ 6256 38965 40278 12545 -22282 -40534 -29294 3705 31960 35529 15609 -12340 -34395 -34226
236c4226K6963L5464J3547j9284l4436k4945J825K8166L3521J2091j7098l0633
$$ -34226 -7263 28201 41748 22464 -11972 -36917 -35092 -6926 26595 38686 21588 -9045
248i045k1793j155K0261K8731J8348o476k8569l0057q033K0669L3684K1297p278
$$ -9045 -30838 -31993 -11732 16999 35347 28871 302 -29755 -37788 -17119 16565 37862 30584
261C0584l0687k9912n309K0556K8211J6765k202k0610k7294j4470J0853K8514
$$ 30584 -103 -30015 -35324 -14768 13443 30208 28006 7396 -19898 -34368 -23515 4999
273D999K6011M262k3387l3764j6488J4503L1195K3098j28k0531k5365j4213O020
$$ 4999 31010 35272 11885 -21879 -38367 -23864 7331 30429 30301 9770 -15595 -29808 -23788
286b3788K1295K4152J1287j3513k9487k3259K248K6321K9661J0340j7566k9484
$$ -23788 -2493 21659 32946 19433 -10054 -33313 -31065 -4744 24917 35257 17691 -11793
298a1793j7767M272J9346K2417J2463p182k3692k3050n284J6113K7856J9642o662
$$ -11793 -29560 -25288 -5942 16475 28938 21756 -1936 -24986 -30270 -14157 13699 33341 26679
311B6679k8245k5903l075J8292K5385J5167n147k1178k1498p687R409K2607K1607
$$ 26679 -1566 -27469 -30544 -12252 13133 28300 23153 1975 -19523 -27210 -17801 4806 26413
324B6413K426k0180k7231j2810J0794K6206K1790j18k0480k2873r998P428J8626
$$ 26413 28839 8659 -18572 -31382 -20588 5618 27408 27290 6810 -16063 -26061 -18633 -7
337gJ9950O570j2794k3235j6604J543K0307K4860R653j5029k6233j5810M903J9179
$$ -7 19943 26513 13719 -9516 -26120 -24577 -4270 20590 30243 15214 -11019 -26829 -21926 -2747
351b747J9458P696q902j9038j6729l609J3348K2112J5054m736k2798k2383l786
$$ -2747 16711 24407 15505 -3533 -20262 -23871 -10523 11589 26643 21907 -891 -23274 -27060
364b7060J7288K3559J1367p453j8375j6825m978R905J8791J4935M93j4829k1443
$$ -27060 -9772 13787 25154 17701 -674 -17499 -22477 -12572 6219 21154 21647 6818 -14625
377a4625j1708Q927K3075J8316j219j8053k0053p664Q460J7788J4801K181j0741
$$ -14625 -26333 -17406 5669 23985 22766 4713 -15340 -23004 -14544 3244 18045 20226 9485
390I485j7864j2920J712J7387J9584O524j1857k0807j4236L406J8214J7687M218
$$ 9485 -8379 -21299 -19587 -2200 17384 23908 12051 -8756 -22992 -19586 -1372 16315 20533
403B0533r063j6250j3213j307J2929J8053R776o152j6924j6438l709J2934K0730
$$ 20533 11470 -4780 -17993 -19300 -6371 11682 21458 15306 -1618 -18056 -21765 -8831 11899
416A1899J0619p225j7258j4674l050J0685J6685J1452k376j4610j5887n919P604
$$ 11899 22518 15293 -1965 -16639 -19689 -9004 7681 19133 16757 2147 -13740 -19659 -12055
429a2055J6795J4355N4j4704j8343o888Q699J6580J2199Q55j1594j5915q540M719
$$ -12055 4740 19095 19149 4445 -13898 -20786 -12087 4493 16692 17547 5953 -9962 -18502 -13783
443a3783J4084J4176M586r508j7074j2777L418J6746J5774L354j0426j5390j0064
$$ -13783 301 14477 19063 9555 -7519 -20296 -16878 -132 15642 18996 8570 -6820 -16884
456a6884J901J2301J3828O443n701j4320j3425k254J1373J7643R599p158j7326
$$ -16884 -14983 -2682 11146 17589 11888 -2432 -15857 -18111 -6738 10905 20504 13346 -3980
469c980j2929N90J1265J3546P760k956j2976j3086m162P861J3764J2151L06j4266
$$ -3980 -16909 -16319 -5054 8492 16252 13296 320 -12766 -16928 -9067 4697 16848 17154 2888
483B888j7369m850J0921J5229Q783j762j0632j3542n520N212J2441J1721K829
$$ 2888 -14481 -19331 -8410 6819 15602 13840 3208 -10334 -15854 -10642 1799 13520 16349
496A6349q958j6059r598M572J5299J3379J622j0681j4035p351L307J1125J2449
$$ 16349 7391 -8668 -18266 -13694 1605 14984 16606 5925 -8110 -15461 -12154 -1029 11420
509A1420M463p149j3759r789M16J0547J4488P363p267j6129r896J708J0124J1734
$$ 11420 15883 8734 -5025 -14814 -14398 -3851 10637 18000 10733 -5396 -15292 -13584 -3460 8274
523H274P045l731j3416j1493j155Q434J2444Q774j893j2684j3423k977R195J2627
$$ 8274 15319 11588 -1828 -13321 -14476 -6042 6402 15176 13283 599 -12824 -15801 -6606 6021
537F021Q454j920j0917j2718l955O592J2349R429o6r379j2631n967M157J2081
$$ 6021 14475 12555 1638 -11080 -15035 -8443 3906 13335 13269 3890 -8741 -14708 -10551 1530
551A530J2078J399j0702j2713n846M132J0256J1199L002q325j2133o917J878Q380
$$ 1530 13608 15007 4305 -8408 -14254 -10122 134 11333 14335 6010 -6123 -13040 -11162 -2782
565b782J1713O641o339j4241r488K318J0257J0799N419n695j2042q937Q10Q066
$$ -2782 8931 15572 9233 -5008 -14496 -12178 -1921 8878 14297 8602 -3440 -12377 -11567 -3501
579c501R847O452k227j0596j1187l201Q298J2931P286l686j0841r484k681O353
$$ -3501 6346 12798 10571 -25 -11212 -14413 -6115 6816 14102 10416 -425 -9909 -12590 -6237
593f237J0766P553j738q489r223n432L419J1198J1079j9j0695j0581l893M085
$$ -6237 4529 12082 10344 1855 -7368 -12800 -9381 1817 12896 12877 2182 -8399 -12292 -8207
607h207R747R488R32q544r541m549J285Q114J0401L971o655j1609p150K021R032
$$ -8207 1540 11028 11960 3416 -6125 -10674 -9389 -1275 9126 13097 6442 -5167 -12317 -10296 -1264
622a264J0541L047o221j0144o620L49P874R661M384m133r190p983k157P447J1292
$$ -1264 9277 12324 6103 -4041 -10661 -10312 -2438 7223 11607 7474 -1716 -9699 -11856 -4409 6883
637F883N534m654r416p307k056O097J0650N726l388q149p070l557L570J0336Q366
$$ 6883 12417 7763 -1653 -8960 -11016 -4919 5731 11457 8069 -80 -7150 -10707 -7137 3199 11565
652A1565j475q674r267l273M350R288P967q76q134q038l504L065P875P893J597
$$ 11565 10090 1416 -7851 -11124 -6774 2514 10481 9605 1471 -6567 -10071 -7006 869 8762 10359
667A0359n888r453o166K474R315Q249J429n851q982o146K197P990Q013J761m199
$$ 10359 4471 -4982 -11148 -8674 641 8890 10319 4468 -4514 -10660 -8463 -473 7540 9301 5102
682E102p299o808p74P276R359L653m218q304o956j234P514R394L387m002p984
$$ 5102 -2197 -9005 -9779 -2503 6856 10509 6291 -2013 -8969 -10203 -2689 6705 10092 6090 -1894
697a894n745j275M870Q222N677k022p362q160k371N069Q826O041j541p648p980
$$ -1894 -7639 -8914 -4044 4178 9855 7833 471 -7689 -10060 -4991 3835 9876 8335 687 -7293
712g293k287M949P485N433N8n814q404l947L398P942O916L50n516q433m831L446
$$ -7293 -9580 -4631 2854 8287 8345 2531 -5873 -9820 -6422 1520 8436 8786 3270 -5163 -9994 -6548
728f548P967O496M20m936p097m789R26P029P506K394m686p965n315L76O721Q030
$$ -6548 1419 7915 8335 3399 -3698 -8487 -7561 -532 6974 9368 4682 -3283 -8598 -8222 -1501 6529
744F529K561m074p884n073J29N482P353L661k468p184o530j137N435P761M402
$$ 6529 9090 5016 -2868 -7941 -7812 -2330 5023 8684 6216 -968 -7498 -8635 -3200 4561 8963
759H963k117p156o775j304N349P025L741r89n947o565k830L678P275N421j62n420
$$ 8963 6846 -310 -7085 -8389 -3040 3985 7726 6737 790 -5775 -8605 -4927 2348 7769 7607 2187
775B187p857l371L602P631N913p98n538o155l526K014O653N887R71m351o805m693
$$ 2187 -5670 -9041 -5439 2192 8105 7307 1769 -4386 -7912 -5898 755 6642 7613 3262 -3543 -8236
791h236J493O571O940J538m443o948m833J620N612O203K085k949o590m874k20
$$ -8236 -6743 -172 6768 8306 3863 -3085 -7918 -6298 -686 5517 7602 4653 -1937 -6811 -7031
806g031M865O788L562k662o712o015o78N544O689L398k417o018n320j190M134
$$ -7031 -2166 4622 8184 5522 -1190 -7205 -7883 -2339 4350 7748 5331 -687 -6007 -7197 -3063
821c063O286L940q34n711o178k263L725O796M561q24n529n734k288K456O395M673
$$ -3063 3223 7163 6329 618 -5560 -7823 -4098 2698 7259 6435 906 -4828 -7116 -4660 1735 6408
837F408K71m464o327l227K316N805N379R98m251o599l436J671N627N480J136l614
$$ 6408 6679 2215 -4112 -7339 -5023 782 6161 7159 2908 -3691 -7127 -5456 171 5651 6787 3173
853C173n763l946L99N129N917K094k879o272m290O1N302N608K554l111n201m415
$$ 3173 -2590 -6536 -6137 -1008 4909 7003 4124 -2148 -6438 -6377 -1075 4533 7087 3976 -1225 -5640
869e640l89L934N940K769j471n463n178j201L449O271L965j726n151n234j537
$$ -5640 -6029 -2095 3845 6614 5143 -320 -5498 -6699 -3250 3021 6986 5260 109 -5125 -6662
884f662L492N660L599j200m265m566k490K006N786M748O1m430n326k993J803N767
$$ -6662 -3170 2490 6089 4889 624 -3942 -6432 -4426 1360 6108 6169 1739 -3587 -6580 -4777 990
900I90M825J91m274m953k676J084M935M881J309l496n107l720P47M747N047J920
$$ 990 5815 6006 1732 -3221 -5897 -4813 122 5003 6312 2816 -2291 -6011 -5264 -517 4530 6450
916F450l138n759l572O77M397N002J672k074m742m361j14L910N204K640j619n056
$$ 6450 3312 -2447 -6019 -5342 -945 4057 5729 3655 -1087 -5448 -5562 -1652 3552 6192 4573 -483
932d83m887q58M030N213K825j708m184m339j569K966N056L619l94m482n139j858
$$ -483 -5370 -6228 -2198 3015 5840 4132 -52 -4391 -5960 -2994 2062 5681 5287 805 -4334 -6192
948f192K738N292L819n87l961m812j984K206M470L642M80k947n033k822J313M578
$$ -6192 -3454 1838 5657 5070 1109 -3703 -5687 -3481 989 4631 5111 2164 -2869 -5691 -4378 200
964B00M655R76l724m880l047J431M432M229J311k815m302l611Q1L927M775K067
$$ 200 4855 5831 2107 -2773 -5820 -4389 43 4272 5583 2768 -1534 -5145 -5064 -1137 3638 5705
980E705k158m924l807M7L553N009J968j714m337l776n87K820M893K243o68l866
$$ 5705 3547 -1377 -5184 -5137 -1584 3425 5393 3679 -658 -4434 -5021 -2201 2692 4935 4267 401
996D01m585j607K851M844L448q90l970m358j789K531M575L408k53l580m058k308
$$ 401 -4184 -5791 -2940 1904 5352 4462 492 -3866 -5655 -3124 1451 4859 4606 1026 -3032 -5340
1012e340J759M648L753M21l405m536k654J393M203M212O15k907m400k484N70L865
$$ -5340 -3581 1067 4820 5241 1836 -2700 -5354 -3961 242 4454 5069 2162 -2238 -4722 -4152 -287
1028b87L700J148j729m260l239J62L641M322J720k381l715l515k56L406M268J772
$$ -287 3413 4561 2832 -1428 -4667 -4505 -864 3458 5178 2797 -918 -4433 -4689 -1283 2985 4757
1044D757j303l735l513j218K851M693K554j353l933l790r45K569M210K821o94
$$ 4757 3454 -281 -3794 -5012 -2161 2532 5086 3733 -200 -3990 -4935 -2366 1844 4665 3971
1059C971l154l752j692J582M209L122K93l166m275j867J549M012L278J35k798
$$ 3971 817 -2935 -4627 -3045 1164 4286 4579 1413 -2862 -4729 -3180 832 4110 4245 1447
1074A447l958j951J287L276L281J078k270m134k913J141L640L574R96j981m021
$$ 1447 -2511 -4462 -3175 101 3382 4460 2190 -1944 -4857 -3716 -76 3498 4494 2513 -1508
1089a508k913O62L124L666J176j464l443l239j59K646L913J831j176l629l285
$$ -1508 -4421 -3759 -635 3031 4207 2743 -700 -3939 -4098 -1452 2461 4292 3116 -513 -3798
1104c798l57K441L956K183j203l381k882j055J994L230L123m28l051l823j402
$$ -3798 -4155 -1714 2242 4425 3222 -159 -3041 -4096 -2102 1128 4251 3823 772 -3051 -4453
1119d453K070L232K755L55k934l470j731J308L532K680L91k387l580j997J117
$$ -4453 -2383 849 3604 3959 1025 -2445 -4176 -2868 664 3344 3735 1348 -2232 -4229 -3112
1134c112L751K717N71k097l331k794N76L696L009P04j679k956k586r9K618L906
$$ -3112 639 3356 3927 1830 -1501 -4295 -3719 -23 2986 3690 2011 -945 -3531 -3630 -1012 2894
1150B894J080j402l140k958l3K775K992J766j179l370k783m64K408L137K080n50
$$ 2894 3974 2572 -568 -3526 -3559 -784 2208 3974 2795 -575 -3358 -3822 -1414 1723 3803 3253
1166C253l185k861r91J737L591K347m92k906l255r94J773K968K155n7k334k965
$$ 3253 68 -2793 -3784 -2047 1544 3891 3399 493 -2762 -3756 -1983 985 3140 3083 749 -2216
1182b216j755J586K933K317M72k041l240j806J153K871K804J54j702l029j932
$$ -2216 -3971 -2385 548 2865 3337 1296 -1944 -3750 -2597 274 3078 3232 1530 -1499 -3431
1197c431M30K946K788J021j836l021k211M6K547L341J082j623k720k447K4K140
$$ -3431 -3001 -55 2733 3754 1918 -1103 -3314 -3268 -721 2620 3702 2079 -641 -3088 -3064 -924
1213i24K561J912j050k858k509m86K176K893J659m06k729l126o21J916K977K042
$$ -924 1637 3549 2499 -359 -2868 -3354 -1178 1715 3374 2968 239 -2887 -3508 -1592 1385 3427
1229C427l31k602k944j061J469L051K013j41k002k954j249J150K961K052L63k144
$$ 3427 3096 494 -2450 -3511 -2042 1009 3022 2881 879 -2075 -3324 -2174 787 2839 3202 1058
1245A058k900j490R78K538K211O70j757k596j687M01K366K667P33j297l092j920
$$ 1058 -1842 -3332 -2354 184 2395 3065 1308 -1288 -2975 -2574 -208 2459 3192 1895 -1197 -3117
1261c117NK692K555J035j248k458k451L45J895K433J472p02k650k612l38J999
$$ -3117 -3112 -420 2135 3170 1922 -536 -2987 -2642 -747 1686 3158 2456 -194 -2806 -3144 -1145
1277a145K855J418o90k546k539o82J644K851J626j95k248k515q56J109K847J993
$$ -1145 1710 3128 2438 -108 -2647 -3329 -1685 1166 2792 2597 349 -2166 -3022 -1913 934 2927
1293B927k87j913k966o67Q40K628K112J96k144k285j301O90K333K334N98j818
$$ 2927 2640 727 -2239 -2906 -2066 562 2674 2870 726 -1559 -2860 -2170 163 2497 3095 1277
1309A277k559j870N95K707K185P12j436k771j666K85K035K509Q23j103k136k307
$$ 1277 -1282 -3152 -2557 150 2335 3047 1611 -1160 -2826 -2541 -506 2003 2826 1723 -413 -2720
1325b720p6J786K492J696j034k538k153k64J596K482J696p99k123k220p45J458
$$ -2720 -2796 -1010 1482 3178 2144 -394 -2547 -2811 -1215 1267 2963 2164 41 -2179 -2924 -1466
1341a466K392J908m10k180k167q79J305K311J709O0j898k405j152J329K047J772
$$ -1466 926 2834 2424 244 -1923 -2802 -1497 814 2523 2583 685 -1720 -2872 -1543 504 2276
1357B276O16j997k589j234P81K488K092K63j842j955j845Q24K047J828Q29j209
$$ 2276 2892 895 -1694 -2928 -2147 341 2433 2696 854 -1101 -2946 -2122 -75 1753 2582 1373
1373A373k351j619L43K008J979J035j015k310k054K73J591K186Q60n20k051k009
$$ 1373 -978 -2597 -2254 -246 1733 2768 1753 -557 -2611 -2338 -747 1439 2299 1779 -272 -2281
1389b281l82J880K285Q85l23j734k434n11J608J977J487m37j893j767r90J535
$$ -2281 -2663 -783 1502 2387 2064 330 -2104 -2615 -1007 970 2457 2020 127 -1640 -2630 -1095
1405a095J951J280Rj701j986r95Q66K031J703J22j544k030r83J97K519J921J65
$$ -1095 856 2136 2145 444 -1542 -2537 -1671 360 2063 2185 641 -1389 -2372 -2175 344 2265 2430
1422B430j411j978j303K17K054J751O09j083k073j593K39J919J792P11j002j894
$$ 2430 1019 -959 -2262 -2045 9 1760 2369 1286 -787 -2380 -2141 -222 1570 2281 1279 -615
1438f15j565j06J643J948J063p76k237j494k64J724J840J198n43j859j927l71
$$ -615 -2180 -2286 -643 1305 2368 1592 -645 -2139 -2403 -679 1161 2359 1816 -43 -1970 -2341
1454b341J117K286J069l04j597j875p56J248J802J369L0j517j864q20O96J904
$$ -2341 -1224 1062 2131 1827 230 -1645 -2401 -1153 649 2018 2048 531 -1333 -2153 -1457 447
1470D47J743p1j284j968r69M96J727J599P37j371k238r26J50J878J594N36j148
$$ 447 2190 2119 835 -1133 -2102 -1606 121 1720 2457 1086 -1152 -2078 -1928 -50 1544 2080 932
1487I32j745r68l53J700J904R47j218j281j723k44J350J968J126q97j525j764
$$ 932 -813 -1781 -2134 -434 1470 2417 1199 -82 -1805 -2049 -699 1269 2395 1498 -27 -1791
1503a791n0J034J773J231m57j717j551n13J023J683J666p98j360j636o81R16J738
$$ -1791 -1841 -807 966 2197 1740 23 -1528 -2041 -1018 665 2331 1533 173 -1463 -2144 -1228 510
1520E10J392j84j312j410r57P96J310J725K74j674j310j024K32J869J179M83j039
$$ 510 1902 1718 406 -1004 -1961 -1165 145 1870 2144 470 -840 -1864 -1632 237 1416 1899 860
1537H60j837q67M03J391J490L22o74j693j315K37J483J566L61n31j696j016oJ027
$$ 860 -977 -1844 -1441 -50 1440 1762 1088 -605 -1920 -1683 -200 1366 1727 1196 -500 -1516 -1522 -495
1555d95J553O55k18j739j378r2P92J788Q81m21j291j463l32R06J612J192l11j472
$$ -495 1058 1713 1495 -244 -1622 -1714 -922 866 1747 1326 35 -1428 -1760 -854 758 1950 1639 167
1573A67j514l81O60J668Q31J23r68j535j063Q82J361J170L86j128j476q99K20
$$ 167 -1347 -1728 -1068 600 1431 1554 586 -949 -2012 -1130 231 1401 1787 659 -817 -1716 -1496
1590a496J502J410K04r73j325q10O4J134J615J53m56j650o47k01J194J159P43
$$ -1496 6 1416 1620 647 -678 -1488 -1424 -290 1325 1478 1022 -628 -1275 -1476 -282 877 1620
1607A620o94j289j048J2Q37J107J174n05j472j101l01J066J182Q19k09r52j558
$$ 1620 926 -363 -1411 -1399 -562 545 1719 1214 -258 -1359 -1660 -594 588 1407 1198 246 -1312
1624a312k55O61J497J028m19o81j539l72L97J259J085Q8j085j259m58N37P27J455
$$ -1312 -1567 -906 591 1619 1200 519 -1020 -1392 -995 264 1349 1437 352 -907 -1365 -828 -101 1354
1642A354L0q54j131r49N18J178O82M36o48j098r57L41J069J025M92m13j472j040
$$ 1354 1384 530 -601 -1550 -1032 146 828 1264 616 -482 -1439 -1098 -29 996 1488 1075 -397 -1437
1660a437K35Q94J396K06l61j310j076K73O43J499N39n05r79j260k58J033J311
$$ -1437 -1202 -308 1088 1294 933 -377 -1453 -1180 -537 962 1501 996 17 -1243 -1501 -468 843
1677H43P83m37j356p06o16P94J258N86o3j111r35P4L27P84P81J91j165q42p12
$$ 843 1626 1189 -167 -873 -1489 -695 563 1149 1086 -25 -960 -886 -559 225 1006 1197 32 -810 -1522
1696a522O15R78J095K60r45j049r22N56R30J019J8l82j131p47J73Q54J514r4n63
$$ -1522 -907 71 1166 1426 481 -568 -1490 -934 -4 1015 1033 651 -480 -1227 -1054 -200 1314 1220 657
1715F57j055p79K52M53J340L17l15j085q45j76R11Q79Q11n36j023p52j02L88J212
$$ 657 -398 -1177 -925 -472 868 1185 870 -215 -1060 -1236 -325 554 1365 829 -194 -946 -1048 -660 552
1734E52O52n13m18q82n65K87J328P10O9j128j017j66K59J065N54L87q05r79l30
$$ 552 1204 691 273 -609 -1174 -887 441 1151 1220 92 -925 -1091 -832 233 787 1174 369 -610 -940
1753i40K26P90Q38j6o46p32o07L77N65R82N0m39o50r49L17Q76N99N69n14j021
$$ -940 -714 76 914 898 252 -480 -1087 -710 -145 837 887 448 -202 -1151 -834 42 641 1210 696 -325
1773c25n57k67Q04N92O82j13r98p58r6P63P92P01m67r35l46k39M92Q14L09L9j032
$$ -325 -882 -1149 -345 247 929 816 -182 -940 -1036 -273 519 1220 753 -182 -528 -767 -275 539 848 887 -145
1794a45n46n41Q11N61O38J43q72q47n60P87R96L75J49l59j156k15Q0N32R24J44
$$ -145 -691 -1232 -421 140 778 921 49 -798 -1358 -571 425 800 949 590 -566 -781 -701 -169 755 899
1814H99o43q54l25J89P20O98L09m25j055l68Q0O83O55J84k81p51m92rP29O17M04
$$ 899 256 -598 -923 -734 -14 684 993 568 -487 -855 -775 -92 563 747 466 -285 -777 -786 -57 560 964
1835I64m53n24n97j93O18P24N00k87q80n64R6K09P11L92J78p83o20k67M73N67
$$ 964 511 -13 -610 -803 -185 539 1039 752 -128 -692 -596 -387 324 716 894 111 -509 -776 -303 264
1855B64L42J76p40o00l55K87N96R27l57l93n76m27J45R62M68M3m34n96n59M5Q57
$$ 264 606 782 42 -558 -913 -626 -30 897 540 147 -429 -856 -711 251 719 762 328 -268 -827 -782 75
1876G5P73Lm46q58k22M0M71O41K43k62p17o31K22P38N84j95k1n52n10k20Q00P20
$$ 75 848 851 405 -453 -675 -635 -164 477 720 458 -259 -890 -668 70 654 459 438 -114 -624 -844 -44 676
1898F76J34j33r00l59k48M28Q21N46k29p81n05j16N06N24K12j35o95l26q4K96
$$ 676 810 677 -223 -582 -830 -402 419 965 736 -45 -550 -666 -160 364 576 441 -254 -580 -664 -368
1918c68O62M98J43m79q64j68J26P25O51j78k85p63m37L10N94M80J45m68o74n95
$$ -368 294 792 935 456 -408 -576 -450 275 926 748 463 -300 -737 -427 167 647 792 324 -350 -945
1938i45J10P68P12J30j09n45l56m75M68P76J70j53r07l75o5M37Q39nP8o74p07
$$ -945 -835 -67 645 775 666 121 -235 -710 -242 534 704 551 -356 -731 -796 -359 480 475 553 -121 -828
1959h28K0M75R26R0k69m89l52Mj63P44N53o6m95m51n09J18R62L36P1l36p04m26
$$ -828 -808 -333 593 683 414 -75 -427 -423 -586 158 711 645 150 -301 -810 -692 270 606 677 341 -363 -789
1981g89N2N41Q16j05j30o35k91J40K61O33K79n72n25k68j76O11N99L49n66l09
$$ -789 -737 -196 620 515 385 -250 -541 -401 -140 493 772 200 -325 -593 -769 -158 441 790 224 -85
2001h5q09L42M95N18J72j92m12o23O6J20P53M55k86p27k39j99L80K04P17K0m87
$$ -85 -894 -552 -57 461 633 441 29 -594 -528 -408 345 800 514 -213 -452 -651 -271 -67 650 670 183
2022A83q27m9J41Q40L18R0m86o55m05M59N83K84K98l47q46j16M4M78L58N9k40
$$ 183 -644 -693 -552 288 606 696 210 -445 -850 -391 192 476 774 427 -419 -535 -491 -13 345 404 164
2043A64k29o48N43J14K21O01m42k66o30k47Q91L34J90m6q15k86Q2M77K9O23k17
$$ 164 -65 -713 -170 -56 165 766 324 58 -572 -819 72 406 596 550 -265 -551 -469 8 37 660 443
2064D43m98n33P5K74L94K96j80j90n02p9N8M04P81m34j46n31L3J87L42M08Lk44
$$ 443 -55 -588 -513 -239 155 451 271 81 -421 -500 -442 -38 743 309 163 -368 -335 -148 194 602 605 361
2086C61q65J72k00P08J15J14o0n64m81L49L11N52K44n95l80l66l20P70Q63o2l24
$$ 361 -504 -332 -532 176 291 405 345 -219 -700 -351 -40 512 756 161 -219 -585 -905 -135 728 666 342
2107C42n80l57K27N68PL80k45m17m88NL52N77K12J6o93l47r6M39M33L56j28m49
$$ 342 -238 -595 -368 200 207 587 342 -75 -563 -558 -206 371 583 599 -94 -441 -537 -98 335 691 563 114
2129A14n76j85K30O28K84k94p8m84j4jO17n6M32n36m81n6M5M48N27j77l9p79L5
$$ 114 -462 -647 -417 211 495 201 123 -361 -375 -376 241 185 617 81 -400 -456 -411 37 564 387 348 -431 -396
2152c96k9K72O79j45l28m26k31K70L71L03N48n38n12n84J99M18O90Qn38l84j27
$$ -396 -425 -153 526 381 53 -373 -604 -334 37 340 888 350 -162 -746 -547 -129 561 569 31 -353 -480
2173d80l9K43N47J04m9k78n69pO04K88L27k05l94m50L0l9M79K46M28n88o38m6
$$ -480 -519 -276 271 375 326 48 -521 -528 76 364 691 486 92 -358 -328 -367 112 358 786 198 -440 -486
2195d86K02K98N12j5l57n33R1k14O04J23J67j12l77l38J15O96J57J68n99l28j22
$$ -486 -284 14 526 511 154 -379 -288 -502 102 225 392 280 -97 -435 -320 376 533 701 102 -226 -348
2216c48j32L36O91M38o45n89j92k28L21O27R5J32m40m33l81N13N33L93k09l09
$$ -348 -480 -144 547 985 340 -249 -441 -669 -348 279 374 506 66 -367 -748 -235 298 691 482 173
2236A73m31k77K87N48K63k20k51o65j95M76N66q6K91k80k86n38K15O07J23J28
$$ 173 -258 -535 -248 300 563 343 92 -573 -768 -292 274 188 479 199 -87 -625 -410 197 320 448
2256D48j33p51J41l31N29N32P0k29n77k29J96J34O17q9j57l54n08K41O06J29J79
$$ 448 315 -436 -295 -626 -97 435 505 276 -301 -530 -334 -200 417 328 171 -183 -691 -450 156 285 464
2277D64r8k68n30p1M13k2O05j50k81l98p1J43P17j84k3k23l68K9J10M20Q1K44
$$ 464 366 98 -432 -503 -90 -112 493 343 62 -336 -407 -264 453 269 246 23 -345 -316 -206 214 295 539
2299E39k80m32k5M4K56K41K64k08p36l1j78N71M67l59L5Jo21K30K22M28j50j90
$$ 539 259 -173 -198 -154 102 343 607 399 -337 -368 -546 25 492 133 168 169 -452 -222 0 428 278 88
2321H8p4n72J14K52P02k31R7m10l05j19J37O12J53R8m88k99j18K8P23j40K2l77
$$ 88 14 -558 -444 -192 510 279 376 -34 -339 -458 -321 291 444 542 54 -245 -363 -335 388 248 270 -107
2343a07k86j97K54M54L12k47j50j88j52N8K53N38p4k72o33k1N6L38K87L29n50
$$ -107 -393 -590 -336 118 430 183 33 -155 -307 -249 4 542 468 196 -437 -458 -402 -64 223 552 2
2364Bl58k33L69J46N69n7l43k86l16J71K70L09K52j07m83l48k45N3P42L38o5n39
$$ 2 -356 -589 -220 -74 495 438 95 -191 -507 -336 -66 243 495 388 -95 -443 -688 -635 107 445 380 -159
2386a59j10j3j87P11J91M3n06j8k44K12M23j38K01m71k43m2J34J37L97K03m39
$$ -159 -269 -282 -469 242 433 476 -30 -48 -292 -80 343 205 406 -65 -308 -350 -216 -79 318 521 82
2407H2k91k00j06N77K14J25k97l10j63L02k1K34M4o9l20k04j15L06M74J72j4m75
$$ 82 -209 -409 -515 62 276 401 104 -206 -369 -67 -88 146 190 121 -199 -403 -518 -212 262 434 420 -55
2429e5m04j16M52K88R8n2k87j34M4O5K59K04o2l47l77o5K67K36M62k64Om94k60
$$ -55 -459 -575 -123 165 263 211 -76 -210 -166 -101 158 362 300 -47 -424 -489 -222 14 476 212 218 -276 -536
2452e36K03K82L73J74l05l32n22L30J65L67qk4j82n01L94R2J16N89m13k56m78
$$ -536 -333 -51 322 496 191 -141 -663 -333 -168 199 191 167 -15 -516 -122 -30 86 675 262 6 -472
2473d72qL54M48K16k86k41k63r5J51K41L03n3l69m21M7L25L00K66k81j60m52j4
$$ -472 -480 -126 322 538 252 11 -252 -347 -196 45 348 295 -74 -495 -448 -123 177 443 162 2 -450 -464
2495d64J58L03L16K0k97N1p52M16M37qJ7j0m12r6K36L17J55J51k35n69rKM6L88
$$ -464 -306 -3 313 333 36 87 -665 -249 188 180 197 187 -225 -321 -85 232 387 538 303 -266 -275 -273 -227 161
2519A61K73k03m78r9k47M49K11L10m25j3j03j31K6L82K02k07j85l18k93L21M19
$$ 161 434 231 -247 -346 -593 -144 67 377 -48 -61 -164 -295 -269 113 315 108 -77 -395 -688 -367 52
2540E2K47J03m10r1l39K34K59K56n7n7k76k66J86K15K94J02n41k48p6J01K07J40
$$ 52 299 402 -8 -99 -438 -204 55 311 254 197 -79 -345 -159 56 350 452 -89 -337 -413 -312 -105 35
2562C5J47O0m48J1j93PO45o2J17l35k63k82O45J90R1j17k03k99j53K33M78J88
$$ 35 182 242 -206 -195 -388 -381 264 202 319 -16 -279 -561 84 274 365 248 45 -254 -407 -174 304 492
2584D92m9l24n28j11K89N23j74L92o02k36j52M75N0m9L47l18j31j26J38R7J89
$$ 492 443 119 -409 -520 -231 292 118 510 -92 -328 -480 -5 45 -4 343 25 -106 -232 -94 3 192
2605A92K91j67o05o8l7N27L95j91j42m34j9J39k0O27j76O4m24k97J06J29M75R3
$$ 192 483 316 -289 -357 -394 133 528 337 195 -239 -258 -119 -139 488 312 376 -48 -345 -239 -110 365 458
2627D58r9n18k17K07j49O79j12j08k18k65j55L50L13k4j3j23k12k23L57K9M89
$$ 458 359 -159 -376 -169 -318 361 249 141 -77 -342 -497 -147 166 142 129 6 -206 -429 -72 -43 446
2648D46M4n88k58kK19K77J85Rp8l81mk55J37N33L7m1k17l54J50P5O45k86j63k03
$$ 446 490 -98 -356 -358 -139 138 323 332 254 -127 -131 -386 -249 284 321 280 63 -291 -141 -66 579 293 130 -73
2672g3j23n1K85J90K31j74k36m97N3J75M34J77j50m18P0k63J68M08K40j68l57
$$ -73 -196 -247 38 228 459 285 49 -448 -395 -220 214 391 241 -177 -107 -370 -202 206 446 278 -79
2693g9j88j54J17L25K3J91o8l61l12K75L54M34k57n2n25k5J61K55M29k67j33l82
$$ -79 -267 -421 -304 21 44 235 167 -194 -506 -231 123 557 300 248 -277 -302 -141 114 543 276 143 -239
2715b39j80K14L41K55k63K60k44o96L33Q7M54j09K80n64j12J1K22O9m9pJ22o74
$$ -239 -419 -205 136 391 128 388 144 -552 -219 -132 322 213 493 -71 -183 -172 50 119 70 63 185 -489
2737d89j07N32K22L02l36K6k91j32K30J32J85K05l27k55j70p4M56l9r2J49m43
$$ -489 -596 -64 158 460 124 150 -141 -273 -43 89 274 479 152 -103 -273 -347 109 70 -22 127 -316
2758c16O1L4L07L19k29j49j89k50J43N09k7j85q8k70rL04K17J87r1k21m06J66
$$ -316 -255 -221 86 405 176 27 -162 -412 -269 240 213 28 -60 -330 -339 -35 182 369 278 57 -349 -183
2780a83j81L92M08l04p4l71L9K20j00L27m4l75P0k31M21j05j9M66q6l74l38q6
$$ -183 -364 28 436 132 58 -313 -274 -54 -154 173 129 -246 -176 -407 14 -91 -110 356 270 -104 -442 -528
2802e28M93K53K6m5J6o93K40K0K32M05k20l07J06l34J32J51L89p7j85n63O8J50
$$ -528 -35 218 244 199 215 -478 -238 -218 14 419 199 -108 -2 -336 -204 -53 336 259 74 -489 -421 -271
2824b71L10K78K0k02n27K07j6M52j48K18k12l99J28M5l0N08m7q4l46l85L23L97
$$ -271 39 317 337 135 -392 -185 -201 251 103 321 109 -290 -162 -117 -147 361 314 230 -116 -501 -178 219
2846B19j8J67l37L6q9l70L52L03m8k35k5k36R9K5K37K63l22J34l11l10M08J45
$$ 219 201 368 31 67 -22 -392 -40 263 215 -20 -45 -281 -182 -157 80 343 21 155 -156 -466 -58 87
2868H7J36J89l79o6l36J70J28M64r8l59r6k56N96M5K18k05j43l75L8p0N01J9o6
$$ 87 223 412 33 -33 -369 -199 -71 393 295 -64 -160 -416 180 225 443 238 95 -280 -242 -312 189 208 142
2891A42q3l61j29k1L50L57k8j9l59j16J80m7J66J42q4j75j80J48k5L58M06m14
$$ 142 59 -302 -431 -452 -102 255 227 208 -151 -267 -87 -134 32 174 90 -85 -265 -117 -142 216 622 208
2913B08j78l54p2K28N13o5R2l63k82j54j0P99Nl81m3J7l79N58rq2N29m73m95J84
$$ 208 30 -324 -396 -168 345 280 372 9 -273 -427 -437 362 367 -14 -57 -40 -419 139 130 48 577 104 -391 -207
2937b07k13M98K16J21l39m27j03L10K24J93nK24r35j26L99M71q9j60N7k56l9l
$$ -207 -420 78 294 415 76 -351 -454 -144 80 273 268 492 -443 -569 -170 301 212 52 109 -147 -186 -189
2959a89J55K72R9p1n40p3j80M15K26mJ30m74P8j09k2M71R9o3l56J18j95K91j56
$$ -189 -34 238 337 266 -274 -347 -527 -112 114 110 240 -234 -156 -265 -287 184 283 220 -136 -18 -213 78 -78
2982g8K88J15k97j52k98L00J88M55k68k03j90k25J79N15J17j87l35l41J84mK23
$$ -78 210 325 28 -124 -422 -122 66 521 253 50 -140 -365 -186 329 446 259 -76 -417 -233 -237 -14
3003a4R9L3j98OP5j87k3O05j34k52j9j85j27O59L1k20j18j44l15m7K95O4L43K9
$$ -14 85 118 -80 -74 1 -186 -209 396 262 10 -9 -194 -321 338 369 149 31 -113 -428 -475 -180 -116 227 256
3027B56l95l64M96J48J67j86J27k65j95L4J9J15K67j66k38Q1l92L06J96L74p1
$$ 256 -139 -503 -7 141 308 122 249 -16 -211 -177 -158 -43 224 58 -180 -99 -491 -185 11 385 314
3048C14k18r2j97j7M18K01P7j97n54j27J37N39mN2j30o0n81J83L70J29L49n81
$$ 314 96 4 -193 -210 208 409 486 289 -265 -392 -255 284 280 332 202 142 -439 -256 114 243 592 11
3070A1j54p5J15O8L92j6K53o51m38N10M2K00j84J37j50l32J03l4M26K50j39o34
$$ 11 -143 -218 -103 -35 357 341 594 -57 -495 15 57 257 73 210 60 -272 -169 -203 223 473 334 -300
3092c00M7M8J57N72m26n3Q3k98o1l3K66P9J53k84N4j16l0K19L6J74m25lk3j68
$$ -300 -253 -205 -48 524 98 45 128 -170 -231 -264 2 81 234 -50 4 -112 -142 77 113 287 -138 -141 -164 -332
3116c32L63J97M2l30l58K58j42M01R1j09n9k47j01j99O41L15k33Rm53n7J74M07
$$ -332 31 228 270 -60 -418 -160 -302 99 190 81 22 -225 -326 -525 116 431 198 207 -246 -303 -129 278
3138B78PJ27j09k57n16P5M81j59N8K62j80l95k51L47M52O3K10l76o90K76qM25
$$ 278 285 412 303 46 -470 -395 86 -73 -15 247 67 -328 -579 -232 220 283 493 117 -573 -297 -305 120
3160A20J14j2j95l91Q2J83L94q6L04k99n77k36K63N41nM25n61l2k79O7K06L26
$$ 120 234 222 27 -364 -282 -99 295 209 513 214 -363 -599 -336 205 200 625 64 32 -247 -180 26 352
3182C52K8o0l26m91L36K39N5J41j48m63Q3K8J36L45K57k24o3m69k46L62M45k36
$$ 352 380 320 -6 -497 -161 78 133 274 126 -337 -254 -226 -90 255 512 288 225 -244 -490 -128 317 81
3204H1K14l20m25K10J05L88l52K59j99l23r9L59J84L98J80q27o4j61K23K78K63
$$ 81 295 -25 -450 -240 -135 253 -99 160 -39 -362 -461 -102 82 480 660 -167 -231 -392 -169 109 372
3225C72j32k16k13k54P3M21M45j44j48l62l23j11M26M80J86j13p14r2J41K0M00
$$ 372 240 24 -189 -443 -370 51 496 352 204 -158 -481 -592 -166 314 500 387 -327 -419 -278 -258 142
3246A42K62k72n43j75K57K20L98K81j49m99k61k42M20L53L49j0o16k17j93J23
$$ 142 404 132 -411 -586 -329 -109 289 570 421 -78 -339 -581 -161 192 541 531 -85 -302 -495 -372
3266c72O96k7K91n35l87N7k31O91R2J92m83m75J24mN54K07j68j30l08k35k3J78
$$ -372 324 297 588 53 -334 -277 -508 183 275 467 -16 -491 -367 -371 183 390 222 92 -216 -451 -474 -296
3288b96L97K01l3j89m11r8M30L12j6J1m28l39J10K44K90J70J18l83n74Q5J22K41
$$ -296 101 302 269 80 -331 -429 1 313 297 308 -120 -459 -349 -105 185 355 473 90 -484 -399 -277 -36
3310c6M99k44k69k75j48K16N47q3n0j80m59q3L47N20J03Q3k88n29j12L73L11l8
$$ -36 463 219 -50 -325 -473 -257 290 207 157 -23 -482 -565 -218 302 405 488 200 -329 -441 -68 243 205
3332B05K96o24l49J14J53L75P3J99l69k90j53L66J59l4J43K4o56j7l0L80O73l10
$$ 205 501 -123 -472 -358 -205 170 243 442 73 -217 -370 -4 155 121 264 288 -368 -385 -415 -35 638 328
3354C28l16j71k24J70J74N31o6k42l3o48q8O79M55k38j07m20J10k05m7P99L8k47
$$ 328 12 -159 -383 -213 -39 492 426 184 151 -497 -585 94 549 311 204 -216 -106 -311 -358 441 479 232
3376B32m3n02l90M44L26K94Q5m07m17l90N91N14P9K62o10m09k13M1N83K62Q3j30
$$ 232 189 -313 -703 -259 67 361 446 39 -378 -768 -177 337 416 678 68 -341 -554 -513 70 332 415 285
3398B85m15j89J81L67J00J91k48l87l22L6M90K11J10l04l79p3N8K31M78J67j59
$$ 285 -130 -319 -138 229 329 520 272 -115 -437 -401 89 300 410 106 -273 -346 -288 -57 421 588 429
3419D29n91k72J26L14L13J41l41k61k03j6K53K83K61L2m90m34J11m3O29j1O45
$$ 429 -162 -434 -308 6 319 460 119 -142 -345 -361 -108 175 436 468 -22 -456 -345 -388 241 230 875
3440H75n92p39n3J31M56M81l34m6m76j32J95J28M71k14l7k76n41N99J90M04j2
$$ 875 283 -456 -509 -378 78 559 225 179 -297 -429 -234 -106 365 151 114 -162 -703 -104 86 490 478
3461D78j90m83n21L71L99L65j75K3m09j13JQ9O14N0m04j73m81N6L75M38L59n47
$$ 478 288 -195 -716 -345 54 419 244 267 -142 -255 -254 -165 449 499 95 -78 -559 -503 -128 310 669 122
3483A22j68m73K54P0K58L49L7m37o6k90j00O14J92J3j24p02L69m9J85J30L89m18
$$ 122 -46 -519 -265 -195 63 412 449 12 -54 -344 -444 170 362 375 251 -451 -82 -131 54 184 573 155
3505A55m33J0k0M32J99Km3p40n7K58J11M15M76p71l34j87J37M62J53J99r2o19
$$ 155 -278 -268 -288 144 343 345 302 -438 -495 -237 -126 289 765 -6 -340 -527 -390 72 225 424 332 -287
3527b87j68J72L55K04K20j48m95k73N8L03M78j68n3k41k14j06L09J15K77o7l03
$$ -287 -455 -283 72 276 496 348 -147 -420 -362 -59 419 251 198 -43 -257 -363 -54 61 338 271 -32
3548c2l66k60M66O64J0Q6n89m04j04L28L94J32K7l39n30J01J95N61j05J94l42
$$ -32 -398 -658 -192 472 482 568 -21 -425 -529 -201 193 325 352 13 -517 -416 -221 340 235 429 87
3569H7k05k42P7K32K19K81l46j81o59N05K65K38K9k44k92j82O9L03M78K31l28
$$ 87 -118 -360 -283 -51 168 449 103 -78 -737 -232 33 271 300 56 -236 -418 -349 -46 432 663 335
3590C35m67l78jM24M88J73l63j03l18k59L67O10j96j15o03o1J04K24L21K43k70
$$ 335 -132 -510 -511 -87 401 574 211 108 -210 -469 -102 508 312 197 -406 -467 -363 -139 182 425 155
3611A55k89l21M2J80N05J06k71J1l01Jj98L92N70m0m07n92n4L86K13J65L40l91
$$ 155 -134 -455 -413 -233 272 378 107 118 -183 -182 -380 12 582 542 135 -457 -511 -125 88 253 593 202
3633B02l45m5J3J03L28Q4r8l34l27K01J54L36O8j47l24k82m7J47M43R3J5m57o7
$$ 202 -143 -188 -175 -72 256 340 242 -92 -419 -218 -64 272 340 193 -131 -413 -460 -313 130 223 238 -219 -286
3656b86m8K35L40O0K83p17l8m3K7K20O41l76k45j15o78L82O72j11K04m62k11k00
$$ -286 -334 -99 241 301 584 -133 -171 -214 -187 33 674 298 53 -62 -740 -358 314 203 407 -55 -266 -466
3678d66J81L89K85N2k94k42j36K2J48L27K28j19m45n08L08K57nM97q8m13j11j44
$$ -466 -285 104 389 441 147 -95 -231 -209 -61 266 494 375 -70 -578 -270 -13 -18 479 391 -22 -133 -277
3700b77K48L28J13l48j38j56j01K74J91L66k37j66l78k46J29L57L97Q1n16L8p12
$$ -277 -29 299 412 64 -74 -230 -331 -57 134 500 263 97 -281 -527 -398 -41 356 437 -79 -41 -753
3721g53M36N79k4K8l77k12j48K48K73K09ok08l87J41N5L45k4K32l44k47k69J64
$$ -753 -317 262 238 266 -111 -323 -471 -223 50 259 253 45 -342 -201 -146 199 175 407 63 -184 -453 -289
3743b89M12L27k3m73K37p06q6L24R29k08k74l23j36l9K65JL61n5l92k17J30K61
$$ -289 123 450 427 -46 191 -515 -601 -277 652 444 170 -153 -289 -328 -63 -62 299 244 -148 -365 -235 26
3765B6M1K68j97j50r9k33K83K42L61j70l90k91JJ35R8M15J9n60J11p5k6J54J11
$$ 26 67 335 138 -12 -111 -344 -61 181 542 372 -18 -309 -308 -173 -75 340 359 -201 -90 -165 -191 -37 74
3788G4N91p05j9l55L80J43L7J2L5n05l45K26N47q3K69K7m85o9rK01M84j01q3l33
$$ 74 665 -40 -59 -414 -34 109 146 158 193 -312 -657 -431 116 33 302 329 -156 -225 -234 -33 451 350 267 -66
3812f6m22L90o5M48r0J77n07l77J26L34L64J36k38l15l51K17J65K26K68j01l78
$$ -66 -488 -98 -163 285 195 372 -135 -512 -386 -52 312 448 210 -105 -456 -239 -74 152 420 319 -59
3833e9j55L0j50P09J77mk95l97k02j6N50R0Q0J7p01j6j08M68J23N04o78n7j71
$$ -59 -214 -184 -334 375 552 548 253 -144 -346 -362 188 278 358 375 -326 -342 -450 18 141 645 -33 -90 -261
3856b61QK34M24J5j99m33m52M68M8K76L19o7l04l87j75N68j06M69j17m55r0L7
$$ -261 -253 -19 405 420 221 -212 -664 -196 -148 128 447 380 76 -311 -486 82 -24 445 328 -127 -217 -180
3878a80L1L54R6j44j59j29n19M71M22J16l4k81m70K28J14J50J06M7j05l21j45
$$ -180 -149 205 301 157 -2 -131 -650 -179 243 359 325 44 -426 -198 -84 66 172 219 114 -207 -352
3899c52J85P4M44n0j25l98n3J16K50K62J66l21l90j67J47m1O00l6j19j97m59J26
$$ -352 -167 -93 351 301 176 -222 -275 -159 91 353 519 198 -192 -359 -212 -253 347 311 192 -5 -464 -338
3921c38M71k0K48j14m07k13K21J51J64L40k58m16k31J08N4L88K56j87r4q46M26
$$ -338 133 113 361 247 -160 -373 -152 -1 163 503 245 -171 -402 -294 -240 148 404 217 123 -723 -297
3942b97PL30J88J81n44r4j07J21L01L16k23q0m77k3r1N37K93M7l27k35J73k97
$$ -297 -290 40 228 409 -135 -229 -336 -215 86 402 179 99 -378 -401 -492 45 338 385 58 -177 -4 -301
3964c01O63K11l14l0k79l35K52J17K82r9j6l28k07k07Q22K1k9o0m42l13K47L38
$$ -301 362 573 259 229 -50 -385 -133 -16 266 167 151 -177 -384 -591 231 252 223 163 -279 -592 -345 -7
3986gL42K71n33j28j50j51J71L81K14k34j60m66K70k10N54rj11Lk94j80K92K13
$$ -7 335 606 73 -55 -205 -356 -185 196 410 176 16 -450 -180 -390 164 155 44 47 -247 -427 -135 78
4008G8L62k21k36j77j68J22K97L74j59k28l58O0M6J51K53J76l57l40Q9R2L52L8
$$ 78 440 219 -17 -194 -362 -240 57 431 272 44 -314 -254 -208 -57 196 372 15 -325 -236 -144 208 246
4030B46P4l71M0k66L49k55L09J93n22K67m06lL28L14k07K07l79k23j38L83K66
$$ 246 320 -51 -11 -277 72 -183 126 319 -203 64 -342 -345 -17 297 90 297 -82 -305 -443 -60 206
4051B06j04R4j30k59j2M36l24M31J9n63j64J83J73M8N8K98k66o7l22J17L49J22
$$ 206 102 196 66 -193 -205 231 -93 338 357 -206 -370 -187 -14 34 92 390 124 57 -265 -148 201 323
4073C23O8m25j48j15Q4M57J32n7j67l69j56j48Q14p6J53l43l08p9J66K46L06R0
$$ 323 391 -34 -182 -297 -213 244 376 319 152 -217 -373 -521 293 217 370 27 -281 -360 -194 52 358 448
4095D48l62l27Q5q9K43K93J07j31m54Q8k23L02K38K53k71k94k57K45J85K81j93
$$ 448 86 -241 -156 -245 -2 291 398 267 -187 -99 -322 -20 218 471 200 -94 -351 -106 79 360 167
4116A67j19j17k66k47L21L27K00J30m11k44p6K60K59J63j20j78k37j60K42J60
$$ 167 48 -69 -335 -582 -261 66 266 396 -15 -259 -335 -75 184 347 227 49 -188 -348 -106 54
4136E4L46q7k21n13K33n1K51L3K88m06l63j03M60J49J7J43q5j87l05O0J39K50
$$ 54 400 313 92 -421 -188 -239 12 45 333 -73 -436 -539 -79 70 87 230 145 -42 -347 -287 -148 102
4158A02K8L34o07n8l04L40J14L47k06q5l74j15K96L89Q4Q6m10m58K55K94L26k70
$$ 102 130 464 -143 -201 -505 -165 -51 296 90 5 -369 -484 -188 201 285 371 -39 -497 -242 52 378 108
4180A08L7n1n76%J70L89K59j27k93p8j8n7L14M99m87M1l00r9M5M67O4M7q6m31
$$ 108 145 94 -482 -482 -312 77 336 209 -84 -162 -180 -237 77 576 89 130 -170 -269 -224 243 307 354 268 -163
4204a63k48K48J52K29o6J38m41n5MJ08N58l12j01j82j70j18N77k3N7r9k73j52
$$ -163 -411 -163 -11 218 152 290 -151 -206 -202 -94 464 152 51 -131 -301 -419 158 135 192 93 -180 -332
4226c32LK42R5M31j86j04k72nNL26J87k47R6j78k66R1L14J67k20o3l39k25K44
$$ -332 -329 -87 8 439 253 149 -123 -128 -123 203 390 143 239 61 -205 -114 200 367 147 84 -255 -480 -236
4249b36N26k7k1l48m01J40J99K02L72r0n1l78l37M53N7K97J61m91L6qj11k0L55
$$ -236 290 263 242 -106 -507 -367 -168 34 406 316 265 -113 -450 3 60 357 518 27 63 55 -56 -76 279
4272B79m3o9o2l47K6L49K78j62n1j85j27K3j64M81P8j88J4j20j79K00N0K92k19
$$ 279 236 167 105 -242 -216 133 411 249 198 13 -114 -91 -255 226 304 116 130 10 -169 31 81 373 154
4295A54j03m9q5r6j18N88K57o85K15m66L07K32L47l36k11k10j84K75L77Q9n0o2
$$ 154 51 2 -83 -179 -297 291 548 -137 78 -388 -81 151 498 162 -49 -259 -443 -168 209 298 248 186
4317A86j80j71k47O94O2j26l59k22kO4L77OJ88J48n14r1j28J13J34L22o4m00M0
$$ 186 6 -165 -412 282 344 218 -141 -363 -365 -301 76 82 270 418 -96 -187 -315 -202 -68 254 190 -210 -170
4340a70M0J42K47P7o7l93j39p3J48O50k37k79K1j3m31N70L3J65j87N3k03j14j8
$$ -170 -130 12 259 336 269 -124 -263 -336 -188 462 225 -54 -33 -46 -477 93 126 291 104 157 -46 -160 -178
4363a78L50J93j89k06k35j69M04L11JJ29k09l24k49J19L76J5M70m03m87K23j85
$$ -178 172 365 176 -30 -265 -434 -30 281 282 411 202 -122 -371 -252 124 139 609 206 -281 -58 -243
4384b43N69j68r8O4q7k83k63O87J07j34Mk93m06K62J78L87K02l52m1n35J34k4
$$ -243 326 158 60 124 37 -246 -509 178 285 151 155 -138 -544 -282 -104 283 485 133 92 -443 -309 -333
4406c33N09o0R9k72j76J67n7K81M0O8l38j10k02P3N81l17K95k41j56m5K0K31J38
$$ -333 176 116 215 -57 -233 -66 -123 158 198 266 -72 -182 -384 -311 270 -47 248 7 -149 -194 -174 57 195
4429A95M13l28k93n84N18J01L04m1nk61j55m0M66j97J01J40l09k04M2L76j87L42
$$ 195 608 280 -13 -597 -79 22 326 285 280 19 -136 -176 290 93 194 334 25 -179 -137 239 52 394
4451C94r1l61j89LJ35L45R5m28J21q2k99J10L39L24r9j16k99m12L80N93k74J21
$$ 394 303 -58 -247 -244 -109 236 331 -97 24 -58 -357 -247 92 416 317 201 -98 -510 -130 463 189 310
4473C10l14j53q8j42M25K4K11p2j50p50P20j83K23P8J34o05M76l44Q0J81Q9n1
$$ 310 -4 -157 -245 -387 38 62 273 201 51 -699 21 -162 61 139 273 -332 144 -200 -120 61 150 99
4495I9k27j73L6K38O0L35l64l30J72j82K54K15R7l1j71k17k5q5N83Q2j62m88p3
$$ 99 -128 -301 -265 -27 33 368 4 -326 -154 -336 -82 133 230 199 28 -189 -214 -299 284 366 204 -284 -357
4518c57J01J54L54r8j18J4k60J90j81M45L74l19k69l59l4OM65M5q3K28j85m40
$$ -357 -256 -102 252 154 36 50 -210 -20 -201 244 618 299 30 -329 -363 -357 108 153 70 298 113 -327
4540c27K13kK79j11J84n32l4K80q6J18N44o01j16k70L73K38L0J32r4k80M5j17
$$ -327 -114 -116 163 52 236 -296 -330 -50 -136 -18 526 -75 -191 -461 -88 150 180 312 218 -62 -17 -134
4562a34R9L30ol13pj08k30K03J64L44l3j06n31K08k06N65O7l19j04j15j30M11
$$ -134 -35 295 289 -24 -31 -139 -369 -166 -2 342 309 203 -328 -120 -326 239 306 -13 -117 -232 -362 49
4584D9p1P8N8m2l75J78m9K57M18q8j97j62k29Q7J74L03j45l35j41J7J7K77J00
$$ 49 -22 56 114 72 -303 -125 -174 83 501 413 216 54 -175 -88 86 389 244 -91 -232 -215 -198 79 179
4607A79N1q2q1m05L88n4K25q0J31l39k81J65Q8M36k6n9k05m38L4M88L2J32k77
$$ 179 230 148 67 -338 50 -4 221 141 272 -67 -348 -183 -95 341 315 256 51 -387 -353 135 167 299 22
4630B2j97OK2q2M0M14k75p6j11K06K5K92p3j75k53r4K4J51k1K24J37J6k82k06
$$ 22 -175 -169 -147 -229 -189 225 -50 -126 -237 -31 -6 286 213 38 -215 -309 -285 -134 -155 69 206 222 -60 -266
4654b66P0J53L21j21o2q8o2k41K74K27J31m82O8j41nJ12J85K46j93k21j82r6J26
$$ -266 -196 -43 278 157 95 7 -55 -296 -22 205 336 -146 -78 -219 -224 -112 73 319 126 -95 -277 -373 -247
4677b47M16J44P9p83J90k52O74p1n0J62m16l16J49K08O45l99j61n9k53J76q6M12
$$ -247 169 313 392 -391 -201 -453 221 150 100 262 -154 -470 -321 -113 532 133 -28 -87 -340 -164 -250 162
4699A62R4Ok15k14L8l6M58l44M89l53j80n5P2K11p8J64j92k58j6Qm7M16K68k69
$$ 162 256 262 47 -167 -129 -165 293 -51 438 85 -95 -150 -78 133 55 219 27 -231 -247 -239 -286 130 398 129
4723A29j08k67p4M33J4N0J6j43l96M66l9j47J63J97j69l01j25L37q6M64j97j60
$$ 129 21 -246 -320 113 127 177 193 50 -346 120 81 -66 97 294 125 -176 -301 36 -50 414 217 57
4745E7k26L7j44L44K65l31J92k40m33L90K66K20l05j63l6j01O0K76K0J07k79l62
$$ 57 -169 -132 -276 68 333 2 194 -46 -479 -89 177 397 92 -71 -107 -208 -148 128 148 255 -24 -386
4767c86R1j24O09R4m4j84k59mj44L13L01o8J20m31P4j14K34Q9K48n26j67j7M34
$$ -386 -295 -419 190 284 240 56 -203 -207 -351 -38 263 195 315 -116 -42 -156 78 167 415 -111 -278 -295 139
4790A39m2m7Q5J77n13N9o9J9L08R1j11j11j03K7P9K14K4K5m49J14l05N00p2J52
$$ 139 97 50 135 312 -201 -142 -211 -192 116 207 96 -15 -118 -91 -12 202 226 251 -198 -84 -389 111 39 191
4814A91ql82P8k08M37k33L4m0Q9j01jJ19M8M7J30k63J51j78O9r3L19k25O8K9l13
$$ 191 183 -199 -121 -329 108 -125 -91 -131 -42 -143 -144 -25 23 70 200 -63 88 -90 -21 -114 205 -20 48 77 -236
4839b36J67K49p3j52j36J66L9m7j97K85l06J32l3j08L95j92J50n0Q6M6k79N9k97
$$ -236 -69 180 107 -45 -181 -15 24 -23 -220 65 -241 -109 -142 -250 145 -47 103 53 139 185 -94 -35 -332
4862c32M55j33j80RP7p8J18K37K8j54M3O6k76K06j31R4K04j92o8k04O8J62J33
$$ -332 123 -10 -190 -181 -104 -182 -64 173 201 47 90 156 -120 86 -45 49 253 61 -7 -211 -143 19 152
4885A52L65n83j60kN7jJ61K00j85k02Q5j01J27K76j94J63l61J6j79N92K00k69
$$ 152 517 -66 -226 -228 -171 -172 -11 189 4 -198 -113 -214 -87 189 -5 158 -203 -187 -366 226 426 157
4907A57J44l47j91r8L34n1K59O2j64j86J96j01R8j48K23k44j24K21PK46J37l11
$$ 157 301 -46 -237 -335 -1 -52 207 269 105 -81 115 14 112 -36 187 -57 -181 40 47 293 430 119
4929A19j15m4j70k0p1M75J21m35K45j87J78r3J13J70k03j42j80P0K44J76J43l36
$$ 119 4 -40 -210 -230 -301 174 295 -140 105 -82 96 3 116 286 83 -59 -239 -169 75 251 394 58
4951E8k75J54P2K9J97k32kk40J07J60N9J04j06q1L49n02j44J88p0J23nL8j63r3
$$ 58 -217 -63 9 38 235 3 1 -239 -132 28 87 191 85 4 353 -149 -293 -105 -175 -52 -57 -19 -182 -275
4975b75L46K8L51m35j71O0j2r6K57j6m4K51l53J68l30L98J78r3Lk00l79K02M98
$$ -275 71 99 450 15 -156 -96 -108 -204 53 37 -7 244 -109 59 -271 127 305 212 215 15 -364 -162 336
4998C36k41J05k04j06N6K06Q1Q2k29n2j64J28j6p1L31L5j36m76k0K71j22L82j75
$$ 336 95 200 -4 -110 -54 152 233 315 86 34 -130 -2 -18 -89 242 277 141 -335 -355 -84 -206 176 1
5021Ak3J48m49K7M97M8j02j82o5P6L0L7N7r3L6m0p0j8J21m7R0K19k55k05L6J58
$$ 1 -22 126 -323 -296 201 249 147 -35 -100 -24 6 43 100 7 43 3 -67 -85 36 -11 79 298 43 -162 -126 32
5047C2J7rR5k80K6L3k32L76j61K5M5O0%j40K74k89J59j54K67l11m4K4J01K65K20
$$ 32 49 40 135 -145 -119 -86 -318 58 -103 -78 -33 27 27 -113 161 -128 31 -123 144 -167 -211 -187 -86 179 399
5072C99l71m0p0PL42j45j79l02K25K7J05J95m4k80K13N8o8k16J78R3j8j07Q2k29
$$ 399 28 -12 -82 -75 267 122 -57 -359 -134 -107 -2 193 149 -131 82 140 72 -144 34 127 109 2 84 -145
5096a45R4Q7j30J93J9l56K24p4J56J77Qm69l5K44L8k72K47l0r6o5K04l42K97K97
$$ -145 -51 36 -94 99 118 -238 -14 -88 68 245 253 -216 -251 -7 31 -241 6 -24 -120 -185 19 -323 -26 271
5120B71l34K79N8k59l69M69N1J52j86Nj73j51q3K67j3J24k62j56K5K42J13M0j8
$$ 271 -63 216 274 15 -354 115 166 318 132 137 -36 -187 -270 -3 -16 108 -154 -310 -285 -43 70 110 92
5143I2j33k18J8M5L11k62K47o6j18k56N20j63L26j41q0n30L15N1j91K06j8K59
$$ 92 -41 -259 -241 -196 115 -147 100 34 -84 -340 180 17 343 202 122 -408 -93 -42 -233 -27 -45 214
5165B14n26P3L1K78p9K22n36L27%j49J60J95j50J02k91k15J86M73Q1n37J08j17
$$ 214 -312 -239 -208 70 -9 213 -323 4 4 -145 15 210 60 162 -129 -344 -158 315 396 -141 -33 -150
5187a50oK41k88J65K29K2l23n8n7J94M9n2L39j38jn87L77j4J85L0k49O7j16J06
$$ -150 -156 85 -203 -38 191 213 -110 -168 -225 -31 18 -34 305 167 166 -421 -44 -58 127 157 -92 -25 -141 -35
5211c5N5k6L25j46l32k8L27j74KK92j99Pk48Q4O7J96j76k68N08m88L23j08J15
$$ -35 20 -6 319 173 -159 -187 140 -34 -32 260 61 68 -180 -96 -29 167 -9 -277 231 -257 66 -42 73
5234G3l97L04m89L33K22n3p5M47m02l88L89l6J97r4j12J90m7j92J26K78j95j8
$$ 73 -324 -20 -509 -176 46 -7 -82 365 -37 -425 -36 -72 125 31 -81 109 62 -130 -4 274 79 61
5256F1K41m10J04j53K97O6p5J4m7l05J23K75k74L33k44k56J42Q4J72m87K85L9
$$ 61 302 -108 -4 -157 140 206 131 145 98 -207 -84 191 -83 250 6 -250 -108 -24 148 -339 -54 -15
5278a5j59J14R1n2p0r4M75M5n55j01J07K62M00l17j54K19k24J13k28N7K1J94j83
$$ -15 -174 -60 31 -21 -91 -185 290 335 -220 -321 -214 48 448 131 -23 196 -28 85 -143 -86 -65 129 -54
5301e4q7L4J82o5J17o2j38J08n22N35O5k52J69j5j70M7P9j39L03j41j90J82p3
$$ -54 -141 -107 75 10 127 65 -73 35 -487 48 113 -139 30 15 -155 -108 -29 -168 135 -6 -196 -14 -87
5324h7L2J73l43J78J05Q1k10K04l7j19K64n3m0k36J77j07J97K2k45R9k03k5L73
$$ -87 -55 118 -225 -47 58 139 -71 133 96 -23 241 188 148 -88 89 -18 179 201 -44 55 -148 -173 200
5347B00k13L28q4l62K7l8j99O05J27l11j83K06k84j08K99M4j9q5j74K19J13MO
$$ 200 -13 315 231 -131 -104 -142 -341 264 391 80 -103 103 -181 -289 10 54 35 -50 -224 -5 108 112 118
5370A18j47n9j32j50N98k97j1J25n9k59N81m15J12Q1j90K65j20l13P6L88K01j66
$$ 118 -29 -88 -220 -370 228 -69 -80 45 -14 -273 308 -107 5 86 -104 161 41 -272 -196 192 393 227
5392B27j1l41L0j61J95m0j84R8K01m47K01J29K82Rm00O23o88J47M34j17j42l39
$$ 227 216 -125 -95 -256 -61 -101 -285 -187 14 -433 -232 -103 179 188 -212 411 -277 -130 304 187 45 -294
5414b94M26Q0j06j35Q4J29j84n9k1J21L2j41J22M7o8K2j06j0r2J73j03j2n7k6
$$ -294 132 212 106 -29 55 184 0 -59 -80 41 73 -68 54 101 33 55 -51 -61 -153 20 -83 -95 -152 -178
5438a78J48L1J23k5j06l22J00L11k85K64l8j3J1Kj70J38J39j82K44l30Q8J09N3
$$ -178 -30 1 124 99 -7 -329 -229 82 -203 61 23 10 21 23 -147 -9 130 -52 192 -138 -50 59 112
5461A12j48K27k2j8j73j43p3QK25r7J09k37n2M44k2k39j16K52j93R3J10Q7m19
$$ 112 -36 191 169 151 -22 -165 -238 -230 -5 -102 7 -230 -282 162 140 -99 -215 37 -156 -63 47 134 -285
5484b85L13k07J16k9L19l13J13k0m9L31k56N8j1K35J09n48n3J02J22pL4j67K2
$$ -285 28 -179 -63 -92 227 -86 27 7 -42 289 33 91 80 315 424 -124 -177 -75 47 40 74 -93 -71
$$ [...]
8191D1
##END NTUPLES=NMR FID
##END=
