##TITLE=1H_SR72_oil
 d2o, 8 sc, 
 3.08.2021
##JCAMPDX= 6.0         $$ Bruker NMR JCAMP-DX V2.0
##DATA TYPE= NMR FID
##DATA CLASS= NTUPLES
##ORIGIN= UXNMR, Bruker Analytische Messtechnik GmbH
##OWNER= root
$$ XWIN-NMR		Version 3.5
$$ Tue Aug  3 12:47:13 2021 Russian Standard Time (UT+4h)  she@DPX200
##.OBSERVE FREQUENCY= 200.131506
##.OBSERVE NUCLEUS= ^1H
##.DELAY= (6, 6)
##.ACQUISITION MODE= SIMULTANEOUS
##.ACQUISITION SCHEME= undefined
##.AVERAGES= 8
##.DIGITISER RES= 18
##SPECTROMETER/DATA SYSTEM= spect
##.PULSE SEQUENCE= zg30
##.SOLVENT NAME= D2O
##.SHIFT REFERENCE= (INTERNAL, D2O, 0, 15.7039)
##AUDIT TRAIL= $$ (NUMBER, WHEN, WHO, WHERE, WHAT)
$$ ##TITLE= Audit trail, XWIN-NMR		Version 3.5
$$ ##JCAMPDX= 5.01
$$ ##ORIGIN= Bruker BioSpin GmbH
$$ ##OWNER= she
$$ F:/spectra/data/she/nmr/H-F/1/audita.txt
$$ ##AUDIT TRAIL=  $$ (NUMBER, WHEN, WHO, WHERE, WHAT)
(   1,<2021-08-03 12:46:13.09 +0400>,<she>,<DPX200>,
      <created by zg, POWCHK disabled, PULCHK disabled
       configuration hash MD5:
       00 E9 B6 7A A2 85 ED C7 34 08 36 98 17 FE 4E 26
       data hash MD5: 16K
       5C CA 2C 46 D1 09 5F 7D B2 C6 92 52 C7 75 E8 09>)
$$ ##END=
$$ 
$$ hash MD5
$$ 8B AE D0 D3 DA 22 D0 CD D6 79 FF 17 9A 90 2F BA
##$RELAX= 
##$RELAX= 
##$RELAX= 
##$RELAX= 
##$RELAX= 
##$RELAX= 
$$ Bruker specific parameters
$$ --------------------------
##$DU= <F:/spectra>
##$EXPNO= 1
##$NAME= <H-F>
##$PROCNO= 1
##$TYPE= <nmr>
##$USER= <she>
##$AMP= (0..31)
100 100 100 100 100 100 100 100 100 100 100 100 100 100 100 100 100 100 
100 100 100 100 100 100 100 100 100 100 100 100 100 100 
##$AQSEQ= 0
##$AQ_mod= 1
##$AUNM= <au_zg>
##$AUTOPOS= <>
##$BF1= 200.13
##$BF2= 200.13
##$BF3= 200.13
##$BF4= 200.13
##$BF5= 200.13
##$BF6= 200.13
##$BF7= 200.13
##$BF8= 200.13
##$BYTORDA= 1
##$CFDGTYP= 0
##$CFRGTYP= 5
##$CHEMSTR= <none>
##$CNST= (0..31)
1 1 145 1 1 1 1 1 1 1 1 1 1 1 1 1 1 1 1 1 1 1 1 1 1 1 1 1 1 1 1 1 
##$CPDPRG= <>
##$CPDPRG1= <>
##$CPDPRG2= <>
##$CPDPRG3= <>
##$CPDPRG4= <mlev>
##$CPDPRG5= <mlev>
##$CPDPRG6= <mlev>
##$CPDPRG7= <mlev>
##$CPDPRG8= <mlev>
##$CPDPRGB= <>
##$CPDPRGT= <>
##$D= (0..31)
0 1.2 0 0 0 0 0 0 0 0.06 0 0.03 0 0 0 0 0.0002 0 0 0 0 0 0 0 0 0 0 0 0 
0 0 0 
##$DATE= 1627980372
##$DBL= (0..7)
120 120 120 120 120 120 120 120 
##$DBP= (0..7)
150 150 150 150 150 150 150 150 
##$DBP07= 0
##$DBPNAM0= <>
##$DBPNAM1= <>
##$DBPNAM2= <>
##$DBPNAM3= <>
##$DBPNAM4= <>
##$DBPNAM5= <>
##$DBPNAM6= <>
##$DBPNAM7= <>
##$DBPOAL= (0..7)
0.5 0.5 0.5 0.5 0.5 0.5 0.5 0.5 
##$DBPOFFS= (0..7)
0 0 0 0 0 0 0 0 
##$DE= 6
##$DECBNUC= <off>
##$DECIM= 32
##$DECNUC= <off>
##$DECSTAT= 4
##$DIGMOD= 1
##$DIGTYP= 9
##$DL= (0..7)
0 120 120 120 120 120 120 120 
##$DP= (0..7)
150 150 150 150 150 150 150 150 
##$DP07= 0
##$DPNAME0= <>
##$DPNAME1= <>
##$DPNAME2= <>
##$DPNAME3= <>
##$DPNAME4= <>
##$DPNAME5= <>
##$DPNAME6= <>
##$DPNAME7= <>
##$DPOAL= (0..7)
0.5 0.5 0.5 0.5 0.5 0.5 0.5 0.5 
##$DPOFFS= (0..7)
0 0 0 0 0 0 0 0 
##$DQDMODE= 0
##$DR= 18
##$DS= 0
##$DSLIST= <SSSSSSSSSSSSSSS>
##$DSPFIRM= 0
$$ [...]
##$SUBNAM2= <"">
##$SUBNAM3= <"">
##$SUBNAM4= <"">
##$SUBNAM5= <"">
##$SUBNAM6= <"">
##$SUBNAM7= <"">
##$SUBNAM8= <"">
##$SUBNAM9= <"">
##$SW= 20.0188882624521
##$SWIBOX= (0..15)
0 0 2 0 0 0 0 0 0 0 0 0 0 0 0 0 
##$SW_h= 4006.41025641026
##$TD= 16384
##$TD0= 1
##$TE= 0
##$TE2= 300
##$TE3= 300
##$TEG= 300
##$TL= (0..7)
0 120 120 120 120 120 120 120 
##$TP= (0..7)
150 150 150 150 150 150 150 150 
##$TP07= 0
##$TPNAME0= <>
##$TPNAME1= <>
##$TPNAME2= <>
##$TPNAME3= <>
##$TPNAME4= <>
##$TPNAME5= <>
##$TPNAME6= <>
##$TPNAME7= <>
##$TPOAL= (0..7)
0.5 0.5 0.5 0.5 0.5 0.5 0.5 0.5 
##$TPOFFS= (0..7)
0 0 0 0 0 0 0 0 
##$TUNHIN= 0
##$TUNHOUT= 0
##$TUNXOUT= 0
##$USERA1= <user>
##$USERA2= <user>
##$USERA3= <user>
##$USERA4= <user>
##$USERA5= <user>
##$V9= 5
##$VALIST= <valist>
##$VCLIST= <CCCCCCCCCCCCCCC>
##$VD= 0
##$VDLIST= <DDDDDDDDDDDDDDD>
##$VPLIST= <PPPPPPPPPPPPPPP>
##$VTLIST= <TTTTTTTTTTTTTTT>
##$WBST= 1024
##$WBSW= 4
##$XGAIN= (0..3)
0 0 0 0 
##$XL= 0
##$YL= 0
##$YMAX_a= 135457
##$YMIN_a= -197489
##$ZGOPTNS= <>
##$ZL1= 120
##$ZL2= 120
##$ZL3= 120
##$ZL4= 120
##$ABSF1= 10
##$ABSF2= 0
##$ABSG= 5
##$ABSL= 3
##$ALPHA= 0
##$AQORDER= 0
##$ASSFAC= 0
##$ASSFACI= 0
##$ASSFACX= 0
##$ASSWID= 0
##$AUNMP= <proc_1d>
##$AZFE= 0.1
##$AZFW= 0.1
##$BCFW= 1
##$BC_mod= 2
##$BYTORDP= 1
##$COROFFS= 0
##$CY= 11.3945322036743
##$DATMOD= 1
##$DC= 2
##$DFILT= <>
##$DTYPP= 0
##$F1P= 2.36226072786647
##$F2P= -0.459571619588291
##$FCOR= 0.5
##$FTSIZE= 0
##$FT_mod= 4
##$GAMMA= 1
##$GB= 0.15
##$INTBC= 1
##$INTSCL= 1
##$ISEN= 128
##$LB= 0.24
##$LEV0= 0
##$LPBIN= 0
##$MAXI= 10000
##$MC2= 0
##$MEAN= 0
##$ME_mod= 0
##$MI= 1.114404
##$NCOEF= 0
##$NC_proc= 0
##$NLEV= 6
##$NOISF1= 3.799351
##$NOISF2= 2.8
##$NSP= 1
##$NTH_PI= 0
##$NZP= 0
##$OFFSET= 15.70392
##$PC= 1
##$PHC0= -13369.29
##$PHC1= 27.20099
##$PH_mod= 1
##$PKNL= yes
##$PPARMOD= 0
##$PSCAL= 0
##$PSIGN= 0
##$REVERSE= no
##$SF= 200.130013532006
##$SI= 16384
##$SIGF1= 3
##$SIGF2= 2
##$SINO= 400
##$SIOLD= 16384
##$SREGLST= <1H.CDCl3>
##$SSB= 0
##$STSI= 0
##$STSR= 0
##$SW_p= 3612.71676300578
##$SYMM= 0
##$S_DEV= 0
##$TDeff= 0
##$TDoff= 0
##$TI= <>
##$TILT= no
##$TM1= 0
##$TM2= 0
##$TOPLEV= 0
##$USERP1= <user>
##$USERP2= <user>
##$USERP3= <user>
##$USERP4= <user>
##$USERP5= <user>
##$WDW= 1
##$XDIM= 8192
##$YMAX_p= 0
##$YMIN_p= 0
$$ End of Bruker specific parameters
$$ ---------------------------------
##NTUPLES= NMR FID
##VAR_NAME=  TIME,          FID/REAL,        FID/IMAG
##SYMBOL=    X,             R,               I
##VAR_TYPE=  INDEPENDENT,   DEPENDENT,       DEPENDENT
##VAR_FORM=  AFFN,          ASDF,            ASDF
##VAR_DIM=   8192,          8192,            8192
##UNITS=     SECONDS,       ARBITRARY UNITS, ARBITRARY UNITS
##FACTOR=    0.0002496,     1,               1
##FIRST=     0,             0,               0
##LAST=      2.0444736,     0,               0
##MIN=       0,             -197489,         0
##MAX=       2.0444736,     135457,          0
$$ Real data points
##PAGE= N=1
##DATA TABLE= (X++(R..R)), XYDATA
0 0 0 0 0 0 0 0 0 0 0 0 0 0 -8 8 -8 8 -8 16 -16 16 -24 24 -32 40 -40 48 -56 67 -80 88 -104 118 -134 152 -171
35 -171 192 -216 243 -270 301 -336 374 -415 460 -508 562 -619 683 -753 829 -914 1007 -1111
53 -1111 1224 -1352 1496 -1661 1849 -2065 2321 -2629 3002 -3469 4076 -4896 6074 -7913 11222
68 11222 -19050 81212 -13126 -141027 -33289 -67114 -775 124253 74572 -24847 -10367
79 -10367 -78044 -89266 33546 70881 37030 66250 -16537 -116603 -46864 15574 11069 92250
91 92250 80423 -58791 -72544 -31258 -58505 30962 135457 45773 -49212 -52510 -84449 -29542
103 -29542 95372 65846 -5309 15462 -36554 -96651 -8434 53590 28364 52764 28700 -70648
115 -70648 -65636 -8992 1463 54024 80015 -5344 -52778 -39058 -50844 -577 83803 54398
127 54398 -4437 -19763 -69351 -63671 45574 70580 12954 11642 -7390 -63094 -35525 16772
139 16772 21319 44991 44005 -27979 -57119 -28448 -13282 27642 68750 24181 -29983 -32862 -40461
152 -40461 -23148 40079 53883 17890 -2329 -36210 -59318 -8905 42163 35953 23613 845
164 845 -41634 -37380 -2724 8624 27066 43584 6822 -35884 -35257 -22815 4037 44720 40027
177 40027 -1873 -24598 -34338 -29762 9916 40247 27878 8346 -13672 -39634 -29741 9879 29823
190 29823 29563 15903 -17756 -36156 -19087 420 15993 32819 22169 -12392 -29916 -25822 -10007
203 -10007 20404 37835 18192 -10618 -25419 -28146 -9417 19900 28179 16955 856 -21053
215 -21053 -32173 -11687 15222 25596 22430 3385 -23276 -27948 -10228 7791 22258 25173 4737
228 4737 -17945 -23636 -17603 1095 25787 27172 4254 -14809 -23213 -19301 2754 22474 20242
241 20242 8453 -6766 -23487 -20796 708 16218 20769 15291 -6492 -24961 -18523 -2095 11683
254 11683 22405 15751 -5859 -18332 -18457 -9439 10870 24244 14334 -2728 -15091 -21366 -10245
267 -10245 11831 19629 13655 2616 -13376 -21270 -9385 6752 15509 18176 6187 -14716 -19759
280 -19759 -9421 2069 14955 19836 5337 -11323 -16791 -13262 -757 15298 18105 6914 -6168
293 -6168 -17259 -16159 189 13502 15037 10045 -3430 -17030 -14938 -1887 8990 16354 12449
306 12449 -3230 -15173 -14068 -5906 7104 17448 12520 -2322 -12068 -14299 -8561 6406 15984
319 15984 12022 1024 -10148 -15760 -8481 4960 13372 12954 3952 -9810 -15240 -8757 2351 11990
333 11990 14331 4887 -8027 -13690 -10299 -29 11347 14243 5696 -5654 -12822 -11998 -1474 10740
347 10740 13608 6804 -3441 -12125 -12121 -2762 8458 13072 8902 -2026 -11383 -12262 -4641 6706 12854
362 12854 9619 -868 -10516 -12304 -5089 4785 11424 10619 1209 -9275 -12428 -6573 3577 11202
376 11202 10977 2315 -7820 -11733 -7936 2426 10455 10096 3844 -4926 -11570 -9582 921 9776 10874
391 10874 4925 -4839 -11107 -9031 -366 7669 10760 6074 -3648 -10132 -8736 -2748 6570 11884 6858
406 6858 -2739 -9063 -9690 -3780 6063 10468 6938 103 -7699 -10657 -4419 5204 9281 8240 1539
421 1539 -8280 -10691 -4151 3127 8111 8932 1564 -6898 -8796 -6145 396 9448 10037 1454 -5157 -8949
437 -8949 -7660 1065 9190 7972 3188 -2703 -9104 -7941 346 6398 8226 5920 -3101 -10260 -6562
452 -6562 -722 4651 9120 6221 -3480 -7137 -6424 -3625 4493 9960 5327 -1417 -5786 -9621 -4315
467 -4315 6128 8137 4523 1172 -6072 -9793 -2962 3675 6007 7732 2288 -7198 -7595 -3138 219
482 219 7045 8834 175 -5345 -5310 -6018 -793 8029 7180 1484 -2336 -7975 -7636 2307 6941 4887 4105
499 4105 -1819 -9065 -5347 1459 2624 6669 6450 -3027 -7027 -4487 -2664 3142 9515 3866 -2809
514 -2809 -3911 -6399 -4212 5254 7503 3004 1246 -4586 -9135 -2428 5390 5060 5169 1579 -6754 -6302
530 -6302 -402 463 4003 7510 615 -5075 -3954 -4237 -1320 7436 6540 -155 -1986 -5249 -7128 1736
546 1736 6624 3377 3105 -889 -8142 -5545 2118 3508 5265 4440 -3554 -6608 -2033 -845 1797 6746
562 6746 3091 -2799 -2997 -4260 -4007 3729 6868 2185 399 -3399 -7416 -2142 4374 3579 3662 2225
578 2225 -5588 -6571 -322 1471 3339 6159 396 -5261 -3551 -1760 -252 5029 5076 -427 -1574 -3526
594 -3526 -5921 293 5905 3662 1890 -1051 -5803 -4914 1675 3479 3870 3440 -2389 -5530 -2183 -345
610 -345 1654 5834 3130 -3245 -3300 -2822 -2382 2372 5444 1996 -1075 -2314 -4513 -2713 2884 4469
626 4469 3092 890 -4236 -5406 -1271 2447 3730 4252 420 -4350 -3773 -1700 128 3777 4386 -149
642 -149 -2741 -2625 -3121 -321 3991 4091 728 -1509 -3714 -3737 477 3250 3698 2427 -1372 -5316 -3491
659 -3491 591 3006 3720 2369 -1793 -4009 -2758 -322 2045 3560 2327 -1304 -2838 -3253 -1679 2311
675 2311 3877 2106 -251 -2283 -4092 -1855 2371 3231 2245 642 -2539 -4341 -1418 1790 2903 3137
691 3137 509 -3042 -3168 -1256 247 2785 3472 388 -2017 -2700 -2440 -230 3591 3295 461 -1008
707 -1008 -3150 -3207 434 3339 2086 1484 -883 -3672 -2719 725 1799 2790 2213 -1264 -2948 -1728 -757
724 -757 1185 3663 1939 -1169 -1670 -2680 -2283 1923 3587 1339 -113 -1467 -3751 -1519 2264 2503
740 2503 2043 1069 -2570 -3475 -524 1053 1689 2950 330 -2633 -2241 -1423 -189 2838 2856 99 -1381
757 -1381 -2072 -2637 -7 3244 1820 823 -251 -2966 -2512 717 1801 1922 1736 -1522 -3331 -1341 -28
774 -28 996 3018 2101 -1385 -2121 -1525 -1090 1239 2940 1083 -867 -1386 -2584 -1193 1736 1917 1500
791 1500 629 -1996 -2848 -484 1034 1667 2376 629 -2180 -1978 -775 -3 2135 2593 -284 -1700 -1455
808 -1455 -1958 36 2491 1691 170 -378 -1827 -2291 437 1788 1596 1318 -748 -2541 -1228 304 1181
825 1181 1970 1407 -614 -2369 -1299 -460 793 2546 888 -828 -1300 -1771 -1000 1371 1923 1152 155
842 155 -1307 -2202 -600 1206 1594 1394 559 -1736 -1907 -498 423 1712 1948 -35 -1640 -1275 -1207 87
860 87 2045 1653 175 -965 -1821 -1417 324 1495 1487 530 -796 -1574 -1458 -10 1143 1600 1052 -725
878 -725 -1563 -1197 -248 939 1869 928 -535 -1459 -1864 -555 944 1900 974 -315 -1187 -1582 -821 1257
896 1257 1933 1062 196 -1025 -1901 -509 516 1503 1356 -75 -958 -1357 -1122 170 1620 1023 239 -975
914 -975 -1187 -892 151 1550 1211 376 -697 -1719 -913 97 1167 1135 506 -392 -1259 -1195 -199 1110 1567
933 1567 642 -401 -1397 -1500 -278 974 1349 609 -471 -1337 -1091 -481 642 1505 1134 -221 -1458 -1412
951 -1412 -663 752 1469 1116 60 -855 -1333 -714 709 1332 856 266 -669 -1549 -789 556 1130 1076 492
970 492 -1016 -1241 -872 127 1070 1216 280 -609 -668 -752 -21 1396 1490 224 -653 -899 -1114 -136 774 863 740
991 740 -380 -1284 -997 -269 774 1174 737 -169 -1230 -753 -338 471 1178 1103 -364 -823 -1010 -661 502
1010 502 1460 392 -55 -417 -1174 -454 559 646 955 426 -732 -1199 -447 34 812 1284 160 -762 -1038
1029 -1038 -399 -258 983 1250 108 -856 -814 -990 115 1107 781 269 191 -1237 -923 235 835 843 874 -121
1049 -121 -1249 -860 -169 348 1198 881 -382 -701 -369 -418 275 1235 470 -315 -640 -1159 -446 650 698 683
1069 683 182 -660 -1361 -462 415 566 988 448 -544 -822 -350 193 694 708 58 -241 -821 -879 -33 1007
1089 1007 734 -33 -244 -619 -843 -209 772 687 381 -268 -1047 -988 -50 436 743 722 8 -480 -587 -387 199
1110 199 995 668 -455 -655 -616 -597 423 837 768 194 -608 -889 -505 516 372 619 668 -274 -882 -208
1130 -208 -177 607 852 224 -291 -1037 -143 65 634 788 316 -513 -404 -610 -41 1001 677 279 -50 -674
1150 -674 -359 43 649 744 673 -220 -838 -532 154 265 777 658 -83 -633 -486 -254 335 918 541 -103 -457
1171 -457 -695 -401 592 733 301 -42 -242 -651 -400 213 525 473 107 -606 -724 -201 -381 286 608 -46
1191 -46 -638 -722 -403 -286 473 588 -45 -182 -290 -591 -202 615 355 79 132 -660 -472 301 283 367 592 -89
1213 -89 -873 -473 -60 132 573 510 -246 -172 -375 -392 317 834 267 -277 -158 -781 -498 405 449 347 126 -456
1235 -456 -725 -252 80 334 617 479 -672 -266 -226 123 193 713 217 -534 -347 -614 -124 352 336 -129 254
1256 254 -737 -433 114 645 360 354 -14 -574 -458 -91 197 348 293 -308 -534 -218 -520 172 660 396 -285
1277 -285 -400 -396 -403 245 161 332 379 -348 -710 133 300 417 502 98 -288 -707 -123 140 425 744 -162 -263
1299 -263 -364 -198 286 532 412 -93 -285 -315 -426 107 346 416 382 77 -811 -125 29 144 472 168 -208
1320 -208 -614 -322 -266 278 448 272 -233 -266 -365 -465 318 541 339 304 -329 -295 -158 195 389 191 205 -293
1342 -293 -730 -165 241 335 404 192 -344 -168 -251 -87 568 566 -138 -227 -155 -238 -87 511 145 181 -259 -476 -101
1365 -101 139 543 101 219 -180 -476 -166 -174 279 540 250 -33 -324 -345 -562 71 386 106 -143 -162 -13
1386 -13 -178 70 281 200 99 -156 -360 -346 180 333 329 -86 -534 -318 -57 97 116 259 137 -209 -406 -183
1408 -183 38 228 60 -83 -39 -492 -132 64 347 298 82 -30 -115 -426 218 310 250 17 -336 -202 -447 291
1430 291 71 451 400 -74 -570 -292 -6 228 233 382 -85 -220 -146 -118 67 635 347 217 -197 -226 -215 176
1452 176 129 577 68 -303 -212 -56 26 447 154 -249 -90 -324 -354 -151 282 178 427 2 -246 -201 -134 130
1474 130 50 92 78 -353 -384 -56 186 208 188 -227 -137 -196 -268 191 198 451 -246 -66 -276 -110 122 241 201 -61
1498 -61 -187 -407 -131 79 279 98 -4 -134 -330 -97 240 281 251 6 182 -211 -295 -32 258 270 15 -139
1520 -139 -411 240 21 341 426 -243 -223 -208 175 14 24 278 -16 -129 -309 -288 65 243 181 225 -75 -75 -399
1543 -399 -121 182 310 307 -81 -40 -170 -117 -7 144 504 202 -246 -269 -49 68 547 423 152 -96 -70 64
1565 64 151 -79 108 -36 -389 -295 -220 -13 259 313 30 -164 -185 -358 -24 360 305 -1 99 16 -71 51 114
1588 114 122 20 88 -61 -116 160 -128 94 541 239 -138 -125 -156 227 214 247 0 -52 99 159 225 -157 139 -176
1612 -176 -158 -210 -207 142 293 -92 123 -134 -296 -307 11 267 358 -2 -231 -160 -92 69 239 407 -128 -192 61
1635 61 -51 -145 296 147 -63 -10 -74 -60 162 29 399 29 -142 46 -164 -145 208 141 140 -29 -312 -77 -31
1658 -31 134 240 39 72 -207 -217 -107 -46 314 278 187 -26 -361 -166 98 204 -9 111 208 -178 -36 49 31
1681 31 87 -25 -120 -137 -55 -270 -70 309 33 -77 -13 -427 -25 328 190 63 156 -271 -241 17 191 89 273
1704 273 107 -421 -68 259 -74 61 159 -216 -55 83 -17 -107 -204 -64 -107 -374 15 -110 -17 144 52 -99
1726 -99 337 -19 98 327 -58 158 124 -379 -156 84 -143 106 102 127 -34 30 -126 -140 237 225 -146 3 -408
1749 -408 -72 -181 130 140 -52 2 -144 -196 73 20 -118 269 145 119 -12 -208 175 146 174 64 1 18 -83
1772 -83 126 228 -154 252 -53 169 18 75 189 303 58 32 -270 118 -152 159 198 63 79 -20 -43 -249
1794 -249 -18 -54 213 3 19 68 -58 168 157 75 70 -249 -226 87 208 -90 -110 266 -26 -66 -69 11 99 135 59
1819 59 10 -236 55 11 222 212 415 -90 -75 15 205 267 105 -273 15 -157 -177 55 42 324 -213 11 -381
1842 -381 -67 139 97 -2 -189 -102 11 -82 103 216 165 -137 -142 -146 -43 -175 41 198 -259 73 -57 4 -74 115
1866 115 148 147 -95 -8 -103 -48 -182 38 -62 163 -171 21 -201 72 237 149 -13 56 9 -26 369 41 391
1889 391 -78 -32 117 -106 -287 41 97 46 75 -281 58 -48 -66 49 170 35 28 -175 261 56 132 274 161
1912 161 -46 -64 43 144 162 244 -55 132 -34 -314 109 22 -147 111 206 74 -14 77 33 103 34 155 208 -19
1936 -19 290 -225 138 -35 -11 -40 46 -25 142 126 -79 162 -275 234 -39 170 -54 93 -226 -248 112 -2
1958 -2 14 292 -379 107 -85 -121 -200 66 12 170 111 -167 -184 -225 204 16 -12 -95 -17 -113 -1 264 -41 26 -71
1983 -71 43 125 -36 41 -19 -68 23 -154 -175 -116 5 78 -1 11 -71 -74 -58 -322 -11 43 -119 -4 -108 -82 108 -34
2009 -34 53 -214 -119 7 231 154 192 -77 161 69 -104 -122 84 338 1 192 86 -162 -263 -372 266 241 -142
2032 -142 139 113 -69 -78 -73 11 229 24 -260 35 -158 115 -36 51 177 -20 -289 -69 44 337 131 -400
2054 -400 243 -277 -48 277 -55 91 -7 -277 225 -143 -12 266 246 -204 12 -190 -190 -194 -118 92 -137 -87 -314
2077 -314 -370 -131 0 133 -155 -396 -44 -206 -163 -288 267 -168 -86 -227 84 -118 -5 170 212 -70 -76 -86
2099 -86 -16 -20 50 3 -73 -120 56 -188 -139 29 -230 -53 94 -26 34 74 -7 219 126 -385 63 -74 174 -164
2123 -164 -106 -79 -76 220 98 109 62 -19 -122 -78 -11 237 -37 -231 25 -96 -149 -69 -86 -125 45 38 -75 66 -132
2148 -132 216 186 97 -254 -27 16 -422 -127 215 216 228 71 -296 -84 -232 51 132 395 74 -160 -103 -153 -173
2171 -173 -13 -117 -33 78 -162 139 -187 -113 -7 -72 -244 299 -100 -24 27 256 -112 -130 -80 -448 60 -109
2193 -109 66 114 223 -113 -128 -30 -157 -39 62 -223 130 176 178 27 -184 -107 30 -34 28 -128 73 -72 -94
2216 -94 71 210 -192 -256 -36 135 46 -81 -259 -118 8 -281 1 45 -105 140 -233 -176 -3 29 150 125
2238 125 234 89 -12 123 -33 -80 37 -161 140 -210 4 30 -109 48 130 18 -329 -140 -92 50 308
2259 308 169 90 22 62 -165 -99 118 31 26 43 12 34 67 105 77 -15 -171 -332 -254 233 179 137 -166 -373 331 -58
2285 -58 -33 -350 -77 -199 -223 17 -154 112 225 -75 -61 245 -103 -49 40 214 98 -69 407 -127 -205 -29
2307 -29 -5 58 13 207 26 -134 25 104 -141 -233 -63 -148 38 -103 349 44 83 -195 267 -187 -114 -94 88
2330 88 -171 -343 -57 -225 174 164 128 45 -29 -104 29 -46 108 293 196 -198 16 -150 -184 109 -331 20 175
2353 175 50 80 -30 256 10 4 -148 -165 -52 35 161 -7 119 -209 -187 -153 -16 -166 -3 24 -101 -230 -98
2376 -98 -221 174 190 146 204 -169 -113 97 -25 -110 279 97 -53 133 -369 -92 16 88 165 5 200 -80 31
2399 31 74 120 26 -67 143 96 104 130 115 204 -113 73 -76 320 -90 98 208 -224 -23 -136 -129 -94 92 -244 111
2424 111 113 -169 2 -239 137 6 -177 46 0 -116 111 -137 96 58 104 -138 -29 -77 333 -48 181 73
2446 73 -71 -145 26 -62 3 260 -81 -22 -114 -8 91 25 -42 44 162 76 -264 122 82 -183 72 120 127 67 -1 197
2472 197 -81 154 -48 194 -184 -130 -54 74 -180 74 240 -37 300 157 102 -9 64 47 -38 -58 175 27
2494 27 -204 208 -104 90 63 46 -28 -92 42 63 16 -58 82 112 8 167 -9 394 -89 -99 17 115 -17 -191
2518 -191 -166 -173 187 -18 46 -6 -166 -51 -110 54 244 292 195 -141 91 74 109 64 213 24 81 -222 -93 -100 12
2543 12 -45 -167 -145 -223 151 141 -87 -57 100 36 130 -50 -117 -81 73 217 68 29 -98 118 145 -121 -13 -4 218
2568 218 -38 117 79 118 -149 -53 -177 -38 -181 -32 27 -58 170 -132 77 110 -168 -97 -26 23 -97 216 12
2591 12 49 170 4 -261 -60 -142 121 213 -69 -101 145 100 76 186 146 257 -69 165 -91 176 -168 -128 -25
2614 -25 -299 -149 59 0 -64 115 84 -194 86 285 -78 17 -86 84 11 36 -170 174 87 -143 105 -85 -262
2637 -262 55 -87 -186 103 101 24 -144 331 290 59 -91 147 181 -497 123 95 -184 -55 -194 208 181 -182 -166
2660 -166 -88 -135 176 -4 -79 266 -135 174 209 -5 -33 16 -129 133 -92 315 106 -66 332 56 0 58 161
2683 161 -98 -101 33 -155 -159 161 -108 103 8 101 111 109 9 -57 -350 169 -14 -187 51 -182 -44 -142 -44 -76
2707 -76 76 17 196 -53 152 -15 155 242 17 -7 -20 119 107 -77 3 211 32 48 -360 116 -300 -116 16
2730 16 62 92 -32 207 11 204 12 76 -24 121 79 1 -151 -9 -191 -46 -78 -31 331 -99 175 86 209
2753 209 -31 130 102 -29 -96 -32 36 -67 -185 60 124 -3 -88 126 -36 -7 20 -108 -58 -90 -97 -48 -188 66
2777 66 -112 -188 40 -106 -220 12 -125 22 -23 -143 207 -118 -52 -13 5 -4 122 148 165 -239 -15 -48 -47 -273
2801 -273 123 -35 89 143 322 -96 196 43 277 -82 -96 25 220 -108 -216 75 -77 49 -214 284 -81
2822 -81 -156 -28 -330 -187 -111 -70 61 256 105 -144 -139 -191 100 -209 -44 1 -127 -123 282 105 -49 -175 112
2845 112 -113 154 138 -38 -56 -11 -241 -56 -12 32 18 -176 80 -48 -235 -87 -226 -119 330 79 100 39 -162
2868 -162 -81 74 140 -113 -14 45 22 -164 21 211 95 63 135 239 72 0 -231 123 -110 -138 56 75 202
2891 202 254 159 79 179 56 110 317 -39 -84 60 93 -60 -70 -35 -174 -33 -189 266 163 179 -131 112 -203
2914 -203 -9 79 12 142 209 -89 146 -26 -232 95 93 319 343 -17 -51 -115 -111 150 -206 75 13 -323 -259 -15
2938 -15 121 -100 178 12 4 -42 175 -21 -47 -1 140 45 143 162 102 -25 -59 44 -122 262 -75 155 19 71
2962 71 -14 -13 -20 52 45 137 -80 34 -222 41 -237 184 -267 -1 -13 162 -43 42 -105 46 231 256 -261 57
2986 57 18 31 -51 -12 -50 -101 -18 -145 72 -15 -1 127 -6 -43 -256 85 -154 -72 48 -20 96 10 22 35 -39 157
3012 157 -127 -79 -55 182 147 -29 177 49 135 10 24 -149 -216 -70 -215 -80 231 32 -24 135 -17 146
3034 146 157 16 104 14 46 -192 -204 -148 -199 218 126 -44 199 -126 -17 -245 -144 45 -115 -64 -295 -90 174
3057 174 17 -34 73 -72 142 99 92 115 136 389 124 -135 -129 309 -13 99 -123 60 78 69 27 -118 51 -32
3081 -32 -131 67 178 96 190 -213 -26 99 -74 6 -104 10 60 94 96 237 -74 104 -201 152 -34 140 -319
3104 -319 -160 84 -145 -35 -92 -3 39 -40 338 146 152 -264 26 12 98 -316 -113 59 -197 162 -23 182 -194
3127 -194 -40 91 -7 -223 -16 -185 -14 -341 126 13 179 51 -51 66 -25 146 20 86 70 -96 -21 -154
3149 -154 52 307 -50 94 43 -7 38 -173 87 -33 74 161 -257 -164 9 -119 -56 -155 -81 -183 -86 -90 -58 -186
3173 -186 -81 163 0 -98 327 21 40 -27 -105 -106 -32 -3 -142 118 80 128 62 95 -379 -116 76 -263 -13 166
3197 166 87 -58 -73 -70 104 -68 -51 49 303 146 -146 -129 -181 -202 -117 -18 47 -25 144 208 64 -64 -262 32
3221 32 272 -88 -95 -26 -99 -200 35 -35 248 222 -22 60 -142 24 54 -68 -199 108 -237 18 11 144 -196 -4
3245 -4 2 16 44 85 157 -154 -65 -170 -29 -144 36 -113 170 109 -355 224 157 39 2 -298 147 -196 -7 -18
3269 -18 -88 209 4 -53 226 93 -42 -11 -208 -310 -202 -55 54 -18 -125 160 84 -12 -17 32 218 -34 -40 -56
3293 -56 -143 49 -9 -113 184 -273 -151 -111 162 -90 146 -142 169 -109 90 -87 -20 33 -55 18 -220 47 -159
3316 -159 -18 -8 -96 250 -3 -133 126 140 126 94 -15 35 124 -149 60 -105 50 161 192 22 129 68 -82
3339 -82 233 -31 -27 -119 -274 -110 71 186 31 -217 -113 -151 43 -128 -169 160 65 200 -62 136 -3 -160
3361 -160 6 -71 10 223 138 -69 -166 59 -21 -7 -54 76 21 210 16 -15 25 -35 213 174 -168 -43 -27 130
3385 130 151 -42 -108 218 4 16 36 -69 35 -136 -130 -78 229 21 -158 -22 89 50 -21 -142 -197 -248 -41 221
3409 221 -54 121 -40 -39 102 -281 284 39 61 117 84 183 -321 -98 -163 71 47 -109 -15 -191 48 32 -246
3432 -246 -78 233 -45 -13 38 -27 86 -107 123 -16 115 -231 208 4 -69 -172 35 -20 -57 104 -13 -36
3454 -36 -69 -142 -101 321 21 277 -218 89 -81 -16 227 -57 -303 -94 127 220 183 -94 268 82 -13 -28 74
3477 74 -161 109 -4 -297 -163 198 34 202 146 154 119 12 185 -300 147 -40 -42 222 -218 -126 135 -80 147
3500 147 -83 -270 -22 -33 81 113 -161 -34 66 68 -16 149 -28 130 -75 -135 44 189 248 -217 -139 94 104
3523 104 -109 12 75 -94 -88 82 245 -79 219 125 7 -109 91 -198 -188 -95 80 126 289 -75 15 -155 -246
3546 -246 149 77 -184 242 -144 268 93 -185 136 1 -21 94 -28 71 -4 -42 149 -221 15 94 -40 243
3568 243 -88 181 -63 86 -35 135 146 26 209 153 -87 -143 -89 -104 -153 -241 52 203 32 181 158 -128 -74
3591 -74 -123 170 91 -7 99 -153 -284 43 -158 -147 241 66 171 77 55 -104 -221 -95 -268 -32 147 -36
3613 -36 -10 165 -88 35 30 182 -167 -43 -132 -89 -11 -57 156 240 180 -53 1 -115 14 110 -88 84 -59 11
3637 11 -31 -158 37 -98 61 -199 101 -208 -64 -6 108 118 208 71 77 122 -10 291 194 -202 -64 72 -134
3660 -134 62 245 20 30 -107 -9 -267 -233 56 63 -194 88 26 -3 175 -243 44 -219 -71 -103 166 262 0
3683 0 -168 -228 -64 150 85 161 -68 86 -27 106 120 7 163 -97 -198 98 247 -149 -201 41 -124 -50 -319
3706 -319 -46 32 -56 -270 -246 250 -234 212 -29 -65 2 88 61 142 -156 125 240 -130 -101 211 102 12 -57 -98
3730 -98 -109 -287 -30 -142 147 151 84 -82 -129 -28 97 153 94 79 -104 -94 123 102 209 99 78 -260 108 -174
3754 -174 12 -326 151 35 -60 164 -417 -239 -74 -68 57 123 -197 239 -35 -256 -146 -54 -232 -167 -31 -120
3776 -120 -95 63 -60 61 45 -81 -197 -83 226 174 -209 137 -39 -59 -109 48 74 44 59 188 -42 24 -97
3799 -97 123 -138 -325 232 -152 -223 -13 13 155 278 72 128 -193 -173 253 -26 -84 -81 152 53 -23 -27 -92 -5 327
3824 327 -124 115 -129 18 40 24 21 96 -21 191 127 -5 -178 93 144 -187 15 40 -183 202 -35 124 32
3847 32 -83 -115 88 -34 55 305 -134 221 -68 33 272 -66 -161 -182 50 62 75 -123 -130 31 145 265 106
3870 106 107 33 138 -358 -2 -54 66 65 19 -280 86 -153 -134 -28 -266 65 125 -135 48 61 195 239 -61 53
3894 53 11 47 -135 -91 -138 145 29 33 -192 142 -53 11 143 -69 -317 44 107 12 -275 -140 -82 55 81 -13
3918 -13 102 -51 260 -104 181 -29 12 -189 26 -41 -65 7 236 132 25 -99 -104 -137 4 76 10 -303 -10
3941 -10 -75 -239 -59 205 -166 -72 60 -102 116 -1 -119 61 76 -128 -401 228 -85 87 -183 129 86 98
3963 98 15 -15 47 60 90 -43 177 -256 445 7 -88 30 110 -22 -83 277 -290 -14 -85 -53 -68 97 69 59 -231
3988 -231 64 265 107 7 -88 -15 -233 49 -43 -13 58 20 -160 80 -70 -227 125 -54 -246 -12 315 -115
4010 -115 16 22 -25 187 -106 362 -87 72 43 -56 202 -176 -124 40 -11 136 -69 17 -61 -95 27 164 -129
4033 -129 188 -261 74 126 -69 129 -76 160 -120 127 190 -34 -116 20 32 43 -74 65 79 -13 -128 137
4055 137 -114 239 162 162 216 129 174 57 42 -188 -139 92 -78 28 100 -18 50 40 242 119 248 -31 -210 276
4079 276 101 33 6 -82 132 -82 142 -331 -97 121 248 -10 -31 -61 -189 -29 -23 -34 -345 139 -211 -58 55
4102 55 259 69 97 -95 77 -277 156 -11 91 245 -236 -9 -17 -72 308 -44 105 -213 151 -45 -39 -139
4124 -139 183 -135 -332 25 41 -354 -95 21 393 109 -45 249 -191 129 -71 -57 -200 -193 -414 -171 53
4145 53 193 25 74 -31 -3 337 279 200 -281 -333 131 80 -51 157 3 72 -226 31 -14 183 176 -2 24 251
4169 251 -33 -195 131 -87 -42 -31 149 -157 157 -406 74 26 -48 143 174 -86 102 -150 60 -95 15 52
4191 52 10 53 -41 -126 1 -81 161 112 174 -112 95 -269 211 274 -143 53 81 -259 -205 30 -197 -145 -140 -159 143
4216 143 -248 -191 74 -73 54 106 -50 -76 -55 -51 -55 -104 92 13 -22 -131 -103 122 -76 337 101 47 63 -340 40
4241 40 55 -167 47 319 86 -162 131 -107 -90 -20 13 -11 -158 86 43 43 237 -260 -152 -6 -47 -59 60 -54
4265 -54 20 -10 -71 -77 113 182 -111 -111 -104 165 58 -88 -33 159 -106 -54 -247 46 88 -4 -188 83 59 1 182 -87
4291 -87 -43 148 -133 8 -201 161 -276 236 35 -54 34 66 21 -4 -108 -51 124 -290 146 -82 -10 76 253
4314 253 -95 -76 -5 -88 -228 -37 18 -50 -24 -66 217 -145 221 19 -50 400 -54 -145 51 113 -173 -36 -60 51
4338 51 39 348 76 -117 137 -140 221 -70 5 71 -111 66 67 77 39 -210 -61 353 119 -216 -102 -17 -325
4361 -325 73 96 40 -189 -18 229 -87 -249 -250 178 34 -24 78 302 1 187 175 -91 -205 135 -88 -128
4383 -128 82 169 -19 -111 43 -97 155 18 296 -77 -160 60 239 -87 -28 -75 -40 262 28 111 -36 -276
4405 -276 85 -259 126 -10 170 107 103 40 28 -275 310 130 259 -154 159 -326 -75 349 -39 6 52 101 200
4428 200 176 -28 197 -37 71 150 -88 78 248 -60 146 -151 -56 119 224 -225 -87 152 -107 -40 47 -273
4450 -273 91 43 -315 -31 259 -103 -407 86 -145 -63 56 145 -9 -60 -162 200 164 -41 -139 9 4 -145 -210
4473 -210 -194 256 -247 -62 17 -21 41 -58 -78 102 368 -162 -134 325 131 89 -11 -234 -42 165 -55 -128 56
4496 56 -149 95 229 62 209 -36 -106 -113 240 218 33 -235 56 56 8 -1 94 214 218 -68 15 -36 -128 169 -299
4521 -299 -105 -71 -220 -91 259 30 130 203 60 203 230 269 107 -280 56 -252 -53 150 76 186 -30 -26
4543 -26 -89 -91 -191 89 -52 106 -79 150 -207 36 -285 51 190 125 205 236 192 -135 182 -146 148 -102 85
4566 85 -105 168 -70 204 153 275 342 41 -45 177 -204 -263 10 64 -163 5 -33 -232 84 -174 4 -124
4588 -124 86 133 -86 -127 83 36 2 -18 -131 16 -68 -116 -229 -2 135 52 -167 149 53 125 279 -107 -178 -121
4612 -121 27 52 92 -182 218 -259 87 104 51 17 -126 125 55 54 58 -77 131 -88 -154 -14 29 62 97 73 126
4637 126 16 -95 17 57 -181 -28 37 127 159 40 3 -259 -166 -156 -67 292 108 293 37 252 30 109 -5
4660 -5 -24 10 134 298 -30 -102 41 254 -136 -64 135 -88 -108 -41 273 216 -93 -34 -101 -9 -223 -153 75 -237
4684 -237 -229 57 14 -217 25 -182 -6 131 -105 -5 31 332 -148 -121 4 61 -63 -107 -98 44 -206 205 -28
4707 -28 -1 343 398 193 -88 -128 -138 -123 24 -47 59 51 24 139 86 292 104 40 151 17 -228 8 138 54
4731 54 -189 185 12 -79 68 -94 -253 58 -23 220 31 -71 50 118 -139 -70 299 162 186 -300 49 -81
4753 -81 -54 -36 36 84 24 168 280 -65 -29 171 229 -66 -24 -12 -329 -21 -64 -146 132 -138 -116 -151 139 -243 -90
4778 -90 0 -244 -91 46 386 -40 -27 -139 -98 -38 197 183 305 -85 4 -143 -413 81 -136 176 23 -34 177
4801 177 174 -75 105 138 1 -27 -59 -176 -286 357 327 -54 -54 -200 327 -182 75 -97 -173 149 54 141 -125 -123
4825 -123 -17 -61 110 163 -275 -95 -79 -83 -189 -36 139 -131 -33 -79 -191 6 -159 168 207 -159 -66 -29 132
4848 132 -164 119 25 -143 211 -41 -103 -88 260 158 -126 -65 -108 -91 -34 50 -66 -27 -82 -145 67 -160 -200 144
4872 144 145 -100 11 141 26 242 288 -172 43 65 -180 196 -109 -105 -74 -100 170 155 -120 35 92 93 6 -11 70
4897 70 -1 18 -96 -143 268 139 -238 -47 -42 -227 -33 144 231 105 -59 39 48 -124 -97 163 -318 -178 -43 -44
4921 -44 -25 178 80 191 278 88 -130 -171 -212 -83 29 289 -109 102 165 -74 -168 96 74 170 191 64 251 18
4945 18 -15 -46 -89 77 120 170 191 17 29 95 235 127 82 189 307 98 77 188 31 -80 230 104 106 -71
4969 -71 -133 -133 -79 -6 -242 7 103 141 137 -250 -209 2 -18 -51 238 143 -96 -47 44 -33 132 -31 -184 15 -255 -153
4995 -153 -153 66 160 -2 265 70 -45 -123 -20 -233 257 196 -111 45 -277 -286 -74 125 57 317 113 9 205
5018 205 -235 139 32 -214 -178 0 40 -61 51 -33 69 306 -86 -70 44 6 -72 -37 7 21 45 76 185 -217
5042 -217 -50 -369 -88 -213 -113 56 -137 48 -313 -178 -74 62 51 -96 -5 89 -288 -153 59 -72 -66 271
5064 271 -103 181 131 -156 48 -46 213 -74 201 -86 -223 -94 297 381 -52 162 28 220 76 156 -132
5085 -132 13 -165 385 108 -79 205 -114 59 3 -12 148 161 117 -14 146 53 167 -234 282 -265 -207 -137
5107 -137 -52 121 -157 -73 -427 126 -107 168 127 -358 22 146 47 -85 -176 141 88 -115 -45 -52 73 181 226
5130 226 118 50 -140 -81 80 80 78 -8 -196 -85 -198 86 -21 98 116 -182 -134 77 -134 -379 -217 -55 -22
5153 -22 -9 12 -54 -144 214 99 -5 30 -233 -106 -75 -214 -32 133 51 76 59 -116 354 -21 162 -218 -99
5176 -99 67 115 -45 -53 -203 -14 68 139 116 129 30 -96 42 -188 -197 107 142 -310 75 -37 -95 -38 4 11 5 -179
5202 -179 -67 229 -48 -125 49 -103 58 258 78 -2 318 -108 149 17 43 225 -121 -165 127 52 -35 22
5224 22 -201 18 268 55 151 -79 -146 -4 50 32 -100 94 -66 204 -99 -211 -70 -94 -76 -17 44 -22 -57 -6
5248 -6 167 -118 270 -187 -276 270 170 -282 123 -57 -99 -168 -106 -189 26 -120 77 -58 -59 -41 213 133 28 -71
5272 -71 -104 61 -122 281 -23 117 -81 88 -47 -37 158 -48 97 -95 -139 10 122 -212 23 -120 -93 -140
5294 -140 166 -107 -92 -4 185 23 -66 -13 41 -117 -84 -15 7 -26 52 231 117 156 -22 46 -131 109 -148 186
5318 186 -187 -120 -136 -145 101 187 -30 -64 -36 64 25 50 49 -309 9 -196 -1 -215 -149 -46 -133 13 187 12
5342 12 7 39 -107 50 -129 74 -148 11 -132 -107 125 -21 19 -35 120 -211 -19 71 -47 43 -218 84 30
5365 30 43 48 -11 130 51 215 -139 -74 19 -37 -46 -267 -58 111 19 16 78 147 235 7 -98 -71 -106 -37 110 94 -158
5392 -158 -30 -98 -70 239 276 -48 115 -150 34 -178 -66 -181 -14 -24 -65 -8 -38 -10 66 188 -77 -42 42 -138
5416 -138 -212 -50 -203 46 48 -57 34 129 43 -128 -18 31 169 -23 202 95 118 35 -190 -33 76 -210 -155
5439 -155 -213 -116 -119 186 -114 181 -138 18 26 -16 117 -61 -107 -134 86 -51 24 117 200 -383 -180 130 -116 190
5463 190 48 -66 17 -360 30 -132 215 -236 -97 -53 -77 -186 -1 19 -205 -159 154 -106 -22 102 50 -93
5485 -93 -130 323 223 179 178 -82 185 -110 176 -117 70 28 -67 208 118 58 230 -105 -117 -305 301 120 -27
5508 -27 258 118 -85 -20 -105 -182 186 -15 129 78 -250 -160 27 18 190 248 -76 58 140 -59 -318 99 96 122
5532 122 28 158 -123 -169 195 -226 190 64 -174 -69 -50 -179 -154 139 73 243 21 -319 105 -212 -163 38
5554 38 69 337 355 60 57 72 -75 25 -55 265 -7 -195 133 -54 -219 -91 -1 120 109 154 -98 114 86 -54
5578 -54 -158 -185 -71 -165 16 24 -195 63 147 -52 -151 -382 -183 95 75 93 56 317 57 183 -56 -15 133 -167
5602 -167 282 208 -3 199 -56 19 128 -69 -139 170 -2 233 63 195 -201 -142 -69 -133 74 107 147 -186 -148
5625 -148 37 176 -168 -214 259 95 -17 87 144 45 -101 -32 -201 -248 -145 296 -84 324 -40 168 22 141
5647 141 -15 -132 6 6 217 -12 75 -12 176 41 139 -161 -99 -99 167 63 -227 -31 -46 69 -53 159 -94
5670 -94 -177 -20 -67 -279 229 183 347 -1 -195 -45 -56 21 -79 -201 121 24 46 253 -85 312 -111 41 -78
5693 -78 115 122 -35 -131 100 -47 345 -103 -39 -9 -110 209 -71 90 5 -181 -97 23 61 12 -78 34 -116 -51
5717 -51 35 66 96 -10 217 -46 -76 69 133 -65 116 81 93 -30 -18 -250 76 -158 -114 -43 36 -306 -97 -144
5741 -144 -352 -39 -32 62 52 48 28 62 -56 60 -76 -56 119 115 -147 49 174 -9 30 177 -13 57 14 -61 97
5766 97 -54 -234 -43 -219 -95 134 226 -107 150 6 -228 69 -57 148 23 210 9 -223 -85 38 116
5787 116 -93 -10 -100 -29 83 99 139 8 -130 159 -40 67 -125 -25 -96 -207 -7 103 129 91 156 -155 145
5810 145 -202 33 239 -118 183 -98 -86 -31 209 -287 25 72 169 12 15 59 -16 -123 -25 16 -115 -54 -102 22
5834 22 21 116 -79 -185 -12 -126 -79 -22 -88 -18 169 -114 28 167 158 70 -214 -41 -235 -102 -100 264 12 -168
5858 -168 -14 44 -25 43 25 -179 -7 10 -143 113 6 20 -65 69 158 -12 -418 258 -128 104 -18 -308 -99
5881 -99 -135 -140 33 -89 -101 -17 -101 48 1 83 -104 104 35 173 -76 252 53 -159 35 63 -107 77 -31 238
5905 238 -46 -275 -165 -47 6 92 -213 127 -212 -75 12 243 226 -197 250 18 42 102 -130 -60 38 -276 141
5928 141 155 -180 -240 -9 -99 -97 -134 54 279 9 158 0 138 -206 -136 328 242 -144 30 -9 -119 333 146
5951 146 -87 -32 40 -97 136 213 37 152 -335 -93 75 296 166 327 29 67 -116 -208 353 -19 23 -69
5973 -69 175 -111 -58 -9 -19 -67 -6 -60 114 14 -74 73 28 121 -282 35 -24 115 59 206 63 100 -182 33
5997 33 170 59 -41 30 -64 88 114 224 146 230 -59 -294 96 76 26 58 134 -63 -181 6 -131 -72 -181 17
6021 17 -71 -154 -17 -77 -348 -93 144 235 75 44 -20 -116 -51 -97 -71 -93 272 -115 289 113 -147 -27 -74 -125 -112
6046 -112 14 55 -39 -27 52 29 -16 45 136 41 -15 -105 39 97 96 -127 -171 260 -92 -222 15 -61 -82 -58 -37 -68 -192
6073 -192 -191 -40 -81 -32 -158 -38 -66 -81 81 -42 -26 267 186 -40 -131 81 104 54 160 -183 261 -5 -178 352
6097 352 -160 186 96 -129 -14 -12 -18 -166 -23 -323 -155 -75 -131 -12 297 70 222 -204 -41 -47 -111 47 196
6120 196 239 -167 163 201 -63 -211 19 43 -122 114 -70 136 39 91 66 -37 -180 -227 -207 -209 -14 -333 80
6143 80 -78 38 58 46 119 -72 91 23 11 265 -293 -252 39 -56 -425 -119 -230 -72 189 72 -46 -39 19 -46
6167 -46 -151 27 86 112 -69 3 -127 210 157 -256 -5 100 157 -340 89 49 -21 228 -84 -23 -63 -110 -80 86
6191 86 205 226 105 -248 267 7 -121 198 -11 189 -48 131 -90 -191 -172 15 -33 102 -183 8 -168
6212 -168 -192 167 -137 125 -130 -302 -141 176 177 96 136 73 105 -156 -6 -26 -55 274 -207 113 -91 0 -142
6235 -142 -93 172 -86 23 87 -119 -220 37 -59 84 -75 89 -115 111 76 -58 25 25 -204 11 -75 -201 85
6258 85 149 31 -7 83 323 -82 -98 227 52 -122 157 144 274 -64 224 -215 -87 47 -46 -16 -58 -32 -22 108
6282 108 -159 4 -63 -45 -23 1 132 -110 -1 -92 44 -42 -176 255 27 65 270 84 -117 110 -83 153
6304 153 104 -45 121 35 220 -64 149 263 157 261 290 66 -55 81 -20 123 162 -41 -18 -292 231 54
6326 54 -110 -165 57 21 61 -26 -38 44 -44 -25 -34 -153 -112 -178 -12 -205 37 -112 -143 -263 -68 109 -38 -105 71
6351 71 165 136 -87 271 85 157 -175 31 -68 -59 -202 -147 -150 -180 -261 -36 164 -46 151 -120 -29 3 97 -38 45
6376 45 166 -56 -132 -64 150 -58 54 199 -126 20 28 30 7 -88 131 -224 -79 -34 152 -45 172 162 285 -68
6400 -68 -152 61 153 -33 -223 323 -324 -193 -28 -247 -97 45 38 61 -306 -57 54 116 180 -4 65 -130 62
6423 62 -361 -4 224 -94 -53 -159 -61 -162 -53 55 123 -185 -57 -441 117 93 -187 -35 -16 -29 -223 226
6445 226 -87 -171 13 110 234 48 -195 51 -209 -17 116 -74 -34 -273 45 374 24 302 42 -298 -256
6466 -256 19 -48 -66 99 33 -125 -157 47 127 -111 64 -113 206 175 -42 -110 91 -312 2 243 -327 -85
6488 -85 -186 -53 100 -15 -67 -237 -324 -82 141 203 148 142 21 -41 134 -384 -243 -103 -229 87 173 -135 187
6511 187 14 143 -60 -228 -123 -47 200 13 341 -21 -179 -44 9 128 -86 80 180 -111 225 177 -75
6532 -75 -94 -20 -89 -13 432 222 68 -58 56 -91 -125 185 -89 39 -3 72 44 107 171 57 12 51 269 -151
6556 -151 -75 -17 -109 66 154 -271 107 -36 13 -98 44 253 -8 -179 -86 -47 -54 -266 -29 -23 -75 -56 75 -248
6580 -248 -52 -232 -107 164 2 50 -93 -301 -258 -16 -40 -173 27 -17 -194 -47 244 76 -65 106 324
6601 324 325 -94 -198 -105 11 -99 257 -192 -254 238 -60 -16 -155 83 7 -148 -153 56 -7 4 -19 -16 -47 14 -100
6626 -100 -186 -281 -155 -157 -179 18 -210 71 -136 -152 -29 131 206 159 -2 134 95 -68 -210 -260 284 166 53
6649 53 13 -37 84 95 91 -57 115 -323 -231 -241 -215 240 -31 174 110 15 63 -31 269 167 35 -26 42 -14 -58 472
6675 472 93 -150 -39 100 87 290 -40 150 -3 -22 -97 89 -6 8 147 119 75 18 91 106 5 -65 -152 -6
6699 -6 -46 56 -164 -151 38 -155 57 6 -47 109 -62 61 293 -70 53 39 32 -83 -32 -245 63 -43 103
6722 103 -272 26 3 -212 246 138 -275 -301 99 16 51 -9 53 -24 253 58 161 77 130 126 4 89 -154 -83
6746 -83 202 -98 -43 -25 126 16 -71 115 -109 300 82 62 -87 66 43 175 137 -225 -80 212 44 120 211
6769 211 244 -103 -85 57 -63 156 -78 56 -33 277 -51 16 84 -61 23 -80 -48 -87 28 -109 109 39 146
6792 146 -131 -144 14 40 -46 17 86 -40 183 133 -17 -282 56 108 138 -2 101 -63 116 261 -210 -239 98
6815 98 -154 121 -94 38 103 -2 165 94 79 -101 -48 34 238 -117 84 8 -76 52 -256 -25 -168 310 153
6838 153 132 220 65 76 3 -58 141 58 -133 -176 4 -38 -225 98 126 -41 35 -9 188 26 41 -60 -51 -156 94
6863 94 -74 -105 66 -84 -25 151 -264 -102 -276 -7 489 -52 1 273 158 -152 -47 -72 -182 186 2 34
6885 34 -44 67 80 4 -104 153 58 48 -48 101 143 -26 -244 41 -47 72 -138 43 231 -96 298 -11 38
6908 38 -61 -224 -24 315 56 -47 43 73 197 -149 -162 -25 -144 -249 52 -287 -218 133 7 -186 3 -46
6930 -46 -152 188 -276 282 42 -130 188 -218 -59 -142 166 -85 -50 273 -138 -90 441 69 -504 89 68 18
6952 18 1 340 -63 -9 -234 311 -11 -24 107 72 276 37 -129 53 83 -155 -99 -222 64 279 20 -141
6974 -141 -23 -122 225 197 176 38 89 80 81 125 62 -197 -61 102 144 101 235 34 -164 -178 46 -32 -309 43 158
6999 158 -24 265 -2 28 150 -116 473 -16 -308 21 -23 119 51 97 164 124 -63 51 31 -22 -167 -137 -117
7022 -117 -67 -79 -124 -183 -26 112 -34 202 -82 22 -182 -140 -62 -185 134 1 80 -466 -172 205 -101 77
7044 77 -155 159 -10 96 177 115 -76 -31 10 -12 95 -48 86 -53 147 127 92 121 28 160 146 -133 -157 -191
7068 -191 351 -19 60 224 145 134 -112 -8 -46 175 -70 140 213 -84 -55 -3 193 167 212 137 210 83 115 -206
7092 -206 -33 -45 -189 186 -130 30 -63 100 78 55 -45 -156 57 182 120 19 118 -195 160 118 -17 159
7114 159 -66 230 180 120 201 -103 10 -70 -126 36 -79 -20 159 -21 39 91 28 -90 -79 -16 103 119 154 -82
7138 -82 -17 173 104 294 75 -107 21 -16 33 -199 121 -36 168 128 200 79 213 92 -137 -12 52 -195 -162
7161 -162 -99 -411 60 -86 14 -67 -288 68 51 140 -78 -22 -204 14 -211 -159 7 18 -246 -32 237 -245
7183 -245 -103 -49 -149 7 -30 -78 -166 -161 208 193 -112 40 -229 177 135 38 25 -149 139 -85 304 -22 141
7206 141 7 168 167 -138 -67 1 -317 168 -50 81 105 157 -115 -44 115 -174 69 14 -37 89 -64 47 95
7229 95 117 149 79 -38 254 -83 124 -65 12 239 -17 174 80 -38 100 79 15 104 135 -207 119 157 94 -67
7253 -67 -22 32 -123 -71 59 67 129 64 -31 -26 301 -303 -34 35 203 -71 35 65 -28 149 -28 -20 -103 46 -58 37
7279 37 -75 -40 -82 -125 -173 8 285 -186 59 54 149 91 -14 58 151 -92 193 -23 -229 -170 -56 -34 -216 11
7303 11 6 62 160 102 -175 88 -101 -48 -83 33 135 -170 -34 -20 326 -267 80 -17 -225 332 -4 -45 180 -9
7327 -9 -6 -102 -58 294 -230 -122 -74 68 -201 -153 -213 -168 141 37 -287 36 14 52 145 -75 -299 -5 -195 12
7351 12 -174 -215 69 -71 -23 89 -220 -122 -302 -171 -42 -25 217 5 -68 -48 -182 -32 29 165 -106 -27 -154
7374 -154 72 -2 187 -5 -182 -139 47 -313 142 -7 -129 -100 -166 143 -24 205 51 -83 250 202 46 -93
7396 -93 70 146 -142 -146 6 -15 -173 193 -185 126 23 -117 115 53 145 163 -155 -294 211 -295 61 -47 155
7419 155 -316 -21 19 7 58 33 -95 37 5 30 94 -43 129 74 196 -92 -92 46 -192 45 -2 -95 48 -119
7443 -119 216 -11 47 -92 97 44 -184 162 -29 140 -282 104 211 -113 -67 -79 -102 -34 -54 24 -56 -201 204
7466 204 170 -120 -186 -318 16 411 249 196 -4 51 97 -50 -135 2 -9 260 -32 96 -4 -25 175 -52 -44
7489 -44 20 391 -20 4 176 -7 -77 5 47 28 -134 171 45 -4 -26 76 -61 132 42 -105 -40 220 31 -117
7513 -117 -13 69 300 -70 110 -63 -63 -75 -122 6 209 219 18 109 23 -5 185 -193 301 185 -133 189 77
7536 77 -19 101 -46 -141 -45 -114 123 277 -37 -280 -48 49 -78 -48 -90 -145 -77 268 150 89 -90 -53 -59 -28 -70
7561 -70 132 167 -26 107 146 36 108 337 168 -68 63 -179 -98 187 108 -173 73 135 -246 -139 -62 126 -97
7584 -97 103 -106 -102 -314 0 -117 185 49 2 -185 19 -11 -97 106 143 -17 -236 153 -306 128 184 45 -151
7607 -151 -267 272 15 -167 -36 -20 -99 238 -438 106 84 -194 -400 -139 -116 277 208 -93 1 -42 186 -141
7629 -141 73 -247 163 -28 -211 43 98 51 156 -214 62 79 220 -178 174 -113 260 59 -183 143 -67
7650 -67 165 -181 -106 -84 -58 0 -149 49 184 -202 101 -108 21 -266 -83 -326 -130 130 -56 -169 81 80
7672 80 -18 160 65 -15 -79 129 -33 -101 161 -87 -49 15 127 75 100 142 -96 177 185 -123 216 -1 6 -92 -169 100
7698 100 77 145 64 -107 234 22 173 80 74 -5 -58 -91 61 242 -129 -98 -87 59 142 117 222 1 235 -133
7722 -133 -130 -125 175 272 25 -131 269 -157 -148 -87 -126 -47 -16 -47 -173 -159 143 -289 -150 73 -148 175 -306 -62
7746 -62 120 -214 43 -39 -100 -72 -65 -151 -61 215 118 -101 -70 -84 -254 -15 172 -53 -99 61 181 -20 192 213
7770 213 95 -87 129 -13 -82 160 -170 22 100 -21 -137 -241 -67 -149 -8 11 -143 33 -29 91 218 127
7792 127 4 227 -217 0 -223 -201 67 -121 -82 351 -26 -80 170 181 277 -142 50 -53 -161 27 -99 124
7814 124 47 -135 111 -50 -102 -282 0 -12 -300 238 216 -120 -72 215 -114 64 -131 -77 118 192 -81 -74 160
7837 160 4 120 89 -126 62 -52 -15 54 -27 -82 196 55 -53 50 139 -201 -184 71 -98 271 38 -32 -101
7860 -101 186 4 59 -39 315 67 -22 -101 93 120 -214 85 142 -65 -225 95 -5 122 -189 -28 -19 247 112
7883 112 182 273 -47 -103 -273 -145 -1 154 48 122 50 103 135 -204 -186 -204 -61 -91 60 3 54 79 195 123 209
7908 209 -123 272 -86 -187 41 -204 87 -50 119 -238 90 -168 52 25 -116 -87 -32 45 -233 -179 -129 173
7930 173 201 7 98 -40 -238 -101 -36 -37 79 279 4 -246 -70 71 -183 59 266 -289 106 47 1 -69 200
7953 200 -19 91 -10 -60 138 79 -30 -21 55 -249 -133 -277 82 -206 42 -171 2 -54 183 -150 -222 -142 126
7976 126 -83 57 50 -16 24 -45 -22 22 -165 -33 -7 30 -132 -40 194 -56 11 70 108 -58 -33 16 314 -79 -134
8001 -134 89 -27 -188 12 173 -4 107 24 61 72 25 -99 -67 -195 20 137 229 10 83 -21 2 -67 196
8024 196 -80 -2 86 -159 101 127 -94 -330 -3 1 247 80 221 -37 102 74 207 -210 -129 -29 13 50 -70
8047 -70 60 44 134 84 25 -244 163 121 13 191 154 -161 -26 7 55 -21 29 78 -263 -61 13 290 199 -21 18
8072 18 420 -160 260 217 -214 -119 -174 214 50 -4 -1 155 -88 64 -230 -305 18 104 204 81 -158 -142 34
8095 34 128 40 70 17 -37 31 -95 180 -172 32 336 -241 -9 -100 68 -137 -99 -217 172 100 12 -145 -54 101
8119 101 196 168 93 -244 -97 -6 156 -64 -27 175 56 -280 -204 -211 222 -37 15 -41 -30 -94 -219 -84 -54 -121 51
8144 51 -63 -13 75 -111 403 42 79 2 -126 -26 222 -88 -146 52 -163 19 -6 -142 147 -147 -52 111 344
8167 344 297 77 -91 -130 -118 45 256 211 56 -224 51 57 395 -15 45 -37 -179 -189 -47 -3 -104 -15 -299 53
8191E3
$$ Imaginary data points
##PAGE= N=2
##DATA TABLE= (X++(I..I)), XYDATA
0 0 0 0 0 0 0 0 0 0 0 0 0 0 0 0 5 -8 8 -8 8 -8 16 -16 16 -24 24 -32 32 -40 46 -50 56 -66 75 -85 95 -108 121
37 121 -134 149 -169 187 -207 228 -253 279 -310 342 -377 414 -457 503 -555 612 -676 746 -828
56 -828 923 -1029 1154 -1306 1488 -1715 2005 -2392 2936 -3753 5115 -7789 14991 -75382 -197489
71 -197489 -11777 29946 34373 118317 50278 -90059 -56939 -42535 -44438 69644 102522 7748
83 7748 -4338 -41047 -111720 -21107 80533 43265 51377 36949 -92703 -96788 10209 13460
95 13460 47509 115215 7002 -110397 -64098 -25151 16306 109095 62772 -53772 -35718 -28710
107 -28710 -67121 19393 91860 28507 2343 -6108 -78090 -57854 35785 44749 43556 46651 -37472
120 -37472 -82942 -25238 1651 28410 83227 34165 -52922 -49647 -42381 -24220 69127 81843
132 81843 -12520 -34774 -20454 -49095 -15994 49681 38861 20127 11006 -47577 -62936 -1941
144 -1941 27852 38641 50611 -2494 -60450 -38634 -9024 8715 51922 47985 -12503 -36496
156 -36496 -36732 -34663 17450 62116 30082 -8970 -23780 -42617 -25135 23014 31323 22072 20891
169 20891 -15345 -49606 -26901 7629 26433 43172 22335 -28300 -41371 -22707 -2855 28983
181 28983 44182 12629 -19471 -28351 -30930 -9106 30998 37456 14116 -8648 -30823 -33365 -2706
194 -2706 23152 24681 21307 2555 -29223 -33235 -9070 13201 30033 30027 -1272 -29854 -28331 -12044
208 -12044 10287 30824 24661 -1111 -18160 -25337 -20849 6403 29926 24797 5052 -14715 -29503
221 -29503 -20105 7582 23207 21573 11124 -11187 -28018 -19147 270 16471 27541 16447 -13052
234 -13052 -26650 -18382 -2996 17022 26788 11825 -8651 -18716 -20591 -8632 15202 24050 13515
247 13515 -544 -17777 -25068 -8058 13686 20128 16330 2280 -18070 -22005 -8810 6422 19326
260 19326 21288 2491 -16949 -19446 -12386 2976 20976 19452 1809 -11143 -17957 -15507 2412
273 2412 17820 16511 7423 -6419 -21277 -16617 2548 13976 16677 11293 -6579 -19562 -14424
286 -14424 -1570 10684 18672 11797 -5365 -15688 -15624 -6081 10885 18990 10428 -1996 -12372 -17437
300 -17437 -7515 9527 15661 11948 2130 -12521 -18019 -7216 6036 13986 14927 3340 -12758 -15762
314 -15762 -8015 2548 13472 15500 3709 -9448 -14607 -10927 1292 13153 14301 5709 -6023
327 -6023 -14822 -12524 565 11498 13815 7776 -4609 -14428 -12129 -1742 8885 14180 9326 -3646
341 -3646 -12660 -12087 -4411 7512 14632 9727 -2317 -11179 -12449 -5402 5730 13384 10349 300
355 300 -10005 -12828 -6657 4136 12259 11216 2001 -8971 -13228 -7547 3347 11312 11126 3664 -6439
370 -6439 -12562 -8979 1440 10259 11839 4689 -5823 -11864 -9212 -211 9172 11596 5165 -4086 -9938
385 -9938 -9923 -2812 7999 12298 6398 -2817 -9910 -10493 -2613 7120 10886 7488 -915 -9144 -10575 -3678
401 -3678 4657 10084 9664 322 -9489 -10294 -4449 3685 10180 9213 707 -6667 -9616 -7102 1948 9872
417 9872 9139 2294 -5345 -10876 -7583 2650 9086 8578 4049 -4496 -10127 -6929 114 6447 10147
432 10147 5863 -4832 -9670 -7104 -1807 6235 10658 4935 -3633 -7427 -7879 -3091 5960 9409 5035
447 5035 -210 -7931 -10028 -2340 6038 7358 6425 770 -7861 -8887 -2247 2491 7530 8619 712
462 712 -7220 -7691 -5017 1356 9591 7819 -513 -4738 -6935 -6506 1789 8098 5928 2297 -2568 -9413
478 -9413 -6364 2355 5232 6906 5409 -4065 -9064 -3845 -259 3336 8931 5001 -3936 -6295 -6217 -3356
494 -3356 6154 9194 2310 -1464 -4805 -8231 -2166 6242 5264 3746 1684 -6238 -8479 -1057 2804
509 2804 5182 7636 421 -7685 -5272 -2413 80 7604 7408 -1055 -3972 -4924 -6287 1309 8865 4368
525 4368 130 -1986 -7521 -4925 3533 4641 3524 4432 -2017 -7758 -3075 471 2023 7317 4544
540 4544 -4316 -5388 -3937 -2858 4402 8397 1666 -2271 -3231 -7114 -2742 6151 5790 2257 572 -5464
556 -5464 -6881 235 3592 2995 4906 835 -6065 -4251 -1355 -339 5420 6450 -723 -3962 -3909 -4792
572 -4792 804 7242 3743 -229 -1351 -5899 -5244 2718 5060 3007 2714 -2162 -6936 -2470 1952 2311
588 2311 4748 3002 -3018 -4273 -2370 -2126 2320 6580 2497 -2350 -3233 -5011 -2420 4736 5269 1781
604 1781 79 -4157 -5662 -69 3122 2887 3869 580 -5686 -4130 -73 788 3399 4960 -582 -4024
620 -4024 -3039 -2828 38 4742 4325 163 -2431 -4588 -3896 1695 5163 3297 1060 -2098 -5373 -2277
636 -2277 1764 2695 3508 2315 -2710 -4336 -2071 -388 1908 4686 2254 -2079 -3332 -3160 -1410 2757
652 2757 4682 2235 -594 -3335 -4713 -1415 3504 4067 2018 -439 -3302 -4351 -606 2395 3146 2515
668 2515 -104 -3016 -3472 -1435 699 3423 3441 -349 -2553 -2911 -2624 544 4175 3193 233 -1986 -3263
685 -3263 -2917 626 3843 2767 915 -1803 -4194 -2193 1092 2458 2610 1919 -1343 -3746 -2062 -91
701 -91 1828 3790 2170 -1698 -2881 -2603 -1338 2476 4185 1296 -1014 -2171 -3132 -1097 2719 3062
717 3062 1491 -80 -2735 -3339 -396 1907 2248 2956 370 -2856 -2634 -707 326 2962 3561 -234
733 -234 -2357 -2278 -2151 362 3435 2160 131 -1140 -3017 -2539 1657 2904 1643 1412 -987 -3235 -1504
750 -1504 754 1420 2467 2041 -1832 -2754 -1553 -1041 1612 3745 1192 -1085 -1848 -2642 -1241 2494 2883
767 2883 783 -119 -2000 -3070 -470 2094 1688 1836 511 -2889 -2704 -200 469 1867 2491 -23 -2273
784 -2273 -2040 -1086 310 2787 2063 -31 -1076 -2388 -2222 954 2568 1302 744 -706 -2886 -1695
800 -1695 922 1605 2066 1431 -1501 -2521 -818 -217 815 2614 890 -1500 -1605 -1741 -883 1724 2463
817 2463 774 -387 -1438 -2320 -493 1704 1612 1318 131 -1859 -2389 -180 1178 1633 1978 -25 -1770
834 -1770 -1855 -801 430 2223 1798 -315 -1283 -1681 -1387 290 1981 1460 271 -618 -2278 -1286 649
851 649 1606 1408 957 -955 -2218 -942 116 1169 1848 905 -832 -1691 -1176 -130 1032 1890 1002 -558
869 -558 -1605 -1591 -385 1362 1615 1063 -73 -1617 -1614 -530 909 1617 1068 38 -1437 -1597 -611 557
887 557 1540 1436 10 -1276 -1460 -922 208 1563 1268 461 -996 -1443 -1079 475 1361 1243 705 -593
905 -593 -1746 -1133 351 1201 1401 559 -409 -1668 -1267 35 1429 1515 625 -541 -1301 -1224 -307 1075 1226
924 1226 753 -561 -1130 -1164 -194 793 1365 861 -219 -1446 -1451 -520 743 1499 996 4 -1183 -1546 -414
943 -414 659 1164 1155 196 -910 -1475 -833 586 1239 1045 481 -638 -1409 -891 269 1494 1312 457 -624
962 -624 -1352 -1037 409 1316 1339 543 -624 -1110 -1040 112 1000 1357 573 -471 -1186 -1081 -253 631 1307 780
982 780 -590 -1120 -1019 -456 566 1517 633 -161 -1107 -1259 -595 696 1365 657 -129 -680 -1374 -620 430
1001 430 810 1073 233 -1078 -1169 -340 203 1194 908 115 -964 -848 -734 52 1100 1223 284 -318 -1154
1020 -1154 -867 112 808 821 745 -275 -1463 -709 416 253 1157 570 -457 -1213 -416 -102 738 1234 654
1039 654 -308 -735 -902 -248 666 1019 391 65 -466 -1341 -505 512 827 1037 -20 -1194 -949 -381 406
1058 406 742 1170 152 -742 -563 -588 81 900 1036 -142 -553 -977 -737 107 928 646 563 -95 -1052 -734
1078 -734 394 601 1056 554 -183 -833 -650 -59 743 1173 539 -469 -810 -686 -521 341 1027 500 -183
1097 -183 -451 -1061 -619 475 1008 417 -88 -821 -1027 -270 455 430 665 95 -921 -422 -246 -84 534 618
1117 618 -48 -367 -514 -475 267 897 691 -120 -310 -633 -798 -243 425 572 496 -66 -816 -611 -25 453 827
1138 827 506 -656 -873 -718 1 390 829 468 -397 -652 -632 -238 442 831 290 -119 -87 -771 -647 468
1158 468 671 584 -51 -507 -818 -329 340 167 821 210 -441 -489 -403 -204 707 646 68 -107 -442 -571 43
1179 43 569 384 228 -60 -684 -702 80 678 625 599 -37 -859 -264 247 -26 528 432 -392 -618 -368 -138 49
1201 49 672 530 -221 -345 -628 -511 478 635 174 423 -207 -663 -308 402 200 471 61 -664 -417 11
1221 11 168 317 814 -74 -478 -369 -260 -116 608 285 94 -58 -623 -503 59 450 285 339 -189 -901 -548
1242 -548 222 380 617 666 -184 -645 -16 -193 -44 263 371 -485 -566 -429 -287 643 723 35 92 -194 -602
1263 -602 -216 285 300 220 205 -301 -503 -262 19 244 504 112 -476 -330 -2 -322 291 557 -136 -193 -460
1284 -460 -211 127 592 138 194 -55 -557 -487 62 242 196 51 -389 -635 -443 -167 40 694 199 -383 -253
1305 -253 -347 -45 276 624 -171 -156 -695 -477 -130 357 341 9 243 -294 -532 26 321 526 460 165 -551
1326 -551 -157 -201 79 481 601 -195 -278 -175 -391 63 582 396 -255 -325 -618 -293 96 506 485 309 -107
1347 -107 -493 -395 122 440 162 482 -221 -457 -277 -250 260 419 196 73 -149 -203 -38 127 273 285 -310
1368 -310 -479 -547 -83 513 560 114 208 -333 -551 51 52 149 101 92 -152 -263 35 5 421 175 -415 -288 -501
1391 -501 -565 113 359 19 -26 -247 -167 -254 24 282 282 351 -56 -374 -238 -206 164 431 110 -477 -407 -109 -171
1414 -171 498 322 260 -467 68 -50 -320 229 275 150 -50 -370 -283 -175 215 113 173 207 -447 -201 56 297
1436 297 216 369 -107 -136 -307 87 -216 373 -76 -91 -60 -207 -393 111 282 481 37 -241 -213 -54 -22 387
1458 387 203 273 107 -360 56 1 215 468 139 -208 -328 -63 77 222 344 224 156 -246 -139 -205 57
1479 57 335 231 -94 -101 -93 1 382 208 43 -57 -386 -387 -97 28 287 288 198 -193 -621 -73 -195 264 168 -17
1503 -17 -474 -128 30 -106 167 308 48 -176 -360 -50 -74 423 292 265 201 -154 -307 237 98 369 113
1524 113 -78 -309 -130 -99 23 311 -57 89 -265 -301 -209 206 349 138 -82 -151 -247 -83 -105 289 63 209
1546 209 -74 -394 -140 -38 377 189 36 -224 -485 -50 131 210 396 245 -140 -26 -244 377 88 -182
1566 -182 -55 -30 -346 -89 -53 71 115 -11 118 -300 -125 -112 257 130 173 -258 -466 -145 45 145 91 362
1588 362 -2 -295 -134 -224 -139 335 86 6 211 -299 -2 228 51 358 386 46 -472 -43 70 155 152 -111
1610 -111 -313 80 18 -94 122 347 11 -60 -380 -120 137 357 75 -168 89 -62 -292 18 110 360 205
1631 205 -31 -162 -362 -21 -174 221 70 14 -238 9 112 297 405 -29 96 18 -379 -128 301 92 198
1652 198 147 -135 -162 -150 -98 116 -4 -286 -139 -259 138 -18 40 438 56 -37 -99 -315 37 247 -52 71
1674 71 -132 -125 -209 54 367 34 141 -44 32 -114 232 -17 49 284 -40 -331 33 148 -315 220 86 -87
1696 -87 -363 -2 -150 -3 353 139 -90 36 -187 -236 176 115 62 -47 -480 -226 127 -81 -119 408 38 -80
1718 -80 -357 -173 125 69 153 23 228 -47 -395 -53 207 62 174 59 3 -292 275 175 77 115 3 -18
1740 -18 -243 -127 261 207 514 -107 -178 -225 -110 135 249 222 37 75 -202 9 246 213 -84 -261 -182 -343 55
1763 55 130 51 197 174 -42 23 -339 -240 80 189 -94 -129 -291 -88 -176 410 350 0 239 -48 -175 -101 39
1786 39 219 -27 159 -504 95 109 16 82 371 -283 -148 34 -153 -144 115 125 -141 -246 19 185 -68 468
1808 468 394 58 134 -159 -34 -69 33 -25 -129 -138 -276 -251 96 451 5 -40 -44 -274 -30 -28 154 350 -109 -184
1832 -184 -463 -179 142 210 249 30 -1 -162 -185 -146 128 40 0 17 -321 54 49 -34 343 -118 -131 -50 -182 -66
1856 -66 109 109 -122 -349 -292 -184 93 209 81 152 -228 -80 -141 -177 240 48 -74 62 28 -360 -53 -112 52
1879 52 -19 122 -83 -263 -159 137 -63 107 159 -110 -26 -229 -209 86 38 -231 90 124 -132 -100 368 25 136
1902 136 -108 129 -293 339 -37 15 160 -253 148 -151 140 86 -56 308 43 -252 -91 14 -2 348 266
1923 266 -75 24 -107 15 74 -19 65 -238 -162 51 -191 95 286 89 18 -28 -23 -83 24 19 62 -508 -94 -120 -187
1948 -187 20 -95 -3 -60 60 -10 -66 -211 -118 233 242 -267 -106 -98 41 149 -117 -88 104 133 -305 63 -78 56
1972 56 -59 -3 -169 45 -163 216 42 48 -148 -43 -244 151 -167 -32 271 56 2 -409 131 22 34 -101
1994 -101 -8 -160 -318 161 -213 -74 23 17 -282 -13 -12 -49 -298 7 248 -58 37 86 35 273 100 67 -12 -53
2018 -53 292 65 202 75 49 108 9 176 159 163 143 184 -63 -131 193 11 -86 213 -65 76 -216 -278 90 -107
2042 -107 193 43 -109 -132 -90 13 -62 28 205 286 14 48 -165 121 -208 188 156 -232 -51 5 204 -27 147
2065 147 -26 15 -181 -269 -43 -67 14 11 -29 51 -172 -30 265 -32 130 -96 -3 -152 -231 -40 46 177 -23 59
2089 59 219 239 293 125 135 100 -113 -346 270 -82 -165 -4 -67 -59 124 -9 -153 20 88 16 -57 -201 152 103
2113 103 201 116 0 49 -128 185 -97 77 248 -88 190 5 -20 285 2 -33 204 -102 -187 167 -217 69
2135 69 212 203 204 -7 -314 98 88 92 24 47 -171 134 -106 24 241 -195 -344 -256 -141 -224 -334 51 -170 -16
2159 -16 -195 200 -51 -123 46 -58 -149 100 316 -158 -73 50 171 114 88 97 62 -142 143 72 310 -84 26
2182 26 48 228 59 -3 247 331 59 -36 -60 -102 233 -223 32 408 -309 -10 81 -15 -99 123 -100 -120 7 -107
2206 -107 79 -141 -124 -156 -326 -126 233 29 185 84 103 69 54 -243 -236 230 -67 -191 -2 -146 129 -219
2228 -219 -52 -115 -66 144 259 150 146 82 -160 -172 -78 -77 -42 191 106 -14 -159 46 182 -23 120 229 219 110
2252 110 -85 -140 -94 -42 180 76 343 10 -85 -104 -100 -136 -113 35 -20 12 349 -65 106 104 132 -45 -183 -22 102
2277 102 117 83 120 -180 31 -13 74 -13 319 57 150 264 -138 -5 273 76 105 -37 158 24 125 234 37
2300 37 184 -67 137 -195 156 -230 92 -87 142 -151 261 105 42 152 1 -159 63 75 -168 19 -7
2321 -7 -3 10 151 142 -4 -225 -148 183 257 -124 -99 -44 169 74 43 86 119 -146 43 10 170 43 158 123 -472 -128
2347 -128 198 -1 229 -94 -191 107 52 -106 46 101 -6 8 -3 161 241 108 167 -151 -104 53 36 -124 -19
2370 -19 98 -64 -61 82 29 92 355 -131 3 23 -138 100 138 -151 242 55 111 192 6 154 -308 81 83 -97
2394 -97 180 27 161 109 -21 32 -77 -16 -133 -117 255 107 -425 248 0 -34 70 -17 50 -17 70 293 24
2417 24 151 -109 -74 63 -11 -12 49 271 0 -7 235 -3 -79 -17 -57 -176 -178 53 -10 -102 22 -90 63 1 -116
2442 -116 13 159 57 7 16 58 -162 -36 -159 114 -90 116 -225 239 6 51 77 111 -102 -32 288 4 -119
2465 -119 49 172 157 -66 5 -60 -331 249 -167 164 8 -9 -158 -251 157 49 85 -14 132 -89 84 365
2487 365 158 -83 -213 92 -110 24 -102 -73 21 164 22 -10 -18 119 -200 -68 -45 -4 160 139 3 -131 -169
2510 -169 -89 -24 -71 96 34 120 101 -212 66 -112 -141 -151 193 102 -55 -23 135 -279 -169 131 31 -161 81
2533 81 -73 -31 -286 40 213 -61 -150 33 -83 190 -98 -62 85 133 -1 -247 119 71 -22 14 -216 -141 -47
2556 -47 184 156 -223 150 235 -204 -288 -190 124 60 76 442 -258 -116 -190 182 202 -56 -124 -8 117 128 54 114
2580 114 -51 94 2 106 68 3 26 91 57 -144 83 20 45 33 195 -307 -26 -168 130 129 17 176 136 -413
2604 -413 -130 -38 -5 257 -45 -247 -209 46 -87 62 19 -179 -29 63 31 122 63 -5 -165 -170 -16 144 64 158
2628 158 17 -136 114 174 -132 171 -74 57 -94 -109 -19 -40 127 60 0 119 -157 -216 -16 68 92 97 323 -320
2652 -320 -168 49 5 -209 -130 -118 -79 -111 -100 -108 -38 -83 -125 -87 -173 95 -148 -58 138 -15 53 -149 -178 4 -3 173
2678 173 -121 218 -123 -256 -53 72 49 44 14 -18 132 -191 -1 86 34 170 -226 216 -228 78 -102 51
2700 51 -126 54 -13 48 72 20 208 -98 -192 0 90 47 -175 -49 43 -181 5 398 -42 73 -278 11 118
2723 118 -138 -47 93 -70 143 137 -39 93 184 -41 -8 -38 -153 324 -177 44 -26 107 69 -83 -42 135 119
2746 119 193 192 21 25 -203 157 41 9 135 29 80 188 -2 143 15 108 131 -182 -47 -121 -121 -95 -150 16 171
2771 171 26 -163 -53 -19 45 68 270 166 -282 181 54 1 18 51 272 -72 233 167 -268 138 -203 35
2793 35 -68 -15 -48 92 -139 -100 -263 -103 63 40 49 107 40 -46 -23 -120 52 -12 -90 -101 160 -64 68 -142 -89
2818 -89 -194 -114 7 97 -102 -13 57 -163 38 122 -29 151 28 -191 -137 167 102 -124 -50 209 9 -173 -50
2841 -50 -89 33 -71 63 -123 132 -49 -1 9 -101 -82 -143 147 -110 -31 -128 -115 -91 -67 -127 159 -61 -78 50
2865 50 116 151 -4 43 -210 150 -28 -275 14 75 32 -128 -135 38 64 138 -5 -31 121 131 -18 96 -11 156
2889 156 -220 -33 -4 -45 0 -127 28 -51 -63 47 32 -58 141 43 -243 224 137 86 45 144 -159 112 156 67 -238
2914 -238 -28 44 -245 179 -57 -232 -172 -10 -163 217 -54 161 -21 -48 44 66 85 -36 -78 41 -309 236
2936 236 -121 243 -32 -147 134 96 167 -89 -200 113 -130 322 15 167 104 215 236 130 143 18 -8 117
2958 117 5 478 60 -13 -141 -48 54 -14 -134 194 -147 -243 8 -6 -163 -253 65 -214 -98 108 -124 -57
2980 -57 -107 -35 157 141 -30 -164 36 -150 14 -146 46 122 -285 -107 72 116 75 247 -170 -21 -66 164 -32
3003 -32 183 46 -263 -133 -229 -16 -40 103 -101 -108 129 -177 -80 -146 -98 85 -196 23 -131 88 -255 -13 -194
3026 -194 35 27 81 308 66 -267 95 -81 7 69 -107 -294 27 86 -145 -15 76 165 -117 21 -39 69 255
3049 255 -215 -58 -49 179 64 127 -66 -216 -167 104 35 125 -196 -24 -122 -134 126 -139 152 -425 206 -136 -5
3072 -5 -50 58 -207 117 -62 145 16 98 154 95 37 -185 -91 -212 -7 169 146 27 -236 235 -140 -201 -112 -87
3096 -87 -28 -215 -135 -216 60 21 -39 -194 -189 -237 104 -2 304 -260 -29 57 93 -63 69 -150 -129 -24 -79 55
3120 55 -83 -82 -13 -70 75 -158 -122 41 -53 1 148 40 -142 162 95 3 -147 -43 -169 34 138 -144 -57 88
3144 88 -183 -200 100 13 75 -69 -168 240 286 101 11 177 -85 289 -132 156 92 -223 -12 101 333 0 -143
3167 -143 -200 -113 -172 -154 99 253 -103 -218 -17 -6 -116 -11 25 87 -169 195 -75 -20 -2 -229 -74 144 -116
3190 -116 -201 102 73 145 -3 -23 27 40 -41 -165 -336 120 259 -28 -228 81 -72 190 220 163 0 -89 156
3213 156 31 -163 -133 -143 -74 113 78 108 134 229 234 92 123 84 -105 -214 -125 -29 51 -22 38 166 30 -200 108
3238 108 64 -50 65 43 -107 -300 43 -153 15 108 77 -218 -33 39 -10 71 266 -197 -102 65 93 -31 -179
3261 -179 77 237 -150 -1 -18 -140 -162 -73 199 60 62 -291 -313 -133 152 13 -26 16 -78 -125 -49 59 139 245
3285 245 -44 -33 91 125 82 134 266 -88 -87 180 -56 -160 87 -166 -96 -15 70 -394 191 -219 -5 114 -145
3308 -145 86 -41 16 -251 27 99 -308 77 -177 5 133 -92 396 -52 -245 -119 81 -179 207 -158 -21
3329 -21 -136 15 9 37 230 -63 61 226 -7 -155 99 -75 -116 -418 23 -43 -246 -187 -34 -99 197 -369 -39
3352 -39 -158 180 40 277 81 65 -148 -78 -152 -4 61 87 18 -188 -228 104 -165 -93 109 -127 -156 13 239
3375 239 -32 47 96 -97 42 -63 -17 -309 -221 69 -63 -91 60 196 -36 308 150 4 -29 115 -187 -38
3397 -38 93 114 -172 178 -100 -66 25 14 100 -12 -72 -14 135 75 84 57 -130 -63 63 -128 244 156 -66 -111 34
3422 34 -102 -151 134 135 -103 -127 -36 -242 -1 -10 -206 -96 279 -230 177 146 106 106 66 -61 -258 95 21 -109 0
3447 0 154 -150 -60 78 -84 -176 132 15 -132 148 -74 -189 -157 18 77 -13 83 123 4 188 125 300 39
3470 39 72 -100 178 125 -88 6 -122 -169 53 -108 -55 122 -147 113 -138 217 73 7 71 -44 76 -52 -198
3493 -198 44 -185 -199 100 34 -83 162 59 -244 77 53 -214 -76 -204 64 231 -64 -143 -213 -92 191 4
3515 4 82 -153 -71 -64 -125 104 91 164 -289 21 -92 144 -97 -53 -204 181 3 42 -87 -147 144 -303 224 134
3539 134 296 139 -100 237 -315 -93 74 -266 94 32 -42 18 66 11 60 134 -14 -157 194 -96 -18 -164 90
3562 90 -96 -104 82 -126 24 -93 -37 16 266 44 46 124 11 113 35 214 4 155 281 522 60 169 22
3585 22 94 43 12 -84 51 156 -29 -207 64 250 -29 -127 -80 115 -101 245 73 -38 -161 -72 106 24 35
3608 35 332 -161 21 126 101 -261 -96 14 -242 -39 -219 220 -172 183 60 -163 -67 46 -53 -60 76 -66
3630 -66 62 -68 65 -87 -278 -132 -27 -32 84 1 -54 19 -124 -112 32 73 -46 -133 -8 -12 3 -85 -297 12
3654 12 145 64 -119 181 -259 213 19 -214 -101 19 157 8 111 -137 -2 99 31 40 33 76 -300 -80 -120
3677 -120 -210 69 -133 39 143 -133 -188 121 -273 161 -27 -51 -92 -298 175 176 77 -30 137 -151 113 -203
3699 -203 -260 -182 20 -15 -240 -58 -225 78 50 107 24 102 -97 -17 71 216 -190 -94 96 -10 27 -5 -34 40 60
3724 60 -43 65 -134 150 83 -51 -48 -190 207 42 -74 11 -151 161 121 -5 87 272 -68 149 72 -52 248
3747 248 7 -104 308 -102 -237 -35 -85 -2 132 120 -126 68 364 -22 -34 -302 -9 -58 91 -159 -201 240
3769 240 166 61 -54 -13 29 -3 54 112 129 155 -205 -54 81 -34 -23 -183 44 -180 181 -20 -56 141 170 -79
3793 -79 148 107 -11 44 -81 -149 110 -13 -67 -139 -189 -142 37 -123 -121 14 207 180 56 -120 -56 18 124 -153
3817 -153 188 -133 125 14 82 113 -111 -160 -83 -104 -117 167 -122 114 279 22 -67 182 190 -19 -145 -66 -21 179
3841 179 -149 -226 -131 26 280 123 94 83 73 -40 19 19 -121 -340 44 71 -39 202 107 -115 -69 -332 -339 190
3865 190 169 -112 -40 273 0 -57 -111 51 -73 79 139 -118 -109 129 59 88 -193 -273 -55 278 32 -102 -86 -78
3889 -78 -137 -152 -38 -3 -84 -19 -97 157 160 -24 95 207 57 -100 -141 -125 182 -171 3 -193 25 -35 241 -101
3913 -101 254 -96 322 -73 -168 207 -198 -225 31 -13 130 73 335 -13 -173 0 -274 57 23 -219 21 5
3935 5 -82 -130 -42 -58 -37 -185 -6 199 21 -31 -90 -298 -32 39 -189 104 -61 32 -215 -44 186 -167 88 225
3959 225 127 -240 7 -175 44 20 -37 38 173 35 12 -42 42 162 171 2 165 56 -195 -134 -192 190 -149 -39
3983 -39 52 144 135 -108 39 136 -54 178 -57 308 279 -42 -78 108 17 146 -120 11 -248 -35 338 -56 59
4006 59 97 18 -122 -333 14 -196 -36 -54 131 -12 137 -101 -66 88 33 -247 11 -119 -87 -53 26 152 198
4029 198 -60 -36 -146 92 44 166 138 -57 -138 -100 -215 119 92 -33 76 170 -220 -139 -237 15 -54 -208 -178 159
4053 159 -61 75 -1 -97 40 -30 -117 -66 -39 75 -223 54 -135 -18 93 -193 65 -35 -165 -90 -53 89 216
4076 216 -115 -219 -210 16 -142 14 -159 -99 -125 52 154 108 -3 -39 -93 73 98 24 52 163 31 44 -155 62
4100 62 132 -72 59 -25 -129 35 55 -84 41 -35 226 -8 210 -310 68 -3 77 -4 -22 -131 -14 155 -273
4123 -273 -111 -360 -49 -78 3 106 -140 -19 251 95 -106 87 58 -66 -76 128 -57 -59 -10 56 156 -228 -16
4146 -16 -146 155 -31 59 -43 -1 -8 97 -388 -5 -168 87 -18 -328 -49 -85 148 -247 -37 -24 -69 -152 166
4169 166 -62 -124 82 -33 209 256 23 21 155 -25 -65 -362 -125 -85 110 119 -27 -48 -31 -70 -45 201 150 124 192
4194 192 179 -123 181 -130 -63 192 164 -25 -80 -302 -130 55 -70 -78 -222 -276 -108 30 -237 -49 -47 2 -170
4217 -170 156 -65 -227 -227 239 263 -72 26 -169 19 -173 128 82 148 70 224 -7 -145 208 164 156 -14 -19 53
4241 53 -64 103 -79 -161 -50 61 68 153 76 52 -120 -112 -175 -136 -26 -91 216 -83 95 -46 149 57 172 -113
4265 -113 146 248 -76 42 132 -18 37 21 3 -2 -224 43 -201 -230 -233 6 -206 42 51 -217 18 186 61 -130
4289 -130 54 7 -128 25 129 -36 48 -63 68 -45 47 -62 -11 -128 -26 -158 -35 242 107 113 261 117
4311 117 150 130 172 104 -81 -1 -36 65 37 24 13 -109 -289 -131 56 221 50 59 -99 -86 -109 180 236 -124 250
4336 250 -32 -129 -142 139 60 186 -173 52 -97 102 104 48 -167 -203 -320 26 -51 -101 56 129 150 37 224 17
4360 17 -377 -11 -12 -215 -47 6 -103 -265 35 69 -73 -5 110 323 -48 153 227 29 106 -34 -169 -64 -67
4383 -67 -114 69 -19 67 -130 143 -261 98 -40 -213 -41 2 54 188 -49 26 69 -57 -181 -28 167 -160 75
4406 75 114 -182 115 172 -194 -176 -190 124 -70 -261 -119 -70 410 178 -243 333 166 150 -345 48 -46 210 33
4429 33 -135 -144 253 -321 196 -22 136 -86 78 -96 -102 9 -76 37 95 -331 -100 105 81 -77 -175 -174 -233 95
4453 95 82 -126 -34 80 -177 360 -358 190 87 150 49 466 -64 26 240 -150 -87 169 -105 -86 -21 -2 124
4476 124 -193 7 -122 198 -208 70 170 -71 28 -13 -247 145 -25 42 -37 -128 109 106 -74 56 -180 16
4498 16 -176 132 83 -311 434 48 11 35 177 371 -183 -190 133 -1 -258 149 150 -67 -274 -198 21 113 256
4521 256 -102 -71 -225 -165 -294 -16 -15 -151 -15 238 253 -152 78 217 -279 223 29 -66 -67 141 120 -108 73
4544 73 116 427 1 115 -22 -102 -10 200 178 252 -350 -20 -119 -38 -95 -100 26 -57 213 245 231 202 -31 -87 225
4569 225 38 -39 71 111 93 135 38 -108 -37 -194 147 28 236 106 143 -191 -87 -191 -100 -24 115 -309 -115
4592 -115 21 116 -173 -1 157 134 80 83 -246 -173 69 301 -101 -49 64 173 169 -83 -240 -44 -296 -191 -110
4615 -110 156 84 -41 82 -76 -174 -116 -77 -109 -58 -57 -28 9 72 14 -113 133 -104 -138 -6 -137 37 163 109 -28
4640 -28 -145 240 -55 -240 -3 -127 -174 205 -56 93 154 9 -89 -145 237 210 156 336 -260 163 71 -142 -186
4663 -186 236 -275 -66 156 131 -156 -38 94 23 -26 -222 256 10 -136 150 -108 -134 32 -230 -77 -32 353
4685 353 -105 64 36 73 175 6 -98 -108 215 -233 9 62 -269 20 -165 -115 106 -190 116 25 -145 97
4707 97 -161 -106 -206 -45 -78 143 20 108 -33 -113 -160 -95 162 -30 -94 53 100 161 64 114 229 24 -15 136
4731 136 147 150 211 -127 44 17 95 -3 15 4 19 229 86 -104 127 42 53 -69 -98 229 84 127 -5 382 106
4756 106 343 9 81 102 177 115 136 190 -146 77 -11 18 6 116 -28 -188 9 24 -32 -29 -15 -4 -220 161 179
4781 179 -202 -82 1 62 18 -28 -5 -94 -239 -11 44 -70 -25 -151 105 17 -23 27 252 103 -103 -23 -94 158
4805 158 182 -213 -131 260 157 -290 -66 -165 -132 96 -63 410 119 51 173 -72 53 95 247 -70 129 -131
4827 -131 -132 -224 -129 -134 224 116 -96 -12 159 112 -246 -56 26 -106 -100 22 17 -143 70 -167 136 -181 -89 45 -51
4852 -51 253 -62 58 -325 -165 -167 -211 205 80 61 73 240 -229 -162 240 11 -56 120 -135 -300 256 75 -33
4875 -33 -77 79 77 -27 12 348 -113 -188 123 204 18 -192 21 49 0 -29 98 61 -132 27 29 -169 91 -15
4899 -15 109 82 210 100 -53 -139 148 -201 -143 -97 94 22 -31 -348 31 -95 -344 79 316 192 -123 95
4921 95 -55 31 33 -97 -182 -234 182 -113 -15 -75 142 -26 -150 -35 -158 218 163 406 125 -115 16 -91 208
4944 208 134 -26 31 30 140 -108 2 -480 -10 -98 -69 30 -81 -95 16 -1 56 39 225 -14 -18 -140 -28 26 172
4969 172 77 -39 16 64 50 -68 -59 -103 120 -391 135 196 -168 -31 -18 -22 24 51 343 178 -13 15 -182 -58 -48
4994 -48 83 12 -26 185 174 108 1 70 219 -146 96 120 224 -28 79 -122 -39 119 -146 -105 2 -37 19 -133
5018 -133 31 -37 69 -39 -69 -361 15 222 -50 68 -176 -79 45 -63 -245 -68 96 -104 89 59 -237
5039 -237 122 -20 -183 -52 112 -219 86 129 -225 117 -105 -17 101 68 73 -35 207 -135 -155 -81 199 -33
5061 -33 -97 10 52 75 -33 -155 65 -291 181 90 67 3 -104 -171 -62 -82 -41 141 -115 -221 -7 -76 -271 -105
5085 -105 278 -252 123 72 -41 175 55 -83 90 -21 -46 -231 115 -141 -12 75 -162 209 -146 -47 -42 344
5107 344 -7 208 -253 298 89 -168 252 -35 -109 79 62 85 -119 99 -122 138 7 -123 60 -179 -262
5128 -262 -69 -123 -3 8 333 -25 126 53 -46 -70 -11 -43 76 -310 -3 151 87 36 -96 -145 -49 25 -67 41
5152 41 -104 -95 103 -181 -17 166 73 -185 143 37 -108 199 187 181 6 8 -120 265 119 208 -51 -97 -115 72
5176 72 97 55 130 -313 -424 85 41 136 -94 21 298 -15 84 -217 -9 241 -77 -10 200 225 53 -107 110
5199 110 -119 358 22 65 -81 -64 53 -9 171 193 97 -39 -238 85 74 -35 -99 -131 -47 -66 123 49 174 -106
5223 -106 -44 -17 -140 -32 139 -298 176 165 -69 -168 185 -49 255 150 82 -37 215 63 -59 77 -150 -338
5245 -338 -216 33 -241 96 -147 62 13 71 34 19 114 130 -28 405 116 14 256 253 -105 -4 8 -101 -21
5268 -21 -249 -275 3 71 -23 -16 139 31 3 -10 64 -313 -78 231 -126 69 165 31 200 63 -96 139 -185
5291 -185 221 -235 -8 -57 -41 0 91 176 -118 -67 -63 -23 35 -248 -278 -120 -173 -228 -226 -196 114 -137 -110 155 -9 -155
5317 -155 -226 -38 24 -114 52 -405 24 149 37 -43 -39 217 219 -177 -26 102 -25 104 213 20 -10 145 -183
5340 -183 125 41 -182 5 155 -244 51 -55 -218 58 154 -163 86 6 -55 -182 -68 150 -111 -157 -81 102
5362 102 8 -11 171 237 102 -58 -50 -42 -269 -112 142 -98 59 34 -111 -195 -81 68 99 -1 19 -56 25 -129
5386 -129 273 138 -62 38 -54 -109 -42 417 140 -98 -20 154 35 -247 -7 -64 -57 -11 112 68 306 54 37
5409 37 -3 -238 75 -155 178 30 -66 208 170 12 95 188 161 292 2 -5 -72 105 -64 -116 -107 -260 245 -11
5433 -11 123 -46 -189 29 -4 -86 18 27 -293 -125 -226 232 -177 134 214 -41 -147 -29 -13 -20 131 -75 108
5456 108 75 -30 -51 9 -240 -343 -380 133 4 73 -144 25 42 -135 -60 -279 -131 -125 152 -106 53 -255 244
5479 244 368 -259 -144 22 75 63 -161 53 -1 -20 -37 -33 -295 -50 129 200 59 -15 343 -71 44 275 71
5502 71 -236 21 -9 107 151 -35 -21 -134 102 38 -35 -160 165 -260 -106 229 180 -45 -52 89 -50 -6 -18 5
5526 5 32 47 -84 15 40 -8 84 21 -107 -114 33 247 -213 -18 110 5 -120 63 120 -22 -33 -11 11 89 144 -199
5552 -199 132 -42 -85 -207 -10 -47 118 -20 -112 113 -138 180 53 -122 45 -26 -104 48 84 -61 -64 160 -78
5575 -78 -49 -74 73 -158 -83 -334 -23 -135 -106 190 145 63 101 -6 -72 108 87 -64 -61 282 166 108 -301 -402
5599 -402 -34 98 180 170 -35 -186 -124 78 86 184 150 193 -5 97 43 225 50 63 -80 -59 53 -64 234 -17
5623 -17 -3 -47 -218 -29 56 -70 -46 62 107 61 -16 -158 -19 337 2 -237 18 177 41 62 -65 19 18 58
5647 58 -150 45 -191 38 -7 -119 151 108 169 71 -36 -41 -6 -35 69 -100 -346 -53 31 242 208 107 -141 -40
5671 -40 -48 -144 -87 21 7 181 123 -196 99 22 9 -12 76 -123 165 -78 45 -67 -16 161 -8 -56 -333 221
5695 221 -194 129 52 -87 -15 -130 114 61 -43 -14 -43 -50 64 30 -184 30 -196 193 203 -116 275 8 114
5718 114 122 -50 141 -243 -83 -75 -221 16 -144 90 -71 -91 114 -94 -71 -165 -2 130 -57 9 -23 181 87
5741 87 -139 -34 212 -122 134 127 -119 -11 -196 -179 -106 -9 266 -135 27 15 168 160 20 -40 -95 127 -15 -14
5765 -14 316 -102 193 -186 -83 208 77 129 59 -41 32 -45 198 66 -41 20 81 -160 -183 80 -149 -52 15
5788 15 133 35 -8 -46 68 298 67 -15 178 -173 253 208 4 -48 14 18 139 42 -45 -47 -179 16 60 -105 -158
5813 -158 -67 117 -125 -64 325 50 44 -134 -174 11 60 69 51 -13 -8 163 70 -166 -45 -15 42 215 13 -128 -125 -17
5839 -17 9 -60 193 119 15 73 114 27 -99 124 -161 27 -74 -161 17 115 -103 -68 -149 -117 -31 -295 27 57 28
5864 28 -222 11 -49 -64 -124 -56 139 17 -22 -42 116 -104 143 -37 -257 9 -161 -252 -104 -6 40 22 92 -118
5888 -118 -117 68 94 9 22 -251 -20 -76 -88 90 56 224 115 -195 107 300 6 85 -75 254 -246 330 61
5911 61 164 -241 121 66 293 -33 92 167 -39 121 -76 174 100 -64 149 38 -148 42 -184 -76 -254
5932 -254 -9 -76 -241 125 -111 -23 -74 77 -25 221 72 36 353 -58 -21 -33 -87 -183 -80 33 162 -201 -337
5955 -337 -108 -79 37 -156 17 93 -64 76 113 49 -90 55 -6 77 -72 -25 17 -82 -5 170 0 -55 -35 98
5979 98 245 13 -172 215 24 -4 -34 -303 -200 -148 -58 -237 -127 72 -76 -220 19 -105 -27 -165 -23 24
6001 24 -96 -219 91 -109 -329 -76 -124 133 -52 -46 -41 146 -6 -72 -245 22 -41 133 -106 40 150 -25 34
6024 34 9 125 5 -100 162 -35 -44 -202 -38 166 140 238 -112 172 45 77 131 -141 91 -23 -44 -82 -114 262
6048 262 -42 156 -21 -387 -15 -99 35 247 -21 263 -49 68 -395 14 105 76 -29 248 58 21 54 -86
6070 -86 200 -93 2 -226 215 -244 268 249 3 -42 14 55 48 -153 30 -28 232 23 33 -23 -56 339 168 245
6094 245 55 -203 -181 -62 232 100 -68 -38 128 -16 11 136 34 106 62 -28 -168 123 129 -273 -11 -98 31
6117 31 21 52 32 44 -255 -193 204 -100 308 41 -84 4 -87 -407 -319 312 -62 -48 -119 33 -50 -173 21 40
6141 40 52 -68 -104 277 -116 -17 80 -267 83 43 124 -12 43 126 -69 -162 -244 -142 -82 -71 -211 -117 10 155 3
6166 3 129 -124 -200 205 38 59 54 170 293 -6 -82 104 -81 -32 87 116 255 81 406 -15 -133 118 -247
6189 -247 -91 -48 -121 -7 -150 80 317 -45 101 -49 -195 -93 -13 93 -19 -37 -88 222 -174 302 314 -32
6211 -32 -345 -25 -85 203 71 150 -77 -150 -90 110 -50 208 69 -111 -129 -108 -92 101 31 -192 172 -201 -140
6234 -140 120 9 15 -11 13 -105 161 -182 -244 148 -63 13 -83 -158 -13 64 -42 137 -13 209 -175 -183 190 -22
6258 -22 -87 -120 -205 108 -37 -19 94 199 -210 -95 -66 14 -203 -29 243 188 -153 -5 -4 -263 -210 -25 91 10
6282 10 -410 122 -82 138 -24 -67 -99 173 -181 15 173 47 -123 12 -152 -78 204 -166 23 228 227 193
6304 193 -79 174 325 129 205 -7 236 -100 -27 -21 98 -412 -182 -139 -198 178 38 4 77 115 3 -106 -214
6327 -214 177 68 81 28 25 184 -197 -21 136 -6 61 -100 64 51 -160 -228 56 335 270 -40 20 -214 129
6350 129 -85 76 85 128 161 -190 99 140 40 -12 -172 175 81 -123 -81 113 -86 -75 -42 184 41 141 161 -61
6374 -61 -77 -109 275 -3 193 38 -21 140 173 131 25 211 75 305 -86 -33 127 31 61 120 173 12 273 -134
6398 -134 -20 137 -63 10 205 -52 -65 -27 182 -26 -97 -15 -308 -188 -175 -161 37 40 -263 -340 -51 61 -21 45
6422 45 0 -121 83 -84 -45 233 -154 75 -73 116 202 65 -19 -198 301 -112 137 -187 155 -80 -51 -62
6444 -62 105 -55 -13 -10 -50 -31 -130 -51 -108 -133 -312 -83 -21 28 -36 229 40 256 -54 97 46 119 31 263 -132
6469 -132 -92 -149 -124 -27 62 129 -205 -49 -99 97 177 11 123 -18 72 -221 43 108 -99 35 28 -56 37 -93 35
6494 35 -87 -46 31 191 -486 163 101 52 -11 75 -61 -144 -92 -209 -54 153 7 293 -20 82 45 -95 -7 -18
6518 -18 112 -71 -147 -70 197 -22 -151 -343 132 235 59 95 48 -80 -299 43 45 157 381 130 -15 96
6540 96 159 178 -63 8 -45 -35 -41 -151 8 -249 -102 -106 -20 -64 6 -43 -50 -231 253 192 3 96 125 56 -174 38 66
6567 66 -153 60 168 14 -180 46 -244 -252 119 213 -172 -106 -91 -260 125 -99 68 -55 -66 -91 -26 9 -49 196
6591 196 129 129 -19 4 -24 -11 46 -35 -60 -177 2 64 127 -268 -20 -9 91 -275 -110 42 -208 -142 -235 75 -55
6616 -55 16 -234 268 -35 113 -35 -30 60 -167 160 209 -21 -53 -182 238 81 60 219 93 121 33 126 -108 8
6640 8 -67 125 -281 -89 -57 -26 -35 -178 61 74 -212 -226 -57 -53 -194 -92 123 -218 -51 -191 -123 -42 158 21
6664 21 187 -60 -66 114 75 -236 -124 43 -184 -107 -20 12 76 56 207 167 182 96 -67 110 101 -127 192 -245 -189
6689 -189 -225 -121 119 90 58 5 -183 27 166 0 -14 231 -76 -264 79 55 -274 -160 -130 258 97 -97
6711 -97 -95 150 -95 250 -102 214 203 12 183 -20 66 67 -281 132 -121 -300 207 -30 -139 -35 -36 114 25
6734 25 -101 117 -8 -103 -27 4 19 -64 -19 -1 -40 23 -94 33 -420 -71 101 30 72 75 110 -205 224 111 29
6759 29 -147 -23 33 47 66 -1 -38 87 6 -72 16 -33 196 55 56 334 170 -75 -81 3 -145 97 169 249 -203 99
6785 99 -277 37 -98 -13 78 -12 -99 92 -10 66 -129 -231 85 153 156 -60 77 313 -5 48 -133 -145 -103 -80
6809 -80 128 -198 -18 -70 164 74 -234 76 148 67 -139 43 211 234 -90 362 97 -5 240 -69 -241 63
6831 63 98 -79 52 -93 -1 136 268 -81 167 65 175 31 108 43 48 -245 -122 36 -113 -14 4 88 115 195
6855 195 64 -217 17 -46 93 -223 6 -33 -94 -68 -251 -52 -191 -6 133 54 16 -205 6 -189 37 162
6877 162 6 -8 -125 -77 199 -2 24 -290 56 75 4 161 -217 -222 -27 -49 54 215 -279 221 108 -104 -156
6900 -156 -181 57 189 172 -102 71 54 38 35 -185 -112 -23 185 83 -184 268 38 51 -347 -243 -186 -41 119
6923 119 26 -13 -295 110 177 -36 24 -62 -100 43 -90 -20 -177 -183 -135 -79 -72 72 -130 8 43 89 82 -65 -3 121
6949 121 71 20 236 122 103 154 86 -8 83 -107 70 -66 -25 -85 -175 71 -37 -208 -345 -71 -292 -259 -104 -247
6973 -247 -7 12 158 97 -29 -137 -9 -173 245 -56 155 -152 -290 122 -106 -73 -46 70 -127 -36 -22 8
6995 8 13 -58 -333 -65 74 -112 31 137 99 -92 -83 -183 -70 -58 -1 -45 188 19 48 -62 -79 -170 59 -158 -100
7020 -100 167 121 38 -87 169 83 95 -222 27 46 -262 -11 -60 -75 -33 -51 -97 50 102 7 -21 -32 81 257 184
7045 184 38 37 -119 55 257 33 260 169 61 20 -66 136 -61 281 -372 -126 158 -86 73 -77 137 -190
7067 -190 21 245 -45 -196 179 25 -113 171 -44 -267 -27 -38 130 151 212 -120 277 -7 -122 -68 -229
7088 -229 167 10 -160 -7 96 301 -147 158 -226 -172 159 -87 24 118 -114 130 51 -79 -76 -4 190 211
7110 211 -155 89 -98 63 -149 -227 182 31 96 58 -174 -79 -211 32 -14 -411 77 39 176 -189 -60 -86
7132 -86 250 -130 -33 38 53 -57 -90 144 185 27 -68 109 132 -118 51 157 -46 -107 18 40 -166 56 68 275
7156 275 93 32 94 124 141 -278 -54 -68 154 89 196 50 95 31 -96 -15 62 39 -45 -87 -48 48 139 9 -51 -88
7182 -88 27 -64 -182 129 -176 -89 -20 -37 85 -91 43 -40 -346 177 81 2 137 -172 -100 -124 120 119 -209 -283
7206 -283 5 -31 -197 291 -314 -129 20 -300 106 -248 376 59 54 102 128 -302 -11 200 49 -30 -122 42
7228 42 -112 102 -281 30 110 85 269 77 164 167 53 -231 29 -103 168 7 25 -8 255 -393 -221 -23 -201
7251 -201 31 -61 -199 107 -176 -84 -16 -129 50 -129 -179 -36 120 -48 -154 98 -126 65 -211 131 -261
7272 -261 110 -193 26 337 88 116 61 -240 3 65 8 89 -46 232 353 122 -12 -152 110 -43 -146 -33
7294 -33 -86 -241 -99 41 134 -71 10 245 -113 6 -370 31 -223 -133 -151 -52 -38 -232 63 14 -250 -88 23
7317 23 41 64 -88 -59 107 -56 -20 165 341 18 3 255 -14 -193 -117 -54 -148 185 -89 -133 101 236 133
7340 133 -181 30 -148 68 -76 -320 258 -95 -205 -189 -143 -83 -28 -151 167 -115 5 -283 45 137 100 -259
7362 -259 -1 -296 -105 112 456 -169 197 57 -11 209 -8 -199 262 -36 -335 -17 7 -244 -302 -151 -22
7383 -22 100 -51 -99 -128 100 -113 -87 188 188 82 -229 312 92 -169 13 -112 57 159 0 -62 -82 -1 -134
7406 -134 -53 112 54 -98 -73 169 -92 62 -43 -58 192 173 58 -37 -85 40 -74 -107 -33 299 -65 -37 142
7429 142 -82 -67 -396 134 -146 -191 102 24 102 201 77 -288 63 4 -167 -124 -163 -30 193 14 17 -211 -71
7452 -71 -57 173 143 6 132 -150 182 115 266 38 -136 -60 -64 59 -40 45 79 -180 58 7 -112 -45 -120 244
7476 244 -46 14 125 -294 187 58 -140 152 51 -198 -118 39 -40 -124 -114 44 88 -81 134 242 -205 -39
7498 -39 102 -70 180 194 10 30 -100 -135 -130 -100 -6 329 -36 -151 -91 126 -147 -59 126 29 -308 100 39 -34
7522 -34 -25 -1 31 -32 142 -126 311 -41 -229 13 -44 -133 243 -172 -247 -133 -141 119 63 -65 233 189 55 351
7546 351 -9 -52 132 -351 216 224 268 299 -123 -72 42 13 -69 24 139 259 44 -27 180 133 -100 -13 125 -217
7570 -217 118 210 -126 160 99 -270 61 224 156 10 101 -291 -178 51 -120 23 -75 166 -156 206 0 -12
7592 -12 116 -275 232 -95 31 -162 108 -158 -77 -336 -88 177 165 -8 127 -27 140 -60 -206 164 124
7613 124 118 -133 110 59 -92 256 204 7 91 -8 171 -123 13 -313 -44 20 164 -42 28 -26 -157 20 -19
7636 -19 36 120 -79 52 -154 -29 -254 -105 3 96 101 -41 147 159 -277 27 -48 -117 6 99 135 -214 95 -29
7660 -29 38 -161 102 36 64 10 -67 24 -28 239 -144 168 116 3 49 41 46 75 8 -230 112 51 20 262 -226 -2
7686 -2 -46 -168 134 -88 120 -21 201 67 -238 -14 43 -42 64 -189 92 -106 79 -310 220 60 -210 -53
7708 -53 -147 180 -21 187 55 -6 -210 87 -1 -357 -98 79 39 3 104 -181 27 -19 -76 102 89 101 -22
7731 -22 71 -127 -118 113 -44 100 -182 18 -251 -172 25 286 -24 -255 -235 42 -3 98 177 -80 48 -167 15
7754 15 -179 -16 111 233 -99 215 210 -7 72 -313 120 -61 -282 227 -72 -157 -40 169 -28 316 17 -21
7776 -21 135 140 40 23 -217 -128 189 -93 -16 -204 -98 -166 308 -76 85 6 187 165 70 -124 22 -62 19 20 81
7801 81 -305 107 161 -73 -65 -114 181 -23 120 51 -41 -181 -19 -166 -67 177 -139 39 47 -35 -52 130 -72 -56
7825 -56 139 -107 47 -83 34 63 105 -43 64 103 -254 -34 167 -66 73 161 73 -141 265 21 -273 -152
7847 -152 183 8 68 304 -314 -218 66 146 201 171 126 49 -35 -158 159 95 -147 -220 72 -101 261 144 -286
7870 -286 176 -1 263 -55 -32 -181 -120 310 -70 -96 -47 97 -9 -17 -17 36 7 -78 75 -182 -192 280 -123 -153
7894 -153 -1 -77 48 286 -84 31 173 -129 11 -66 122 -249 -10 -160 181 -248 -11 70 -17 -122 14
7915 14 155 348 121 -39 -199 -86 -21 87 -127 -223 -91 71 -184 86 -26 194 -83 -11 12 -76 5 -111
7937 -111 58 -146 138 -132 190 -264 -162 102 199 -99 -1 -94 -2 -138 -118 50 120 5 -128 87 -114 161
7959 161 307 -177 -15 -13 -61 269 -30 42 180 -27 52 -310 245 158 121 12 -87 49 148 -186 51 -75 -125
7982 -125 -8 29 34 298 -138 -45 137 106 -180 -134 200 -94 370 -64 70 -93 -127 -168 117 -65 18 352 24
8005 24 -60 -17 -213 -44 -25 -79 224 86 -20 83 -67 -76 244 -54 -195 -279 32 234 -93 227 -170 205 175
8028 175 70 73 8 8 -23 48 -41 75 -75 -261 -23 209 152 115 -165 -138 -146 -276 -150 245 -41 127 106 -430 44
8053 44 -57 -52 -79 38 63 27 234 5 27 -175 69 -110 -185 -36 197 -144 147 81 145 21 108 -61 162 -33
8077 -33 -100 116 -76 4 -260 74 47 55 105 143 269 -46 11 107 31 158 -181 -167 95 -70 -105 -170 -202 46 -35
8102 -35 225 -12 50 90 -38 120 -81 9 -58 166 -91 -111 -96 128 264 -31 -151 66 79 222 19 -80 182
8125 182 -126 316 247 294 35 56 155 -178 206 -321 -30 160 2 -6 -191 191 78 44 78 208 52 -179 33
8148 33 173 410 235 34 81 -75 -97 -231 -178 -100 -217 -5 -4 -50 59 -133 -299 59 25 118 -82 -165 3 -360
8172 -360 150 232 19 91 -236 -167 -70 -81 -18 199 99 -178 132 110 190 85 28 91 -94
8191i4
##END NTUPLES=NMR FID
##END=
