##TITLE=1H_SR71_27
 CDCl3,8 sc, 
 27.9.2021
##JCAMPDX= 6.0         $$ Bruker NMR JCAMP-DX V2.0
##DATA TYPE= NMR FID
##DATA CLASS= NTUPLES
##ORIGIN= UXNMR, Bruker Analytische Messtechnik GmbH
##OWNER= root
$$ XWIN-NMR		Version 3.5
$$ Mon Sep 27 12:55:07 2021 Russian Standard Time (UT+4h)  she@DPX200
##.OBSERVE FREQUENCY= 200.1314
##.OBSERVE NUCLEUS= ^1H
##.DELAY= (6, 6)
##.ACQUISITION MODE= SIMULTANEOUS
##.ACQUISITION SCHEME= undefined
##.AVERAGES= 8
##.DIGITISER RES= 18
##SPECTROMETER/DATA SYSTEM= spect
##.PULSE SEQUENCE= zg30
##.SOLVENT NAME= MeOD
##.SHIFT REFERENCE= (INTERNAL, MeOD, 0, 15.7039)
##AUDIT TRAIL= $$ (NUMBER, WHEN, WHO, WHERE, WHAT)
$$ ##TITLE= Audit trail, XWIN-NMR		Version 3.5
$$ ##JCAMPDX= 5.01
$$ ##ORIGIN= Bruker BioSpin GmbH
$$ ##OWNER= she
$$ F:/spectra/data/she/nmr/H-F/1/audita.txt
$$ ##AUDIT TRAIL=  $$ (NUMBER, WHEN, WHO, WHERE, WHAT)
(   1,<2021-09-27 12:54:10.28 +0400>,<she>,<DPX200>,
      <created by zg, POWCHK disabled, PULCHK disabled
       configuration hash MD5:
       00 E9 B6 7A A2 85 ED C7 34 08 36 98 17 FE 4E 26
       data hash MD5: 16K
       E7 F8 9F 02 C0 19 6F BE A4 FB 3C 8A A0 F4 DF 84>)
$$ ##END=
$$ 
$$ hash MD5
$$ FA B4 4F D5 F1 03 60 48 AE E8 31 36 5F EA 9D E3
##$RELAX= 
##$RELAX= 
##$RELAX= 
##$RELAX= 
##$RELAX= 
##$RELAX= 
$$ Bruker specific parameters
$$ --------------------------
##$DU= <F:/spectra>
##$EXPNO= 1
##$NAME= <H-F>
##$PROCNO= 1
##$TYPE= <nmr>
##$USER= <she>
##$AMP= (0..31)
100 100 100 100 100 100 100 100 100 100 100 100 100 100 100 100 100 100 
100 100 100 100 100 100 100 100 100 100 100 100 100 100 
##$AQSEQ= 0
##$AQ_mod= 1
##$AUNM= <au_zg>
##$AUTOPOS= <>
##$BF1= 200.13
##$BF2= 200.13
##$BF3= 200.13
##$BF4= 200.13
##$BF5= 200.13
##$BF6= 200.13
##$BF7= 200.13
##$BF8= 200.13
##$BYTORDA= 1
##$CFDGTYP= 0
##$CFRGTYP= 5
##$CHEMSTR= <none>
##$CNST= (0..31)
1 1 145 1 1 1 1 1 1 1 1 1 1 1 1 1 1 1 1 1 1 1 1 1 1 1 1 1 1 1 1 1 
##$CPDPRG= <>
##$CPDPRG1= <>
##$CPDPRG2= <>
##$CPDPRG3= <>
##$CPDPRG4= <mlev>
##$CPDPRG5= <mlev>
##$CPDPRG6= <mlev>
##$CPDPRG7= <mlev>
##$CPDPRG8= <mlev>
##$CPDPRGB= <>
##$CPDPRGT= <>
##$D= (0..31)
0 1.2 0 0 0 0 0 0 0 0.06 0 0.03 0 0 0 0 0.0002 0 0 0 0 0 0 0 0 0 0 0 0 
0 0 0 
##$DATE= 1632732849
##$DBL= (0..7)
120 120 120 120 120 120 120 120 
##$DBP= (0..7)
150 150 150 150 150 150 150 150 
##$DBP07= 0
##$DBPNAM0= <>
##$DBPNAM1= <>
##$DBPNAM2= <>
##$DBPNAM3= <>
##$DBPNAM4= <>
##$DBPNAM5= <>
##$DBPNAM6= <>
##$DBPNAM7= <>
##$DBPOAL= (0..7)
0.5 0.5 0.5 0.5 0.5 0.5 0.5 0.5 
##$DBPOFFS= (0..7)
0 0 0 0 0 0 0 0 
##$DE= 6
##$DECBNUC= <off>
##$DECIM= 32
##$DECNUC= <off>
##$DECSTAT= 4
##$DIGMOD= 1
##$DIGTYP= 9
##$DL= (0..7)
0 120 120 120 120 120 120 120 
##$DP= (0..7)
150 150 150 150 150 150 150 150 
##$DP07= 0
##$DPNAME0= <>
##$DPNAME1= <>
##$DPNAME2= <>
##$DPNAME3= <>
##$DPNAME4= <>
##$DPNAME5= <>
##$DPNAME6= <>
##$DPNAME7= <>
##$DPOAL= (0..7)
0.5 0.5 0.5 0.5 0.5 0.5 0.5 0.5 
##$DPOFFS= (0..7)
0 0 0 0 0 0 0 0 
##$DQDMODE= 0
##$DR= 18
##$DS= 0
##$DSLIST= <SSSSSSSSSSSSSSS>
##$DSPFIRM= 0
$$ [...]
##$SUBNAM2= <"">
##$SUBNAM3= <"">
##$SUBNAM4= <"">
##$SUBNAM5= <"">
##$SUBNAM6= <"">
##$SUBNAM7= <"">
##$SUBNAM8= <"">
##$SUBNAM9= <"">
##$SW= 20.0188988654967
##$SWIBOX= (0..15)
0 0 2 0 0 0 0 0 0 0 0 0 0 0 0 0 
##$SW_h= 4006.41025641026
##$TD= 16384
##$TD0= 1
##$TE= 0
##$TE2= 300
##$TE3= 300
##$TEG= 300
##$TL= (0..7)
0 120 120 120 120 120 120 120 
##$TP= (0..7)
150 150 150 150 150 150 150 150 
##$TP07= 0
##$TPNAME0= <>
##$TPNAME1= <>
##$TPNAME2= <>
##$TPNAME3= <>
##$TPNAME4= <>
##$TPNAME5= <>
##$TPNAME6= <>
##$TPNAME7= <>
##$TPOAL= (0..7)
0.5 0.5 0.5 0.5 0.5 0.5 0.5 0.5 
##$TPOFFS= (0..7)
0 0 0 0 0 0 0 0 
##$TUNHIN= 0
##$TUNHOUT= 0
##$TUNXOUT= 0
##$USERA1= <user>
##$USERA2= <user>
##$USERA3= <user>
##$USERA4= <user>
##$USERA5= <user>
##$V9= 5
##$VALIST= <valist>
##$VCLIST= <CCCCCCCCCCCCCCC>
##$VD= 0
##$VDLIST= <DDDDDDDDDDDDDDD>
##$VPLIST= <PPPPPPPPPPPPPPP>
##$VTLIST= <TTTTTTTTTTTTTTT>
##$WBST= 1024
##$WBSW= 4
##$XGAIN= (0..3)
0 0 0 0 
##$XL= 0
##$YL= 0
##$YMAX_a= 10442
##$YMIN_a= -10097
##$ZGOPTNS= <>
##$ZL1= 120
##$ZL2= 120
##$ZL3= 120
##$ZL4= 120
##$ABSF1= 10
##$ABSF2= 0
##$ABSG= 5
##$ABSL= 3
##$ALPHA= 0
##$AQORDER= 0
##$ASSFAC= 0
##$ASSFACI= 0
##$ASSFACX= 0
##$ASSWID= 0
##$AUNMP= <proc_1d>
##$AZFE= 0.1
##$AZFW= 0.1
##$BCFW= 1
##$BC_mod= 2
##$BYTORDP= 1
##$COROFFS= 0
##$CY= 11.3945322036743
##$DATMOD= 1
##$DC= 2
##$DFILT= <>
##$DTYPP= 0
##$F1P= 2.36226072786647
##$F2P= -0.459571619588291
##$FCOR= 0.5
##$FTSIZE= 0
##$FT_mod= 4
##$GAMMA= 1
##$GB= 0.15
##$INTBC= 1
##$INTSCL= 1
##$ISEN= 128
##$LB= 0.24
##$LEV0= 0
##$LPBIN= 0
##$MAXI= 10000
##$MC2= 0
##$MEAN= 0
##$ME_mod= 0
##$MI= 1.114404
##$NCOEF= 0
##$NC_proc= 0
##$NLEV= 6
##$NOISF1= 3.799351
##$NOISF2= 2.8
##$NSP= 1
##$NTH_PI= 0
##$NZP= 0
##$OFFSET= 15.70392
##$PC= 1
##$PHC0= -13992.9
##$PHC1= 29.20089
##$PH_mod= 1
##$PKNL= yes
##$PPARMOD= 0
##$PSCAL= 0
##$PSIGN= 0
##$REVERSE= no
##$SF= 200.130013532006
##$SI= 16384
##$SIGF1= 3
##$SIGF2= 2
##$SINO= 400
##$SIOLD= 16384
##$SREGLST= <1H.CDCl3>
##$SSB= 0
##$STSI= 0
##$STSR= 0
##$SW_p= 3612.71676300578
##$SYMM= 0
##$S_DEV= 0
##$TDeff= 0
##$TDoff= 0
##$TI= <>
##$TILT= no
##$TM1= 0
##$TM2= 0
##$TOPLEV= 0
##$USERP1= <user>
##$USERP2= <user>
##$USERP3= <user>
##$USERP4= <user>
##$USERP5= <user>
##$WDW= 1
##$XDIM= 8192
##$YMAX_p= 0
##$YMIN_p= 0
$$ End of Bruker specific parameters
$$ ---------------------------------
##NTUPLES= NMR FID
##VAR_NAME=  TIME,          FID/REAL,        FID/IMAG
##SYMBOL=    X,             R,               I
##VAR_TYPE=  INDEPENDENT,   DEPENDENT,       DEPENDENT
##VAR_FORM=  AFFN,          ASDF,            ASDF
##VAR_DIM=   8192,          8192,            8192
##UNITS=     SECONDS,       ARBITRARY UNITS, ARBITRARY UNITS
##FACTOR=    0.0002496,     1,               1
##FIRST=     0,             0,               0
##LAST=      2.0444736,     0,               0
##MIN=       0,             -10097,          0
##MAX=       2.0444736,     10442,           0
$$ Real data points
##PAGE= N=1
##DATA TABLE= (X++(R..R)), XYDATA
0 0 0 0 0 0 0 0 0 0 0 0 0 0 0 0 0 0 0 0 0 0 0 0 0 0 0 0 0 0 0 0 0 2 -8 8 -8 8 -8 8 -8 8 -8 14 -16 16 -16 16 -22 24
48 24 -24 26 -32 32 -37 40 -45 49 -54 62 -69 77 -87 101 -118 137 -164 207 -275 397 -700 3052 765
71 765 -9935 -8957 689 8985 8194 2499 -5315 -9388 -5826 3024 8265 6863 189 -7561 -10097 -3152
87 -3152 6203 8657 3650 -2806 -7676 -8069 -1541 7396 9183 2100 -6222 -8805 -4975 2454 7965 6594
103 6594 -380 -6657 -7735 -3015 4715 9087 4952 -3385 -7374 -5179 -152 5452 8284 3835 -4808
118 -4808 -8411 -3829 3328 7437 6038 -64 -5913 -6189 -1492 3962 6907 5061 -1691 -7244 -5512
133 -5512 977 5421 5585 2549 -2868 -6807 -4774 1936 6564 5247 -97 -5242 -6183 -2148 3299 5574
149 5574 3524 -1171 -5646 -6042 -871 4991 5688 1471 -3249 -5453 -4221 480 5358 5342 304 -4858
165 -4858 -5810 -2215 3023 5503 3237 -1414 -4560 -4576 -1223 3841 6048 2560 -3176 -5289 -2999 1127
181 1127 4510 4983 1345 -3715 -5262 -2046 2910 5501 3708 -1007 -4376 -3738 -377 3193 4835 3036
197 3036 -1792 -5275 -3562 1353 4501 3926 862 -2913 -4623 -2520 1954 4682 3394 -776 -4387
212 -4387 -4295 -696 3060 3841 1871 -1508 -4373 -4093 -10 4086 4066 382 -3304 -4245 -2363 1307 3925
229 3925 3225 -397 -3860 -4228 -1106 2980 4183 1802 -1724 -3560 -2982 -158 3336 4389 1456 -2833
245 -2833 -4139 -1747 1884 3925 3159 111 -2924 -3505 -1029 2626 4289 2440 -1438 -3621 -2469 443
261 443 2903 3526 1642 -1949 -4002 -2301 1478 3812 2819 -278 -2928 -3265 -1157 1780 3394 2248
277 2248 -1111 -3761 -3167 89 2771 2818 802 -1798 -3429 -2642 508 3264 2931 -151 -3021 -3327 -1054
294 -1054 1765 2929 1889 -679 -2956 -3028 -446 2729 3334 1000 -1859 -2889 -1872 562 2833 3064
310 3064 644 -2411 -3154 -1021 2017 3250 1947 -578 -2388 -2347 -412 2225 3391 1620 -1592 -3073
326 -3073 -1708 926 2593 2468 596 -1869 -2943 -1427 1424 3109 2005 -778 -2748 -2321 -282 1717
342 1717 2443 1339 -1193 -3093 -2302 525 2533 2158 103 -1934 -2605 -1470 875 2502 1968 -496
358 -496 -2687 -2561 -322 1878 2232 902 -946 -2317 -2104 18 2381 2600 418 -1916 -2372 -933 1040
375 1040 2288 1903 83 -1885 -2308 -513 1917 2714 1213 -979 -1952 -1419 169 1866 2412 978 -1487
392 -1487 -2411 -1062 1122 2248 1659 -57 -1661 -1996 -758 1263 2376 1399 -990 -2402 -1670 237
408 237 1559 1659 636 -1169 -2383 -1674 578 2131 1530 -358 -1877 -1919 -734 918 1826 1280 -562
425 -562 -2183 -2000 -9 1822 1831 406 -1076 -1759 -1278 304 1950 1957 151 -1693 -1861 -421 1234 1882
443 1882 1251 -210 -1502 -1577 -183 1709 2260 782 -1163 -1701 -833 553 1558 1721 534 -1335 -1962
460 -1962 -711 1184 1936 1104 -502 -1555 -1421 -318 1138 1750 895 -972 -2081 -1276 524 1518 1098
477 1098 65 -1117 -1746 -1091 645 1786 1115 -566 -1711 -1448 -199 1010 1366 689 -655 -1677 -1465
494 -1465 163 1660 1455 -32 -1164 -1276 -651 397 1471 1449 18 -1462 -1409 -131 1232 1578 764
511 764 -468 -1207 -983 53 1339 1707 583 -1045 -1498 -444 746 1237 1135 274 -1037 -1545 -471
528 -471 1125 1611 745 -604 -1374 -1094 48 1023 1262 532 -866 -1748 -1059 604 1429 826 -286 -1067
546 -1067 -1301 -728 583 1424 820 -678 -1557 -1159 83 1059 1057 239 -726 -1268 -967 275 1417 1177 -191
565 -191 -1162 -992 -190 590 1137 988 -116 -1170 -1035 135 1175 1284 372 -601 -937 -503 248 1019 1250
584 1250 397 -915 -1177 -213 791 1028 680 21 -827 -1072 -280 841 1244 535 -629 -1215 -736 229 805
603 805 784 254 -679 -1306 -814 516 1178 590 -417 -954 -1000 -416 533 1118 567 -581 -1323 -951 223 1068
623 1068 851 13 -703 -909 -658 233 1215 982 -242 -1100 -807 27 707 973 617 -280 -927 -726 171 1045
643 1045 1112 206 -747 -765 -155 396 777 865 197 -826 -982 -82 836 889 390 -239 -741 -736 -63 718 923 301
665 301 -642 -1044 -491 430 686 450 6 -560 -977 -634 429 1008 426 -482 -875 -704 -158 506 754 332
685 332 -472 -1005 -757 217 926 674 -124 -646 -664 -345 294 919 809 -189 -984 -694 173 793 815 334 -298
706 -298 -710 -518 253 943 915 122 -670 -694 -19 497 691 635 85 -672 -806 -31 779 805 187 -420 -669 -400
728 -400 88 576 632 159 -573 -904 -332 453 640 227 -171 -547 -684 -352 346 719 271 -483 -832 -498 80
749 80 473 440 108 -375 -716 -535 230 776 528 -234 -566 -435 -113 325 659 549 -132 -678 -515 211 699
770 699 656 166 -309 -421 -251 213 681 725 46 -605 -563 26 517 572 346 -37 -511 -557 -5 649 675 108
792 108 -477 -581 -244 177 398 393 40 -468 -740 -287 470 592 147 -349 -482 -446 -169 296 549 205 -434
813 -434 -703 -343 209 463 296 -30 -358 -485 -323 209 620 401 -212 -584 -326 93 372 480 288 -147
833 -147 -518 -373 218 670 501 24 -309 -310 -55 224 477 492 47 -465 -447 50 513 497 128 -136 -343 -330
855 -330 -6 452 529 13 -474 -495 -157 244 334 210 -30 -396 -520 -246 362 493 77 -398 -459 -284 -40 222
877 222 342 106 -331 -632 -264 233 425 207 -151 -341 -335 -137 189 512 333 -167 -521 -283 190 416 311
898 311 138 -110 -345 -247 180 571 421 -39 -325 -218 51 289 386 373 28 -330 -413 57 505 391 33 -261
920 -261 -267 -200 55 329 399 42 -400 -478 -83 263 292 97 -123 -279 -378 -194 243 419 61 -387 -456 -166 69
943 69 183 185 74 -276 -458 -251 201 396 176 -247 -300 -200 -55 170 380 251 -144 -414 -208 232 368 256
965 256 51 -78 -235 -156 147 440 359 -29 -349 -193 119 275 282 207 25 -250 -277 59 422 337 -25 -246 -234
988 -234 -65 96 218 260 24 -313 -401 -90 279 260 -17 -198 -251 -251 -164 173 312 38 -353 -405 -116 140 196
1011 196 100 -40 -160 -282 -173 170 359 147 -219 -293 -101 67 154 206 188 -106 -311 -166 179 357 203 -40
1033 -40 -152 -64 -18 124 310 303 -20 -281 -177 170 290 198 94 -38 -182 -202 29 315 305 -18 -279 -233 24
1056 24 128 129 91 6 -235 -383 -113 266 259 -56 -203 -213 -171 -45 140 195 19 -249 -368 -134 176 222 13 -143
1080 -143 -139 -180 -133 121 323 123 -213 -230 -9 136 164 151 85 -86 -204 -104 151 303 219 -80 -139 8 89 91
1104 91 182 241 38 -264 -146 139 219 143 22 -46 -139 -87 15 173 214 43 -240 -256 48 161 94 20 4 -136
1128 -136 -302 -119 223 207 -50 -210 -216 -113 6 107 122 9 -193 -311 -164 190 249 25 -164 -145 -104 -76 104
1151 104 295 116 -171 -245 -48 160 228 139 -16 -76 -82 -58 121 272 176 -125 -201 13 151 100 110 156 10 -168
1175 -168 -95 142 222 128 -22 -97 -104 0 35 63 164 27 -223 -255 13 171 36 -55 -7 -99 -214 -99 125 147
1199 147 -52 -195 -248 -106 59 95 21 -20 -64 -263 -178 127 242 -17 -166 -64 -52 -54 92 248 110 -160 -188
1222 -188 -43 141 276 172 -56 -96 -14 6 78 267 242 -91 -221 12 200 118 99 131 -27 -156 -50 138 189
1245 189 135 -34 -166 -73 64 85 12 56 34 -164 -180 72 200 -12 -139 -67 -59 -120 -25 109 55 -42 -173 -171 -66
1270 -66 97 117 -56 -87 -23 -90 -131 69 209 30 -136 -99 29 1 57 164 96 -62 -115 -64 112 202 141 -53 -83
1295 -83 47 48 54 154 173 -50 -175 -10 176 163 69 37 -26 -65 -37 67 166 131 -32 -171 -76 39 77 12 3 6 -133
1322 -133 -190 -10 145 94 -88 -146 -89 -35 -6 25 59 -59 -136 -184 -50 123 43 -60 -94 -23 -46 -110 62 135 37 -145
1348 -145 -106 24 101 82 25 49 -32 -61 -25 89 171 117 -91 -70 76 71 56 117 115 14 -128 -19 127 171 61 -43
1374 -43 -33 -30 -2 17 116 106 -38 -156 -109 54 97 -10 -69 -21 -85 -144 19 108 98 -71 -163 -96 14 -6 8 13 0 -93
1402 -93 -162 -51 121 87 -33 -92 -28 -2 -3 39 107 57 -111 -139 24 130 104 19 21 43 -6 -8 75 174 101 -84 -72 14
1430 14 117 61 39 55 31 -51 -104 81 149 65 -60 -71 33 48 11 59 82 7 -121 -104 42 129 11 -81 -34 -55 -39
1457 -39 -39 49 66 -27 -154 -94 22 51 -41 -40 -11 -58 -110 -69 103 103 -33 -116 -69 13 19 2 39 36 -14 -117 4 140 144 14
1487 14 -26 25 44 17 57 120 111 -25 -92 17 133 93 29 21 31 0 -35 62 139 73 -52 -64 35 61 28 -20 22 -1 -119
1516 -119 -96 14 58 -8 -95 -77 -12 -44 -59 -17 52 -33 -98 -127 28 80 -29 -62 -50 -17 -79 -61 63 77 -41 -123 -58
1543 -58 44 55 7 -1 32 15 -43 4 119 136 23 -60 11 61 25 12 102 100 20 -65 11 106 116 -2 0 50 13 5 8 86 75
1574 75 -52 -115 -52 50 14 -28 -26 17 -59 -101 -3 95 29 -75 -89 -6 -7 -14 -24 3 -34 -87 -105 -25 64 7 -73 -48 -10 -14 -51
1605 -51 9 67 -9 -95 -83 48 60 40 9 22 28 -10 -24 53 95 34 -76 -6 80 65 -16 48 59 13 -35 3 92 71 26 -44
1635 -44 13 24 20 -32 34 88 -19 -112 -40 64 37 -72 -23 5 -20 -66 -17 53 20 -53 -117 -74 15 5 -32 -55 4 -65 -141
1664 -141 -22 101 35 -89 -82 11 -18 -13 17 34 10 -43 -48 6 76 76 -8 -37 62 53 20 38 108 79 -66 0 97 77 -3 12
1694 12 61 4 -2 26 58 57 54 -25 -50 31 51 -31 -26 39 36 -62 -50 65 52 -62 -51 -3 -25 -63 -13 2 18 -19 -81 -78 -4 44
1726 44 -33 -39 13 18 -122 -73 84 60 -45 -78 -21 24 -10 21 50 19 -34 -53 5 82 100 -3 -38 29 75 43 9 90 87 -51
1756 -51 -49 61 101 34 41 -9 16 17 15 4 41 31 -69 -26 28 77 -7 -75 -5 20 -49 -64 35 48 -37 -85 -43 -11 11 -57 -46
1787 -46 -13 -12 -65 -80 -19 13 -48 -78 -25 -1 -32 -69 11 43 -27 -73 -17 9 26 22 -7 14 7 -17 -22 65 73 28 -41 40 65 15 1
1820 1 72 84 -18 -40 19 111 47 41 -2 18 58 27 20 48 37 -22 -97 38 57 5 -68 -37 1 -59 -28 29 44 -43 -108 -57 13
1851 13 6 -29 -67 -20 -16 -41 -60 -5 51 -28 -109 -24 56 -30 -28 -20 34 -5 -59 -42 49 66 6 -27 29 50 4 -22 4 90 42 -25
1883 -25 23 59 29 8 -4 51 53 -17 -1 48 53 6 -32 -13 20 8 -25 -4 38 -28 -71 -25 49 24 -26 -36 12 -16 -17 -28 4 15
1915 15 -61 -73 -28 27 3 -73 -41 5 6 -50 -12 40 14 -44 -46 4 30 -25 -13 10 15 19 -12 12 82 16 0 -18 64 20 -32 5
1947 5 87 35 -28 10 48 58 4 -11 54 60 -11 -6 9 62 -8 -36 -44 22 3 -24 23 42 21 -52 -24 31 44 -19 -25 -16 0 -8 -35 -8
1981 -8 3 -38 -61 -52 14 -7 -55 -35 27 4 -43 -14 36 27 -21 -45 -12 34 9 -37 0 34 3 -15 10 51 52 -31 -14 59 30 40
2013 40 -2 52 60 7 -19 14 88 -4 12 12 52 31 -4 34 23 36 -45 -40 70 47 -28 -8 9 7 -14 -69 -4 20 -16 -36 -23 4
2045 4 -11 -41 -48 12 -4 -51 -48 1 37 -22 -66 -26 17 -9 -26 -5 9 17 -25 -12 62 50 -2 13 11 10 -18 -4 31 21 -5 -28 15
2078 15 58 19 -23 23 63 -16 -3 9 18 46 -5 13 12 21 -16 -8 12 24 -29 -23 15 22 -16 -57 -26 6 -5 -58 -17 21 -10 -22 -45
2111 -45 23 -8 -46 -71 1 -9 -7 -53 -11 35 -13 -46 -17 43 10 -32 2 9 9 -23 -23 15 60 -8 -31 43 38 12 0 19 37 30 -18
2144 -18 27 85 38 -24 25 39 28 -5 -7 7 45 -14 -18 15 41 4 -34 22 52 14 -61 -49 25 -13 -41 -4 -9 6 -46 -61 -39 -10
2176 -10 -14 -90 -9 -10 29 -36 -52 17 -7 -68 8 51 1 -49 -39 34 25 -4 -9 -12 8 -2 -11 6 48 30 -55 14 65 27 -16 17 54
2209 54 5 3 16 55 58 -6 9 36 40 14 -5 -6 43 -17 -17 -6 9 14 -58 -32 46 1 -31 -4 -10 -38 -56 -32 -3 -4 -26 -42 -28 28
2243 28 2 -54 -34 74 11 -33 -2 -3 4 -50 -8 29 8 -33 -26 -4 34 22 0 -2 8 16 -40 4 51 26 -16 -8 55 36 -4 -25 63
2276 63 6 -28 -14 17 64 24 -1 -10 47 56 -39 -16 30 31 -30 -39 28 47 -3 -40 26 15 -11 7 11 -7 -3 -25 -6 -2 30 -40 -58 0
2310 0 18 -8 -80 -18 -1 -65 -17 36 12 -16 -66 12 4 -12 4 -6 33 -2 -6 -17 8 26 -7 -39 11 49 15 -6 52 44 13 -6
2342 -6 18 35 4 -28 35 47 23 5 -38 13 45 -6 -21 37 18 -34 -30 13 8 -12 -32 -6 -5 -24 0 0 -16 -9 -17 -74 -18 37 -16 -64
2376 -64 -38 4 -21 -38 -4 8 -60 -27 11 30 29 -15 -27 20 15 -11 -24 -17 17 -6 -35 33 62 6 -12 22 35 19 28 42 38 -8 -11
2409 -11 26 24 24 -7 -20 9 46 28 -48 -11 23 -9 -4 9 41 -24 -62 9 9 13 -25 -17 0 9 -16 -23 -11 24 -33 -50 -21 30 -25 -77
2443 -77 -5 19 -16 -48 -25 -1 26 -6 -13 35 8 -29 -38 -17 16 16 -38 -5 31 31 -27 10 39 39 -5 8 38 -3 16 9 36 4 2 5
2477 5 35 77 24 -36 -4 30 14 -55 -11 34 6 -36 -21 10 10 -29 -26 -10 14 -12 -51 -8 14 2 -50 -18 20 7 -60 -37 -3 7
2509 7 -50 -23 0 12 -29 8 15 21 5 -22 -24 5 7 -30 -1 17 35 -15 15 60 10 -7 -12 28 10 -7 14 35 36 2 -13 1 59 -1
2543 -1 -20 8 46 31 -43 2 35 29 -21 -10 27 17 -22 -22 -9 -15 -19 -29 -9 15 0 -40 -13 -4 -10 -37 -30 -6 8 -45 -16 4 4 -18 -18
2578 -18 -8 9 -18 -48 16 10 15 -43 -7 25 28 -5 -45 26 17 -14 -17 33 21 15 1 3 24 9 -9 -2 28 -3 -2 -21 32 39 -15 -17 39 44
2614 44 -26 0 4 5 30 8 -12 44 -7 -19 -10 30 14 -33 -18 25 -6 -52 -36 -15 -23 -66 -37 3 23 -9 -47 30 33 3 -29 -12 41
2647 41 0 11 -12 5 24 -5 -14 9 21 2 -11 20 42 16 -8 21 47 10 -10 24 16 18 14 -12 49 42 -18 -1 26 28 20 -39 26 25
2681 25 -8 -42 -3 22 -4 -16 -8 37 9 -8 11 17 -9 -26 -49 -20 18 -20 -33 2 21 16 -23 -16 20 -17 -34 8 8 -19 -7 -13 -15 18
2715 18 2 -21 29 15 -4 -30 5 55 1 -9 23 23 12 1 25 32 -16 -29 -8 4 47 17 -20 38 50 14 -12 -5 33 -4 -49 1
2747 1 12 2 -20 -7 28 7 -5 12 6 20 -18 -12 -19 17 -45 -28 -43 11 -16 -79 -22 -6 -17 -31 -31 -14 11 -51 -38 -6 24 -15 -46
2780 -46 -12 -7 12 -21 19 16 -4 -7 10 61 32 11 5 43 4 20 14 -5 10 -9 -7 12 24 35 -11 -8 16 2 -24 -1 -1 -10 -21 -16 17
2815 17 19 -25 -29 -14 7 -6 -19 -15 14 -4 -2 -26 6 0 -48 -40 14 13 -39 3 -10 -5 -10 -14 0 16 -14 -34 1 21 28 7 -16 6 35 -8
2851 -8 11 21 -12 8 0 31 18 -2 -12 18 27 17 21 -11 0 32 -5 -12 22 54 -7 -45 24 40 -39 -24 -28 -15 -17 -10 4 -5 -35 -15 6
2886 6 6 22 -26 -52 -16 12 -14 -10 6 51 -41 -25 -1 0 5 -36 -9 2 -19 -35 14 1 -26 -4 -25 -18 38 -11 -12 37 32 -24 -11 28
2920 28 29 -17 -35 8 15 6 -27 -10 -4 43 9 25 7 26 1 -15 15 28 3 -21 9 18 4 -4 33 24 -6 -33 -6 19 29 5 -56 -7
2954 -7 21 -28 -34 -7 27 -21 -54 -3 33 -13 -17 -6 -24 -22 -2 -32 13 9 -4 -50 -18 37 11 -20 6 41 -3 -36 1 15 -1 5 14 13
2988 13 12 -15 -2 17 13 29 27 -9 19 14 -8 -12 16 -11 -21 -10 29 -20 -23 -4 -10 -1 -33 -6 24 9 -35 -33 3 37 -10 -43 -16 30 11
3023 11 -55 -9 -16 -8 -15 -15 20 -22 -46 -15 -12 1 -21 -12 -4 16 13 -24 -25 32 13 -15 -1 23 -15 -33 19 19 -12 -21 -14 32 34 1 -10 -4 49
3060 49 26 -15 -5 22 7 -19 -11 25 29 -17 -5 9 32 -2 -23 10 15 -12 -21 12 43 -19 -16 -36 13 -24 -49 -18 0 1 -6 -36 -8 23
3094 23 -34 -33 17 -2 8 -45 -11 10 2 0 -4 16 21 -12 -45 17 20 -19 -27 10 14 -17 -6 -7 -1 0 -7 6 26 59 14 16 30 32 -14 -27 -1
3131 -1 16 -7 -41 -9 -25 -10 1 23 32 -25 -23 -15 -13 -13 -38 -15 17 10 1 11 -7 -1 -32 -37 -6 -17 -8 -31 -1 12 -32 -17 3 -5 -16 -27
3167 -27 2 -10 6 -6 -8 16 -11 -7 -15 16 38 -20 -5 11 25 5 -21 -7 -8 26 -1 -2 -2 9 -11 -1 -1 31 5 -55 10 17 -18 -15 -18
3202 -18 15 -27 -24 -21 3 4 -37 -31 0 -4 -16 -21 -15 19 -18 -48 -32 -11 -16 -37 -35 16 -9 -18 -20 -9 6 -45 -6 15 9 8 -38 -13 17 -28 -15
3239 -15 4 23 2 -36 -11 22 26 3 -9 35 22 11 -25 16 34 8 -27 27 7 23 -34 13 23 8 -13 -11 2 7 -19 -12 32 -10
3271 -10 -39 -12 -17 28 -4 -22 -14 35 -39 -39 4 13 -12 -36 -16 -10 -8 -13 -2 -14 -19 -33 -23 -8 -17 -47 -3 7 0 -18 -20 -39 13 -5 -13 5
3307 5 -13 27 -16 28 19 14 4 8 9 12 -20 -21 -5 26 7 -2 -1 5 8 -15 -18 18 40 -19 -19 7 -8 2 -15 -1 7 -21 6 7 3 -7 -19 -7
3345 -7 0 -1 -27 -40 18 8 -49 -5 -4 -4 -47 -45 2 -6 2 -11 -1 14 -1 -17 14 17 18 3 -12 13 0 -24 2 7 -8 -21 20 27 21 26 -21
3382 -21 3 -1 8 -25 -8 21 29 8 -17 11 5 14 -5 -6 35 -26 4 0 35 1 8 -5 3 -19 -32 11 23 9 -2 -9 -13 7 -15 -35 -16 2
3418 2 -8 -17 2 -6 -28 -3 5 9 12 16 -3 30 27 -37 -30 37 40 -16 -11 21 19 9 -3 26 -16 -8 -4 -2 46 17 33 10 13 20 27 14 21 15 -9 -9 36
3459 36 26 10 -25 43 19 -2 -6 -10 1 -15 -25 10 8 32 -10 -7 5 8 11 -29 0 -19 -25 -35 3 -5 -12 -10 -30 -5 16 -13 -20 -15 32 -32
3495 -32 -29 -21 -5 -17 -40 16 14 2 -17 8 25 20 -13 -5 9 -13 -12 -9 -15 -2 -15 -10 -3 26 -33 -4 6 14 -8 -52 21 44 -33 -29 3 -13
3531 -13 -20 -7 -4 -4 -5 -21 -16 14 10 -20 -43 -9 -8 -16 -14 22 -26 -10 -4 -39 30 27 -3 -44 8 -20 5 -27 7 19 30 -23 10 12 -6 -15 5
3568 5 3 -9 -16 15 23 -16 13 15 24 3 -15 -21 -16 22 6 6 9 18 11 2 47 20 18 -25 10 13 16 -2 -5 15 -12 -34 -20 -5 14 -27 -27 -7 8
3607 8 -8 -40 -33 -8 -20 -51 -19 -20 -3 -13 -18 -16 -1 -31 -55 -19 -1 -6 -29 -29 24 -1 -24 -5 24 25 -5 8 27 19 15 -4 -6 10 -5 4
3643 4 21 17 13 3 -6 12 3 -21 -5 34 9 0 -5 6 -6 -15 -20 -24 8 -1 -14 4 14 -13 -21 -21 20 22 -22 -30 15 -16 -19 15 -11 -25 -31 -21 -4
3682 -4 31 -22 -25 -6 5 1 -7 -15 -11 -23 -5 -19 34 10 13 -28 28 36 6 -3 -3 16 -10 -2 -1 4 10 -24 1 52 19 1 -27 13 36 5 -25
3719 -25 12 4 -2 -24 6 -1 -11 -12 -11 8 9 -12 1 -14 8 -8 21 -1 -11 3 -13 -13 10 -10 -42 -17 6 -9 7 -6 -1 -3 -7 -19 11
3754 11 1 -12 -17 -3 22 -4 -10 15 11 2 8 28 12 12 2 -15 1 16 -20 7 -3 44 -9 -3 15 28 19 -14 0 11 40 -9 17 9 6
3789 6 -8 -12 38 -8 16 4 16 -7 -6 -2 -14 -8 19 -23 -1 10 -15 -34 -23 -11 -20 -15 -11 -7 -16 -7 14 -17 11 2 -9 -12 4 -1 7 5 18 -14
3827 -14 -9 -5 24 10 -24 2 33 -19 -7 9 20 17 22 -10 -6 5 -3 4 -6 12 -5 -10 -3 20 -15 -7 -33 14 1 -40 -32 15 -1 0 3 -10 -2
3864 -2 -7 -34 -21 9 -13 -31 -16 4 -1 -13 -6 24 8 -19 -5 11 19 -34 -22 -10 5 -6 17 3 13 29 -5 -2 -8 19 4 15 13 41
3898 41 -2 -13 24 6 12 -25 22 24 19 -2 23 26 52 24 -14 24 -18 -18 8 0 14 -25 -24 2 18 21 -12 2 -14 13 -9 -14 22 -8 -11
3933 -11 7 17 6 -22 6 2 0 -12 -6 2 29 -17 7 -41 35 21 -11 -20 18 32 -5 -7 13 30 -8 27 14 54 7 17 -8 0 5 11 -9
3968 -9 25 30 5 -10 12 22 -6 -10 24 -10 -24 -16 16 6 -10 12 14 -17 43 -14 -6 29 -26 3 0 14 -23 -14 -3 -18 9 -16 -9 2 -20
4003 -20 -6 6 -15 20 -4 -6 -1 -10 36 8 -18 38 26 -12 -20 -1 12 10 -9 -17 4 -12 -1 33 10 -3 -7 20 7 29 24 7 8 29 10
4038 10 -25 4 35 8 9 24 -24 -22 -2 12 40 22 11 -25 26 5 3 7 -2 -25 -12 -5 -10 13 -6 -17 -6 32 5 -9 15 -10 16 -5
4072 -5 7 -6 -12 -10 -7 -9 21 23 3 21 20 -2 8 15 24 38 31 -10 15 23 -7 47 24 1 14 -3 -20 12 28 -3 20 25 30 -19 -11 -1 1 -1
4110 -1 17 -1 2 12 12 22 35 16 3 -1 14 -1 -20 5 19 -40 -16 2 -1 22 -31 -20 11 2 -7 -2 12 5 -17 -24 24 18 -17 9 -20 10
4146 10 21 -11 29 25 -20 10 -9 28 26 1 2 -9 25 10 23 13 17 -2 -9 18 4 -1 3 -12 22 17 3 1 24 10 4 1 41 -4 23 1
4182 1 2 22 -2 11 11 9 -4 -25 -12 9 4 11 -6 -6 4 -6 8 8 8 -31 -17 23 -11 -26 9 -12 -12 11 -34 11 7 -16 -26 -5 10 27
4218 27 -6 -21 -3 20 -21 -2 56 19 20 -38 7 9 7 20 -5 15 18 10 9 62 9 -26 21 -18 11 0 -19 43 47 -9 -13 -4 -25 -9 1
4253 1 -4 6 -9 -10 -32 -6 -14 1 -20 22 2 -26 1 11 -19 -26 -13 -14 -13 1 17 -1 27 0 -1 8 29 17 -9 -1 5 7 -27 -27 27 18 19 -11
4291 -11 -1 46 -1 5 20 22 -8 -43 -15 -11 27 -8 -13 9 16 6 -11 -12 8 3 -15 0 16 15 -8 5 15 32 -3 -17 12 -5 17 -4
4325 -4 23 35 0 -4 -22 0 -3 12 13 3 13 -6 2 18 -4 -1 -12 -3 10 19 4 10 42 31 4 -1 36 27 -5 15 17 15 12 12 10 12 0 -6 35
4364 35 28 8 12 16 24 27 -9 23 9 4 26 -5 -13 2 -14 -14 25 14 -13 -19 11 33 -16 -24 -3 24 -15 -12 -26 -1 -15 -5 2 -2 7 -28 -11
4401 -11 -2 -22 -14 -8 1 23 -10 -14 -4 2 24 -26 8 26 1 -7 -10 -7 42 1 -15 11 21 15 9 17 36 19 -19 -9 -1 21 -28 -24 12 10 20 17
4439 17 -7 50 -10 -8 -9 -5 -8 -19 13 8 -8 10 -16 -18 -17 3 2 -1 5 -7 -14 15 5 -27 4 -17 17 -12 -30 -32 6 -10 -10 3 -14 4 0
4476 0 -11 8 -7 -14 -17 -27 3 21 1 7 31 3 6 3 26 13 20 -30 0 15 -27 12 -17 23 1 10 2 16 20 -39 25 35 36 -14 -33 -5
4512 -5 6 -4 -28 -4 10 -6 -2 -3 -18 -17 0 -4 -23 -14 -7 -6 -36 14 -6 -21 -6 8 1 -28 -13 9 -12 -13 2 15 7 -7 4 12 16 5 -14
4549 -14 28 24 25 -30 21 21 13 39 21 14 -8 -7 8 24 -8 26 -6 21 12 -11 14 33 12 -10 -12 -10 35 -21 28 4 -6 -5 -14 11 1 0
4585 0 -42 -13 3 -9 2 -35 1 8 -10 12 12 -2 6 1 -37 12 -26 -6 3 2 -13 -18 -11 5 26 8 2 12 6 21 -8 -8 5 8 2 1 41 -4
4623 -4 -10 17 26 2 16 8 1 -15 7 -6 23 -8 11 -14 15 -10 -7 -6 9 -5 -6 4 3 27 5 13 0 -3 -6 -8 -26 -4 -7 -8 -15 5 0 -11 0
4662 0 20 -5 5 -2 -1 7 6 -5 -5 -13 12 5 4 -10 5 -5 -1 -10 -6 15 1 -14 -2 -4 -2 4 -14 -11 -2 -4 -3 7 8 2 8 13 -21 -33 -12 -18 -10 8 -19
4705 -19 5 -1 -33 -13 -3 -8 -7 -6 5 -18 -21 7 19 50 -13 -33 -9 -3 -7 -3 1 -9 5 -4 -14 19 4 -5 -6 6 -32 -29 -17 12 28 15 -14
4742 -14 6 11 17 5 11 24 24 -19 -13 12 16 3 -19 10 22 -25 31 33 6 10 -10 12 -1 -9 11 -26 22 1 -26 -1 19 19 0 28 11
4777 11 14 14 -23 10 -17 -1 -33 16 14 12 -12 0 26 -12 5 -2 13 -23 2 -33 22 12 7 -23 15 22 -14 7 12 21 16 -1 21 29 9 14
4813 14 16 53 10 1 -3 8 21 5 26 -1 9 18 -1 7 -1 36 -16 -15 -17 23 -17 -24 3 3 -17 -2 34 6 -47 3 -6 -9 -17 -19 -33 6 15 30
4851 30 12 25 18 -16 -12 1 43 -25 -29 10 25 2 -6 16 21 3 -15 -12 -21 14 -5 17 15 2 3 9 29 18 17 -19 -1 23 29 4 14 12 12
4888 12 13 14 14 -26 -18 -15 2 9 5 -46 -4 31 -3 -26 -8 5 -32 -16 -7 13 15 -31 -22 3 22 0 -10 6 -18 -16 3 6 -2 -6 2 -6 -39 -8
4926 -8 -30 -1 -1 -30 14 13 4 14 -1 -23 8 5 22 5 -10 -20 -20 6 3 14 25 -13 8 8 29 -10 25 -14 -1 5 4 -11 12 -3 11
4961 11 -13 28 -12 32 46 6 14 -16 -16 12 -20 15 -11 -5 18 -3 -25 -12 -30 -21 3 -4 3 -30 -7 -2 -2 -23 0 -20 17 2 -2 -21 4
4996 4 -20 -24 13 17 23 -6 -26 29 25 6 11 13 -15 12 2 -2 18 -14 2 5 -4 27 -20 10 -11 29 -17 -21 -5 29 2 -27 -6 27 8 -21
5032 -21 2 16 -31 -5 -8 -15 4 -8 -40 -17 -10 -17 -6 -10 -2 9 -16 -28 -2 2 -6 -5 3 -31 -53 16 18 15 -19 -12 9 8 0 -13 -3 5 10 -12 1
5071 1 -17 34 10 -4 16 18 -6 9 -19 23 -15 3 12 -2 -6 -9 -6 -31 -7 -21 12 13 1 -8 9 2 -16 -7 -9 -29 9 6 -6 -19 12 0
5107 0 -23 -17 -7 -6 -15 -27 12 -8 -15 -2 17 25 -8 -2 -7 24 23 -10 10 16 3 -19 -10 12 22 17 -39 -4 24 -27 -15 11 6 -17 17 4 12
5144 12 -1 -9 15 -27 -8 -11 -22 34 6 18 18 24 18 0 -36 24 2 0 -17 7 17 3 -25 14 -11 3 -5 -17 20 6 11 -13 -4 7 23
5179 23 -12 39 7 -2 11 23 -5 20 -28 27 4 -6 -6 6 29 22 5 -19 11 -16 -8 1 23 1 -6 -8 26 21 -1 21 10 -19 42 -31
5213 -31 -4 10 12 12 -7 -16 13 13 4 -14 19 -22 -23 14 33 -18 1 4 24 14 -3 15 -3 -16 -5 12 -20 -10 1 5 -8 15 15 -18 -10
5248 -10 -5 -18 -8 -15 2 -8 -21 0 -12 -7 2 13 -8 0 26 6 23 33 -16 -13 8 -1 10 4 1 -18 31 12 12 11 12 14 -5 31 20 -5 -38
5285 -38 -12 47 -10 -14 15 21 7 -8 -12 26 -7 13 11 -24 -25 -21 -30 5 -7 9 -35 -21 24 13 9 -5 4 -13 -26 -27 4 12 -28 14 13 15 7
5322 7 11 -8 3 -15 -5 -6 5 1 18 -6 5 20 -8 4 7 14 -34 -20 -1 -24 -32 7 -6 35 9 -18 -20 -13 -13 0 -4 -12 -6 1 9 2 3 -1 -9 -21
5362 -21 15 -5 2 0 6 4 -11 -12 3 -24 -7 -23 15 10 -13 4 -19 -3 5 -7 11 12 22 11 22 2 11 -25 -24 4 10 5 -10 16 7 3 15
5399 15 32 29 14 -15 -14 22 2 -22 6 7 31 31 -1 11 36 -9 0 -2 -11 12 13 13 10 27 -14 36 38 -14 7 -8 3 9 -9 14 16 2 -15
5436 -15 -17 4 15 -11 -7 -9 28 -25 -6 5 1 -24 26 14 18 0 -35 -24 -3 28 19 5 1 -3 23 -8 -3 -3 10 -8 1 35 -4 20 1 36
5472 36 1 -9 4 19 17 5 -2 -4 -5 0 12 -9 7 3 -12 7 1 -4 -13 -24 9 5 -2 24 -1 7 -8 -15 26 0 -25 -18 -16 4 -2 -20 -4 10
5510 10 9 5 -20 -15 0 -28 -10 18 17 8 -7 -7 -22 -6 19 -5 -9 42 -10 -10 -6 -16 -3 10 23 -6 -8 1 12 -17 8 -18 -14 8 17 28 -6
5547 -6 15 9 -3 14 -7 -10 2 12 7 -7 14 20 0 9 2 -11 9 -8 24 -6 -22 22 -31 2 15 19 17 -9 25 -9 11 8 -4 -1 4 0 9
5584 9 -8 21 24 3 -2 17 12 -9 5 0 9 -19 23 2 -16 48 4 3 -10 4 -4 1 12 40 11 -1 -1 -28 -11 -2 -5 -16 -11 -5 9 -4 -6 10
5622 10 -10 0 -5 -11 -21 8 5 10 -8 -8 -6 -3 -3 13 13 5 13 4 -24 -32 -6 1 -8 0 2 4 -1 4 -1 8 10 27 -4 14 10 20 -2 11 4 18 -1 -25 4
5665 4 15 4 14 -22 16 16 -3 9 9 12 5 -9 -29 2 -7 4 -18 -17 -12 -10 6 2 1 5 -8 3 13 1 11 21 4 -3 -3 1 0 -12 -4 35 -27
5704 -27 -22 -5 -19 -22 -22 -22 -9 -12 -17 21 -5 8 2 -1 -23 13 23 -6 3 18 29 -18 6 -2 -4 2 -27 20 -28 -5 5 -21 9 -1 -12 7
5740 7 9 20 9 10 -8 10 -17 -13 4 -3 -4 21 17 18 15 26 11 -12 21 1 -8 10 -15 -14 -27 -24 16 8 3 -5 17 -11 8 -22 -13 -6 29 2 6
5779 6 -4 19 -40 -9 -20 3 1 14 37 6 12 34 -12 -10 -13 -8 32 -10 13 20 7 -3 18 6 -7 7 2 9 5 1 -8 10 0 0 9 0 12 -1
5817 -1 6 3 2 -24 -8 -20 -8 -21 -13 -16 -41 1 14 2 1 -9 10 -31 3 2 1 10 41 10 -6 10 6 -4 -10 7 15 13 17 8 -33 28 13 -2
5855 -2 16 -8 2 -1 17 -10 16 29 39 -22 0 -17 6 3 2 0 -15 -5 -33 39 0 23 -6 16 -13 21 14 -12 -21 -15 3 -9 -14 -18 -3
5890 -3 -11 -3 10 -3 -39 -18 -21 -2 3 32 -10 -12 2 -12 26 8 -5 1 9 0 4 0 0 -10 -3 -5 -17 10 -1 -2 23 -4 24 6 25 -4 1 24
5928 24 -8 21 10 -15 -16 5 15 -18 -25 -1 -18 16 -6 -11 0 1 -9 9 12 -15 0 17 -5 -5 -22 -25 12 -25 4 -10 4 38 -12 5
5962 5 -14 -16 28 -36 -2 -8 8 -35 -1 -17 9 -4 -26 17 -10 -9 21 10 -11 9 -11 -14 -7 11 9 -12 20 1 16 15 -1 9 -13 -26
5996 -26 -11 -16 3 5 8 2 0 -11 -3 -5 15 8 -4 1 -19 12 -20 -5 26 -23 -6 0 18 5 -15 -16 -28 -22 -12 -3 8 -5 -23 8 25 -20 -2
6033 -2 13 -15 12 -5 4 -3 -5 15 14 -16 1 -8 8 -19 -16 -2 -33 0 -9 -26 1 -24 -4 45 -17 -10 1 0 21 6 -3 -6 -3 9 15 5 8 -20
6071 -20 -23 16 15 -8 -8 0 -26 -2 -15 -7 -22 -15 -7 -13 8 30 4 -7 -31 16 -4 -23 -7 12 -6 -6 -27 1 13 -15 -15 0 28 -12 -4 12
6107 12 7 -9 -19 -2 14 4 -11 24 30 13 10 14 25 17 13 25 7 -7 -8 3 25 2 -15 -1 26 1 12 -24 -9 23 4 -19 17 17
6141 17 17 23 -6 4 13 10 6 3 7 35 -21 -31 29 -2 -3 9 16 10 -33 2 -2 0 10 -13 -15 31 11 13 23 6 22 6 21 5 6 -36 1 8
6179 8 -2 3 17 19 19 1 1 6 -2 1 16 20 -3 47 29 -3 36 20 -2 8 -9 17 -7 -1 11 -2 -23 -12 2 -9 5 -22 -8 -2 1 11
6215 11 18 -1 8 -18 -7 14 22 -6 -13 4 -16 -16 -8 13 2 -13 4 4 7 13 -26 -17 3 22 -10 -12 12 -5 2 -2 -18 3 34 15 17 -7 4
6252 4 8 -11 36 20 -1 -17 32 -18 -24 1 24 16 3 25 24 2 3 16 -21 -11 13 13 1 -1 -7 -22 9 -24 0 -11 -6 -26 2 -12 -13 -2
6288 -2 -25 -2 -11 16 -16 -13 -14 -1 -11 2 17 -7 -3 -7 -15 17 10 20 -15 -14 10 24 19 -7 15 -4 -3 -6 19 10 -2 -3 13 15 -13 6 -11 13
6326 13 5 -6 7 27 6 29 18 17 18 -4 -46 -25 16 -14 -5 4 10 -15 3 19 -14 -13 -6 -7 17 -6 -12 3 -21 15 -10 -6 -17 4 -6 4
6362 4 -9 0 -3 0 -3 3 1 -23 11 3 -12 -3 -3 5 0 17 8 2 5 22 17 0 -21 6 2 -6 1 7 -10 2 24 43 4 -2 -2 11 -16 19 -19 -2 2 6
6404 6 16 8 -7 -2 0 -5 6 6 16 11 18 -3 4 22 7 -4 -16 5 12 -5 -13 -7 3 4 9 14 1 18 7 -5 1 27 5 6 31 -8 30 -3 18
6443 18 28 -18 18 -33 15 13 1 6 -21 22 12 -8 -3 -1 -5 -13 -26 1 19 12 -5 37 -11 -4 -4 15 29 2 -1 17 -27 -11 -7 3 -13 -41
6479 -41 22 -4 13 3 18 -17 9 11 -10 41 8 33 -16 -15 2 -7 -11 -35 -3 -4 -4 -11 12 4 29 -13 -2 10 -15 -21 13 5 20 19 -27 0
6515 0 14 22 10 30 14 2 10 9 3 -4 -4 -19 7 18 6 -6 -26 55 6 6 33 3 -1 -11 -15 12 -19 -5 17 -4 8 -20 -16 -6 5 -5
6551 -5 -2 -1 19 0 -8 30 -4 -11 -25 -13 2 12 -7 3 3 -18 8 0 -7 0 9 -13 -7 -6 -16 9 0 5 17 -27 7 -10 -12 15 20 -22 16 1
6589 1 -17 5 0 -8 -15 -4 1 -12 3 11 -16 3 -21 -16 -16 6 -9 -3 -12 17 12 -2 5 -2 -16 -28 18 -4 -10 -13 -28 -7 -11 -24 9 -4 5 11 3 24
6629 24 11 -28 0 17 9 -1 -2 7 -15 -21 -4 -16 1 -1 -2 9 -6 20 3 23 19 -4 -44 0 7 -4 -9 30 -36 14 -6 0 -17 -10 15 -7
6665 -7 5 -21 10 -14 23 1 -1 -7 -31 -16 28 21 3 6 -12 11 29 1 16 8 -2 -16 15 -15 -14 -9 7 -6 -22 -15 -8 -6 15 7 -14 22
6701 22 -11 -12 -7 -8 19 15 31 21 13 5 5 3 13 -1 -4 11 -4 14 5 -7 14 -5 11 5 16 2 -27 13 -15 24 -3 -5 0 -10 -2 17 -18
6738 -18 -8 -9 12 6 -4 15 -36 -6 7 6 19 25 10 -25 6 -32 -6 14 -6 14 -11 -4 6 -10 5 11 -8 -6 0 21 1 -16 -12 19 -7
6773 -7 11 3 4 10 7 8 -14 12 9 16 3 10 -10 13 1 0 -36 -13 2 30 1 -44 -6 2 22 9 19 -2 12 25 -14 3 -6 19 -8 2
6809 2 8 9 7 -5 -1 -7 0 -4 -25 -26 3 11 0 15 -2 -8 24 24 21 7 -35 -4 -10 -18 -12 -4 17 15 29 37 1 -9 -5 18 7 39 -6 -7 -10 -18 -22 -30 11
6852 11 12 10 11 15 16 -6 27 6 -10 18 -13 -10 13 -4 2 -10 -6 2 -5 17 -8 10 -36 -14 -25 -9 -13 -7 -53 -11 -5 -4 10 -28 -20 -8 7 41
6890 41 7 8 31 12 -11 -14 -26 -22 10 -16 0 9 17 3 -7 -19 -13 9 -9 1 2 7 10 0 -19 -7 -7 5 4 -7 -21 6 -16 22 13 10 4
6927 4 -19 -15 -37 -21 0 -3 -5 17 -9 -23 -12 -8 5 -10 3 13 6 5 9 -7 8 -6 -4 9 -5 7 15 -3 2 40 21 -16 -28 40 12 14
6963 14 -8 1 33 -16 13 7 12 -3 8 -13 4 -1 6 -11 -7 0 22 -1 -11 -8 -11 19 6 31 11 -16 9 23 4 -5 13 9 0 22 14 15 -2
7000 -2 17 -14 -5 2 -7 -9 -10 -5 8 19 -9 -14 -8 2 2 -16 -28 -28 -38 9 2 12 -12 -9 -22 -8 -12 6 3 0 24 -2 13 27 13 -24 4 10 30
7039 30 -10 1 12 7 8 -4 35 6 -38 14 9 -18 6 -24 -13 6 -15 -18 9 -19 23 -26 -28 -5 4 13 -6 9 2 12 -22 8 -21 -13 -13
7074 -13 -19 -10 5 16 -3 -18 10 22 3 -2 -6 21 1 0 5 -7 -32 14 27 47 5 30 32 6 -1 8 8 9 -10 -9 1 21 -26 0 19 16 1
7111 1 6 -26 10 -16 -11 -29 -26 -23 2 12 28 -7 -9 -7 18 22 4 8 1 -5 -13 -8 1 -3 15 -36 10 7 18 -6 17 10 8 4 -2 13 4 -3 -17 16 13 -9
7153 -9 17 -3 -12 -1 6 16 2 -2 -24 -7 -23 27 1 5 6 3 -16 -22 -9 32 -28 1 -4 5 1 -2 -15 -12 -15 13 7 1 10 -10 -14 -2 25 -1 -7 8
7193 8 8 -23 -22 10 -18 -19 5 -7 12 -17 20 -19 -6 16 27 -19 -32 -34 -11 -10 -10 -3 -1 -17 -5 18 -16 4 -12 34 19 30 -30 -1 9
7228 9 -3 3 16 -1 6 11 6 1 5 3 5 -7 2 21 -6 -7 -4 20 4 6 -10 -32 -18 -3 -7 9 16 16 -23 10 23 -11 18 1 10 23 7 13 37
7267 37 4 2 -1 12 -23 -10 6 -1 24 7 7 -12 -18 -8 7 1 1 -17 5 10 8 24 19 0 -11 9 -16 0 -15 18 -4 17 -21 -16 -7 -1 -20
7304 -20 4 21 10 -2 7 -24 -9 15 9 -20 1 2 -29 -17 18 38 -4 21 4 17 -6 23 -15 0 12 -2 38 -14 -6 -4 -8 -3 -20 9
7338 9 32 2 0 -7 27 6 -7 15 12 -7 -11 17 30 -19 8 -9 4 -8 10 19 9 -11 -10 43 -10 6 8 -10 -1 2 7 4 15 28 -5 11
7374 11 -2 -18 -17 -23 0 -18 10 16 3 35 12 11 9 -19 -23 6 -3 -1 -8 31 -11 -2 -14 6 12 18 9 3 2 -9 9 -12 -18 16 32 15 8 -14 14
7413 14 0 -1 -18 10 -2 14 -1 -11 0 6 3 4 7 -15 10 4 13 -15 -10 28 19 -9 -16 -25 -5 -18 3 -6 12 22 -4 -11 2 -7 -7 -12 -18 -8 -12
7452 -12 -22 -13 -8 -26 4 -5 23 15 -3 -10 -8 -1 -20 18 -19 5 -8 13 21 -21 6 -16 6 -10 6 10 -13 -23 7 4 -17 -15 13 13 16 -7 0
7489 0 -13 -7 -9 0 -23 -9 -20 25 7 -1 -4 11 -7 -14 30 -5 33 0 15 25 16 -17 19 3 23 -24 -7 29 -11 -13 -15 34 -3 5 -42 -13
7525 -13 7 7 26 17 -2 28 -27 -12 16 -28 14 -24 -3 15 14 -7 -9 20 34 -23 -19 -4 38 0 16 1 -1 15 -5 -12 10 -11 23 0
7559 0 -14 1 12 -5 25 -3 -15 -20 -22 -17 0 -12 -36 -1 -5 -15 24 13 -23 29 15 -4 -17 9 22 -20 -3 7 6 10 -12 -20 3 14
7593 14 0 -1 7 13 20 -5 -11 17 16 -8 -1 17 -11 -3 -3 -8 3 -12 -5 -2 15 -9 -1 -14 -24 -6 3 7 13 -17 -7 5 3 -21 -22 -25 -6 -4 4 -19 -8
7634 -8 -8 12 -11 -16 -9 0 -5 3 9 -12 8 -16 8 -2 -19 9 -2 -9 -7 -14 -2 -8 -6 -4 1 -2 -4 3 3 11 4 0 -9 -4 2 18 -21 -3 1 -3 9 24 14 -7
7678 -7 -1 -8 -5 -3 9 -13 -10 -3 1 -35 25 -12 5 -21 9 -11 9 4 2 -10 6 8 -22 5 13 -12 -2 13 11 -10 2 -19 0 -9 -18 -5 -10 2
7716 2 18 25 -21 26 -8 9 25 -1 3 11 14 -17 -10 -4 0 17 -6 -15 9 21 31 -5 11 12 14 17 11 4 11 -7 5 -15 19 -1 -23 -19 -13 17 16
7755 16 20 -18 7 -33 -6 6 -13 2 -14 -20 -3 26 -8 8 23 30 17 -11 -14 -27 5 18 2 1 14 -5 2 -15 10 -26 23 18 -8 -3
7789 -3 -6 4 13 -4 -30 -17 17 -3 3 -10 -17 4 -36 -7 9 -13 21 -15 -11 2 -14 -12 3 -7 -4 4 2 17 11 25 4 3 -18 9 -17 5
7825 5 -8 10 -1 -3 2 22 2 10 15 21 -4 -2 2 13 13 -4 5 -1 15 -23 8 -21 -5 1 -23 17 -6 -11 -23 2 -13 5 4 -12 0 -2 4 -8
7863 -8 -12 -13 10 5 3 -30 14 -28 21 -16 29 -19 -19 -3 -29 44 -2 -1 5 20 -6 -23 24 -12 3 17 -6 -7 11 -16 15 14 15 -14 16 4
7899 4 -6 -7 -3 16 -3 9 4 1 1 -1 30 -5 -18 -5 21 25 7 3 5 14 1 16 -23 -2 -22 -11 -10 45 21 21 -8 22 14 7 9 10 -1 8 8 -7
7939 -7 1 12 19 22 8 -21 -7 5 -23 -26 -3 -4 -9 6 -1 -10 -5 0 0 7 -6 5 1 -19 30 -17 21 22 -23 1 -1 -16 -2 -14 -9 29 -4 29 6
7978 6 1 -4 26 32 -8 11 15 27 4 18 0 9 5 13 13 16 -36 9 -6 -7 4 -12 -11 -14 35 -13 -25 18 -10 13 -10 -16 3 -9 0 15 15 -13
8016 -13 0 -3 -9 15 -4 -11 1 17 14 11 5 6 10 -3 13 -19 -18 7 24 -5 8 -7 1 11 -6 21 -23 4 -6 -4 13 5 9 0 -3 -32 -3 -32
8054 -32 7 32 5 6 7 18 16 17 28 8 -5 -5 10 6 -21 -6 -6 6 0 13 48 -1 -18 -46 7 -2 -8 -24 8 -4 -26 19 -2 -4 -7 -6 -4
8091 -4 -10 -22 16 -28 -7 12 16 1 18 7 -20 9 9 5 5 -3 -10 12 1 20 10 21 -2 7 19 33 27 8 -10 13 28 8 10 16 8 -9 5
8128 5 2 -2 12 -6 -16 13 1 20 -6 2 20 17 16 -9 13 -10 9 12 -12 -16 1 5 -3 46 -16 -11 -10 -8 -6 17 -4 1 19 0 -16 20 -7 -9
8166 -9 11 8 -1 -9 -5 24 -1 -12 32 -18 -23 4 -10 2 -1 -17 -11 9 1 -16 -12 8 -10 -13 19
8191A9
$$ Imaginary data points
##PAGE= N=2
##DATA TABLE= (X++(I..I)), XYDATA
0 0 0 0 0 0 0 0 0 0 0 0 0 0 0 0 0 0 0 0 0 0 0 0 0 0 0 0 0 8 -8 8 -8 8 -8 8 -8 8 -16 16 -16 16 -23 24 -24 25 -32 32
46 32 -40 40 -48 48 -56 62 -65 72 -80 89 -99 112 -125 140 -159 183 -211 249 -303 380 -501 738
68 738 -1339 6931 9898 -956 -5184 -8071 -4453 3575 10442 7233 -931 -7731 -7941 -1916 6922 9446
84 9446 4034 -3573 -7252 -6553 -392 7622 9321 1562 -6692 -7969 -3462 2272 6719 6276 -62 -7028
100 -7028 -7921 -2574 4347 7605 4367 -3226 -7925 -5872 -145 4897 6889 3080 -4867 -8831 -4190
115 -4190 3111 6111 4679 581 -4870 -7131 -3008 3801 7056 4823 -1407 -6931 -6198 388 5919
130 5919 6149 2593 -2617 -6666 -5026 2168 7499 5747 -136 -4655 -5534 -2304 3323 6715 4550 -1205
146 -1205 -5790 -5601 -434 5583 6545 1852 -3517 -5521 -3821 815 5668 5818 320 -5276 -5733 -1875
162 -1875 2751 5212 3695 -1148 -5329 -5265 -1153 3940 5837 2339 -3596 -6013 -3361 1121 4144 4440
178 4440 1112 -4110 -5974 -2346 2860 4961 3147 -937 -4439 -4548 -943 3420 5046 2722 -2154
193 -2154 -5476 -3647 1560 4868 3973 733 -2718 -4461 -2530 2309 5376 3722 -759 -4025 -3810 -574
209 -574 3350 4637 2470 -1521 -4295 -3590 567 4639 4398 410 -3244 -3860 -1944 1411 4066 3545
225 3545 -406 -4120 -4124 -868 2788 3941 1827 -1853 -4029 -3308 -204 3242 4005 928 -3380 -4506
241 -4506 -1867 1576 3304 2667 -44 -3236 -4001 -1335 2475 4002 2070 -1557 -3782 -2831 200 2966
257 2966 3602 1543 -2070 -4049 -2202 1780 3946 2815 -42 -2508 -3073 -1201 2120 3950 2613 -907
273 -907 -3482 -2847 361 3122 3306 1180 -1614 -3291 -2408 920 3713 3108 -222 -2980 -3055 -1004 1652
290 1652 3087 2144 -740 -3263 -3203 -415 2677 3173 773 -2172 -3221 -2077 425 2658 2830 252
306 252 -2864 -3435 -1093 1729 2835 1738 -727 -2695 -2740 -589 2192 3246 1344 -1828 -3163 -1697
322 -1697 914 2555 2461 677 -1883 -2992 -1320 1723 3229 1980 -590 -2384 -2125 -226 1955 2852
338 2852 1645 -1014 -2869 -2032 833 2832 2302 278 -1659 -2421 -1429 1017 2867 2171 -514 -2581
354 -2581 -2374 -333 1733 2327 1145 -977 -2536 -2276 -39 2357 2474 140 -2154 -2528 -1197 731
370 731 2061 1876 -132 -2342 -2659 -694 1715 2386 958 -1144 -2254 -1770 -44 1839 2414 827 -1672
387 -1672 -2608 -1064 1210 2250 1694 66 -1626 -2095 -669 1631 2633 1435 -831 -2119 -1464 388
403 388 1861 2064 952 -996 -2236 -1383 973 2500 1739 -274 -1672 -1733 -635 1044 2121 1399 -658
420 -658 -2265 -1871 62 1748 1737 358 -1208 -1969 -1474 197 1852 1790 -164 -2023 -2019 -541 995 1602
438 1602 1076 -459 -1893 -1882 -286 1571 1910 530 -1244 -1838 -981 402 1504 1641 472 -1382 -2016
455 -2016 -604 1337 1929 1062 -342 -1322 -1387 -234 1376 1976 996 -853 -1774 -1049 638 1672 1433 342
473 342 -906 -1628 -970 852 2041 1289 -504 -1557 -1297 -215 965 1569 909 -675 -1834 -1443 176
490 176 1558 1405 -12 -1262 -1497 -883 289 1431 1402 -230 -1846 -1690 -180 1098 1306 592 -592
507 -592 -1501 -1347 -10 1348 1540 314 -1233 -1617 -588 731 1311 1060 121 -1151 -1603 -396 1317
524 1317 1703 608 -582 -1127 -895 78 1234 1479 569 -765 -1398 -696 739 1495 981 -68 -802 -1043
542 -1043 -563 690 1599 951 -588 -1402 -897 127 885 1067 461 -656 -1393 -1044 215 1271 1095 -192
560 -192 -1284 -1256 -462 391 1035 915 -257 -1543 -1402 -49 1046 1006 297 -676 -1233 -941 116 1123 1214
579 1214 207 -1135 -1379 -318 889 1140 707 -93 -955 -1153 -179 1206 1462 425 -709 -1044 -522 402
597 402 1139 1092 284 -740 -1188 -496 845 1390 681 -388 -860 -748 -206 688 1200 588 -677 -1199 -641
616 -641 280 844 702 33 -688 -997 -679 227 1014 797 -370 -1185 -866 -76 450 685 515 -318 -1130 -937
636 -937 95 887 808 122 -713 -941 -468 262 838 871 137 -891 -1108 -163 884 977 393 -209 -701 -780 -23
657 -23 980 1136 298 -646 -887 -382 479 955 759 69 -576 -886 -356 735 1237 489 -530 -801 -457 9
677 9 568 872 367 -585 -1013 -545 349 808 553 -163 -709 -725 -390 240 789 564 -376 -1081 -725 118 539
698 539 460 198 -338 -835 -696 60 738 648 -28 -700 -728 -235 330 614 554 45 -677 -826 -19 770 782 220
720 220 -324 -504 -451 77 734 857 297 -519 -751 -239 546 844 527 -20 -474 -619 -234 571 963 383 -472
741 -472 -718 -361 146 533 599 181 -467 -858 -476 291 769 407 -318 -701 -551 -172 212 572 407 -369 -900
762 -900 -598 138 550 415 -11 -407 -606 -435 117 634 574 -75 -657 -601 2 452 507 323 -28 -501 -576 43
784 43 713 683 149 -356 -421 -195 210 543 616 227 -436 -625 -142 509 692 261 -178 -361 -382 -129 420 686
806 686 295 -412 -682 -256 235 434 333 47 -371 -605 -333 228 627 359 -319 -661 -394 -9 259 342 245
827 245 -266 -702 -519 131 537 315 -149 -426 -442 -242 133 500 451 -103 -599 -486 69 484 437 117 -142
848 -142 -327 -335 42 536 596 56 -388 -367 -23 295 455 403 87 -317 -470 -28 498 604 173 -283 -359 -184
870 -184 32 325 465 221 -339 -574 -198 275 391 188 -118 -342 -435 -238 166 450 222 -339 -588 -338 64
891 64 256 192 23 -240 -498 -412 91 481 284 -157 -421 -295 -81 164 369 287 -75 -445 -386 83 457 380
913 380 55 -166 -229 -180 72 439 490 88 -376 -344 51 317 365 223 19 -216 -303 -46 405 516 131 -321
935 -321 -357 -104 107 237 261 120 -282 -487 -207 242 360 122 -204 -312 -283 -130 140 305 154 -255 -521
956 -521 -283 124 285 109 -26 -204 -364 -308 84 392 250 -160 -415 -258 28 206 252 147 -63 -322 -309
977 -309 101 447 371 -47 -232 -167 -52 112 300 363 64 -295 -309 43 348 314 103 -59 -158 -177 -49 299 426
1000 426 96 -288 -316 -46 158 197 156 27 -195 -360 -164 204 321 90 -253 -369 -148 -32 79 203 116
1021 116 -200 -446 -266 115 249 70 -129 -228 -272 -174 86 253 212 -126 -375 -221 109 276 162 47 -49 -221
1043 -221 -240 89 387 291 -45 -209 -137 68 184 240 241 59 -180 -260 46 337 295 -2 -139 -50 -102 -1 183
1066 183 292 75 -255 -291 -74 142 168 57 -87 -133 -202 -174 71 282 98 -271 -333 -127 30 32 117 57 -164
1089 -164 -354 -210 103 251 106 -138 -252 -180 -48 81 162 182 -41 -342 -207 180 242 67 -15 -45 -152 -126
1111 -126 112 340 248 -49 -199 -156 84 259 183 94 16 -136 -188 18 355 277 -79 -201 -75 -20 8 137 197
1134 197 15 -208 -206 -46 167 177 7 -165 -132 -88 -78 4 186 74 -247 -287 -59 49 29 8 -8 -133 -259 -116
1158 -116 40 174 88 -134 -252 -101 23 57 75 134 -32 -273 -186 153 260 117 -1 -72 -132 -50 117 231 205
1181 205 26 -185 -128 110 319 156 9 22 -23 -106 -3 303 269 -52 -159 -78 21 90 164 94 -35 -112 -157 -69
1205 -69 132 198 -56 -227 -125 -17 -58 -30 132 19 -229 -258 -18 58 12 -14 -75 -132 -127 -64 18 98 144 -96 -242
1230 -242 -62 109 42 -24 81 77 -152 -173 132 226 79 -8 -47 -66 -3 106 163 127 86 -94 -174 37 260 166 -35
1255 -35 -16 -2 -104 -30 215 225 -41 -171 -103 15 74 100 34 -68 -123 -159 -70 125 163 -18 -226 -153 -3 36 -21
1280 -21 70 31 -206 -224 -66 94 84 -16 -121 -136 -67 -14 18 77 96 -72 -214 -78 127 86 -1 -8 13 -72 -92 75
1306 75 187 106 -57 -99 -8 62 109 91 60 63 -57 -108 15 227 152 -45 -56 2 -13 -17 124 148 5 -138 -126 9
1332 9 124 119 -14 -59 -56 -86 -83 83 166 1 -211 -173 4 42 -31 8 9 -116 -206 -79 57 128 -13 -131 -143 -29 6
1359 6 -20 50 77 -47 -176 -49 143 147 27 -17 -28 -14 -4 80 158 135 -30 -67 -44 111 137 91 56 45 -6 -59 40 181
1387 181 153 -46 -130 20 39 16 43 66 28 -92 -112 -2 98 68 -58 -102 -58 -49 -46 -4 106 -11 -138 -163 -20 81
1413 81 17 -41 -55 -68 -103 -73 26 114 19 -112 -158 -1 67 16 24 52 -10 -90 -48 110 175 52 -64 -6 53 22 54 97
1441 97 136 9 -103 -39 112 134 33 -15 18 -3 -31 9 115 124 -20 -100 -30 60 64 19 22 48 -55 -105 -34 106 56 -49
1469 -49 -128 -24 -9 3 -61 46 28 -118 -150 -56 44 6 -73 -80 -52 -25 -39 -1 88 24 -99 -137 -14 92 21 -37 15
1496 15 23 -36 -67 42 132 58 -57 -23 49 81 3 56 103 46 -49 -4 91 159 68 -12 -21 25 11 31 87 135 31 -87 -60
1525 -60 64 122 -10 -31 23 -41 -87 -62 39 79 -44 -141 -78 6 -8 -45 -7 5 -66 -129 -60 45 29 -47 -82 -39 -17 -23
1553 -23 -3 69 35 -73 -111 -6 109 34 -20 -9 59 23 -14 45 88 86 -12 -52 28 89 61 2 44 37 -28 -59 33 134 37
1582 37 -56 -43 18 2 1 16 59 33 -64 -39 24 78 -1 -86 -49 -18 -52 -65 20 83 -23 -111 -84 34 1 -40 -40 -33 -61 -83 -55
1613 -55 28 76 -36 -105 -72 8 10 -33 26 46 -60 -110 -19 91 43 8 -40 -21 10 0 17 38 48 -11 -65 -31 113 81 -30
1642 -30 1 74 -4 -41 36 146 31 -40 -13 47 56 38 12 5 14 -35 -59 20 87 26 -90 -72 12 -12 -103 -29 45 -35 -103 -47
1672 -47 21 -8 -48 -54 -33 -23 -40 -35 -39 57 -12 -84 -101 24 17 -45 -27 78 -6 -134 -30 75 71 -2 -8 -20 29 58 53 70 59
1703 59 19 -50 -55 117 117 0 -22 64 22 -22 20 108 39 -6 -35 -3 31 36 -15 -27 -14 -16 -57 -71 47 33 -77 -93 10 22
1733 22 -54 -47 33 -19 -101 -40 19 -19 -22 -67 -45 -22 -13 -49 -37 31 36 -52 -57 37 42 -13 -50 66 39 -31 4 15 39 7 -23 11 3
1766 3 25 -2 -19 60 42 -35 -64 64 112 9 -35 19 20 -38 9 64 36 -17 -61 -46 16 54 14 -28 -34 5 -22 -56 62 46
1796 46 -62 -114 -21 27 -18 -53 -12 4 -73 -55 -37 -2 9 -49 -98 -30 42 3 -58 -25 30 -29 -64 15 50 -32 -55 15 48 -10
1826 -10 7 -3 32 69 4 -24 30 72 32 -33 48 52 7 -36 53 105 -6 -4 -2 29 5 14 -2 23 6 -39 -56 29 60 10 -58 -49
1858 -49 5 -53 -59 15 25 -58 -89 -53 13 -5 -56 -51 -34 -41 -45 -56 12 21 -38 -89 -2 33 2 -46 1 25 -6 -53 44 59 13 -3 -12
1891 -12 20 42 19 11 40 25 10 -47 35 66 42 -45 24 49 -16 -38 10 54 15 -25 -11 8 24 -3 -28 26 39 -27 -68 17 36
1922 36 5 -37 -57 23 14 -45 -16 9 -5 -59 -71 -8 9 -25 -33 -19 14 -10 -26 -11 35 -21 -56 -23 39 -2 -24 -33 10 -11 -41 -25
1954 -25 51 51 12 -35 10 53 49 -38 0 33 14 -44 -14 75 34 -16 -7 36 60 9 18 41 52 3 -25 34 50 30 -20 -18 19 -19 -52
1987 -52 -21 39 13 -33 -61 5 47 -61 -42 3 22 -44 -60 -15 -7 -17 -69 -45 -11 -11 -49 -46 10 -11 -47 -38 13 9 -2 -31 11 19 -7
2020 -7 -18 49 63 11 -26 29 62 44 -13 -2 31 29 -18 3 35 61 -4 -19 13 62 28 -30 25 11 -18 -49 -38 35 24 -28 -31 -5
2052 -5 17 -10 -73 -5 30 -23 -54 -16 -3 -11 -60 -3 14 2 -52 -35 50 43 -45 -41 31 32 -9 -41 18 11 -13 -38 19 58 0 -46 2
2085 2 24 21 -25 -6 23 19 -22 4 7 27 -25 -42 35 42 -8 -40 22 53 14 -21 4 39 45 -35 8 12 7 -21 -23 20 30 -27 -46 -5 17
2120 17 0 -70 -27 11 -21 -58 -33 2 -6 -21 -52 -23 -17 -57 -59 -13 26 -19 -72 -46 20 -13 -28 -5 1 -20 -47 -6 7 18 -9 -17 29
2153 29 21 4 -17 23 52 10 -21 33 50 52 -29 21 55 44 7 -10 36 41 -2 1 27 24 4 -13 -17 19 -17 -30 -7 37 -3 -53 -26
2186 -26 14 12 -34 -30 -5 0 -42 -61 -22 -4 -10 -43 -12 -6 -25 -57 -25 9 -11 -46 1 38 28 -37 -6 46 15 1 -3 41 47 -11 -25 -14
2220 -14 33 38 1 -4 29 25 -41 10 43 11 6 -2 47 23 -12 8 26 13 22 -25 17 73 21 -39 -25 25 -3 -68 -55 -1 -25 -52 -32
2253 -32 5 -9 -36 -50 10 19 -21 -6 7 18 10 -39 -27 7 -11 -54 -31 2 -18 -54 -13 24 -9 -7 -9 45 -2 -2 -31 -20 33 38 -16
2286 -16 -26 39 50 -13 -1 14 41 -26 -10 45 37 -17 -29 20 18 34 -8 3 32 21 -31 -30 14 30 -22 -40 36 8 -32 -64 45
2317 45 24 -45 -17 -7 22 -24 -62 -66 -17 -14 -6 -37 -19 -21 -14 -29 -2 31 -44 -69 -18 11 -24 -34 -3 11 -22 -13 1 29 34 -14 4 42
2351 42 58 16 -42 20 60 -16 -21 52 72 -28 -24 3 67 29 5 14 -8 32 -5 -2 36 33 -26 -44 18 10 -27 -71 1 10 -53 -34 -1
2384 -1 17 -23 -55 -24 -6 20 -13 -51 -19 -4 -4 -48 25 7 -5 -34 33 37 28 -39 -1 19 -30 -21 12 2 23 8 -43 19 19 7 -44
2417 -44 0 33 8 -23 13 49 -3 -56 3 69 16 -26 -13 -4 25 -4 0 -25 31 -2 -36 13 26 9 -38 -2 36 -19 -38 -10 7
2448 7 -31 -41 4 15 -1 -11 -57 -13 -15 -11 -48 -46 13 -49 -84 -24 -5 9 -44 -29 11 -7 -17 -26 20 16 -9 -23 22 29 23 -11 -21 36
2482 36 41 -15 37 38 35 8 9 49 14 -32 0 26 48 -2 -11 36 40 16 -17 -6 43 0 -31 -22 21 -28 -38 -64 0 5 -46 -38 -4 15 -26
2517 -26 -42 -28 12 -18 -29 -9 5 -12 -9 -50 12 10 -13 -11 22 -10 -12 -10 38 28 1 -6 11 13 32 -14 11 18 -1 -9 -4 23 36 19 -1
2552 -1 43 21 -14 -19 2 34 -6 -28 6 27 28 6 -29 31 36 -24 -21 12 16 -27 -43 35 12 6 -12 0 32 -17 -46 9 18 -37 -32 -20 27
2587 27 16 -36 -13 24 2 -7 -58 20 10 -6 -37 -1 3 -22 -27 2 15 5 -26 -8 -5 1 -12 -34 38 32 -11 -22 13 15 -5 -23 10 40
2621 40 19 -22 9 21 -4 -3 -8 15 21 17 -12 26 27 -17 0 24 17 -15 -14 32 19 -17 -77 -19 30 1 -23 -15 -23 -30 -79 -54 -15 -5 -22
2656 -22 -49 -3 17 -43 -53 -15 16 -7 -14 14 22 28 -10 7 35 38 -16 -6 3 30 5 12 4 63 -16 -22 17 45 0 -15 10 57 27 1
2690 1 -21 15 -1 -12 -19 2 56 -30 -54 -12 3 -3 -24 5 -2 -18 -75 -13 1 20 -29 -23 15 0 -43 -33 -2 8 -40 -32 7 17 -10
2723 -10 -35 6 7 17 -43 -5 21 -7 -15 -14 -1 2 -13 12 23 34 16 -18 -30 36 -3 -32 -22 30 -8 -11 3 -5 18 -30 -20 22 -12
2756 -12 14 5 -21 -9 -17 5 -4 24 -5 -27 -8 47 -6 -16 2 24 32 -22 -8 22 26 4 -28 -13 -6 -12 -50 -15 23 -12 -58 -24 -18 -8
2790 -8 -31 -26 -25 12 -17 -11 -1 30 10 -22 2 19 6 -32 22 30 45 -22 -5 43 26 -10 23 12 19 0 6 23 24 -15 11 -7 25 -6
2824 -6 -29 8 36 54 -27 -22 -4 6 -26 -19 4 -2 -31 -6 4 -6 -32 -12 -26 8 -10 -35 -31 15 27 -19 -48 0 -3 -6 -12 29 21 -37 -18
2859 -18 -2 5 5 8 14 -17 -6 9 -10 28 34 11 -11 55 20 -21 -8 22 39 -14 9 16 17 -19 -28 10 45 41 3 -60 -30 9 -30 -18 10
2894 10 19 -38 -16 13 23 1 -17 5 23 -7 12 -12 -1 22 -11 -35 2 20 -28 -37 1 -14 -37 -54 0 1 -37 -22 -12 17 -27 -19
2926 -19 0 7 1 -12 -15 9 -14 2 -10 7 39 6 -36 7 26 18 -41 10 20 22 15 -9 13 20 7 -3 22 28 8 -28 -5 15 -3 -40
2960 -40 33 9 19 -21 -16 1 6 -30 -47 7 -23 -29 -35 -23 -16 -30 -51 -32 18 -16 -26 -19 6 -12 -22 -11 3 -21 -17 -14 6 -6 -14 -2 3
2995 3 18 18 13 -1 64 28 -60 7 32 23 -9 -14 -4 12 2 14 43 4 -13 3 30 33 -24 -36 6 14 0 -3 -7 7 -23 -25 -38 26 -20
3030 -20 -21 -18 -3 -9 -3 -9 -8 -34 -26 -28 -19 4 -8 3 -5 28 -6 -25 0 17 7 -9 9 11 5 -2 -1 10 30 -5 -23 13 32 -6 -3 0 38 26
3068 26 -23 -1 43 37 -19 5 36 3 -1 -22 34 11 15 -27 -4 32 39 -12 -2 29 9 9 -7 38 23 -23 -13 16 8 1 -7 -3 10 11 -21
3103 -21 -8 -4 10 -22 -21 -1 -15 -36 -15 3 7 -37 -51 -5 10 -27 -44 -14 9 7 -7 -2 11 -2 -1 5 -8 21 19 6 34 55 9 -16
3137 -16 43 18 23 -4 6 31 25 8 8 20 14 -1 0 18 19 -31 -8 30 7 3 -21 18 13 -10 -32 -21 -1 -15 -47 -47 -3 6 -50 -44 8 -2
3173 -2 -39 -18 -10 -5 -41 -12 -3 22 8 -19 -11 7 10 -13 0 -7 -13 0 2 20 11 23 -2 17 43 20 -29 -13 5 1 -19 -12 -9 -2 -16 -17 14 4
3211 4 -41 -29 -4 16 -2 -8 -13 23 7 -17 -5 16 8 2 6 38 3 12 -9 27 -16 -8 -31 -17 36 -35 -10 -14 20 -8 -15 9 -4 2 14 1
3247 1 -20 1 -19 0 4 -4 -19 -33 16 34 -20 -42 23 -10 -10 -23 -2 11 18 12 8 15 5 -7 58 30 27 16 -6 24 26 2 -6 40 43 3
3283 3 -18 42 10 11 -19 9 17 19 28 -3 -4 -12 -10 -30 -50 23 -26 -28 -41 18 -9 -3 -46 15 6 -5 -44 5 -8 -13 -1 12 1 -24 -25 -2 9
3320 9 -11 -7 -36 55 17 -1 -21 26 5 -7 -10 16 31 -7 20 20 26 1 -18 28 9 10 -7 -22 9 -18 -6 -21 10 10 -12 -32 11 7
3354 7 -24 -22 16 -16 3 -12 -8 -12 -7 -35 -21 7 30 -22 -5 29 -10 -12 -14 -14 19 -19 -6 18 23 -5 -15 18 25 5 -12 -13 -8 -2 -13 1 39
3391 39 18 -12 -9 19 12 -4 -22 24 -13 -20 -1 26 4 20 -25 -22 43 1 -11 -35 49 27 5 -15 23 14 -4 -26 21 -3 -1 -33 -17
3424 -17 17 -2 -32 -28 -3 15 3 -17 11 18 -22 -34 -22 -1 -8 -25 -9 0 -27 -28 -9 -5 12 -14 13 6 2 -6 -22 -5 17 -10 2 20 31
3459 31 -37 10 22 25 3 23 17 12 39 31 11 15 33 -17 -18 18 29 -27 -11 6 5 -24 -26 -1 -5 -1 -28 9 -17 -17 -49 -36 3 -4 -24 -17 16
3496 16 7 -51 -31 -15 -17 3 -26 2 7 -17 -9 -18 -4 -9 -5 6 44 14 6 -21 -2 18 6 -30 4 12 4 -16 12 4 25 -9 3 14 -2 10
3532 10 -40 6 22 -9 -16 21 27 0 -21 -37 19 12 -20 24 8 4 2 6 8 31 -14 19 9 43 24 -12 1 21 -11 -25 -7 -11 -42 -30
3566 -30 -6 7 -16 -43 3 -4 -11 6 -8 -25 -2 -12 -29 -28 -29 -24 -37 2 22 -10 -9 6 6 -14 -4 -24 33 10 -5 24 11 31 -1 -20
3600 -20 -10 32 9 -31 5 36 22 11 30 14 12 -15 -9 28 -17 -15 -14 -33 5 -33 -18 -20 -3 1 -17 -16 -7 -2 -39 -62 1 -31 -17 -36 7
3635 7 1 -12 8 -3 -16 -17 18 4 39 13 -2 16 18 15 18 19 9 13 -19 30 17 11 3 0 37 24 -9 -15 9 9 6 -41 -20 24 0 -36 -31 -7
3673 -7 -39 9 -21 8 -14 -10 -18 -30 8 -21 -10 -8 33 1 -32 -25 14 -2 -5 3 -31 12 -36 -6 -3 14 -4 -22 -5 -7 -18 -44 -26 -15 6
3708 6 -14 1 0 -1 -6 -3 -14 11 -9 -7 10 20 -1 -30 -13 20 6 -36 -12 24 19 1 -14 10 44 1 31 1 6 18 3 11 0 4 -4 -11
3744 -11 32 -26 3 1 25 2 -13 -26 18 7 -31 -11 -10 9 -10 -29 -6 11 -61 -19 12 12 5 -26 8 -12 0 -29 -14 -16 -12 -25 -14
3777 -14 -9 24 -12 -5 7 46 13 -7 15 -2 30 9 6 -17 31 -12 -13 47 -6 2 13 18 20 -20 -18 14 21 -4 -21 2 6 9 -21 -4 27 -1
3813 -1 -9 -29 -14 -11 -19 -33 -22 -32 -24 -37 -5 -18 -9 -36 -2 6 -21 -14 -8 1 25 -18 -2 22 -8 7 -7 1 19 -13 -18 36 -4 11 -2 -2 22
3850 22 27 -17 3 -5 24 -14 -1 10 22 -7 -26 11 21 44 -15 4 2 -7 1 0 9 11 -6 6 -22 -15 8 -4 -6 -7 -2 -21 1 -16 3 -15
3886 -15 3 28 -10 0 -25 -1 8 -17 -40 18 8 -3 -26 -1 -6 10 7 -3 14 0 -25 -33 8 9 -25 1 -1 15 -5 2 26 36 -5 3
3920 3 33 35 25 3 25 2 17 -9 13 41 26 -25 -2 17 4 13 -25 -13 7 -21 -13 19 -1 1 -14 -10 27 -22 -17 -22 9 -15 -50 5
3954 5 -12 -19 -4 -24 7 -11 -33 -17 -22 -24 -35 -12 15 19 -3 6 -5 17 52 -7 -2 43 19 25 -2 -5 10 12 28 -20 21 44 -7 7 3 15
3990 15 9 -10 12 -10 22 -16 22 -13 5 -19 -3 4 -12 -15 -17 -17 -14 -25 -1 32 7 -32 -21 -14 18 7 -8 4 -1 -19 -3 12 -11 -31
4024 -31 -15 -8 4 -8 -14 -17 -11 16 -12 -14 -11 1 -17 -13 15 -10 5 -24 -33 6 5 -7 19 -5 11 9 -10 -11 27 19 -12 -3 -6 -17 -4 37 28 -36
4062 -36 -27 27 37 19 -8 15 12 0 -13 8 23 -4 -39 -6 -1 29 -17 -31 9 29 -48 -16 -15 21 -9 -22 1 -17 -31 -38 -24 -21 -25 -23
4096 -23 -22 9 3 8 -24 -1 -2 3 15 10 10 -8 -20 18 26 20 4 16 19 28 26 -18 -15 18 -7 36 -15 4 23 3 -3 -23 39 -15 -5 24 -29
4133 -29 4 -30 7 7 23 -26 -18 -1 -6 -2 4 9 7 -7 -5 -19 -13 -14 14 2 7 -5 -13 -1 11 27 17 -12 28 27 -5 -18 11 15 -6 -5 29 16
4171 16 -28 -16 2 8 -16 -5 -10 14 16 -13 13 30 -7 1 20 16 3 -23 -15 3 18 0 4 21 -11 -16 -13 5 18 -6 -1 13 1 -23 -23 -13
4207 -13 27 8 0 8 20 -8 -21 -8 0 24 1 -10 -34 -14 -8 -31 -16 19 -8 -5 -35 -46 -30 -31 1 -8 2 -38 11 23 6 -24 1 18
4241 18 7 26 -16 29 4 24 -3 23 35 30 9 6 -7 13 -18 -3 20 -7 29 -10 37 -12 1 -21 4 22 0 5 13 -3 -26 -40
4273 -40 -47 -10 7 8 -43 5 -8 -32 -33 0 -6 -18 -14 -14 13 -36 3 6 5 31 -8 -9 -10 25 19 -10 9 24 21 -5 -17 19 7 17 13 6 15 -26
4311 -26 -2 19 9 -9 -6 -15 3 -14 18 3 -11 7 -12 0 -19 -15 -28 -2 13 -11 -41 -31 -11 -6 8 -3 14 30 2 -14 8 11 14
4344 14 -11 -2 -1 0 -12 -12 26 14 3 -17 22 -7 6 -11 11 -5 22 -15 -6 20 -15 0 7 -3 -9 -2 2 5 12 -4 -2 5 11 16 10 20 5 22
4382 22 21 -3 8 -19 5 3 39 11 7 -8 6 39 -20 19 3 13 -14 -12 3 10 5 19 18 8 12 -11 -6 -21 -16 -51 -15 -26 -13 -29 -6
4417 -6 -2 9 -25 -2 -15 -5 22 -11 -4 20 10 -16 1 7 -2 -9 -8 20 -7 -15 4 17 16 23 -18 13 31 -9 3 -13 5 -5 -26 10 17 -5
4453 -5 -8 9 31 14 20 17 -30 5 -17 -5 -36 1 -16 -16 -12 -4 -6 -36 -11 13 -15 -5 -17 -8 22 0 33 34 45 26 -7 3 37 10 16 -15
4489 -15 4 16 11 15 20 18 -13 -29 28 -7 1 18 -7 5 12 -18 10 23 -5 10 9 9 5 0 8 -2 17 -16 -4 0 -10 -12 4 -3 7 -19 18
4526 18 -19 14 -9 23 5 -1 49 -10 -9 11 5 -21 0 -4 13 -24 -16 -9 0 12 -11 -2 3 -32 -18 -33 -24 11 -28 -18 -2 -5 -20 -19 9 -3
4562 -3 2 2 24 21 36 9 -15 18 23 3 -12 6 34 -16 41 30 -1 -12 -3 2 33 34 7 0 14 -6 0 -19 -11 -36 -22 -1 12 4 -30 -15
4598 -15 -14 -5 -42 1 7 -12 -14 3 1 -30 -5 -25 -31 25 34 2 7 10 15 -3 -19 14 32 -3 -2 29 47 14 -28 18 21 36 -1 -6 17 5 5
4635 5 10 17 41 3 4 24 17 7 5 -5 8 -13 -31 19 16 -10 2 -18 26 4 -7 -7 -8 24 4 -16 -4 15 11 -2 -11 4 -24 6 -5 33
4671 33 -1 29 14 20 6 -11 -14 -1 -2 -11 -9 -14 3 -12 7 -14 7 -12 -2 6 -13 -9 6 -39 18 -11 43 -10 36 17 -8 -10 31 14 -7
4706 -7 21 9 9 17 23 26 49 7 36 22 29 -11 -1 14 3 24 -5 -9 -3 34 13 -4 -16 23 -36 -15 -40 -9 -24 -4 -24 7 -5 -5 -15
4741 -15 5 2 0 -27 -1 -17 11 -8 -14 -1 -21 -9 -15 6 7 -10 17 47 45 14 -14 1 17 0 11 35 36 42 13 35 4 14 6 8 25
4776 25 -21 -18 -7 4 2 -13 -9 -14 10 -17 -15 -11 11 -14 -29 -25 5 10 -15 -21 9 9 -1 8 -3 21 2 13 13 10 8 18 20 26 16 4 -5 -10 3
4815 3 23 10 12 12 1 31 6 19 5 -7 4 4 -10 -18 32 14 22 -14 13 -5 7 8 -8 6 -15 4 15 -8 18 -8 7 7 18 4
4849 4 2 -18 11 18 -6 13 -1 21 25 36 38 42 -13 0 -18 6 18 -26 -1 -2 -8 -8 -2 -23 12 -16 -23 2 -10 -5 -16 -6 -15 -20 -20 -20 -38 11
4887 11 5 -1 -3 -19 -16 1 13 25 18 27 12 21 9 -12 8 15 19 -18 6 20 22 17 -7 19 39 -2 5 8 2 -8 -34 1 9 -21 -25 0 -10 -31
4925 -31 -22 16 7 -18 -51 -36 -12 -21 -16 -23 -1 0 -17 8 21 -2 0 -19 0 20 -6 29 -7 14 -9 6 29 9 8 7 1 19 18 9 3 11 12 -6
4963 -6 -17 -7 -17 2 9 12 19 6 -15 -22 12 5 22 -10 8 -8 -14 -18 9 26 -17 9 4 0 1 -2 -6 -25 22 -11 18 27 22 -2 -17 17 17 18 -16
5002 -16 10 15 -10 -4 16 -14 -2 -10 -8 -4 -22 -19 -11 22 -3 18 -13 -15 1 -17 4 2 15 1 1 20 5 -4 -27 32 18 20 12 2 30 28 15
5039 15 0 2 8 -5 -3 38 -9 11 17 0 -5 -5 -9 17 7 -3 -4 0 8 -5 -18 -23 0 -40 -27 -12 3 21 -1 -38 -6 26 -22 8 14 2
5075 2 24 -15 -35 22 -8 2 25 22 2 -3 43 -2 17 11 22 30 44 -6 12 6 25 42 -5 23 27 24 -12 -3 -8 1 -9 -19 -17 2 7 -26 -18
5112 -18 -4 -13 1 36 6 -23 -7 13 -4 35 -4 2 12 23 -13 -3 -4 -1 -1 -16 14 11 -3 -43 7 4 23 -16 -6 -23 -18 -1 26 -8
5146 -8 6 -19 8 27 1 8 -9 -15 -4 9 -10 4 -2 22 -25 -25 57 -6 -15 -20 17 0 22 9 -9 21 18 11 9 14 20 -17 22 -2 4 4 -15
5183 -15 9 6 16 -18 5 15 -11 -6 3 -11 -4 12 15 -3 6 -23 -21 -17 -9 -6 -31 -19 10 -21 13 -7 12 -23 5 -2 27 -3 6 -24 -16 41 4
5220 4 12 4 15 14 10 29 29 -21 7 -2 21 -8 17 -20 6 3 5 -27 8 12 15 -11 -35 8 -19 -2 23 7 -24 17 -10 -22 -11 -13 -16 2 -16
5257 -16 -1 4 21 31 20 29 -17 -9 19 -8 10 11 10 21 -1 16 -6 -1 -13 -1 -7 -14 12 25 6 2 21 7 18 15 -13 -14 -4 -7 -7 8 -9
5294 -9 -38 0 4 4 16 -20 -23 -1 -18 28 7 -7 24 -12 12 2 8 6 -31 13 8 9 5 -14 35 9 -10 -13 -7 -24 1 -6 28 25 -18 -18 -5
5331 -5 6 -2 -12 -23 22 2 -8 3 2 -11 11 -2 6 -1 10 -20 -17 17 25 -3 -12 23 4 13 12 17 7 -14 32 0 22 10 3 -17 16 -9
5367 -9 -7 15 14 -3 0 -21 -11 -1 8 -16 13 -11 -21 -4 -11 11 -24 -12 -9 -5 -16 -20 17 -10 -14 4 -2 -9 -10 -27 -24 -4 -24 -4 -41 17 -2
5404 -2 -18 3 -10 -3 -4 7 23 10 1 20 8 30 15 35 1 -24 11 -18 -21 -7 4 -1 -31 9 8 -14 -9 -7 1 4 -14 -34 10 -4 -20 -16
5440 -16 -8 -7 -9 -6 -5 -1 -20 4 -6 12 16 18 -22 15 17 -3 -17 -9 -22 -33 31 -22 -29 6 9 11 -8 2 -19 -13 24 -18 7 0 -27 23 16 -8
5478 -8 45 -15 -2 -10 22 -12 -23 21 9 -12 0 -27 20 -6 31 28 -1 13 11 12 9 10 21 -6 6 20 9 6 -7 30 -9 1 -5 22 16
5513 16 -3 -36 -13 -4 -7 -13 -2 -18 -21 -15 -11 -17 -2 -20 -22 12 0 -24 1 1 -12 -25 -3 19 2 -5 -13 -3 -12 19 31 18 3 13 22 -20 3
5550 3 20 12 17 13 -19 -9 27 24 17 11 19 -31 5 10 7 -2 18 11 12 -22 -13 -2 -29 6 -7 3 -32 -2 4 6 -20 13 -19 -5 25 10 0 17
5588 17 -25 13 18 -30 -18 5 -7 -9 39 -23 -4 4 22 -1 5 -37 11 23 2 -14 10 -2 -5 -20 18 23 3 6 21 12 -22 -9 7 9 -7
5623 -7 -11 -18 -2 -13 -2 -6 -15 -9 -18 -17 -3 22 17 -14 -13 11 24 -19 -23 -2 3 -19 -5 8 7 -20 30 -6 -20 -14 -1 11 -12 -14 -17 -5 -13 12 -18
5662 -18 -17 -8 4 -9 -20 0 -18 -11 8 -16 11 24 7 -11 -15 -4 2 -9 -25 9 -1 2 -22 -3 5 7 17 -18 25 -4 14 23 5 -7 6
5697 6 8 14 10 -4 4 34 -27 -16 2 12 13 9 -6 6 4 -27 -31 -17 1 -30 -41 -41 -9 17 -5 9 14 -2 -11 -4 27 -16 15 12 18 -12 14 -2
5735 -2 -12 31 -9 -16 28 1 -17 -10 16 15 -10 8 -1 -22 19 7 -23 18 -8 7 -4 -1 -19 7 4 -23 37 -24 -33 9 -10 -32 18 5
5769 5 19 20 -14 -5 -1 11 -6 -13 -26 -5 6 20 3 7 3 -17 3 2 -29 -34 -29 -5 -4 -24 8 0 -8 -3 -18 -12 3 -12 -8 -5 8 10 -32 -25 2 -7
5809 -7 -27 -19 8 0 -19 -12 15 -18 16 11 15 11 22 -2 5 -7 -20 -9 7 1 -15 -16 1 9 -30 31 -6 -2 11 12 5 33 -5 13 -2 13 8 -18
5847 -18 -25 2 -25 -22 -13 14 -4 -1 -32 -24 9 -10 -14 4 -16 10 18 18 3 -8 8 -9 6 4 8 23 6 6 -5 13 6 5 24 -1 9 35 12
5884 12 18 -12 -7 26 -10 -3 -7 -21 -11 -21 7 -18 5 -33 -6 -18 -21 4 -19 8 -18 8 -32 23 19 -22 2 -21 4 -8 2 -1 18 -2
5918 -2 3 7 30 10 19 -16 25 16 16 9 -17 1 -7 -10 -10 -4 -8 -15 -17 -7 -6 -3 1 11 -24 -5 0 8 -11 6 -16 -5 4 -13 5 -27 27 8 -37 0
5958 0 5 0 23 2 11 21 -5 -7 5 -3 -5 17 7 4 -9 2 3 9 -8 -21 -1 4 -4 -28 -19 -11 -23 -7 3 -17 23 -29 -10 6 -11 -20 -1 -13
5996 -13 30 -21 16 -27 -2 26 0 7 19 16 -3 6 9 2 -8 -4 6 15 1 3 3 0 31 0 20 -14 3 3 2 -17 12 -3 -9 -1 9 -5 -20
6033 -20 -17 -35 -36 -23 -18 -7 -12 -37 -18 -15 -6 -27 -30 -4 15 -13 -19 -7 26 -36 -5 7 -3 12 7 31 -3 -14 0 19 8 18 -5 -18 12
6068 12 -7 1 -15 17 -11 30 15 5 8 -37 12 -7 -22 -32 -3 -16 29 10 -10 -28 -33 -21 -10 -24 32 -7 7 -10 -10 -2 -26 -13 -2
6101 -2 11 7 -23 16 -20 14 21 -12 10 -10 -2 6 -10 3 6 -16 8 -19 5 6 1 -8 -17 -1 -32 -16 -2 7 -12 -26 -24 3 -27 -12 -16 3 -4
6138 -4 0 -10 32 -14 8 18 22 39 -17 7 19 3 8 13 -17 -18 8 5 -12 22 -4 21 3 5 2 -38 -5 4 -2 28 5 -22 2 -18 -21 -14 -27
6175 -27 -42 -22 -10 -16 5 -32 -21 9 -16 -10 13 -1 -21 32 -2 38 10 -3 13 11 19 -12 -19 33 -1 8 -10 -8 0 -7 21 15 9 3 13 16 2
6212 2 16 9 32 12 -3 -22 -19 1 -9 -15 -26 -3 -37 -6 -12 -6 -33 -18 7 -38 -24 -3 -6 -32 13 20 2 -12 -1 -16 8 -4 25 6
6246 6 4 21 -6 31 15 9 14 -18 -3 0 -20 3 21 1 -23 -7 0 2 -4 -42 1 -9 -8 -2 -6 -4 -14 -4 9 1 -6 -11 -13 -10 -2 -28 6 0 22 19
6286 19 5 20 1 -8 -27 2 6 -11 -1 -24 -7 13 -3 5 11 -4 -22 -1 2 -8 1 -17 -19 -12 -7 -9 -24 -33 -27 -19 -3 5 -1 -19 1 11 -3 -11
6324 -11 10 7 -30 -1 -13 12 30 14 20 0 -10 -37 -22 4 24 20 -9 -1 21 -2 6 -7 1 32 3 -26 -12 -22 -2 -15 -5 2 -37 -10
6358 -10 -42 -8 -17 -8 -1 -30 3 -3 -9 3 -22 -10 -26 7 -12 7 -20 23 -10 -20 -16 16 23 -12 -17 9 24 -5 -7 1 1 3 6 15 25 -11 -8 7
6396 7 -7 -14 12 -18 -20 -13 0 13 -6 23 -30 -15 -3 -30 15 -2 23 -16 -27 -11 14 6 10 3 -19 -17 -30 -15 9 19 -35 -10 -28 13
6430 13 22 25 -3 11 -7 2 -20 2 -10 -10 1 -16 -3 -27 -3 -17 7 -23 -14 1 7 -37 -8 -20 6 -26 -8 10 -7 -2 6 -2 18 -5 9
6465 9 8 9 -3 7 3 -15 -1 -13 -2 -11 20 8 -1 -4 23 1 -1 16 -1 -1 9 15 -1 -7 13 -16 -29 -1 -10 -43 1 -23 10 -9 -7 -23 -19
6502 -19 -10 -35 3 -3 -10 5 -4 18 9 22 -2 -29 6 7 -3 9 19 34 8 -15 0 5 3 -13 27 -3 -10 16 -12 7 6 12 -1 18 3 -4
6538 -4 12 7 -14 1 -1 -18 -32 3 -19 -16 0 -12 1 -6 10 -17 -23 -3 6 16 12 -15 5 -21 3 10 16 9 16 11 15 19 8 -8 -10 -29 -1 -16
6576 -16 -25 19 12 0 2 19 -1 -33 0 -1 14 20 -35 12 11 -1 0 2 -17 11 18 -16 -15 -16 -7 -39 4 9 11 -11 -11 -7 9 -4 0 35 4 1 4 12
6616 12 1 -2 -2 5 17 12 6 10 13 -27 -8 -2 -6 13 -4 -23 -3 -9 -8 28 -9 7 17 -10 -20 4 -3 1 6 22 -14 -33 -7 4 18 2 1 10
6654 10 21 -3 20 18 16 22 -3 3 12 -1 5 6 21 -11 -4 37 0 11 -3 18 -5 -20 -26 -35 -26 19 -33 1 -9 10 -26 -26 -24 9 -26 -18 -15 -1
6692 -1 -23 5 -37 11 -5 18 -18 -1 8 -24 6 2 -9 -9 9 -2 13 16 2 -20 4 -9 -2 13 1 19 38 6 22 3 30 1 -11
6725 -11 14 4 -14 7 7 5 35 8 1 -4 -20 -9 -35 -12 -35 -13 -5 14 4 -10 0 -12 7 -1 -21 6 8 7 1 19 22 8 12 1 15 28
6761 28 -7 6 -20 -2 -6 13 1 -22 -9 -11 -3 -11 -3 -12 -7 5 -8 -18 22 -7 0 7 3 -19 -37 -1 1 -24 12 -8 -24 12 -2 25 0 -34
6797 -34 22 17 36 10 27 27 29 3 -2 9 20 17 17 -1 13 -6 3 -1 -4 -9 -5 -12 -22 -34 -14 -32 -20 -14 -12 23 -12 -7 -15 2 -3 3 1 3 -17 -13 -44
6838 -44 29 6 -7 -11 -22 -13 -10 -5 4 34 3 0 7 -6 -25 -10 30 -3 10 20 -26 1 14 -7 -26 12 4 -16 -16 -24 -10 -28 -14 -38 -1
6873 -1 -32 -35 -45 -17 10 -15 -19 -1 9 24 -9 11 -9 9 13 -13 0 -1 3 -18 -17 -16 31 -20 21 25 -4 -8 9 1 -9 -7 -6 11 8 -16 -17 -9
6911 -9 1 -16 -29 -5 -12 -21 -28 -8 -4 -19 -19 -25 -28 -27 3 -27 -6 -23 -21 -1 11 21 -1 4 26 -17 -11 13 31 12 -3 -13 17 3 13 -32
6947 -32 -9 12 12 -15 -43 0 6 -9 3 -5 -14 1 -14 -3 -24 -8 -4 5 -47 -43 -13 -13 -12 3 1 -4 -9 -3 0 7 17 -3 3 5 26 -28 9 15 -24
6986 -24 3 24 0 37 30 24 22 2 1 2 -25 8 -6 2 8 -4 -7 5 -15 -33 -14 12 -29 -52 -12 -17 8 -8 6 -9 18 -5 -29 -4 19
7021 19 -25 -3 -8 -18 -20 -18 -32 -11 17 -2 -4 12 10 -12 4 18 -18 30 -14 9 13 2 -11 0 30 1 2 -12 -35 2 1 -7 -2 -10 -28 13
7057 13 -16 -27 -18 -17 -7 -21 -9 -14 10 8 -14 2 -14 -19 -3 -2 -27 34 12 -4 -9 5 -13 -18 15 2 5 13 7 -1 2 -21 -21 -3 2 -27 -8 0
7095 0 18 -32 4 10 -1 1 -23 8 -15 -12 -18 0 -4 1 -16 31 7 4 6 2 5 -2 13 10 -5 21 7 -31 1 36 23 -5 12 27 16 -9 31
7132 31 28 41 11 -7 -6 -11 10 -40 -16 13 -8 -17 30 9 1 -19 -16 -20 -9 -8 -23 -13 -24 -21 -2 -11 15 4 -39 -9 -4 1 9 -12 -26 18 -22
7169 -22 2 11 10 2 31 38 -4 17 0 -10 20 -2 5 -23 21 -23 -10 -8 -17 -7 8 4 2 -15 -26 -3 13 -19 4 -22 -2 -14 -4 -5 -4 1
7205 1 0 -44 -18 0 -17 -4 -29 -3 -11 -12 18 16 3 16 -11 11 -14 15 23 -9 -18 -9 14 3 1 9 -8 22 -18 -6 -5 -21 -16 -4 -29 -20 11
7242 11 -7 -19 -6 3 0 -38 9 -10 6 -17 7 4 0 20 -12 -1 4 20 -1 5 0 9 17 -26 -15 -12 26 19 7 15 15 -21 0 -10 -4 11 -35
7279 -35 -8 0 16 -4 -17 -3 -8 -24 -24 -16 13 -47 -21 -7 -3 -23 -2 -16 6 -20 -2 2 -2 2 30 -15 -18 -3 0 19 31 6 11 -5 17 3
7315 3 -13 -4 10 15 5 0 14 -8 -15 10 2 9 -12 -2 29 24 -24 1 -8 11 -6 -17 7 -11 -6 -5 1 26 -3 17 2 4 -22 7 9 -12 8
7352 8 -1 -10 -2 1 -21 38 -1 -10 11 11 9 -23 -14 -10 -29 1 -1 -8 -10 24 -6 -6 15 -27 -42 -14 19 -16 -21 1 -11 -13 25 -7 9 -22 -24 -16 12
7391 12 2 -18 7 5 -16 -15 -9 -4 42 -18 1 26 5 5 -14 20 6 2 0 -18 15 -24 -1 7 19 -2 -8 -13 -26 -30 -12 -1 1 -29 -13 20
7427 20 -20 20 -24 2 -2 -11 -6 3 4 -19 -15 1 28 -19 10 -3 0 16 17 21 14 14 11 3 20 9 24 8 -13 16 -23 20 -20 6 13 -21 -12 4
7465 4 11 -20 -4 -9 -30 -12 -24 -34 2 4 -8 -6 -10 -20 1 4 16 -20 18 -2 -15 9 9 6 1 28 -12 21 16 29 13 6 -9 20 24 -12 24
7502 24 21 31 -17 21 7 -2 -20 -4 -16 24 -1 0 11 15 -32 -4 -18 -2 18 5 15 -4 0 -8 14 16 -22 -14 -20 5 0 -23 -7 -15 -7 -25
7538 -25 3 12 -1 -24 19 3 12 16 26 3 -20 -12 -6 -15 1 24 -1 21 -15 -6 -12 -4 -3 6 3 -12 -18 -31 9 6 -6 5 9 4 18 -3 5 22 6
7577 6 -12 0 28 20 7 -4 -14 4 -9 10 15 18 -5 -3 9 -5 5 -9 13 28 -2 -16 11 26 9 15 -1 -10 6 -13 -6 -15 -7 0 -15 -3
7613 -3 -13 15 -13 0 -6 -19 -10 -18 4 14 -23 -9 -21 1 -5 -6 -29 10 0 12 -8 6 23 6 10 15 -18 -29 -5 26 4 2 -7 1 -12 0
7649 0 -8 -18 -10 -8 -12 -25 -19 -16 -35 -22 -5 -16 -1 0 -12 -13 -17 -50 -7 -23 2 -9 10 2 6 3 8 -9 25 16 -2 12 15 -11 15 -6 21 17 -2
7688 -2 -15 2 9 7 -14 12 13 -4 -23 -40 -10 -2 -35 -17 -13 14 -18 -16 -5 10 6 -21 -14 24 -21 2 -7 -17 8 5 27 5 -7 -1 -15 2
7724 2 -8 -4 14 13 9 -5 10 -15 -12 -8 -6 11 8 -1 0 -21 17 -9 -4 -21 16 -6 -20 -33 -4 -6 -15 18 -21 3 -17 -16 -24 14 0 -15 -4 2
7762 2 -4 14 29 18 -4 18 2 13 -4 28 21 21 -2 0 -15 1 -8 8 25 16 7 -21 32 -1 1 -21 6 3 -1 -18 5 -9 -26 -14 -2 13
7798 13 -5 6 -19 7 7 -6 -21 3 -9 -20 -2 -24 11 16 27 25 -6 16 2 5 25 14 -17 -16 -11 -4 17 -31 9 6 -10 -23 23 9
7832 9 -18 -8 7 1 -1 -5 -10 2 -10 13 -9 -8 4 -3 -5 -28 4 21 -15 -40 -12 -30 3 17 -16 -42 -21 2 8 -30 -38 -20 -5 0 6 7 12
7869 12 -10 6 -8 -11 17 32 9 1 -8 4 -24 3 -25 -7 -2 -24 -32 -8 -18 -13 -15 -17 -13 -26 -20 -5 -2 -22 -27 -9 -16 -2 -22 5 12 7 5 4 2
7908 2 29 38 3 23 -19 -14 -13 5 0 -2 -17 33 3 -19 -15 -6 -22 14 18 11 -25 -15 -17 -14 -13 -6 -9 -19 -26 -11 -40 -9 -29 -41 14 2 -15 3
7946 3 -21 11 19 2 23 -1 -7 -9 4 1 -3 0 15 13 18 14 1 36 -9 -2 25 4 7 26 -3 12 -52 -13 24 -14 -20 -16 -12 -23 -20 8 -44 -49 16
7985 16 -25 -37 39 -16 8 -20 29 -11 19 1 19 15 -36 3 -18 -4 13 -10 -16 -5 8 16 4 13 -11 -13 7 14 13 16 -4 1 -9 11 10
8020 10 -15 -31 -29 0 -17 0 -17 17 14 0 -4 -4 -6 -7 -2 -30 6 -5 -1 -1 -19 9 4 -4 11 -13 4 24 6 -2 16 -3 -2 32 -19 -2 13
8057 13 29 -23 -10 -15 3 -16 -4 9 -20 -27 30 24 -37 9 -2 10 -25 -17 -20 12 0 -22 -15 -2 -45 -4 -18 -2 2 6 -33 -24 11 9 21
8092 21 -3 -12 -20 20 -20 9 16 -12 4 -1 23 4 -5 30 -10 -19 -24 12 23 -10 -4 -21 5 15 -19 -21 -12 5 -25 -21 2 -11 -18 -14 -30 -11 2
8129 2 -17 15 -15 -7 -11 -29 -6 1 -9 -33 4 -3 -3 -1 -2 -7 6 5 -11 12 6 7 -8 24 -2 -14 0 -5 -8 -6 6 -24 -28 7 -12 -31 -3 -24
8167 -24 -25 -24 -6 -15 -22 24 15 -6 -17 -24 -12 4 -28 0 -11 -9 -7 0 3 13 7 -13 17 2
8191B
##END NTUPLES=NMR FID
##END=
