##TITLE=1H_SR70_vak
 d2O,8 sc, 
 29.9.2021
##JCAMPDX= 6.0         $$ Bruker NMR JCAMP-DX V2.0
##DATA TYPE= NMR FID
##DATA CLASS= NTUPLES
##ORIGIN= UXNMR, Bruker Analytische Messtechnik GmbH
##OWNER= root
$$ XWIN-NMR		Version 3.5
$$ Wed Sep 29 12:43:10 2021 Russian Standard Time (UT+4h)  she@DPX200
##.OBSERVE FREQUENCY= 200.1314
##.OBSERVE NUCLEUS= ^1H
##.DELAY= (6, 6)
##.ACQUISITION MODE= SIMULTANEOUS
##.ACQUISITION SCHEME= undefined
##.AVERAGES= 8
##.DIGITISER RES= 18
##SPECTROMETER/DATA SYSTEM= spect
##.PULSE SEQUENCE= zg30
##.SOLVENT NAME= CDCl3
##.SHIFT REFERENCE= (INTERNAL, CDCl3, 0, 15.7039)
##AUDIT TRAIL= $$ (NUMBER, WHEN, WHO, WHERE, WHAT)
$$ ##TITLE= Audit trail, XWIN-NMR		Version 3.5
$$ ##JCAMPDX= 5.01
$$ ##ORIGIN= Bruker BioSpin GmbH
$$ ##OWNER= she
$$ F:/spectra/data/she/nmr/H-F/1/audita.txt
$$ ##AUDIT TRAIL=  $$ (NUMBER, WHEN, WHO, WHERE, WHAT)
(   1,<2021-09-29 12:41:47.10 +0400>,<she>,<DPX200>,
      <created by zg, POWCHK disabled, PULCHK disabled
       configuration hash MD5:
       00 E9 B6 7A A2 85 ED C7 34 08 36 98 17 FE 4E 26
       data hash MD5: 16K
       C8 57 37 1B 87 AE 1B 0F 2B 6B 2C B0 45 89 60 3B>)
$$ ##END=
$$ 
$$ hash MD5
$$ F0 7C 59 D7 80 01 92 B8 2B 24 4D C3 F4 01 28 C1
##$RELAX= 
##$RELAX= 
##$RELAX= 
##$RELAX= 
##$RELAX= 
##$RELAX= 
$$ Bruker specific parameters
$$ --------------------------
##$DU= <F:/spectra>
##$EXPNO= 1
##$NAME= <H-F>
##$PROCNO= 1
##$TYPE= <nmr>
##$USER= <she>
##$AMP= (0..31)
100 100 100 100 100 100 100 100 100 100 100 100 100 100 100 100 100 100 
100 100 100 100 100 100 100 100 100 100 100 100 100 100 
##$AQSEQ= 0
##$AQ_mod= 1
##$AUNM= <au_zg>
##$AUTOPOS= <>
##$BF1= 200.13
##$BF2= 200.13
##$BF3= 200.13
##$BF4= 200.13
##$BF5= 200.13
##$BF6= 200.13
##$BF7= 200.13
##$BF8= 200.13
##$BYTORDA= 1
##$CFDGTYP= 0
##$CFRGTYP= 5
##$CHEMSTR= <none>
##$CNST= (0..31)
1 1 145 1 1 1 1 1 1 1 1 1 1 1 1 1 1 1 1 1 1 1 1 1 1 1 1 1 1 1 1 1 
##$CPDPRG= <>
##$CPDPRG1= <>
##$CPDPRG2= <>
##$CPDPRG3= <>
##$CPDPRG4= <mlev>
##$CPDPRG5= <mlev>
##$CPDPRG6= <mlev>
##$CPDPRG7= <mlev>
##$CPDPRG8= <mlev>
##$CPDPRGB= <>
##$CPDPRGT= <>
##$D= (0..31)
0 1.2 0 0 0 0 0 0 0 0.06 0 0.03 0 0 0 0 0.0002 0 0 0 0 0 0 0 0 0 0 0 0 
0 0 0 
##$DATE= 1632904906
##$DBL= (0..7)
120 120 120 120 120 120 120 120 
##$DBP= (0..7)
150 150 150 150 150 150 150 150 
##$DBP07= 0
##$DBPNAM0= <>
##$DBPNAM1= <>
##$DBPNAM2= <>
##$DBPNAM3= <>
##$DBPNAM4= <>
##$DBPNAM5= <>
##$DBPNAM6= <>
##$DBPNAM7= <>
##$DBPOAL= (0..7)
0.5 0.5 0.5 0.5 0.5 0.5 0.5 0.5 
##$DBPOFFS= (0..7)
0 0 0 0 0 0 0 0 
##$DE= 6
##$DECBNUC= <off>
##$DECIM= 32
##$DECNUC= <off>
##$DECSTAT= 4
##$DIGMOD= 1
##$DIGTYP= 9
##$DL= (0..7)
0 120 120 120 120 120 120 120 
##$DP= (0..7)
150 150 150 150 150 150 150 150 
##$DP07= 0
##$DPNAME0= <>
##$DPNAME1= <>
##$DPNAME2= <>
##$DPNAME3= <>
##$DPNAME4= <>
##$DPNAME5= <>
##$DPNAME6= <>
##$DPNAME7= <>
##$DPOAL= (0..7)
0.5 0.5 0.5 0.5 0.5 0.5 0.5 0.5 
##$DPOFFS= (0..7)
0 0 0 0 0 0 0 0 
##$DQDMODE= 0
##$DR= 18
##$DS= 0
##$DSLIST= <SSSSSSSSSSSSSSS>
$$ [...]
##$SUBNAM2= <"">
##$SUBNAM3= <"">
##$SUBNAM4= <"">
##$SUBNAM5= <"">
##$SUBNAM6= <"">
##$SUBNAM7= <"">
##$SUBNAM8= <"">
##$SUBNAM9= <"">
##$SW= 16.9725446903124
##$SWIBOX= (0..15)
0 0 2 0 0 0 0 0 0 0 0 0 0 0 0 0 
##$SW_h= 3396.73913043478
##$TD= 16384
##$TD0= 1
##$TE= 0
##$TE2= 300
##$TE3= 300
##$TEG= 300
##$TL= (0..7)
0 120 120 120 120 120 120 120 
##$TP= (0..7)
150 150 150 150 150 150 150 150 
##$TP07= 0
##$TPNAME0= <>
##$TPNAME1= <>
##$TPNAME2= <>
##$TPNAME3= <>
##$TPNAME4= <>
##$TPNAME5= <>
##$TPNAME6= <>
##$TPNAME7= <>
##$TPOAL= (0..7)
0.5 0.5 0.5 0.5 0.5 0.5 0.5 0.5 
##$TPOFFS= (0..7)
0 0 0 0 0 0 0 0 
##$TUNHIN= 0
##$TUNHOUT= 0
##$TUNXOUT= 0
##$USERA1= <user>
##$USERA2= <user>
##$USERA3= <user>
##$USERA4= <user>
##$USERA5= <user>
##$V9= 5
##$VALIST= <valist>
##$VCLIST= <CCCCCCCCCCCCCCC>
##$VD= 0
##$VDLIST= <DDDDDDDDDDDDDDD>
##$VPLIST= <PPPPPPPPPPPPPPP>
##$VTLIST= <TTTTTTTTTTTTTTT>
##$WBST= 1024
##$WBSW= 4
##$XGAIN= (0..3)
0 0 0 0 
##$XL= 0
##$YL= 0
##$YMAX_a= 190589
##$YMIN_a= -306918
##$ZGOPTNS= <>
##$ZL1= 120
##$ZL2= 120
##$ZL3= 120
##$ZL4= 120
##$ABSF1= 10
##$ABSF2= 0
##$ABSG= 5
##$ABSL= 3
##$ALPHA= 0
##$AQORDER= 0
##$ASSFAC= 0
##$ASSFACI= 0
##$ASSFACX= 0
##$ASSWID= 0
##$AUNMP= <proc_1d>
##$AZFE= 0.1
##$AZFW= 0.1
##$BCFW= 1
##$BC_mod= 2
##$BYTORDP= 1
##$COROFFS= 0
##$CY= 11.3945322036743
##$DATMOD= 1
##$DC= 2
##$DFILT= <>
##$DTYPP= 0
##$F1P= 2.36226072786647
##$F2P= -0.459571619588291
##$FCOR= 0.5
##$FTSIZE= 0
##$FT_mod= 4
##$GAMMA= 1
##$GB= 0.15
##$INTBC= 1
##$INTSCL= 1
##$ISEN= 128
##$LB= 0.24
##$LEV0= 0
##$LPBIN= 0
##$MAXI= 10000
##$MC2= 0
##$MEAN= 0
##$ME_mod= 0
##$MI= 1.114404
##$NCOEF= 0
##$NC_proc= 0
##$NLEV= 6
##$NOISF1= 3.799351
##$NOISF2= 2.8
##$NSP= 1
##$NTH_PI= 0
##$NZP= 0
##$OFFSET= 15.70392
##$PC= 1
##$PHC0= -14081.66
##$PHC1= 13.80088
##$PH_mod= 1
##$PKNL= yes
##$PPARMOD= 0
##$PSCAL= 0
##$PSIGN= 0
##$REVERSE= no
##$SF= 200.130013532006
##$SI= 16384
##$SIGF1= 3
##$SIGF2= 2
##$SINO= 400
##$SIOLD= 16384
##$SREGLST= <1H.CDCl3>
##$SSB= 0
##$STSI= 0
##$STSR= 0
##$SW_p= 3612.71676300578
##$SYMM= 0
##$S_DEV= 0
##$TDeff= 0
##$TDoff= 0
##$TI= <>
##$TILT= no
##$TM1= 0
##$TM2= 0
##$TOPLEV= 0
##$USERP1= <user>
##$USERP2= <user>
##$USERP3= <user>
##$USERP4= <user>
##$USERP5= <user>
##$WDW= 1
##$XDIM= 8192
##$YMAX_p= 0
##$YMIN_p= 0
$$ End of Bruker specific parameters
$$ ---------------------------------
##NTUPLES= NMR FID
##VAR_NAME=  TIME,          FID/REAL,        FID/IMAG
##SYMBOL=    X,             R,               I
##VAR_TYPE=  INDEPENDENT,   DEPENDENT,       DEPENDENT
##VAR_FORM=  AFFN,          ASDF,            ASDF
##VAR_DIM=   8192,          8192,            8192
##UNITS=     SECONDS,       ARBITRARY UNITS, ARBITRARY UNITS
##FACTOR=    0.0002944,     1,               1
##FIRST=     0,             0,               0
##LAST=      2.4114304,     0,               0
##MIN=       0,             -306918,         0
##MAX=       2.4114304,     190589,          0
$$ Real data points
##PAGE= N=1
##DATA TABLE= (X++(R..R)), XYDATA
$$ plain form
0 0 0 0 0 0 0 0 0 0 0 0 0 0 -8 8 -8 8 -16 16 -21 24 -32 32 -40 48 -56 65 -80 88 -104 120 -136 157 -177 201
34 201 -227 257 -288 322 -360 402 -447 496 -551 610 -678 748 -824 910 -1003 1104 -1216 1341
52 1341 -1478 1629 -1800 1993 -2212 2462 -2753 3094 -3503 4004 -4631 5446 -6550 8141 -10646
67 -10646 15194 -26131 113938 9227 -229250 -124007 -59710 14717 78147 133049 102802
78 102802 4546 -130280 -169998 -100527 77201 190589 143516 10598 -117169 -178359 -68975
89 -68975 51238 68166 97609 122576 5707 -145233 -176756 -58292 99356 156148 105745
100 105745 7465 -109607 -140589 -62856 22580 82796 113950 82676 -4260 -126785 -171221
111 -171221 -39021 112054 127816 75055 3461 -75267 -113426 -91744 4976 121446 127245
$$ packed form
0@%%%%%%%%%%%%qJ6j6J6k4L2l7M5n6O4p2Q8j04J21j45J68j92K24k56K93l34L78
34B01m28M84n45O10o82P62q49R43j047J161j288J426j572J734j913K107k320K557
52A341k819L107l429L793m205M674n215N847o597P507q635J0077j1996J4691j8787
67a0646K5840m1325J40069j04711k38477J05243O4297P4427O3430N4902l0247
78A02802r8256j34826l9718O9471J77728J13388m7073j32918j27767o1190J09384
89f8975J20213J6928K9443K4967j16869j50940l1523J18464J57648N6792n0403
100A05745r8280j17072l0982P7733Q5436O0216L1154l1274q6936j22525m4436
111a71221J32200J51075J5762n2761p1594p8728l8159K1682R6720J16470N799
$$ plain form
122 127245 37740 -44653 -97404 -107682 -51821 59866 148785 101499 -30295 -91555 -89583 -67519
134 -67519 11938 98215 107512 46386 -43923 -103004 -94458 -35140 59586 129543 93337 -17110
146 -17110 -103522 -103716 -32114 31009 64078 90890 59622 -39734 -109054 -94296 -18348 71536
158 71536 111834 74915 -18615 -99733 -92345 -22407 29256 59347 79576 56465 -24826 -112721
170 -112721 -110039 -784 95988 97594 40863 -24133 -69680 -76987 -41611 24132 77285 80269
182 80269 38421 -35397 -104542 -92760 3092 90497 94663 29660 -31413 -54908 -64817 -49189
194 -49189 16414 84612 90841 25428 -59569 -95672 -64722 6304 74886 86917 33829 -28601
206 -28601 -61031 -64217 -37831 17575 79240 90497 19780 -68336 -92017 -49478 15058 63649
$$ packed form
122A27245q9505q2393n2751j0278N5861J11687Q8919m7286j31794o1260J972K2064
134f7519P9457Q6277R297o1126r0309n9081Q546N9318R4726O9957l6206j10447
146a7110q6412j94P1602O3123L3069K6812l1268r9356o9320J4758P5948Q9884
158G1536M0298l6919r3530q1118P388O9938N1663L0091K0229k3111q1291q7895
170a12721K682J09255R6772J606n6731o4996m5547p307L5376O5743N3153K984
182H0269m1848p3818o9145J1782R5852Q7405M166o5003o1073k3495r909J5628
194d9189O5603O8198O229o5413q4997l6103L0950P1026O8582J2031n3088o2430
206b8601l2430l186K6386N5406O1665J1257p0717q8116k3681M2539O4536M8591
$$ plain form
218 63649 73011 39819 -21374 -70487 -69214 -26225 28883 74424 75767 16584 -61126 -91439 -47997
231 -47997 23338 64293 64250 34033 -19657 -66381 -69787 -25691 38083 76472 63395 8700 -55624
244 -55624 -84868 -48756 23875 70138 62371 21115 -21979 -56772 -67618 -27956 40960 79410
256 79410 59508 -118 -59813 -76963 -38842 23005 64574 61231 21269 -26646 -59255 -59966 -22880
269 -22880 37288 79184 61094 -8702 -65541 -67954 -29028 21161 57633 59252 22989 -27802
281 -27802 -62117 -58697 -15965 42477 74876 52875 -9969 -63086 -66755 -25411 25144 54620
293 54620 53554 22779 -25936 -62952 -58201 -10236 47046 70935 44463 -12577 -59141 -62903 -24814
306 -24814 26265 55852 51074 18113 -26537 -59656 -55984 -9381 48621 70305 39246 -17284
$$ packed form
218F3649R362l3192o1193m9113J273M2989N5108M5541J343n9183p7710l0313M3442
231d7997P1335M0955m3l0217n3690m6724l406M4096O3774L8389j3077n4695o4324
244e5624k9244L6112P2631M6263p767m1256m3094l4793j0846L9662O8916L8450
256G9410j9902n9626n9695j7150L8121O1847M1569l343l9962m7915l2609p11L7086
269b2880O0168M1896j8090o9796n6839k413L8926N0189L6472J619l6263n0791
281b7802l4315L420M2732N8442L2399k2001o2844n3117l669M1344N0555K9476
293E4620j066l0775m8715l7016M751M7965N7282K3889k6472n7040m6564l762L8089
306b4814N1079K9587m778l2961m4650l3119L672M6603N8002K1684l1059n6530
$$ plain form
318 -17284 -57580 -56673 -20417 25258 53554 49462 15699 -28809 -59325 -52563 -5939 48849 68386
331 68386 36512 -20932 -58212 -51333 -14213 23606 47691 48236 18387 -30364 -63321 -49725 1306
344 1306 51217 64207 30104 -22779 -53914 -46950 -14458 22755 46723 46741 17035 -31573 -63810
357 -63810 -47856 7183 55500 57745 20416 -21903 -46367 -45017 -17990 21900 50517 48331 11224
370 11224 -36674 -60475 -41011 10269 52719 52714 17248 -21721 -44102 -42682 -18300 21407 53944
383 53944 48344 4340 -41746 -56419 -32359 12175 46090 49303 20580 -21789 -47105 -41103 -12986
396 -12986 24569 51485 43582 2826 -42225 -55366 -26908 14405 42820 47018 20299 -21679
408 -21679 -48401 -42033 -7520 30160 46238 36219 3329 -38580 -54634 -28749 17288 48427
$$ packed form
318a7284m0296R07L6256M5675K8296m092l3763m4508l0516O762M6624N4788J9537
331F8386l1874n7444l7280O879L7120L7819K4085N45k9849m8751l2957J3596N1031
344A306M9911J2990l4103n2883l1135O964L2492L7213K3968J8k9706m8608l2237
357f3810J5954N5039M8317K245l7329m2319k4464J350K7027L9890K8617k186l7107
370A1224m7898k3801J9464N1280M2450nl5466l8969k2381J420K4382L9707L2537
383E3944n600m4004m6086j4673K4060M4534L3915L213k8723m2369k5316O002K8117
396a2986L7555K6916p903m0756m5051j3141K8458M1313K8415M198k6719m1978
408b1679k6722O368L4513L7680J6078j0019l2890m1909j6054K5885M6037L1139
$$ plain form
420 48427 42742 11960 -21134 -44355 -40542 -6267 30054 45715 34119 -746 -37344 -51218
432 -51218 -28667 19676 50934 39572 6342 -23811 -38980 -33710 -10320 25944 51579 35638
444 35638 -7903 -41685 -47581 -20995 21234 44645 37262 6424 -25681 -36548 -30760 -11363 26917
457 26917 52272 34553 -10968 -47251 -44508 -9498 21336 35620 34819 10072 -22055 -40594 -35668
470 -35668 -3396 33516 45832 29254 -11340 -47526 -39964 -5923 20022 33983 31565 11569
482 11569 -19077 -45501 -37054 4158 37246 42407 21222 -15271 -37287 -35988 -14922 21553 40532
495 40532 27696 6754 -20080 -44426 -33123 5405 37833 41944 15151 -15901 -32584 -35503
507 -35503 -13462 20756 37789 33708 4573 -32121 -38144 -21666 1197 32330 43116 16294
$$ packed form
420D8427n685l0782l3094k3221L813L4275L6321J5661j1596l4865l6598j3874
432e1218K2551M8343L1258j1362l3230l0153j5169N270K3390L6264K5635j5941
444C5638m3541l3782n896K6586M2229K3411p383l0838l2105j0867N788J9397L8280
457B6917K5355j7719m5521l6283K743L5010L0834J4284q01k4747l2127j8539M926
470c5668L2272L6912J2316j6578m0594l6186P562L4041K5945J3961k418j9996
482A1569l0646k6424Q447M1212L3088N161k1185l6493k2016J299K1066L6475J8979
495D0532j2836k0942k6834k4346J1303L8528L2428M111k6793l1052j6683k919
507c5503K2041L4218J7033m081k9135l6694o023J6478K2863L1133J0786k6822
$$ plain form
519 16294 -17269 -36374 -33247 -8952 20281 39429 31542 -3153 -28596 -32426 -24575 3257 33750
532 33750 38124 18575 -16256 -43052 -30793 -490 20480 32561 26975 2383 -25363 -40177
544 -40177 -23675 11553 31936 34631 17340 -18562 -39499 -29117 -2235 25287 31924 19165
556 19165 3700 -21265 -41329 -24892 11646 37098 36080 7522 -22273 -31819 -25042 -3292 21062
569 21062 30691 25337 1464 -29179 -37423 -19619 11758 39139 32383 382 -19810 -26672 -24360
582 -24360 -5676 19852 35462 25752 -5804 -30037 -32929 -17086 13832 35394 27899 5084 -19915
595 -19915 -31599 -20371 -1644 17303 34144 26272 -6198 -33744 -34561 -8796 18229 27293 24631
608 24631 8290 -18621 -31585 -22733 -1409 24008 32986 18297 -6802 -29861 -32268 -8877 16707
$$ packed form
519A6294l3563j9105L127K4295K9233J9148p887l4695k5443l830P851K7832L0493
532C3750M374j9549l4831k6796J2259L0303K0970J2081n586k4592k7746j4814
544d0177J6502L5228K0383K695j7291l5902k0937J0382K6882K7522O637j2759
556A9165j5465k4965k0064J6437L6538K5452j018k8558k9795r546O777K1750K4354
569B1062R629n354k3873l0643q244J7804L1377K7381o756l2001k0192o862K312
582b4360J8684K5528J5610r710l1556k4233k892J5843L0918K1562p495k2815k4999
595a9915j1684J1228J8727J8947J6841p872l2470k7546q17K5765K7025R064k662
608B4631j6341k6911j2964Q852K1324K5417Q978j4689k5099k3059k407K3391K5584
$$ plain form
621 16707 29306 24351 3749 -17969 -29489 -24120 2118 26874 28829 15288 -7085 -28770 -29539
634 -29539 -9261 17009 31059 21918 1005 -17558 -28743 -21518 2591 24350 30838 15141 -12648
647 -12648 -27591 -24693 -9341 15364 30749 22294 -496 -20989 -26954 -15919 2041 21823 30824
660 30824 14689 -12803 -28675 -24744 -4622 17165 26359 20735 995 -21317 -26922 -16050 3995
673 3995 23831 27903 12239 -11541 -29073 -24917 -1529 18178 25013 18052 28 -18694 -27221
686 -27221 -16959 6997 25299 25084 10139 -12392 -27975 -22471 -1757 18168 25752 15949 -2307
699 -2307 -18467 -25792 -15927 7361 25518 25296 7069 -15524 -25590 -19537 -2333 17931 25334
712 25334 15457 -3224 -19686 -24371 -13154 7241 24387 25156 5725 -16292 -24890 -17738 180
$$ packed form
621A6707J2599m955k0602k1718j1520N369K6238K4756J955j3541k2373k1685p69
634b9539K0278K6270J4050r141k0913j8563j1185P225K4109K1759O488j5697k7789
647a2648j4943K898J5352K4705J5385q455k2790k0493n965J1035J7960J9782R001
660C0824j6135k7492j5872L931K0122K1787R194n624j9740k2312n605J0872K0045
673C995J9836M072j5664k3780j7532M156K3388J9707O835o961j8024j8722q527
686b7221J0262K3956J8302k15j4945k2531j5583N504K0714J9925P584r803j8256
699b307j6160p325R865K3288J8157k22j8227k2593j0066O053J7204K0264P403
712B5334r877j8681j6462m685J1217K0395J7146P69j9431k2017q598P152J7918
$$ plain form
725 180 16913 23294 15546 -3354 -20856 -24055 -11227 9125 24348 22708 5132 -16018 -25106
738 -25106 -16186 2104 17025 21835 14507 -3301 -20763 -24650 -10297 11507 24340 20089 2827
751 2827 -15492 -23245 -15568 1688 17200 21704 12907 -4307 -20741 -23812 -9119 12870 24612
764 24612 18191 875 -15087 -21544 -14684 1353 17217 22452 12252 -6594 -21461 -21487 -7032
777 -7032 12343 23190 17416 164 -15802 -21065 -13648 1825 17388 22207 11205 -8162 -21831
790 -21831 -20007 -4831 12520 21579 16524 287 -16127 -21365 -12502 4113 17503 20328 9856
803 9856 -8394 -21304 -19145 -3610 13570 20861 14921 -156 -15919 -20916 -11604 5255 17919
816 17919 18983 8034 -8568 -20132 -18588 -3367 14403 21018 13486 -2296 -15887 -18987 -10207
$$ packed form
725A80J6733O381p748j8900j7502l199J2828K0352J5223j640j7576k1150r088
738b5106Q920J8290J4921M810p328j7808j7462l887J4353K1804J2833m251j7262
751B827j8319p753P677J7256J5512M504q797j7214j6434l071J4693K1989J1742
764B4612o421j7316j5962o457O860J6037J5864N235j0200j8846j4867k6J4455
777g032J9375J0847n774j7252j5966n263P417J5473J5563M819j1002j9367j3669
790b1831J824J5176J7351R059n055j6237j6414n238Q863J6615J3390K825j0472
803I856j8250j2910K159J5535J7180P291n940j5077j5763m997R312J6859J2664
816A7919J064j0949j6602j1564J544J5221J7770O615p532j5782j3591l100Q780
$$ plain form
829 -10207 4992 17898 18877 7317 -9355 -19805 -17178 -2262 14456 20875 12422 -3789 -15631
842 -15631 -17428 -9487 4736 17314 19061 6990 -11208 -20310 -15048 -318 14073 19154 11067
855 11067 -3416 -15275 -17441 -8480 5766 17152 18264 5746 -11946 -20220 -13979 1318 14508
868 14508 17337 9824 -2430 -14778 -18097 -8190 7382 18040 16614 3639 -11341 -19222 -13557
881 -13557 1996 14439 16264 9922 -3174 -15565 -17104 -7587 7776 18999 15509 1524 -11962
894 -11962 -17503 -11970 1626 13523 17417 8761 -5458 -14529 -16119 -7092 8368 18507 14260 1129
908 1129 -12077 -17337 -10424 1852 13572 17282 7932 -5888 -15361 -15690 -5097 9200 16343 14106
922 14106 1751 -13388 -17345 -9242 3038 13940 15380 7197 -4663 -15913 -15535 -3112 9220
$$ packed form
829a0207J5199J2906R79j1560j6672j0450K627J4916J6718O419q453j6211j1842
842a5631j797P941J4223J2578J747j2071j8198r102N262J4730J4391N081q087
855A1067j4483j1859k166Q961J4246J1386J112j2518j7692q274O241J5297J3190
868A4508K829p513j2254j2348l319R907J5572J0658j426j2975j4980p881N665
881a3557J5553J2443J825o342j3096j2391j539R517J5363J1223l490j3985j3486
894a1962n541N533J3596J1897L894q656j4219r071j590R027J5460J0139m247j3131
908A129j3206n260O913J2276J1720L710r350j3820r473l29J0593J4297P143k237
922A4106j2355j5139l957Q103J2280J0902J440q183j1860j1250L78J2423J2332
$$ plain form
935 9220 16449 13640 -11 -13022 -16337 -9279 4558 13970 13622 7019 -5436 -15556 -14066 -3848
949 -3848 9704 17924 11211 -1749 -11712 -15580 -8414 4681 13075 14480 6174 -6898 -14629 -13851
963 -13851 -3662 11918 17183 9289 -2336 -12261 -14247 -6711 3618 13056 15116 4759 -7907
976 -7907 -14936 -13089 -1045 11560 14979 9741 -2126 -13014 -13286 -6674 3710 13764 14071 4324
990 4324 -8041 -15967 -11678 940 10290 14153 8964 -2901 -12147 -13660 -6890 5804 14106 12301
1004 12301 3936 -8250 -15285 -10510 301 10877 14452 7640 -2960 -11816 -14598 -5438 6947
1017 6947 13065 11640 2628 -9196 -13234 -10074 -87 11789 14211 7112 -3723 -12504 -12270 -4327
1031 -4327 5854 13402 12055 1213 -8659 -13376 -10172 1196 11594 13221 6523 -4814 -12773 -11319
$$ packed form
935I220P229k809j3651j3011l315P058J3837R412l48o603j2455j0120J490J0218
949c848J3552Q220o713j2960r963l868P166J3095Q394J405q306j3072p731P78
963a3851J0189J5580N265p894j1625r925j986P536J0329R438K060j0357j2666
976g907p029J847J2044J2605L419n238j1867j0888k72O612J0384J0054L07r747
990D324j2365p926M289J2618R350L863n189j1865r246j513O770J2694Q302j805
1004A2301q365j2186p035M775J0811J0576L575o812j0600q856k782R160J2385
1017F947O118j425r012j1824m038L160R987J1876K422p099j0835q781K34P943
1031d327J0181P548j347j0842r872m717L204J1368J0398J627o698j1337p959J454
$$ plain form
1045 -11319 -3800 5966 13195 10540 1630 -8430 -14451 -8547 2462 10886 13085 5876 -5531 -11830
1059 -11830 -10883 -3480 6831 12546 10536 1525 -10180 -14174 -7014 3068 11238 12056 4099 -4666
1073 -4666 -10618 -11607 -3180 7684 12725 9849 -73 -10382 -12504 -7298 3325 11702 10477 3950
1087 3950 -4581 -11784 -10784 -2208 6917 12811 9526 -1700 -10260 -11571 -6092 3965 10408 10358 4520
1102 4520 -5749 -11948 -9375 -2162 8013 13246 7803 -2057 -9504 -11679 -5257 4028 10135 10595 3908
1117 3908 -6363 -11365 -9301 -1132 8703 11812 7317 -1683 -10397 -11249 -4621 4007 10857 10370 2350
1132 2350 -5854 -11068 -9857 14 9042 11000 6447 -2089 -10087 -10635 -4490 4796 10899 8911 2518
1147 2518 -5957 -11387 -8138 334 8127 11053 6473 -3592 -9590 -9560 -3940 4873 10435 9026 1525
$$ packed form
1045a1319P519R766P229k655q910j0060o021N904J1009Q424K199p209j1407o299
1059a1830R47P403J0311N715k010r011j1705l994P160J0082Q170Q18p957q765
1073d666n952r89Q427J0864N041k876r922j0309k122N206J0623Q377j225o527
1087C950q531p203J000Q576R125N894l285j1226q560j311N479J0057O443n0n838
1102D520j0269o199K573P213J0175N233n443r860p447k175O422R285O107M60o687
1117C908j0271n002K064Q169R835L109m495r000q714q52O628Q628O850m87q020
1132B350q204n214J211R871R028J958m553q536p998n48O145R286O103j988o393
1147B518q475n430L249Q472P793K926m580j0065n998L0N620Q813N562j409p501
$$ plain form
1162 1525 -7081 -10757 -7473 367 8729 11170 5292 -3674 -9572 -9599 -3161 5372 9765 8822 1388 -7441
1178 -7441 -10629 -7080 1368 8825 10080 4914 -3309 -9725 -9250 -2333 5348 9814 8065 724 -7123
1193 -7123 -10488 -6795 2103 8882 9360 4426 -3743 -9449 -8954 -2405 5780 9946 7170 370 -6992
1208 -6992 -9798 -6216 2065 8885 9496 3485 -4480 -9411 -7851 -1835 5888 9786 6760 -613 -7620
1223 -7620 -9309 -5122 2234 8935 9365 2959 -5113 -9103 -7416 -1344 5592 9247 6795 -511 -7914
1238 -7914 -9339 -4551 3088 8298 8425 2722 -5047 -8858 -6974 -530 5891 9135 6405 -994 -7790
1253 -7790 -9330 -3949 4089 8519 7690 2019 -4867 -8724 -7009 -331 6425 8764 5480 -1641 -7775
1268 -7775 -8960 -3432 3918 8447 6964 1435 -4829 -8379 -6711 -59 6646 9115 4983 -2832 -7803
$$ packed form
1162A525q606l676L284P840Q362K441n878q966n898k7O438Q533M393r43p434q829
1178g441l188L549Q448P457J255n166q223o416M75O917P681M466j749p341p847
1193g123l365L693Q898O779M78m934q169n706M95O549Q185M166k776o800p362
1208f992k806L582Q281O820O11o011p965m931J560O016P723L898l026p373p007
1223g620j689M187P356O701M30o406q072l990J687O072O936L655k452p306p403
1238g914j425M788P639N210J27n703p769l811J884O444O421L244k730p399o796
1253g790j540N381Q038M430q29n671o886l857J715O678O756K339l284p121o134
1268g775j185N528P350M529j483n529o264l550J668O652O705K469m132p815m971
$$ plain form
1283 -7803 -8138 -3059 3809 8264 6979 951 -5288 -8280 -6296 269 6781 8826 4580 -2851 -7655
1298 -7655 -7391 -2704 3606 7956 6971 1187 -5765 -8340 -5249 799 6445 8238 4326 -2738 -7968
1313 -7968 -7224 -1892 4432 7586 6572 678 -5790 -8272 -5220 1517 6712 7323 3478 -2700 -7648
1328 -7648 -7271 -1586 5089 7668 5668 326 -5556 -7847 -4878 1767 7142 7307 2695 -3275 -7578
1343 -7578 -6561 -1347 4769 7898 5459 -855 -5485 -7374 -4656 1768 7080 7114 2463 -3809 -7519
1358 -7519 -5933 -914 4696 7455 5099 -700 -5917 -7104 -3807 2130 6635 7143 2110 -4285 -7139
1373 -7139 -5759 -595 4803 7133 4984 -668 -6135 -7365 -3263 2330 6594 6516 1864 -3922 -7365
1388 -7365 -5658 208 5163 6421 4665 -1023 -5999 -6919 -3052 2729 6960 5922 1533 -4004 -7130
$$ packed form
1283g803l35N079O868M455j285o028o239k992J984O565O512K045m246p431m804
1298g655K64M687O310M350r85n784o952k575L091O048N646J793l912p064n230
1313g968P44N332O324L154j014n894o468k482L052O737N195O11l845o178m948
1328g648L77N685O675K579k000n342n882k291K969O645N375J65m612n970m303
1343g578J017N214O116L129k439o314m630j889K718O424N312L4m651o272l710
1358g519J586N019N610K759k356n799n217j187L297N937M505N08n033o395k854
1373g139J380N164N398K330k149n652n467j230M102N593M264p8m652n786l443
1388g365J707N866M955J258j756n688m976r20L867N781M231j038m389n537l126
$$ plain form
1403 -7130 -4952 487 5105 6952 3804 -1655 -5661 -6755 -2930 3409 7127 5328 1094 -4472 -6591
1418 -6591 -4694 -50 5303 6890 3592 -1714 -5624 -6701 -2562 3217 6487 5633 180 -4825 -6160
1433 -6160 -4313 278 5228 6350 3664 -1878 -6477 -6008 -1416 3083 6481 5283 56 -4506 -6217
1448 -6217 -4299 1061 5200 6193 3443 -2577 -6477 -5532 -1393 3793 6246 4584 -35 -4298 -6564
1463 -6564 -3755 1576 5229 6469 2737 -2890 -6126 -5546 -1020 4133 5803 4193 -62 -4641 -6403
1478 -6403 -3607 1123 5923 5871 1804 -2892 -5586 -5294 -584 3941 5901 4509 -669 -4916 -5674 -3574
1494 -3574 1835 5821 5225 1788 -2966 -5971 -4554 -423 3562 6155 4169 -776 -4602 -5733 -2632
1509 -2632 2474 5207 5341 1599 -3516 -5800 -4239 -743 4104 6028 3406 -794 -5099 -5700 -2028
$$ packed form
1403g130K178N439M618J847l148n459m006j094L825O339L718j799m234n566k119
1418f591J897M644N353J587l298n306l910j077M139N779L270q54n453n005j335
1433f160J847M591M950J122k686n542m599M69M592M499L398j198n227m562j711
1448f217J918N360M139R93k750o020l900R45M139N186K453j662m619m263k266
1463f564K809N331L653J240l732n627l236N80M526N153J670j610m255m579j762
1478f403K796M730M800n2m067m696k694K92M710M525J960j392n178m247p58K100
1494c574N409L986n96l437m754l005J417M131L985K593j986m945l826j131L101
1509b632N106K733J34l742n115k284J561L496M847J924k622m200m305o01L672
$$ plain form
1524 -2028 2137 5269 5190 1131 -3572 -5365 -4573 120 4654 5262 3112 -1151 -4950 -5066 -1884 2090
1540 2090 5449 4912 884 -3134 -5713 -4397 814 4404 5203 3064 -1553 -5016 -4671 -2061 2324 5487
1556 5487 4412 844 -3453 -5737 -3315 928 3912 5280 2421 -1805 -4803 -4924 -2003 3052 5423
1571 5423 4192 593 -4094 -5106 -2963 587 4359 5023 2147 -1556 -4745 -5073 -1424 3102 4897
1586 4897 3956 -192 -3950 -4855 -3094 1128 4382 4594 2313 -1472 -5172 -4659 -754 2968 5067 3708
1602 3708 -118 -3714 -5022 -2864 1218 4196 4876 2140 -2373 -4995 -4139 -866 3259 5091 3286
1617 3286 -370 -3893 -4973 -2577 1352 4175 4388 1469 -2542 -4872 -3980 -358 3369 4628 3143
1632 3143 -478 -4009 -4770 -2101 1564 4401 4164 1638 -2517 -4980 -3752 -116 3544 4833 3058
$$ packed form
1524b028M165L132p9m059m703j793P92M693M534O08k150m263l799j16L182L974
1540B090L359n37m028m018k579J316N211L590P99k139m617l463L45K610M385L163
1556E487j075l568m297k284K422M243K984J368k859m226k998j21K921N055K371
1571E423j231l599m687j012K143L550L772O64k876l703l189l28L649M526J795
1586D897r41m148l758r05J761M222L254K12k281l785l700N13L905L722K099j359
1602C708l826l596j308K158M082K978O80k736m513k622Q56L273M125J832j805
1617C286l656l523j080K396L929K823K13k919m011k330Q92L622L727J259j485
1632C143l621l531p61K669L665K837k37k526m155k463J228L636L660J289j775
$$ plain form
1647 3058 -643 -3845 -4674 -1965 1789 4655 3682 1223 -2371 -5080 -3491 158 3500 4705 2704
1662 2704 -943 -3991 -4369 -1880 1737 4371 4103 836 -2903 -4494 -3106 10 3607 4662 2681
1677 2681 -1221 -3772 -4256 -1657 1883 4269 4060 788 -3095 -4568 -3187 535 3459 4280 2352 -1121
1693 -1121 -4524 -4087 -1407 2116 4450 3573 433 -2931 -4323 -2975 833 3369 4200 1799 -1639 -3858
1709 -3858 -4182 -1326 2391 4261 3115 470 -2887 -4615 -2891 795 3856 4164 1799 -1613 -3886
1724 -3886 -3713 -1148 2567 4424 3047 3 -3175 -3984 -2460 859 3624 4035 1284 -1991 -3775 -3398
1740 -3398 -700 2412 4051 3210 -297 -3154 -4046 -2244 1109 3559 3929 1297 -2000 -3797 -3360 -450
1756 -450 2320 4183 2859 -546 -3004 -4082 -1811 1339 3417 3548 1409 -1912 -3875 -3366 -428 2676
$$ packed form
1647C058l701l202q29K709L754K866r73k459l594k709J589L649L342J205k001
1662B704l647l048l78K489L617K634k68l267l739j591J388L116L597J055j981
1677B681l902k551m84K599L540K386k09l272l883j473J381L722K924Q21j928l473
1693a121l403M37K680L523K334q77l140l364j392J348L808K536Q31k401l438k219
1709c858l24K856L717J870j146k645l357j728J724L686L061L08k365l412k273
1724c886J73K565L715J857j377l044l178q09J524L319K765M11k751l275j784L77
1740c398K698L112J639q41l507k857q92J802L353K450L70k632l297j797M37K910
1756d50K770J863j324l405k458j078K271L150K078J31k139l321j963N09K938L104
$$ plain form
1772 2676 3764 2608 -701 -3248 -3758 -1698 1322 3543 3248 911 -2046 -3842 -3100 -234 2978 3978
1788 3978 2399 -856 -3248 -3587 -1918 1405 3558 3226 937 -2190 -3764 -2910 2 3009 3873 2105
1804 2105 -1033 -3070 -3183 -1447 1398 3756 3198 822 -2447 -3646 -2333 448 3008 3900 2033 -854
1820 -854 -3357 -3187 -1315 1797 3532 3384 419 -2536 -3893 -2332 470 2771 3522 1497 -1119 -3103
1836 -3103 -3357 -1031 1860 3303 2850 354 -2388 -3660 -2315 606 2894 3371 1627 -1109 -3384 -3111
1852 -3111 -957 1994 3659 2548 18 -2351 -3484 -2372 644 3047 3422 1302 -1573 -3288 -3110
1867 -3110 -937 2135 3645 2504 -3 -2559 -3428 -1696 767 3109 3285 905 -1817 -3038 -2882 -415
1883 -415 2325 3220 2335 -254 -2614 -3358 -1472 929 2996 2967 909 -1473 -3358 -2663 -12 2256 3046
$$ packed form
1772B676J088j156l309k547n10K060L020K221k95k337k957j796P42K866L212J000
1788C978j579l255k392l39J669L323K153l32k289l127j574Q54K912L007Q64j768
1804B105l138k037j13J736K845K358n58k376l269j199J313K781K560Q92j867k887
1820h54k503J70J872L112J735j48k965k955j357J561K802K301P51k025k616j984
1836c103k54K326K891J443m53k496k742j272J345K921K288M77j744k736k275K73
1852c111K154K951J665j111k530k369j133J112L016K403L75k120k875j715J78
1867c110K173L072J510j141k507k556q69J732K463K342J76k380k722j221J56K467
1883d15K740Q95q85k589k360p44J886K401K067k9k058k382j885O95K651K268P90
$$ plain form
1900 3046 2338 -309 -2786 -3203 -1600 1222 2863 2935 997 -1663 -3435 -2524 -51 2266 3459 2024
1916 2024 -295 -2371 -3250 -1342 1464 2960 2639 921 -1802 -3007 -2304 -424 2477 3195 1919 -782
1932 -782 -2712 -3046 -1100 1356 2831 2879 203 -1845 -2805 -2353 -110 2151 3128 1766 -977 -2900 -2572
1949 -2572 -1154 1167 3022 2529 428 -1695 -3274 -2213 425 2332 3121 1601 -1112 -2725 -2453 -950
1965 -950 1669 2658 2129 652 -2005 -3165 -1816 181 2426 2978 1222 -1102 -2658 -2542 -619 1582
1981 1582 2747 2522 201 -2127 -2776 -1823 361 2557 2611 1179 -923 -2490 -2346 -568 1612 2776
1997 2776 2200 -305 -2365 -2743 -1662 583 2530 2524 1154 -1258 -2869 -2109 -459 1670 3066 1864
2013 1864 -187 -2057 -2768 -1327 1009 2116 2587 1034 -1492 -2623 -2366 -509 1939 2626 1464 -341
$$ packed form
1900C046p08k647k477m17J603K822J641P2j938k660j772R11K473K317J193j435
1916B024k319k076q79J908K806J496l21j718k723j205P03J880K901P18j276k701
1932g82j930l34J946K456J475M8k676k048r60M52K243K261R77j362k743j923L28
1949b572J418K321J855m93k101k123j579J061K638J907P89j520k713j613K72J503
1965i50K619R89n29j477k657j160J349J997K245N52j756k324j556J16J923K201
1981A582J165k25k321k328o49R53K184K196N4j432k102j567J44J778K180J164
1997B776n76k505k060l78J081K245J947oj370k412j611P60J650K129J396j202
2013A864k051j870p11J441K336J107M71j553k526j131K57J857K448O87j162j805
$$ plain form
2029 -341 -2353 -2615 -1215 1020 2578 2552 662 -1359 -2494 -2306 -57 2174 2282 1609 -361 -2262 -2312
2046 -2312 -1352 926 2483 2226 288 -1223 -2403 -2054 -80 1858 2635 1653 -845 -2276 -2490 -1177
2062 -1177 1137 2817 2419 492 -1246 -2512 -1801 51 1751 2703 1485 -629 -2068 -2636 -1050 1202
2078 1202 2413 2183 56 -1835 -2357 -1610 281 2162 2269 1047 -769 -2254 -2416 -1039 1183 2261
2094 2261 1864 330 -1525 -2393 -2122 587 2280 2374 1253 -843 -2493 -2329 -747 1296 2317 1828 -34
2111 -34 -1744 -2279 -1553 350 1953 2263 987 -1132 -2093 -1806 -696 1444 2198 1731 304 -1664 -2415
2128 -2415 -1345 510 2276 2277 929 -954 -2352 -1800 -325 1277 2106 1675 16 -2139 -2368 -1328 649
2145 649 1957 2202 669 -1095 -2427 -1792 -252 1462 2042 1540 -106 -1901 -2109 -1188 869 2258 1956
$$ packed form
2029c41k012k62J400K235J558k6j890k021j135J88K249K231J08o73j970j901n0
2046b312R60K278J557k57j938j511j180L49J974J938P77r82k498j431k14J313
2062a177K314J680l98j927j738j266P11J852J700R52j218k114j439n68J586K252
2078A202J211k30k127j891n22P47J891J881J07j222j816j485j62J377K222J078
2094B261l97j534j855q68K71K709J693R4j121k096j650J64J582K043J021m89j862
2111c4j710n35P26J903J603L10j276k119r61K87J110K140P54m67j427j968p51
2128b415J070J855J766Jj348j883j398N52J475J602Q29m31j659k155k29J040J977
2145F49J308K45j533j764j332O35J540J714N80n02j646j795k08R21K057J389l02
$$ plain form
2162 1956 706 -1064 -2261 -1856 -194 1664 2523 1152 -340 -1703 -1994 -1010 1022 2174 1917 555
2178 555 -1234 -2178 -1584 38 1492 2177 1280 -263 -1801 -2078 -1240 737 2155 1775 404 -1659 -2252
2195 -2252 -1530 61 1776 2150 1272 -535 -1946 -1785 -697 751 1950 1597 359 -1405 -2294 -1341 -7
2212 -7 1579 2007 1101 -571 -1923 -1999 -507 1259 1886 1541 332 -1498 -1981 -1362 435 1542 2174 1070
2230 1070 -730 -1870 -1735 -444 865 1844 1477 -95 -1328 -2047 -1345 204 1781 2088 815 -655
2246 -655 -1970 -1855 -272 1130 1775 1611 114 -1465 -1971 -1203 522 1590 1727 904 -1134 -1995 -1809
2263 -1809 -378 1193 1627 1349 -125 -1568 -1932 -1038 423 1485 1802 842 -974 -2070 -1407 -151 1477
2280 1477 2003 1391 -18 -1537 -1681 -840 698 1739 1671 613 -704 -1950 -1598 -248 1360 1537 1274
$$ packed form
2162A956j250j770j197M05J662J858Q59j371j492j363k91R84K032J152k57j362
2178E55j789r44N94J622J454O85q97j543j538k77Q38J977J418l80j371k063n93
2195b252P22J591J715L74q78j807j411J61J088J448J199l53j238j764q89R53J334
2212gJ586M28r06j672j352p6J492J766O27l45j209j830m83O19J797J107O32j104
2230A070j800j140J35J291J309R79l67j572j233p19P02J549J577L07j273j470
2246f55j315J15J583J402O45j64j497j579n06P68J725J068J37q23k038q61J86
2263a809J431J571M34k78j474j443l64Q94J461J062L17r60j816j096O63J256J628
2280A477N26o12j409j519j44Q41J538J041o8j058j317j246L52J350J608J77k63
$$ plain form
2297 1274 108 -1297 -1794 -1071 534 1799 1600 556 -938 -1883 -1128 -30 1137 1819 1102 -264 -1646
2314 -1646 -1396 -851 754 1587 1323 540 -887 -1739 -1173 76 1217 1727 955 -434 -1277 -1596 -811 928
2332 928 1619 1495 123 -1280 -1705 -1119 84 1507 1478 941 -350 -1765 -1719 -900 685 1482 1395 49
2350 49 -911 -1805 -1364 335 1601 1662 900 -676 -1371 -1383 -337 996 1354 1327 12 -854 -1289 -869 440
2369 440 1024 1338 950 -599 -1508 -1609 -457 1105 1560 1306 -126 -1191 -1398 -675 113 1265 1640 721
2387 721 -775 -1449 -1282 -360 842 1576 1431 -224 -1120 -1339 -789 346 1386 1504 556 -610 -1556 -1123
2405 -1123 -22 760 1756 1071 -98 -748 -1520 -851 398 1169 1187 592 -549 -1368 -1060 -429 755 1752
2423 1752 1157 51 -1169 -1929 -681 675 1349 1538 461 -818 -1205 -1219 -29 1135 1270 923 -234
$$ packed form
2297A274j166j405m97P23J605J265j99j044j494r45P55J098J167O82p17j366j382
2314a646K50N45J605Q33k64p83j427q52N66J249J141N10p72j389q43l19P85J739
2332I28O91j24j372j403m25N86J203J423k9n37j291j415M6Q19J585P97q7j346
2350D9r60q94M41J699J266O1p62j576o95j2J046J333L58k7j315q66m35M20J309
2369D40N84L14l88j549r09j01J152J562M55k54j432j065k07P23P88J152L75r19
2387G21j496o74J67R22J202P34j45j655q96k19N50J135J040J18r48j166r46M33
2405a123J101P82R96o85j169o50p72O69J249P71J8n95j141q19L08O31J184R97
2423A752n95j106j220p60J248J356O74J89j077j279l87j4J190J164J35l47j157
$$ plain form
2440 -234 -1192 -1022 -645 407 1178 1136 197 -511 -1382 -1343 88 895 1413 985 -532 -1205 -1268 -340 447 1591
2460 1591 1231 448 -707 -1551 -970 108 1094 1412 924 -382 -1249 -1394 -420 722 1341 1226 473 -1093
2478 -1093 -1270 -749 -125 1119 1371 549 -219 -1120 -1485 -99 560 1301 1101 112 -1063 -1234 -930 219
2496 219 969 1176 386 -341 -1311 -1122 -176 587 1233 1180 -107 -1006 -1242 -684 209 1220 1303 560 -430 -990
2516 -990 -768 -399 808 1244 1030 115 -994 -1339 -514 215 1081 1287 684 -665 -1190 -1214 -27 860 1025
2535 1025 626 -69 -1092 -1230 -554 270 1017 1053 194 -992 -1298 -1149 18 924 1002 673 -204 -1017 -1101 -532
2555 -532 463 1202 1225 531 -835 -1225 -980 192 785 1145 633 65 -889 -1013 -676 291 1305 1080 444
2574 444 -742 -1050 -857 -114 669 1202 597 -150 -985 -1136 -409 246 1174 883 261 -719 -998 -871 92 854
$$ packed form
2440b34r58J70L77J052P71m2r39p08q71L9J431Q07N18m28j517o73o3R28P87J144
2460A591l60p83j155q44N81J078R86L18m88j306q67j45R74J142O19j15p53j566
2478a093j77N21O24J244K52q22p68r01l65J386O59P41k00r89j175j71L04J149
2496B19P50K07p90p27r70J89R46P63O46n3j287q99k36N58Q93J011Q3p43r90n60
2516i90K22L69J207M36k14r15j109l45Q25P29Q66K06o03j349n25k4J187Q87J65
2535A025l99o95j023j38O76Q24P47L6q59j186l06J49J167R06P8l29q77q13q4N69
2555e32R95P39K3o94j366l90K45J172N93L60n12n68r54j24L37R67J014k25o36
2574D44j186l08J93P43P83N33o05p47q35j51P27O55R28k91o22r80k79J27R63P62
$$ plain form
2594 854 1071 395 5 -1000 -1082 -259 702 1184 798 272 -581 -1184 -774 -2 913 896 652 -245 -1003 -1222
2614 -1222 -131 708 854 915 143 -720 -1057 -796 202 1188 959 464 -145 -679 -1022 -487 585 1052 544
2633 544 -74 -710 -926 -815 220 503 867 366 -473 -772 -977 -385 508 897 893 -67 -811 -870 -201 551 956
2654 956 923 140 -304 -878 -730 75 664 827 963 39 -675 -794 -505 194 1137 771 215 -471 -1119 -866
2674 -866 46 557 765 638 139 -592 -1142 -541 389 840 1063 642 -551 -880 -731 15 663 1027 563 -223
2694 -223 -977 -764 -554 405 892 704 425 -673 -1006 -646 47 560 661 687 -213 -889 -650 -500 417 675
2714 675 812 300 -489 -712 -589 -114 660 901 544 -295 -608 -936 -354 369 901 994 335 -760 -857 -565
2734 -565 71 869 921 501 -231 -547 -784 -574 389 930 819 3 -655 -663 -566 140 602 955 385 -306 -699
$$ packed form
2594H54K17o76l90j005q2Q23R61M82l86n26q53o03M10P72R15j7k44q97p58k19
2614a222J091Q39J46O1p72q63l37K61R98R86k29m95o09n34l43N35J072M67n08
2633E44o18o36k16J11J035K83L64n01q39k99k05N92Q93L89mr60p44n9O69P52M05
2654I56l3p83m44n74J48Q05N89J63J36r24p14j19K89O99R43l66n56o86o48K53
2674h66R12N11K08j27m99p31n50O01R30M51K23m21j193l29J49P46O48L64m64p86
2694b23p54K13K10R59M87j88k79j098l33L60O93N13J01K6r00o76K39J50R17K58
2714F75J37n12p89k23J23M75P74K41l57q39l13l28N82P23N32R3o59j095r7K92
2734e65O36P98N2m20p32l16k37K10R63N41j11q16o58qR7P06M62L53n70o91l93
$$ plain form
2755 -699 -711 -436 445 1019 696 169 -588 -900 -532 97 711 836 559 -134 -773 -674 -71 447 731 679 -42
2776 -42 -524 -955 -511 121 760 817 230 -313 -885 -879 -411 563 818 661 80 -387 -977 -416 151 705 813
2797 813 300 -334 -955 -764 -180 499 830 534 -41 -690 -729 -453 308 661 698 308 -208 -632 -373 -73 366
2818 366 871 567 200 -549 -750 -487 490 719 570 97 -267 -931 -758 7 521 830 490 -105 -549 -785
2838 -785 -442 353 677 826 45 -410 -656 -642 -61 628 557 727 -159 -667 -617 -250 433 820 755 46 -386
2859 -386 -741 -504 -43 621 695 489 -336 -564 -697 -435 402 688 782 224 -427 -956 -751 267 707 832
2879 832 503 -267 -613 -623 -289 238 751 446 95 -483 -866 -372 -11 328 725 179 -167 -675 -784 -87
2899 -87 464 685 890 -73 -317 -541 -403 22 348 642 432 -189 -793 -317 -73 441 897 649 77 -342
$$ packed form
2755f99j2K75Q81N74l23n27p57l12L68O29O14J25k77o93o39R9O03N18K84n2p21
2776d2m82m31M44O32O39N7n87n43n72OM68R74K55j57n81m67n90N61N67N54J08
2797H13n13o34o21J91N84O79L31k96n75o49l9K76P61L53L7l90n16m24K59L00M39
2818C66N05l04l67p49k01K63R77K29j49m73l64o64J73P65N14L09l40n95m44k36
2838g85L43P95L24J49p81m55k46J4N81O89p1J70q86n08N0L67O83L87o5p09m32
2859c86l55K37M61O64P4k06q25k28j33K62Q37K86R4n58o51n29K05J018M40J25
2879H32l29p70l46j0L34N27N13l05l51n78l83M94L61L39L97n46l46n08j09O97
2899h7N51K21K05r63k44k24J38M25L26K94k10o21o04M76K44N14M56k48n72m19
$$ plain form
2919 -342 -771 -384 285 419 445 287 -453 -501 -426 -254 353 402 364 -116 -549 -770 -381 225 219 584 240 -287
2941 -287 -481 -579 61 482 515 231 -87 -474 -545 -425 21 735 589 546 -279 -865 -483 64 182 584 701
2962 701 -130 -424 -636 -486 -8 502 613 72 -336 -857 -469 -106 667 731 503 -36 -563 -610 -290 343 413
2983 413 345 99 -602 -718 -551 235 379 617 354 -133 -719 -814 -202 196 603 337 201 -468 -597 -557 92
3004 92 474 772 281 -149 -720 -743 -213 125 694 502 69 -429 -450 -716 57 255 530 451 -275 -518 -460 -124
3026 -124 216 494 419 171 -344 -668 -261 380 347 681 343 -37 -353 -797 20 377 655 629 233 -365 -463
3047 -463 -497 -36 522 551 418 -195 -639 -691 77 481 656 289 93 -350 -586 -82 267 546 300 -10 -353
3068 -353 -494 -494 -185 474 771 422 -182 -190 -529 -171 126 521 692 210 -121 -501 -538 -96 319 330 231 275 -541
$$ packed form
2919c42m29L87O69J34K6j58p40m8P5J72O07M9l8m80m33k21L89O06oL65l44n27
2941b87j94r8O40M21L3k84l18l87p1J20M46P14j46m3q25n86L82N47J18M02J17
2962G01q31k94k12J50M78N10J11n41m08n21L88L63P73O4k28n39n27m7L20O33P0
2983D13o8k46p01j16J67P86J44K38k63m87n86r5O12L98M07k66j36o69j29M0O49
3004I2L82K98m91m30n71k3N30L38N69j92m33m98k1k66P73J98K75p9p26k43N8L36
3026a24L40K78p5k48n15l24M07O41l3L34l38l80l16m44Q17L57K78k6l96n98r8
3047d63l4M61N58K9j33o13m44n2P68M04J75l67j96m43k36N04L49K79k46l10l43
3068c53j41%L09O59K97l49o04ql39L58K97L95J71m82l31l80l7M42M15J1r9M4q16
$$ plain form
3091 -541 -529 -352 216 726 384 150 -488 -484 -286 -33 306 550 502 -8 -679 -510 -223 300 499 361 -36
3112 -36 -368 -466 -469 55 435 455 369 -259 -430 -748 -203 162 298 395 208 -276 -403 -151 -81 211 591 329 1
3135 1 -476 -651 -132 157 402 595 302 -450 -596 -170 34 560 763 317 -48 -541 -486 -247 385 716 224
3156 224 13 -608 -400 -238 46 304 762 208 -215 -335 -462 -431 169 471 376 -69 -304 -582 -546 194 606
3177 606 681 15 -172 -273 -533 -149 365 332 553 89 -180 -504 -375 57 516 250 413 -223 -411 -303 -157
3198 -157 256 186 282 -60 -528 -318 -175 18 522 434 225 -36 -493 -531 -303 230 599 266 67 -220 -553
3219 -553 -274 236 589 511 3 -179 -599 -440 -312 523 562 145 92 -371 -351 -95 44 551 357 212 40
3240 40 -294 -235 -152 348 348 335 -143 -439 -377 -3 243 265 577 164 38 -629 -320 -203 428 518 321 170 -436
$$ packed form
3091e41J2J77N68N10l42k34o38MJ98K53L39K44m8n10o71J69K87N23J99j38l97
3112c6l32r8lN24L80K0q6o28j71l18N45L65J36R7j87m84j27K52P0K92L80k62l28
3135Am77j75N19K89K45J93k93p52j46M26K04N26K03m46l65m93N5K39O32L31m92
3156B24k11o21K08J62K84K58M58n54m23j20j27L1O00L02r5m45k35k78L6P40M12
3177F06P5o66j87j01k60L84N14l3K21m64k69l24J29M32M59k66J63o36j88J08J46
3198a57M13p0R6l42m68K10J43J93N04q8k09k61m57l8K28N33L69l33j99k87l33
3219e53K79N10L53p8n08j82m20J59J28Q35L9m17n3m63K0K56J39N07j94j45j72
3240D0l34N9Q3N00%j3m78k96O2L74K46K2L12m13j26o67L09J17O31R0j97j51o06
$$ plain form
3263 -436 -440 -474 159 263 279 65 -284 -545 -307 -92 516 398 213 -22 -623 -427 -299 307 291 234 72 -330
3285 -330 -257 -139 -167 393 315 178 -326 -532 -404 -49 135 293 381 -96 -543 -504 -165 -140 413 92 154 -190
3307 -190 -369 -346 -224 196 317 278 180 -436 -505 -450 200 409 595 9 -316 -572 -399 -148 368 493 319 -27
3329 -27 -183 -705 -244 201 226 447 35 -352 -708 -557 -3 345 427 292 197 -291 -600 -340 182 465 316
3350 316 215 -342 -308 -253 -50 354 296 317 -23 -437 -459 -311 64 346 477 -40 -97 -518 -464 74 193 327
3372 327 44 -104 -378 -482 -187 -5 636 178 -7 -218 -499 -341 203 350 496 497 -64 -421 -500 -256 225
3393 225 345 377 26 -316 -622 -476 -102 298 278 106 165 -501 -427 -417 83 445 408 -147 -438 -440 -227 -170 201
3416 201 368 54 -197 -579 -239 -23 228 342 282 14 -283 -454 -80 -49 92 319 353 -51 -234 -267 -120
$$ packed form
3263d36ml4O33J04J6k14l49k61K38K15O08j18j85k35o01J96J28O06j6n7j62m02
3285c30P3J18k8N60p8j37n04k06J28L55J84J58Q8m77m47L9L39K5N53l21O2l44
3307a90j79K3J22M20J21l9r8o16o9N5O50K09J86n86l25k56J73K51N16J25j74l46
3329b7j56n22M61M45K5K21m12l87l56J51N54L48Q2j35r5m88l09K60N22K83j49
3350C16j01n57L4N5K03M04n8K1l40m14k2J48L75K82J31n17n7m21N4N38J19J34
3372C27k83j48k74j04K95J82O41m58j85k11k81J58N44J47J46Jn61l57p9K44M81
3393B25J20L2l51l42l06J46L74M00k0j72N9o66P4J0N00L62l7n55k91kK13N7L71
3416B01J67l14k51l82L40K16K51J14o0k68k97j71L74L1J41K27L4m04j83l3J47
$$ plain form
3437 -120 201 311 393 -7 -188 -269 -133 125 802 242 167 -124 -452 -409 257 120 214 310 -82 -289 -184 -278
3459 -278 -75 359 384 368 -196 -308 -384 -125 65 503 317 91 -424 -304 -15 233 394 275 417 -222 -232
3480 -232 -152 -52 45 527 326 3 -204 -373 -252 410 163 399 305 -122 -244 -478 -99 279 551 -68 94
3501 94 -382 -259 -330 -20 560 418 153 -296 -269 -58 -50 416 -20 39 -68 -247 -291 -221 43 346 295 -33 -76
3524 -76 -358 -168 -282 -10 563 313 -5 -299 -135 -139 341 416 391 46 -189 -326 -92 -16 243 415 114 -136
3546 -136 -335 -324 -167 183 459 328 1 -330 -561 112 128 190 101 187 -265 -125 -304 53 236 417 405 -155
3568 -155 -111 -453 -248 -115 669 573 227 0 -251 -423 -268 207 350 275 -126 -331 -592 -282 -182 369 93
3589 93 200 -209 -461 -147 -283 386 514 191 202 -191 -143 -34 -3 301 310 390 -443 -211 -306 -1 284 379 285
$$ packed form
3437a20L21J10Q2m00j81q1J36K58O77n60p5k91l28M3O66j37R4R6l92k07J05r4
3459b78K03M34K5j6n64j12p6K59J90M38j86k26n15J20K89K48J61j19J42o39j0
3480b32Q0J00R7M82k01l23k07j69J21O62k47K36r4m27j22k34L79L78K72o19J62
3501I4m76J23p1L10N80j42k65m49K7K11QM66m36N9j07j79m4P0K64L03n1l28m3
3524g6k82J90j14K72N73k50l18k94J64mM80P5k5l45k35j37K34P6K59J72l01k50
3546a36j99J1J57L50K76j31l27l31k31O73J6O2q9Q6m52J40j79L57J83J81j2n60
3568a55M4l42K05J33P84r6l46k27k51j72J55M75J43p5m01k05k61L10J00N51k76
3589I3J07m09k52L14j36O69J28l23J1l93M8J09L1L04RQ0q33K32r5L05K85R5r4
$$ plain form
3612 285 -161 -361 -413 -270 144 385 22 290 -168 -171 -101 52 326 410 240 -31 -113 -313 -266 139 15 284
3634 284 319 -196 -95 -131 -52 230 651 209 -163 -345 -324 -407 25 366 311 51 -156 -409 -273 128 53 269
3656 269 456 -152 -122 -185 -217 45 192 380 42 -54 -138 -427 60 402 416 220 -237 -60 -223 -42 89 423
3678 423 97 116 -112 -468 -156 36 192 424 416 43 -378 -146 -191 107 410 322 159 -122 -205 -272 0 75 401
3701 401 468 -79 -425 -392 -158 -83 314 417 -216 -117 -299 -316 232 127 225 114 73 -118 -160 0 -26 124 274
3724 274 66 -247 -355 -85 -80 150 305 136 -30 -125 -199 -348 101 166 171 302 -268 -360 -295 126 263 248 175 -5
3748 -5 -270 -281 118 230 257 148 -23 -431 -138 -103 -26 63 283 98 -82 -412 -289 63 218 138 63 -3 -73 -471
3772 -471 -134 24 131 146 84 -120 -317 -215 96 -17 286 399 -7 -236 -406 -300 82 300 292 -3 -336
$$ packed form
3612B85m46k00n2J43M14K41l63K68m58lP0J53K74Q4j70k71q2k00M7M05j24K69
3634B84L5n15J01l6P9K82M21m42l72j82K1q3M32L41n5k60k07k53J36M01p5K16
3656B69J87o08L0o3l2K62J47J88l38r6q4k89M87L42J4j96m57J77j63J81J31L34
3678D23l26J9k28l56L12J92J56K32ql73m21K32m5K98L03q8j63k81q3o7K72P5L26
3701D01O7n47l46L3K34P5L97J03o33R9j82j7N48j05R8j11m1j91m2J60k6J50J50
3724B74k08l13j08K70NK30J55j69j66r5p4j49M49O5NJ31n70r2O5M21J37j5p3j80
3748ek65j1L99J12K7j09j71m08K93L5P7Q9K20j85j80l30J23L52J55q0p5o6p0l98
3772d71L37J58J07J5o2k04j97J02L11j13L03J13m06k29j70J06L82K18qk95l33
$$ plain form
3793 -336 -119 -272 47 266 115 25 -112 -188 -140 -116 -93 454 141 233 38 -407 -250 -55 239 200 184 -90 -129
3816 -129 -362 -261 199 388 420 61 -159 -74 -518 -217 245 240 170 -55 -270 -290 28 78 221 376 87 -379
3838 -379 -391 -260 146 87 188 240 -263 -160 -161 -5 347 251 185 -187 -213 -173 -153 -31 193 116 1 -317 -57 -250
3862 -250 6 201 443 229 -87 -223 -158 -15 153 192 272 164 -14 -125 -325 -8 230 300 160 -28 -227
3883 -227 -176 -150 -7 153 359 213 -43 -169 -161 48 376 141 257 -182 3 -145 -53 145 112 279 77 -179
3905 -179 -168 -241 -16 27 127 63 44 -72 -347 140 50 211 306 165 -238 -346 -255 11 167 273 195 -76 -365
3928 -365 -260 -124 170 11 16 10 -270 -212 -218 141 374 295 69 -3 -287 -285 -193 11 271 -11 119 -286 -217 -67
3952 -67 50 111 286 69 29 -132 -418 41 -5 293 199 -176 -22 -409 -293 6 87 159 178 -6 -286 -409 -275
$$ packed form
3793c36K17j53L19K19j51r0j37p6M8K4K3N47l13R2j95m45J57J95K94l9j6k74l9
3816a29k33J01M60J89L2l59k20Q5m44L01M62np0k25k15k0L18N0J43J55k89m66
3838c79j2J31M06n9J01N2n03J03jJ56L52r6o6l72k6M0K0J22K24p7j15l18K60j93
3862b50K56J95K42k14l16j36O5J43J68L9Q0j08j78j11k00L17K38P0j40j88j99
3883b27N1K6J43J60K06j46k56j26QK09L28k35J16m39J85j48R2J98l3J67k02k56
3905a79J1p3K25M3J00o4j9j16k75M87r0J61R5j41m03j08R1K66J56J06p8k71k89
3928c65J05J36K94j59Nok80N8oL59K33p9k26p2k84KR2K04K60k82J30m05O9J50
3952f7J17O1J75k17m0j61k86M59m6K98r4l75J54l87J16K99Q1P2J9j84k80j23J34
$$ plain form
3975 -275 125 378 317 -168 -97 -362 -175 50 293 127 228 179 -266 20 -348 357 625 156 98 -335 -310 -70
3997 -70 84 218 402 -128 52 -414 -192 -118 54 179 137 -5 -447 -121 -354 22 93 105 220 -74 -259 -255
4019 -255 -118 4 200 222 -77 -324 -125 -208 89 301 265 254 94 -113 -202 -56 281 188 180 -101 82 -342 -104
4042 -104 13 136 223 52 -70 -98 -249 17 154 479 96 256 -116 -95 -52 107 290 219 128 -23 87 -170
4064 -170 127 226 165 88 53 -436 -200 129 136 93 211 133 21 6 59 -122 244 284 212 -186 -92 -205 -73 193
4088 193 177 -86 147 -167 -347 34 94 140 54 247 -53 -159 -246 -199 227 277 234 -10 -103 -93 -82 24 91 263
4112 263 30 36 -94 -540 -23 159 64 252 -119 -175 -362 -238 49 -9 283 381 27 -253 -337 -145 44 155
4134 155 262 -206 -294 56 -107 75 163 -160 306 -107 -252 -40 46 -6 240 117 15 -411 -257 -43 95
$$ packed form
3975b75M00K53o1m85P1k65J87K25K43j66J01m9m45K86l68P05K68m69n8m33K5K40
3997g0J54J34J84n30J80m66K22P4J72J25m2j42m42L26k33L76P1J2J15k94j85M
4019b55J37J22J96K2k99k47J99q3K97K12l6j1j60k07q9J46L37r3qk81J83m24K38
4042a04J17J23Q7j71j22k8j51K66J37L25l83J60l72K1M3J59J83p1r1j51J10k57
4064a70K97R9o1p7l5m89K36L29Pm3J18p8j12j5N3j81L66M0p2l98R4j13J32K66
4088A93j6k63K33l14j80L81O0M6q6J93l00j06q7M7M26N0m3k44r3J0J1J06O7J72
4112B63k33Oj30m46N17J82r5J88l71n6j87J24K87n8K92R8l54k80q4J92J89J11
4134A55J07m68q8L50j63J82Q8l23M66m13j45K12Q6n2K46j23j02m26J54K14J38
$$ plain form
4155 95 140 248 158 37 -83 -138 -155 90 262 256 53 -103 -333 125 37 177 122 -67 -41 -334 -115 98 258
4178 258 334 54 44 16 -333 -168 -80 41 119 165 -280 -81 -278 -200 19 306 237 68 -357 -61 -42 20 -100
4201 -100 132 24 89 -72 -186 -19 -6 211 275 -173 -294 -266 -353 27 134 256 112 -246 -299 -31 44 182
4223 182 5 -23 -27 -59 -57 172 75 181 -17 298 -274 -193 -92 87 260 307 -42 -91 -321 -189 -393 219 174 -82
4247 -82 116 -16 -311 -263 142 141 173 -46 -78 -80 -257 -80 -96 287 59 -46 -28 -209 -102 -33 34 340 -199 50
4271 50 -173 -365 195 187 215 378 -102 -230 -166 -352 131 232 181 125 -94 -303 -2 -240 53 200 234 -141 -193
4294 -193 -216 -373 -160 178 110 128 -47 -246 -193 -185 159 146 41 -128 -38 -175 -263 -48 137 369 27 -226 -216
4317 -216 -235 -214 -47 74 -96 -26 -357 -251 -62 235 311 277 196 -86 -236 20 -58 114 281 93 94 -394 -370
$$ packed form
4155I5M5J08r0j21j20n5j7K45J72ok03j56k30M58q8J40n5j89K6k93K19K13J60
4178B58P6k80j0k8l49J65Q8J21P8M6m45J99j97P8K19K87o9j69m25K96J9O2j20
4201a00K32j08O5j61j14J67J3K17O4m48j21K8q7L80J07J22j44l58n3K68P5J38
4223A82j77k8ml2KK29r7J06j98L15n72Q1J01J79J73M7l49m9k30J32k04O12m5k56
4247h2J98j32k95M8M05jL2k19l2kj77J77j6L83k28j05J8j81J07O9O7L06n39K49
4271E0k23j92N60qK8J63m80j28O4j86M83J01n1n6k19k09L01k38K93J47L4l75n2
4294a93k3j57K13L38o8J8j75j99N3QL44j3j05j69R0j37q8K15J85K32l42k53J0
4317b16j9K1J67J21j70P0l31J06J89K97P6l4q1k82j50K56p8J72J67j88Jm88K4
$$ plain form
4340 -370 -43 126 331 238 189 98 -431 -205 116 2 85 261 50 -386 -197 -282 60 177 382 248 -163 -221
4362 -221 -309 -82 187 212 257 145 -19 88 61 230 178 129 96 -77 -354 16 -46 21 354 161 -9 -272 -153
4385 -153 -230 93 82 334 48 36 -303 59 137 -106 190 73 2 -142 -20 -24 123 80 194 92 -309 -118 51
4408 51 -153 197 411 239 -22 -246 -163 -25 99 416 415 32 -303 -317 -359 4 194 156 48 -139 -316 -199
4430 -199 -46 21 207 234 -128 -46 -205 -72 23 -11 205 -27 160 -32 -103 134 -227 286 283 -234 -241 -143 161 101
4454 101 161 273 172 -133 -175 48 -4 -86 435 157 -84 -164 -300 -95 41 227 11 -99 -150 -198 52 140 226
4477 226 420 387 385 -125 -103 -74 -65 155 151 -106 73 76 -133 -27 207 122 68 74 -194 -33 -70 -104 165 12 31 -254
4503 -254 -391 -16 82 149 -58 -195 58 -254 -175 -3 120 52 89 97 -223 -268 -316 -144 123 147 126 132 -204 16
$$ packed form
4340c70L27J69K05r3m9r1n29K26L21j14Q3J76k11m36J89q5L42J17K05j34m11n8
4362b21q8K27K69K5M5j12j64J07k7J69n2m9l3j73k77L70o2O7L33j93j70k63J19
4385a53p7L23j1K52k86j2l39L62P8k43K96j17p1j44J22mJ47m3J14j02m01J91J69
4408E1k04L50K14j72k61k24Q3J38J24L17jl83l35j4m2L63J90l8j08j87j77J17
4430a99J53O7J86K7l62Q2j59J33R5l4K16k32J87j92p1K37l61N13ln17pR8L04o0
4454A01O0J12j01l05m2K23n2q2N21k78k41q0j36K05J36J86k16j10n1m8K50Q8Q6
4477B26J94l3kn10K2K9RK20mk57J79Lk09J06K34q5n4Ok68J61l7l4K69j53J9k85
4503b54j37L75R8O7k07j37K53l12P9J72J23o8L7Ql20m5m8J72K67K4k1Ol36K20
$$ plain form
4527 16 -145 202 172 269 -25 -11 -40 -193 93 103 80 92 100 -294 -91 -217 86 134 257 6 -106 -207 -64 133
4551 133 212 133 -55 -63 -153 -428 -349 -8 22 161 115 59 -140 -137 119 348 101 -139 -160 -129 -41 -137 142 220 184 -44
4577 -44 -66 120 -333 131 116 58 68 -54 -261 -125 -54 103 333 -4 100 -199 -59 -163 -175 119 -44 245
4599 245 15 -268 73 139 -28 -65 300 -126 -84 -163 -64 28 146 102 -197 -361 -102 64 84 171 -76 -116 87
4622 87 -47 -291 -308 -101 -30 290 -1 -66 -162 7 16 158 146 -58 -105 -214 -112 -338 153 157 314 -49 -166 -309
4646 -309 -78 127 275 183 221 -21 -140 -112 -44 23 243 -120 95 -304 119 28 -45 -3 183 302 -18 -294 -309
4669 -309 52 209 167 41 -171 -159 5 -189 8 261 31 202 33 -212 -258 -124 -304 47 209 -121 -226
4690 -226 -177 -120 -82 226 53 192 67 59 -141 -72 7 11 82 -167 -94 46 29 33 -76 -58 -160 228 -149 -271 -168
$$ packed form
4527A6j61L47l0R7k94J4k9j53K86J0k3J2Ql94K03j26L03M8J23k51j12j01J43J97
4551A33P9p9j88qr0k75P9L41L0J39m6n6j99LK56K29k47k40k1L1Q8r6K79P8l6k28
4577d4k2J86m53M64j5n8J0j22k07J36P1J57K30l37J04k99J40j04j2K94j63K89
4599B45k30k83L41O6j67l7L65m26M2p9R9R2J18m4k99j64K59J66K0Q7k47m0K03
4622H7j34k44j7K07P1L20k91o5r6J69RJ42j2k04m7j09J02k26M91MJ57l63j17j43
4646c09K31K05J48r2L8k42j19K8O8O7K20l63K15l99M23r1p3M2J86J19l20k76j5
4669c09L61J57m2j26k12J2J64j94J97K53k30J71j69k45m6J34j80L51J62l30j05
4690b26M9N7L8L08j73J39j25qk00O9P9MP1k49P3J40j7Mj09J8j02L88l77j22J03
$$ plain form
4715 -168 101 310 -207 -42 -25 -264 -91 103 22 236 -128 77 -159 -219 -77 -253 252 89 -54 -146 -303
4736 -303 -347 -109 276 141 -99 -58 -186 -111 75 -123 15 74 -23 -64 -253 65 95 332 -110 -99 80 -328 -191
4759 -191 -92 210 -33 38 48 72 -459 205 -195 106 395 390 139 -111 -52 -80 -28 37 77 -274 -230 -50 -167 -241
4783 -241 223 248 -30 -375 -13 2 180 63 156 -125 84 -158 17 135 83 212 124 38 -190 -130 53 -130
4805 -130 34 221 113 -131 -111 -66 -151 141 57 184 11 -42 35 -94 99 1 54 46 84 -198 -278 25 149 114
4829 114 104 49 -474 -353 103 -50 43 -37 -12 -25 -118 -228 -110 -98 100 9 -93 -12 -180 -166 -138 107 96 304
4853 304 -56 -77 -85 222 154 169 281 137 -61 -313 -109 9 108 -72 -18 48 -301 -213 -67 -112 267 317 -19 26
4877 26 -182 -129 -56 262 -45 91 -234 -196 -11 -121 -12 57 115 -54 138 -80 7 210 221 -106 -184 73 -238
$$ packed form
4715a68K69K09n17J65J7k39J73J94q1K14l64K05k36o0J42j76N05j63j43r2j57
4736c03m4K38L85j35k40M1j28P5J86j98J38N9r7m1j89L18L0K37m42J1J79m08J37
4759a91R9L02k43P1J0K4n31O64m00L01K89nk51k50N9k8N2O5M0l51M4J80j17p4
4783b41M64K5k78l45L62J5J78j17R3k81K09k42J75J18n2J29q8q6k28O0J83j83
4805a30J64J87j08k44K0M5q5K92q4J27j73n3P7j29J93r8N3qL8k82q0L03J24l5
4829A14j0n5n23J21M56j53R3q0K5j3r3j10J18J2J98r1j02Q1j68J4K8K45j1K08
4853C04l60k1qL07o8J5J12j44j98k52K04J18R9j80N4O6l49Q8J46m5L79N0l36M5
4877B6k08N3P3L18l07J36l25L8J85j10J09O9N8j69J92k18Q7K03J1l27p8K57l11
$$ plain form
4900 -238 -326 139 88 140 -124 -24 -369 -47 142 -186 167 116 242 88 107 -263 217 2 -139 -24 -58 -103
4922 -103 41 -64 -181 186 14 56 -135 -105 57 -82 27 263 -2 76 -335 -182 -190 -149 -8 178 -234 69
4944 69 -10 40 75 116 176 135 -118 150 -304 72 195 191 198 68 -82 -229 -225 15 28 -119 -122 -42 72 -220 -36 -2
4970 -2 259 171 -17 -290 -152 -26 73 142 67 33 -410 -109 135 -3 173 79 202 158 -93 -310 57 95 50 8
4994 8 -55 -325 -45 -188 -111 160 80 88 8 53 -175 -143 17 85 88 70 -37 -362 -110 -166 263 158 150 -160 -186 -257
5020 -257 -249 -98 -37 102 195 -146 -153 35 -133 347 88 -72 -107 -188 -140 34 28 17 141 141 -204 -103 -218 -1 -2
5045 -2 280 -20 -87 -224 -86 -108 57 32 203 -187 -51 -271 156 127 288 133 -33 -13 -60 8 -53 -60 10 75 -204
5070 -204 -59 -147 -81 -48 110 -48 -19 -167 -171 115 -387 82 -47 84 260 -202 220 -108 -147 -52 201 112 -2
$$ packed form
4900b38q8M65n1N2k64J00l45L22J89l28L53n1J26j54J9l70M80k15j41J15l4m5
4922a03J44j05j17L67j72M2j91L0J62j39J09K36k65P8m11J53qM1J41J86m12L03
4944F9p9N0L5M1O0m1k53K68m54L76J23mPj30j50j47MK40J3j47lQ0J14k92J84L4
4970bK61q8j88k73J38J26R9O9p5l4m43L01K44j38J76r4J23m4k51k17L67L8m5m2
4994Ho3k70K80j43P7K71q0Qq0M5k28L2J60O8Lj8j07l25K52n6M29j05ql10k6p1
5020b57QJ51O1J39R3l41pJ88j68M80k59j60l5q1M8J74oj1J24%l45J01j15K17j
5045bK82l00o7j37J38k2J65k5J71l90J36k20M27k9J61j55j66K0m7O8o1pP0O5k79
5070b04J45q8O6L3J58j58K9j48mK86n02M69j29J31J76m62M22l28l9R5K53q9j14
$$ plain form
5093 -2 -263 102 -236 291 220 231 287 64 -321 -339 14 87 346 115 -165 65 -235 -151 90 131 54 -100 -212
5116 -212 -130 -297 -146 142 94 56 -3 -19 -227 -164 137 -47 13 -33 -2 -309 -37 59 124 -95 25 67 147 34
5140 34 154 231 28 -234 26 -170 -39 -116 -77 80 -44 215 0 20 -16 79 65 184 -21 3 -8 38 157 173
5164 173 58 -56 17 -107 -208 -145 -24 181 205 -63 268 -6 -374 -8 -136 13 47 380 -319 -294 -86 133
5186 133 196 158 50 305 -181 -268 -53 19 -66 -31 -172 -77 -40 -57 -29 88 113 -127 -371 -40 106 55 185 34
5210 34 107 98 -49 -35 -139 248 -101 180 164 130 -81 11 168 -48 114 52 112 -33 239 -73 -97 -63 349 222
5234 222 -188 -77 28 -208 91 186 -96 123 -186 -226 -179 -127 -56 67 10 -133 80 -238 95 -73 257 78
5256 78 50 -79 -43 86 71 18 291 -1 -44 2 -94 -125 -21 221 -47 -33 -344 62 -344 -40 -52 -79 -163 -154 -68
$$ packed form
5093bk61L65l38N27p1J1N6k23l85j8L53P3K59k31k80K30l00Q4K41M1p7j54j12
5116b12Q2j67J51K88m8l8n9j6k08O3L01j84O0m6L1l07K72R6O5k19J20M2Q0j13
5140C4J20P7k03k62K60j96J31p7L9J57j24K59k15K0l6R5j4J19k05K4j1M6J19J6
5164A73j15j14P3j24j01O3J21K05K4k68L31k74l68L66j28J49L4L33o99K5K08K19
5186A33O3l8j08K55m86q7K15P2q5L5j41R5L7j7K8J17K5k40k44L31J46n1J30j51
5210C4P3rj47J4j04L87l49K81j6l4k11R2J57k16J62o2O0j45K72l12k4L4M12j27
5234B22m10J11J05k36K99R5k82K19l09m0M7N2P1J23n7j43K13l18L33j68L30j79
5256G8k8j29L6J29j5n3K73k92m3M6r6l1J04K42k68J4l11M06m06L04j2k7q4RQ6
$$ plain form
5281 -68 -143 -26 86 64 287 78 -155 55 -45 163 59 103 -49 -73 -49 -77 84 -91 82 148 -34 -430 -340
5304 -340 -111 -230 139 6 -52 -101 -410 78 -128 -92 -86 116 148 -321 -49 -350 95 63 29 135 239 -116 9
5327 9 81 93 171 -27 116 -158 -85 65 8 23 -111 -222 121 -314 -73 -180 120 115 -9 -27 17 159 -25 33
5351 33 64 124 126 99 86 -72 53 -64 -170 244 -107 -307 -148 134 72 -11 142 -245 18 37 16 232 -29 25
5375 25 111 -348 -125 0 -373 -1 56 47 97 -3 -120 -220 -147 -91 85 -24 -205 -64 -209 -335 312 185 91
5398 91 131 17 -133 -74 25 -33 32 7 -152 110 -127 -8 -49 239 102 -141 -88 2 4 -74 65 124 57 218 14
5423 14 -65 -315 -59 -94 8 97 -44 -105 -3 -92 -115 -19 135 72 -186 -423 -204 13 -8 276 191 -151 -94 21
5447 21 -125 -116 -20 119 211 -255 -8 22 6 35 -133 48 196 -10 172 -40 31 318 -4 -10 -356 -120 149 88
$$ packed form
5281f8p5J17J12k2K23k09k33K10j00K08j04M4j52k4K4k8J61j75J73O6j82l96R0
5304c40K29j19L69j33n8m9l09M88k06L6OK02L2m69K72l01M45l2l4J06J04l55J25
5327IP2J2P8j98J43k74P3J50n7J5j34j11L43m35K41j07L00nj24j8M4J42j84N8
5351C3L1O0Kk7j3j58J25j17j06M14l51k00J59K82o2q3J53l87K63J9k1K16k61N4
5375B5Q6m59K23J25l73L72N7rN0j00j17j00P3N6J76j09j81J41j45j26O47j27r4
5398I1M0j14j50N9R9n8O5k5j59K62k37J19m1K88j37k43N3R0Kp8J39N9o7J61k04
5423A4p9k50K56l5J02Q9j41o1J02q9k3R6J54o3k58k37K19K17k1K84q5l42N7J15
5447B1j46RR6J39R2m66K47L0j6K9j68J81J48k06J82k12P1K87l22ol46K36K69o1
$$ plain form
5471 88 -12 132 255 117 -225 -78 175 224 168 -296 -60 12 34 -112 97 106 -235 100 -105 -92 -104 48 -70
5494 -70 -13 -53 -51 -119 -83 -196 124 -118 55 7 52 -152 104 -50 -63 -63 111 30 -51 169 -173 -118 -80 14 102 -51
5520 -51 59 -166 130 148 38 -103 136 -143 -13 19 -43 111 145 6 -24 14 1 -109 -29 -62 -157 -41 -123 14
5544 14 -16 -28 17 260 -176 -279 -20 156 -53 23 252 -228 205 -125 -131 -171 82 236 175 -160 109 17 96 -87
5568 -87 170 102 117 -191 -279 -76 -161 77 -91 253 -256 11 -218 -44 58 241 -225 -9 -203 -104 -220 -105
5590 -105 99 18 -190 -8 -59 44 -124 29 -70 2 -97 -129 33 127 54 137 42 -203 -138 -79 120 -143 -47 30 -198
5615 -198 -45 35 -381 -247 7 46 -83 -97 -142 -141 -106 52 182 190 -88 -192 65 142 76 121 257 -82 -22 -213
5639 -213 -127 -259 90 229 114 37 192 -141 -201 -122 -188 188 257 -62 80 -23 -16 188 -10 144 155 67 -75
$$ packed form
5471H8j00J44J23j38l42J47K53M9n6m64K36P2K2j46K09Rl41L35k05J3j2J52j18
5494g0N7m0Ko8L6j13L20k42J73m8M5k04K56j54j3%J74q1q1K20l42N5L8R4Q8j53
5520e1J10k25K96J8j10j41K39k79J30L2o2J54L4j39l0L8j3j10Q0l3r5J16q2J37
5544A4l0j2M5K43m36j03K59J76k09P6K29m80M33l30om0K53J54o1l35K69r2P9j83
5568h7K57o8J5l08q8K03q5K38j68L44n09K67k29J74J02J83m66K16j94R9j16J15
5590a05K04q1k08J82n1J03j68J53r9P2r9l2J62R4p3Q3r5k45O5N9J99k63R6P7k28
5615a98J53Q0m16J34K54L9j29j4m5JL5J58J30Qk78j04K57P7o6M5J36l39O0j91
5639b13Q6j32L49J39j15p7J55l33o0P9o6L76O9l19J42j03PK04j98J54J1q8j42
$$ plain form
5662 -75 77 60 44 141 154 316 -71 -341 121 -160 61 87 90 31 -16 -93 10 41 -14 300 -60 -22 -213 -172 108
5687 108 302 -36 -58 -173 88 11 182 167 260 76 144 -60 -270 -215 177 18 134 0 16 19 -132 121 29
5710 29 84 156 92 -149 -150 173 36 -66 183 -64 -116 -119 -33 23 41 -80 74 299 -50 43 -41 -63 42 73 41 -34
5736 -34 -171 -169 61 157 -94 104 -38 -244 -122 143 -167 33 223 -66 -291 -187 152 251 -40 -76 -224 -2
5758 -2 136 -143 -62 -168 245 0 -68 -67 146 1 -94 61 -105 75 -168 -8 11 150 140 146 182 -10 -301 -127
5782 -127 182 -239 -166 79 -52 107 325 -75 94 -104 79 -47 97 -289 -105 -117 288 -192 -41 61 -184
5803 -184 -157 256 -140 -262 -60 -103 -59 -157 -64 64 172 280 150 31 -246 -288 -89 -10 10 -62 -13 -284 88
5826 88 -59 148 -129 179 87 -172 148 -67 23 -45 98 200 -112 -245 -258 -204 111 -121 86 145 -232 -26
$$ packed form
5662g5J52j7j6R7J3J62l87k70M62k81K21K6Ln9m7p7J03L1n5L14l60L8j91M1K80
5687A08J94l38k2j15K61p7J71j5R3j84O8k04k10N5L92j59J16j34J6Lj51K53r2
5710B9N5P2o4k41jL23j37j02K49k47n2lQ6N6J8j21J54K25l49R3q4k2J05L1l2p5
5736c4j37KK30R6k51J98j42k06J22K65l10K00J90k89k25J04L39R9k91l6j48K22
5758bJ38k79Q1j06M13k45o8JK13j45r5J55j66J80k43J60J9J39j0OL6j92k91J74
5782a27L09m21P3K45j31J59K18m00J69j98J83j26J44l86J84j2M05m80J51J02k45
5803a84K7M13l96j22K02m3M4r8R3J28J08J08j30j19k77m2J99P9K0p2M9k71L72
5826H8j47K07k77L08r2k59L20k15R0o8J43J02l12j33j3N4L15k32K07N9l77K06
$$ plain form
5848 -26 -368 115 -121 26 247 58 -105 221 110 -29 311 102 99 -147 -218 -103 1 -67 6 97 -70 116
5870 116 95 11 -98 -177 61 -64 -64 -53 -75 -163 152 97 -119 19 96 48 -45 119 -155 -56 -141 74 -123 59 -128
5895 -128 188 64 -71 263 37 -28 -79 113 -61 -320 140 -150 58 -313 -148 47 219 70 -214 -90 -293
5916 -293 -69 97 -214 -300 147 -198 223 -269 -153 -66 -285 -84 40 -116 -186 28 143 -1 137 130 -140 152
5938 152 196 76 245 314 155 66 -186 33 -253 46 144 -148 -32 209 19 46 -145 -325 50 38 59 -61
5960 -61 -121 -18 -125 47 107 135 -81 -168 133 -256 91 -134 -19 92 200 46 25 101 95 118 13 55 26 -250
5984 -250 -2 -119 197 -169 257 3 -212 36 91 220 120 354 34 44 38 16 -145 52 68 -116 -375 -195
6006 -195 -121 12 -184 26 -33 -46 -164 41 142 -12 -142 -111 3 59 -20 180 83 1 -283 -3 -136 -52 63
$$ packed form
5848b6l42M83k36J47K21j89j63L26j11j39L40k09lk46p1J15J04o8P3R1j67J86
5870A16k1q4j09p9K38j25%J1k2q8L15n5k16J38P7m8r3J64k74R9q5K15j97J82j87
5895a28L16j24j35L34k26o5n1J92j74k59M60k90K08l71J65J95J72j49k84J24k03
5916b93K24J66l11q6M47l45M21m92J16Q7k19K01J24j56p0K14J15j44J38pk70K92
5938A52M4j20J69O9j59q9k52K19k86K99R8k92J16K41j90K7j91j80L75j2K1j20
5960f1o0J03j07J72O0K8k16q7L01l89L47k25J15J11J08j54k1P6oK3j05M2k9k76
5984b50K48j17L16l66M26k54k15K48N5J29j00K34l20J0ok2j61J97J6j84k59J80
6006a95P4J33j96K10n9j3j18K05J01j54j30L1J14N6p9K00r7q2k84K80j33Q4J15
$$ plain form
6029 63 29 139 40 145 -25 -73 -188 -96 -9 49 -209 -38 -134 116 -126 197 -47 102 54 75 -80 -171 122 -57
6053 -57 142 -69 157 -278 -83 -237 -257 153 111 162 95 -249 29 -210 -31 61 -50 -127 154 -218 -18 68 157
6076 157 -59 -62 -79 -71 64 -245 -188 103 5 -177 31 -114 -236 -140 -13 37 -64 -213 15 -25 -86 -36 428 107
6100 107 -286 40 -6 -209 -25 20 104 224 7 -133 -54 32 -4 -78 -85 -107 28 -406 -62 71 21 -92 -110 127
6124 127 -192 71 22 47 -7 101 -274 -139 -8 -166 -76 -28 12 -139 -318 196 -137 88 80 213 -222 -60 -26
6147 -26 -65 -193 -204 -1 133 197 108 58 272 -161 132 72 198 155 206 23 -127 -179 -37 -130 -110 245 -11 202
6171 202 26 105 -68 -71 37 44 -4 -145 -100 37 239 91 -79 44 -94 -68 -39 115 137 73 147 60 -31 129 148
6196 148 -98 251 -90 -234 -141 -160 105 90 95 95 -110 -177 -85 -45 173 -9 199 -57 -124 135 -269 -143 119 -172
$$ packed form
6029F3l4J10r9J05j70m8j15R2Q7N8k58J71r6K50k42L23k44J49m8K1j55r1K93j79
6053e7J99k11K26m35J95j54k0M10m2N1o7l44K78k39J79R2j11p7K81l72K00Q6Q9
6076A57k16lj7QJ35l09N7K91r8j82K08j45j22R6J27N0j01j49K28m0o1N0M64l21
6100A07l93L26m6k03J84M5Q4J20k17j40P9Q6l6p4pk2J35m34L44J33n0j13j8K37
6124A27l19K63m9K5n4J08l75J35J31j58R0M8M0j51j79N14l33K25qJ33m35J62L4
6147b6l9j28j1K03J34O4q9n0K14m33K93o0J26m3N1j83j50n2J42r3K0L55k56K13
6171B02j76P9j73lJ08Pm8j41M5J37K02j48j70J23j38K6K9J54K2o4P4q7r1J60J9
6196A48k46L49l41j44R3j9K65j5N%k05o7R2M0K18j82K08k56o7K59m04J26K62k91
$$ plain form
6220 -172 -59 43 -47 93 -31 -136 -103 74 -136 -118 221 130 -42 -52 41 -8 -156 19 113 -216 20 157 -297
6243 -297 103 -74 44 215 -71 253 -51 249 -124 -6 159 165 31 204 -185 -101 -33 -86 258 150 109 -119
6265 -119 167 88 -27 -65 36 91 -45 -3 76 61 -6 142 -35 95 -89 152 -2 -37 -61 79 324 230 -39
6288 -39 -64 40 221 112 369 14 -39 57 -103 -107 -13 23 -280 -57 -16 84 -56 123 -135 131 -87 -42 -107 -120
6312 -120 -72 -64 395 -183 197 -105 -6 56 -9 -155 60 -41 101 116 -138 -112 -164 64 -30 16 -212 42 -88 -122
6336 -122 -22 -19 285 277 199 -51 43 170 151 143 230 27 60 217 118 -381 -204 26 49 -90 -145 121 -154 89 -35
6361 -35 -80 186 -131 41 -95 38 154 79 121 -39 101 36 77 1 134 85 90 -27 -75 -48 -49 157 -53 24 -40
6386 -40 207 118 -56 -3 144 -195 -145 -91 54 27 92 149 20 237 -23 -49 -39 61 -144 157 -111 -61 136 -302
$$ packed form
6220a72J13J02r0J40j24j05L3J77k10J8L39r1j72j0R3m9j48J75R4l29K36J37m54
6243b97M00j77J18J71k86L24l04L00l73J18J65Oj34J73l89Q4O8n3L44j08m1k28
6265a19K86p9j15l8J01N5j36M2P9j5o7J48j77J30j84K41j54l5k4J40K45r4k69
6288c9k5J04J81j09K57l55n3R6j60mR4L6l03K23M1J00j40J79k58K66k18M5o5j3
6312a20M8QM59n78L80l02R9O2o5j46K15j01J42J5k54K6n2K28r4M6k28K54j30l4
6336a22J00LL04qp8k50R4J27j9qQ7k03L3J57r9m99J77K30K3j39n5K66k75K43j24
6361c5m5K66l17J72j36J33J16p5M2j60J40o5M1p6J33m9Nj17m8K7jK06k10P7o4
6386d0K47q9j74N3J47l39N0N4J45k7O5N7j29K17k60k6J0J00k05L01k68N0J97m38
$$ plain form
6410 -302 102 -91 0 235 -34 -125 187 47 -32 59 133 -21 -55 210 116 29 130 161 114 120 -130 -88 -4 85 92 -63
6436 -63 248 -189 -110 -238 -52 110 116 115 21 -86 100 -128 244 57 -126 104 0 203 -127 119 203 33 70
6459 70 -18 -123 -7 -358 21 156 60 -99 197 -55 99 2 -86 328 127 147 -62 158 41 121 164 -224 35
6482 35 -228 399 -85 197 -16 28 108 -295 -173 -110 -311 27 265 -47 -108 67 -162 200 199 45 27 -183 44
6505 44 132 -52 -23 65 145 -27 -125 -19 183 -70 -52 156 -66 -97 -20 40 44 -175 1 0 -71 -4 -43 -7 -64 -77 153
6532 153 -8 -216 -48 56 93 -5 103 51 -124 88 -74 -192 -172 158 40 162 43 -224 79 149 139 -10
6554 -10 260 146 11 158 -143 154 19 -129 122 80 139 -11 -162 106 101 -187 -37 15 11 -150 59 -179 277
6577 277 291 173 34 -73 -185 105 -5 -85 219 -98 -143 0 -116 103 107 -80 82 -87 167 -140 -152 198
$$ packed form
6410c02M04j93R1K35k69r1L12j40p9R1P4j54l4K65r4q7J01L1m7Ok50M2Q4Q9Pj55
6436f3L11m37P9j28J86J62Ojr4j07J86k28L72j87j83K30j04K03l30K46Q4j70L7
6459G0q8j05J16l51L79J35r6j59K96k52J54r7q8M14k01K0k09K20j17Q0M3l88K59
6482C5k63O27m84K82k13M4Q0m03J22O3k01L38K38l12o1J75k29L62jj54j8k10K27
6505D4Q8j84K9Q8Q0j72r8J06K02k53J8K08k22l1P7O0Mk19J76jp1O7l9L6n7j3K30
6532A53j61k08J68J04L7r8J08n2j75K12j62j18K0L30j18J22j19k67L03P0j0j49
6554a0K70j14j35J47l01K97j35j48K51m2N9j50j51K68nk88J50N2mj61K09k38M56
6577B77J4j18j39j07j12K90j10q0L04l17m5J43j16K19Mj87J62j69K54l07j2L50
$$ plain form
6599 198 -246 -18 -21 -250 20 26 -53 136 96 -369 109 184 38 -61 -1 144 -103 39 -67 263 -287 -31 -56
6622 -56 -3 19 -93 9 -67 14 201 142 44 -11 -41 -23 -15 -219 -45 161 118 -84 -82 166 222 -156 25 26 123 58 -26
6649 -26 173 129 -44 57 -109 -64 -29 19 133 22 58 185 9 81 7 96 -14 88 213 -67 -58 16 200 -194
6673 -194 -162 -8 172 56 127 149 -83 -45 131 59 369 37 8 36 -124 100 -69 200 -115 -52 -23 -139 -36
6696 -36 43 136 21 223 24 -79 7 -129 21 -8 87 82 -314 153 59 40 -101 -54 76 -198 -124 -193 146 -80
6720 -80 78 169 130 40 -118 -60 39 102 84 24 113 13 101 -54 -113 117 -72 -93 102 -50 236 209 51 62 -208
6745 -208 48 -33 130 65 105 -33 -3 -148 33 -39 -159 58 144 169 320 -7 190 -233 5 17 -72 111 -127
6768 -127 121 -36 -82 214 3 33 140 -155 -21 -66 -5 11 -223 46 -197 -68 -43 -206 17 10 214 -169 -29
$$ packed form
6599A98m44K28lk29K70Op9J89m0m65M78P5j46r9O0J45k47J42j06L30n50K56k5
6622e6N3K2j12J02p6Q1J87n9r8n5l0J8Qk04J74K06m3k02KK48N6l78J81JR7o5q4
6649b6J99m4j73J01j66M5L5M8J14j11L6J27j76P2p4Q9j10J02J25k80RP4J84l94
6673a94L2J54J80j16P1K2k32L8J76p2L10l32k9K8j60K24j69K69l15O3K9j16J03
6696c6P9R3j15K02j99j03Q6j36J50k9R5nl96M67r4j9j41M7J30k74P4o9L39k26
6720h0J58R1l9r0j58N8R9O3j8o0Q9j00Q8j55n9K30j89k1J95j52K86k7j58J1k70
6745b08K56q1J63o5M0j38L0j45J81p2j20K17Q6K5J51l27J97m23K38J2q9J83k38
6768a27K48j57m6K96k11L0J07k95J34m5O1J6k34K69k43J29K5j63K23pK04l83J40
$$ plain form
6791 -29 69 25 -92 119 262 250 -57 -124 95 -106 40 142 99 18 -122 122 67 -82 100 -195 -217 5 229
6814 229 -149 235 225 168 10 56 -124 96 46 38 -50 62 -100 16 58 -55 89 138 66 163 68 -312 -14 28
6838 28 -123 54 209 292 139 -33 98 -95 -131 -88 103 -70 -56 -219 -59 -182 89 -2 -231 -67 28 -266
6860 -266 194 11 74 -106 219 106 44 111 -304 212 24 -344 -181 18 -8 94 157 90 23 10 222 -162 2
6883 2 -23 55 -78 -69 85 179 89 108 31 233 173 -186 273 104 76 -58 46 -171 154 264 22 334 21 -19
6907 -19 387 -6 -61 -53 -81 -2 -48 -18 -168 183 26 -105 -40 -225 -223 -58 113 -298 -285 79 -61 -20 345 -264
6931 -264 -204 -144 -184 207 -134 -272 -47 187 -8 70 57 -92 36 -96 -35 -392 -36 157 -47 -173 62 6
6953 6 -197 192 -106 81 -259 194 189 -146 12 182 123 -54 -96 127 60 -85 -25 181 16 298 200 233 10
$$ packed form
6791b9R8m4j17K11J43j2l07o7K19k01J46J02m3q1j40K44n5j49J82k95k2K22K24
6814B29l78L84j0n7j58M6j80K20n0qq8J12j62J16M2j13J44M9p2R7r5l80K98M2
6838B8j51J77J55Q3j53j72J31j93l6M3J91j73J4j63J60j23K71r1k29J64R5k94
6860b66M60j83O3j80L25j13o2O7m15N16j88l68J63J99k6J02O3o7o7j3K12l84J64
6883Bk5P8j33RJ54R4r0J9p7K02o0l59M59j69k8j34J04k17L25J10k42L12l13m0
6907a9M06l93n5Qk8P9m6L0j50L51j57j31O5j85KJ65J71m11J3L64j40M1L65o09
6931b64O0O0m0L91l41j38K25K34j95P8j3j49J28j32O1l57L56J93k04j26K35n6
6953Fk03L89k98J87l40M53nl35J58J70n9j77m2K23o7j45O0K06j65K82r8L3k23
$$ plain form
6976 10 79 215 82 -176 -183 -178 -51 120 -43 181 62 24 73 66 -171 -63 -97 -33 -18 -56 34 126 14 -85 -8 -294
7002 -294 352 69 144 -44 -121 -1 -89 152 21 -46 151 59 -149 142 -33 218 -90 -8 207 29 76 -3 -19
7025 -19 140 -56 -446 -226 -250 24 109 -60 168 -377 -127 -21 -207 43 64 -15 87 40 20 -80 -77 236 2
7048 2 -25 24 134 98 -98 -77 -139 -19 -188 -109 -165 148 -68 -267 -111 -255 -8 266 -62 -10 -57 90 93 -136
7072 -136 26 168 -233 -234 96 60 72 -10 76 6 -64 38 -53 -152 -72 27 27 -142 -32 84 15 -163 27 81 -176
7097 -176 50 -11 43 -88 -196 -145 76 170 4 -5 -27 126 55 -232 89 -267 304 -120 -15 61 -174 48 -91
7120 -91 -24 -6 241 130 -58 147 -61 -74 142 -90 -3 91 -4 -99 162 -40 -144 181 -52 107 73 -84 -89 3
7144 3 -48 86 37 92 -21 -36 -37 54 125 -22 151 46 -92 -24 99 -64 200 45 141 130 5 -41 -14 60 151 116
$$ packed form
6976A0O9J36j33k58pNJ27J71j63K24j19l8M9pk37J08l4O4J5l8R0R2j12r9P7k86
7002b94O46k83P5j88p7J20q8K41j31o7J97r2k08K91j75K51l08Q2K15j78M7p9j6
7025a9J59j96l90K20k4K74Q5j69K28n45K50J06j86K50K1p9J02m7k0j00LL13k34
7048Bk7M9J10l6j96K1o2J20j69P9n6L13k16j99J56j44K47K74l28N2m7J47Lk29
7072a36J62J42m01jL30l6J2q2Q6p0p0J02r1r9Q0R9%j69J10J16o9j78J90N4k57
7097a76K26o1N4j31j08N1K21R4j66rk2J53p1k87L21l56N71m24J05P6k35K22j39
7120i1O7J8K47j11j88K05k08j3K16k32Q7R4r5r5K61k02j04L25k33J59l4j57nR2
7144Cn1J34m9N5j13j5jR1P1j47J73j05j38O8J23j63K64j55R6j1j25m6K7P4R1l5
$$ plain form
7170 116 23 41 -50 -49 -26 -170 153 148 131 -96 75 79 130 133 13 119 51 77 21 -162 -127 88 -38 -19 25 -12 -116
7197 -116 196 248 151 -230 71 -8 164 213 -64 -41 -62 38 -147 -52 84 85 71 -3 -71 -3 118 -238 -135 -126 -182
7222 -182 -98 -165 111 51 2 -195 191 2 58 -127 0 280 -9 89 59 -61 -60 -61 27 -195 21 105 130 96 -63
7247 -63 68 -91 93 110 46 127 -4 16 0 79 291 -179 180 89 2 -137 265 100 -61 105 150 -31 -116 -52
7271 -52 91 64 29 -28 -56 135 55 130 236 96 128 262 39 90 27 -47 -52 -187 -84 -163 -25 145 -298 78 225
7296 225 151 -20 -193 -76 45 -60 -3 232 119 -53 71 -75 3 42 64 160 11 61 8 -189 68 -174 -245
7319 -245 173 -127 99 65 -97 -100 -101 -189 -124 -176 -364 101 52 -51 27 -196 -16 14 136 -141 37 -109 -35 -164
7343 -164 -107 -102 73 -95 -125 -69 -290 32 -114 17 68 9 147 143 -47 217 8 -20 -221 38 -249 -72 3 -17
$$ packed form
7170A16r3J8r1JK3j44L23nj7k27J71MN1Lj20J06o8K6n6j83L5K15j26J9M4l7j04
7197a16L12N2r7l81L01p9J72M9k77K3k1J00j85R5J36Jj4p4o8O8J21l56J03Rn6
7222a82Q4o7K76o0m9j97L86j89N6j85J27K80k89R8l0j20JjQ8k22K16Q4K5l4j59
7247f3J31j59J84J7o4Q1j31K0j6P9K12m70L59r1q7j39M02j65j61J66M5j81q5O4
7271e2J43k7l5n7k8J91q0P5J06j40L2J34k23N1o3p4nj35J03p9J38J70m43L76J47
7296B25p4j71j73J17J21j05N7K35j13j72J24j46P8L9K2R6j49N0n3j97K57k42p1
7319b45M18l00K26l4j62ljq8O5n2j88M65m9j03P8k23J80L0J22k77J78j46P4j29
7343a64N7NJ75j68l0N6k21L22j46J31N1n9J38mj90K64k09k8k01K59k87J77P5k0
$$ plain form
7367 -17 146 85 -64 8 214 -158 -116 205 -72 99 48 -105 30 7 -37 171 7 185 44 -34 -171 32 64
7390 64 162 -150 33 -46 -81 177 -74 0 127 217 36 -207 -16 -90 -55 -155 -170 47 36 71 115 284 28 -139
7414 -139 51 142 -257 -145 43 -68 -2 20 -189 213 -183 -16 -14 64 -120 -49 -13 -103 -155 45 -51 79 13 -150
7438 -150 10 358 77 -43 -71 388 174 32 -18 59 -19 -23 157 40 -46 57 -41 -74 -103 -56 -109 -107 -43 58 -17
7463 -17 80 61 -87 15 52 78 -36 4 -33 -45 119 28 -2 -45 78 -116 10 -137 56 267 -25 -12 -123 262
7487 262 20 23 -97 89 77 26 -164 -55 65 -130 -13 -52 28 -81 111 28 35 -19 220 -288 -156 29 -95
7510 -95 203 -196 136 5 -221 197 -11 -333 -59 -57 50 41 -90 -165 -166 -149 72 -23 -77 43 51 118 -101 220 -53
7535 -53 -131 118 49 -125 -63 -134 -45 98 35 -255 -165 -104 35 -79 -26 -106 -25 -2 -21 212 -193 -222 -158 47 121 -1
$$ packed form
7367a7J63o1j49P2K06l72M2L21k77J71n1j53J35k3m4K08j64J78j41p8j37K03L2
7390F4R8l12J83p9l5K58k51P4J27R0j81k43J91p4L5j00j5K17j1L5M4J69k56j67
7414a39J90R1l99J12J88j11O6K2k09M02l96J67KP8j84P1L6r0n2K00r6J30o6j63
7438a50J60L48k81j20k8M59k14j42n0P7p8mJ80j17q6J03r8l3k9M7n3KO4J01p5
7463a7R7j9j48J02L7K6j14M0l7j2J64r1l0m3J23j94J26j47J93K11k92J3j11L85
7487B62k42Lj20J86j2n1j90J09J20j95J17l9Q0j09J92q3Pn4K39n08J32J85j24
7510i5K98l99L32j31k26M18k08l22K74KJ07rj31p5jJ7K21r5n4J20QO7k19L21k73
7535e3p8K49o9j74O2p1Q9J43o3k90R0O1J39j14N3q0Q1K3j9K33m05k9O4K05P4j22
$$ plain form
7561 -1 65 57 105 100 -298 -12 94 -104 39 -200 121 39 -38 -116 104 181 -72 -30 85 -174 1 227 -17 -24 221
7586 221 106 99 -87 37 -229 -582 7 5 77 -6 109 90 -60 82 96 143 151 17 -233 143 192 -127 111 129
7610 129 14 -157 -84 22 120 -70 -169 -1 103 -228 81 168 176 72 -25 148 -8 -101 102 1 108 -103 -50
7633 -50 180 -160 -84 -115 85 -60 15 235 181 149 -26 -68 -31 85 -80 237 -115 165 -25 -7 -121 -15 -66
7656 -66 59 4 -65 -73 -232 42 52 -87 -41 200 213 -117 60 -46 184 171 -127 -120 76 61 -140 159 107 -58
7680 -58 6 32 179 -196 -49 -100 116 48 230 54 -6 -47 41 -10 77 138 15 -29 -7 -46 63 142 4 -40 -12 0
7706 0 58 59 -6 60 -148 -115 -8 -257 -237 158 -9 -25 49 166 -130 -52 -28 -2 102 -141 112 -56 -13 122 -63
7731 -63 -292 -105 53 90 -207 -111 -33 28 -102 204 174 -95 -1 213 -34 -188 -88 124 -83 -2 -135 -58 182
$$ packed form
7561aO6qM8nl98K86J06j98J43k39L21q2p7p8K20P7k53M2J15k59J75K26k44pK45
7586B21j15pj86J24k66l53N89kP2q3J15j9j50J42J4M7Qj34k50L76M9l19K38J8
7610A29j15j71P3J06R8j90r9J68J04l31L09Q7Qj04r7J73j56r3K03j01J07k11N3
7633e0K30l40P6l1K00j45P5K20n4l2j75m2L7J16j65L17l52K80j90J8j14J06n1
7656f6J25n5o9qj59K74J0j39M6K41J3l30J77j06K30j3k98PJ96j5k01K99n2j65
7680e8O4K6J47l75J47n1K16o8J82j76o0m1Q8n1Q7O1j23m4K2l9J09P9j38m4K8J2
7706@N8Jo5O6k08L3J07k49K0L95j67j6P4J17k96P8K4K6J04k43K53j68M3J35j85
7731f3k29J87J58L7k97R6P8O1j30L06l0k69R4K14k47j54J00K12k07Q1j33P7K40
$$ plain form
7754 182 119 -145 48 -59 -132 62 191 22 60 -133 124 134 -33 11 -82 -86 -208 35 164 -62 -32 27 135
7777 135 232 59 -19 126 -139 88 30 -102 88 -127 -61 -136 -132 35 111 55 -62 58 -25 -34 -123 -280 -2 154
7801 154 135 -2 57 263 -423 -83 182 147 81 108 -256 81 5 -5 21 7 69 49 -34 14 -86 0 -31 17 -25 105
7827 105 -11 151 -176 -36 72 81 129 -14 -81 -148 -118 9 67 38 45 -352 -39 -173 -9 -17 2 -21 92 201 17
7852 17 63 25 14 135 93 178 -82 25 -183 166 337 100 110 -200 -54 -22 -169 14 159 -37 -232 -18 99
7875 99 162 -16 65 179 -141 16 15 -47 67 -44 87 123 99 -64 63 54 120 258 -5 -58 -237 -115 -99 65
7899 65 -149 128 -149 20 24 152 115 -7 -114 -197 -157 6 75 -162 16 2 -35 25 -109 41 -83 37 139
7922 139 175 -32 -61 -31 22 116 -27 -120 277 5 123 -151 0 116 7 211 -138 1 5 200 -118 189 90
$$ packed form
7754A82o3k64J93j07p3J94J29j69L8j93K57J0j67M4r3mj22K43J29k26L0N9J08
7777A35R7j73p8J45k65K27n8j32J90k15O6p5MJ67P6n6j17J20q3rq9j57K78J56
7801A54j9j37N9K06o86L40K65l5o6K7l64L37p6j0K6j4O2k0q3M8j00Q6l1M8m2J30
7827A05j16J62l27J40J08RM8j43o7o7L0J27N8k9Pl97L13j34J64qJ9k3J13J09j84
7852A7M6l8j1J21m2Q5k60J07k08L49J71k37J0l10J46L2j47J83J45j96j95K14J17
7875I9O3j78Q1J14l20J57jo2J14j11J31L6k4j63J27rO6J38k63n3j79J22J6J64
7899F5k14K77k77J69MJ28l7j22j07q3M0J63O9k37J78j4l7O0j34J50j24J20J02
7922A39L6k07k9L0N3R4j43r3L97k72J18k74J51J16j09K04l49J39MJ95l18L07r9
$$ plain form
7945 90 126 81 -254 -222 -79 182 59 26 169 -63 165 -153 41 114 14 15 75 23 -59 126 96 191 -80 -63 -24
7970 -24 -124 56 128 -78 194 -167 -13 -149 108 -250 45 218 -57 -37 3 -55 -255 -61 -80 -20 -150 -71 11
7993 11 -10 -7 55 -201 67 102 -82 28 128 106 346 207 11 -32 -60 143 109 70 126 43 -40 55 144 -214 -35
8018 -35 -49 -141 18 -106 21 -23 -5 -31 -76 -17 -115 43 -37 181 -114 -11 -116 45 64 -141 49 59 -7 16 220
8043 220 -93 -235 65 -47 86 179 -106 72 -19 182 82 -163 -2 124 107 149 61 -87 -57 -126 26 -285
8065 -285 87 -106 67 -188 -29 223 164 2 -147 5 -227 21 -79 21 171 199 34 57 -100 44 238
8086 238 290 -103 16 -75 44 119 18 78 -174 -77 -105 -105 45 117 -36 -171 88 -72 74 -15 0 -199 71 -24
8110 -24 68 47 -23 73 64 107 -81 -123 -114 15 89 -65 275 131 113 -112 -121 -89 -98 272 -27 96 -7 -142 56 94
$$ packed form
7945I0L6m5l35L2J43K61j23l3J43k32K28l18J94P3j00JO0n2q2J85l0R5k71J7L9
7970b4j00J80P2k06K72l61J54j36K57l58K95J73k75K0M0n8k00J94j9O0j30P9Q2
7993A1k1LO2k56K68L5j84J10J00k2K40j39j96m3k8K03l4l9N6q3q3R5Q9l58J79
8018c5j4r2J59j24J27m4J8k6m5N9r8J58q0K18k95J03j05J61J9k05J90J0o6K3K04
8043B20l13j42L00j12J33R3k85J78r1K01j00k45J61J26j7M2q8j48L0o9J52l11
8065b85L72j93J73k55J59K52n9j62j49J52k32K48j00J00J50K8j65K3j57J44J94
8086B38N2l93J19r1J19P5j01O0k52R7k8%J50P2j53j35K59j60J46q9J5j99K70r5
8110b4R2k1p0R6rM3j88m2RJ29P4j54L40j44j8k25rL2rL70k99J23j03j35J98L8
$$ plain form
8136 94 89 69 163 -164 -219 -283 -77 226 75 -113 139 160 -18 -154 -140 128 204 203 -63 -33 -52 -63 -9 34 24 -92
8162 -92 199 12 88 -128 -186 114 100 27 -192 -85 198 -24 -14 -120 337 123 -23 47 101 -75 -58 28 -289
8185 -289 -9 70 166 -90 -156 -46
$$ packed form
8136I4nk0R4l27n5o4K06L03j51j88K52K1j78j36J4K68P6jk66L0j9j1N4M3j0j16
8162i2K91j87P6k16n8L00j4p3k19J07K83k22J0j06M57k14j46P0N4j76J7Q6l17
8185b89K80P9R6k56o6J10
8191d6
$$ Imaginary data points
##PAGE= N=2
##DATA TABLE= (X++(I..I)), XYDATA
$$ plain form
0 0 0 0 0 0 0 0 0 0 0 0 0 0 0 -8 8 -8 8 -8 12 -16 16 -24 24 -32 32 -40 48 -56 64 -72 81 -95 105 -121 136
35 136 -153 170 -191 213 -238 263 -294 326 -358 398 -438 484 -535 587 -647 712 -784 868 -956
54 -956 1057 -1171 1303 -1454 1634 -1843 2100 -2419 2825 -3366 4123 -5261 7153 -10875 20950
69 20950 -108059 -306918 -82546 70826 104532 108725 89046 4616 -92429 -160123 -107571 24167
81 24167 161942 184388 46778 -113974 -167046 -126647 22323 143924 106232 45033 24492
92 24492 -78249 -171262 -109048 55880 173899 143274 11271 -94907 -143862 -101596 23751
103 23751 106998 104936 67244 -6473 -88889 -136125 -98856 57335 176262 111807 -13060 -82124
115 -82124 -109910 -82697 -6334 82249 138258 80172 -49996 -112984 -96840 -44123 37230 113272
$$ packed form
0@%%%%%%%%%%%%%qJ6j6J6j6K0k8L2m0M8n6O4p2Q8j04J20j36J53j76K00k26K57
35A36k89L23l61M04m51N01n57O20o84P56q36R22j019J122j234J359j496J652j824
54i56K013k228K474k757L088l477L943m519N244o191P489r384J2414j8028L1825
69B0950j29009j98859K24372J53372L3706M193j9679q4430r7045o7694N2552J31738
81B4167J37775K2446j37610j60752n3072M0399J48970J21601l7692o1199k0541
92B4492j02741r3013O2214J64928J18019l0625j32003j06178m8955M2266J25347
103B3751Q3247k062l7692p3717q2416m7236L7269J56191J18927o4455j24867o9064
115h2124k7786K7213P6363Q8583N6009n8086j30168o2988J6144N2717Q1353P6042
$$ plain form
127 113272 125316 25985 -110662 -127367 -48181 14442 74383 112601 61877 -33920 -101015 -102248
139 -102248 -35122 47956 104515 106310 19728 -92738 -125684 -61026 39883 90378 73615 42057
151 42057 -10997 -90595 -108673 -34524 59467 110032 86665 2230 -84133 -112663 -52473 43815
163 43815 81595 63677 36096 -10491 -75719 -106488 -48521 70962 128884 66998 -29057 -79945
175 -79945 -79762 -39652 19721 70617 81938 37594 -29292 -79839 -92167 -32985 68995 114734
187 114734 61196 -32621 -81565 -64068 -27499 9100 60387 88157 44882 -39602 -97375 -79490
199 -79490 -4973 65878 91624 55040 -23718 -75291 -66914 -27751 18688 60265 77274 42717
211 42717 -40960 -101017 -72433 8392 68574 78046 41969 -15578 -64234 -74656 -33004 29415
$$ packed form
127A13272J2044r9331j36647j6705P9186O2623N9941L8218n0724r5797o7095j233
139a02248O7126Q3078N6559J795q6582j12466l2946O4658J00909N0495j6763l1558
151D2057n3054p9598j8078P4149R3991N0565k3367q4435q6363k8530O0190R6288
163D3815L7780j7918k7581m6587o5228l0769N7967J19483N7922o1886r6055n0888
175g9945J83M0110N9373N0896J1321m4344o6886n0547j2328N9182J01980M5739
187A14734n3538r3817m8944J7497L6569L6599N1287K7770m3275q4484n7773J7885
199g9490P4517P0851K5746l6584p8758n1573Q377L9163M6439M1577J7009l4557
211D2717q3677o0057K8584Q0825O0182R472l6077n7547m8656j0422M1652O2419
$$ plain form
223 29415 67450 67861 28257 -40509 -88862 -68908 6966 73009 76401 31402 -19739 -59300 -68770
236 -68770 -32756 28089 72277 68193 16644 -45658 -78816 -60615 4688 69229 78003 28645
248 28645 -30054 -59069 -56177 -29187 23085 72975 69858 11585 -51851 -78628 -51191 12465
260 12465 64612 69420 27779 -27226 -60263 -56240 -21908 27709 66237 65442 13297 -56642 -82114
273 -82114 -40994 20989 59866 60316 26848 -23661 -59330 -57823 -20044 32210 67664 58393 5346
286 5346 -55287 -75523 -38688 22783 61057 56286 20860 -22520 -55684 -57715 -20004 35606 69454
299 69454 53479 -1197 -54523 -68073 -34304 21371 59308 55451 18345 -26156 -54467 -52645
311 -52645 -17453 35457 69034 51934 -5162 -56842 -64618 -28276 22944 55169 51606 17208
$$ packed form
223B9415L8035M11l9604o8766m8353J9954P5874O6043L392m4999n1141l9561r470
236f8770L6014O0845M4188m084n1549o2302l3158J8201O5303O4541Q774m9358
248B8645n8699k9015K892K6990N2272M9890l117n8273o3436k6777K7437O3656
260A2465N2147M808m1641n5005l3037M023L4332M9617L8528p95n2145o9939k5472
273h2114M1120O1983L8877M50l3468n0509l5669J507L7779N2254L5454r271n3047
286E346o0633k0236L6835O1471L8274m771l5426m3380l3164k031L7711N5610L3848
299F9454j5975n4676n3326j3550L3769N5675L7937l857l7106m4501k8311J822
311e2645L5192N2910L3577j7100n7096n1680p776L6342N1220L2225l563l4398
$$ plain form
323 17208 -26433 -54300 -50470 -13933 37063 66652 47830 -7688 -57657 -62843 -22581 26993
335 26993 51172 44523 16882 -21844 -54100 -53367 -11224 42718 65473 40981 -12980 -56429 -56289
348 -56289 -18061 25024 48391 43463 15959 -22694 -53823 -52089 -8816 46395 66477 33890
360 33890 -20559 -52281 -46625 -17321 19587 46704 46468 16141 -27819 -56699 -46406 -1881 46189
373 46189 61138 29383 -21049 -49337 -43709 -15714 18852 44870 47728 16152 -33110 -58883
385 -58883 -40025 5281 45314 52717 25632 -16467 -47550 -46602 -13964 23146 45675 43676 11220
398 11220 -32846 -56011 -38194 8858 45646 47446 22683 -15237 -46320 -45853 -13529 26740 48931
411 48931 37090 3931 -30348 -50364 -37448 6819 46482 50855 18700 -23086 -43514 -38664
$$ packed form
323A7208m3641k7867L830L6537N0996K9589j8822n5518m9969n186M0262M9574
335B6993K4179o649k7641l8726l2256P33M2143N3942K2755k4492n3961m3449J40
348e6289L8228M3085K3367m928k7504l8653l1129J734M3273N5211K0082l2587
360C3890n4449l1722N656K9304L6908K7117k36l0327m3960k8880J0293M4525M8070
373D6189J4949l1755n0432k8288N628K7995L4566K6018K858l1576m9262k5773
385e8883J8858M5306M0033P403k7085m2099l1083R48L2638L7110K2529j999l2456
398A1220m4066k3165J7817M7052L6788J800k4763l7920l1083M67L2324M0269K2191
411D8931j1841l3159l4279k0016J2916M4267L9663M373l2155m1786k0428M850
$$ plain form
423 -38664 -12946 25846 47562 34935 2509 -31845 -48466 -32626 7070 46221 51770 14622
435 14622 -27409 -42939 -33149 -7588 21705 41061 39796 5381 -39022 -50442 -26237 13243
447 13243 45214 43710 11749 -24345 -42822 -31284 -4003 19733 40277 40385 2918 -40907 -52092
460 -52092 -22998 22219 43443 32505 10009 -18492 -39414 -34200 -8066 25782 46429 31995
472 31995 -3778 -37493 -49701 -19438 24659 39654 29493 8989 -17234 -35796 -36841 -9900
484 -9900 32602 48395 25406 -9326 -38152 -40080 -14439 15056 38496 37327 5242 -22801 -33739
497 -33739 -33657 -6889 32631 45610 24522 -13399 -38210 -33690 -13455 13612 38229 34257 7972
510 7972 -22586 -43146 -29221 6019 27156 36756 26904 -10847 -39344 -35584 -11839 18254 36517
$$ packed form
423c8664K5718L8792K1716j2627l2426l4354j6621J5840L9696L9151N549l7148
435A4622m2031j5530R790K5561K9293J9356j265l4415m4403j1420K4205L9480
447A3243L1971j504l1961l6094j8477J1538K7281K3736K0544J08l7467m3825j1185
460e2092K9094M5217K1224j0938k2496k8501k0922N214K6134L3848K0647j4434
472C1995l5773l3715j2208L0263M4097J4995j0161k0504k6223j8562j045K6941
484i900M2502J5793k2989l4732k8826j928K5641K9495K3440j169l2085k8043j0938
497c3739Q2K6768L9520J2979k1088l7921k4811M520K0235K7067K4617l972k6285
510G972l0558k0560J3925L5240K1137R600r852l7751k8497L760K3745L0093J8263
$$ plain form
523 36517 31781 7180 -27572 -40497 -21013 2880 25244 39344 22151 -10638 -35746 -39998
535 -39998 -10415 26515 34754 24090 4442 -21838 -35391 -27282 1557 33966 37234 15624 -10466
548 -10466 -35536 -37199 -7232 23813 36153 24361 -2919 -20627 -29030 -28440 -654 34514 39428
561 39428 16477 -18300 -38340 -27331 -3049 19314 32175 23591 2112 -20853 -36456 -25070
573 -25070 6706 31614 38105 14143 -23496 -34498 -20609 -3879 15602 30563 26691 3160
585 3160 -27298 -36987 -18127 8846 31242 34670 9674 -19241 -31871 -25131 -1420 20594 27146
598 27146 23616 4262 -26944 -38194 -18039 15156 34206 25532 5082 -13392 -29806 -26494 -2447
611 -2447 20350 31511 22587 -4268 -26731 -31631 -16497 13379 32277 26079 5710 -17084 -29042
$$ packed form
523C6517m736k4601l4752j2925J9484K3893K2364J4100j7193l2789k5108m252
535c9998K9583L6930Q239j0664j9648k6280j3553Q109K8839L2409L268k1610k6090
548a0466k5070j663K9967L1045J2340j1792k7280j7708q403N90K7786L5168M914
561C9428k2951l4777k0040J1009K4282K2363J2861q584k1479k2965j5603J1386
573b5070L1776K4908O491k3962l7639j1002J3889J6730J9481J4961l872k3531
585C160l0458r689J8860K6973K2396L428k4996k8915j2630O740K3711K2014O552
598B7146l530j9354l1206j1250K0155L3195J9050q674k0450j8474j6414L312K4047
611b447K2797J1161q924k6855k2463m900J5134K9876J8898o198k0369k2794j1958
$$ plain form
624 -29042 -22682 -3671 21475 33706 18184 -7086 -24358 -29541 -14563 13061 30520 26734 4287
637 4287 -19685 -27076 -20290 -1969 21275 30509 18349 -6281 -28608 -28335 -8654 12021 27390
650 27390 26807 4591 -20298 -28770 -18562 2760 20131 26118 18358 -5770 -28626 -28472 -8515
663 -8515 15175 28339 21534 2415 -17240 -28005 -18681 3532 21174 26684 15590 -8269 -26353
676 -26353 -26982 -8273 17325 28259 18867 238 -17275 -25269 -17798 1851 22662 27939 12163
689 12163 -10010 -25025 -25259 -6852 17062 27033 18613 -859 -18558 -24095 -15928 2524 22401
702 22401 27076 11926 -12011 -26834 -22328 -3420 15603 24930 18677 -1350 -19205 -24195 -14357
715 -14357 4719 21583 25065 11513 -12533 -27304 -20906 -1255 16603 23553 16064 -1212 -18354
$$ packed form
624b9042O360J9011K5146J2231j5522k5270j7272n183J4978K7624J7459l786k2447
637D287k3972p391O786J8321K3244R234j2160k4630k2327K73J9681K0675J5369
650B7390n83k2216k4889q472J0208K1322J7371N987p760k4128k2856J54J9957
663h515K3690J3164o805j9119j9655j0765R324K2213J7642N510j1094k3859j8084
676b6353o29J8709K5598J0934r392j8629j7513p994P471J9649K0811N277j5776
689A2163k2173j5015k34J8407K3914R971q420j9472j7699n537Q167J8452J9877
702B2401M675j5150k3937j4823M506J8908J9023R327o253k0027j7855m990R838
715a4357J9076J6864L482j3552k4046j4771O398J9651J7858O950p489j7276j7142
$$ plain form
728 -18354 -24460 -13379 6620 22113 23773 8857 -12830 -25521 -20085 -734 17597 22783 13876
741 13876 -2011 -17337 -23883 -13639 6974 23909 23391 5913 -14382 -23736 -17728 -453 16574
754 16574 22725 13997 -3145 -18253 -22390 -12613 7466 24168 22533 4080 -15281 -22567 -15593
767 -15593 31 15562 22040 14189 -3626 -19581 -22438 -9958 9623 22516 20112 3511 -15241
780 -15241 -22301 -14550 1011 15788 20940 13113 -4449 -20326 -21937 -7872 10937 21514 17774
793 17774 3021 -14385 -21829 -14432 2144 16958 20727 11038 -5612 -19134 -20319 -7002 11357
806 11357 21815 16603 1300 -14452 -20721 -13457 2666 17550 19986 9538 -6911 -18399 -18694
819 -18694 -6526 11157 21549 16315 -74 -15528 -19858 -11448 3276 16179 19275 9089 -7252
$$ packed form
728a8354o106J1081J9999J5493J660j4916k1687j2691N436J9351J8331N186q907
741A3876j5887j5326o546J0244K0613J6935n18j7478k0295r354O008J7275J7027
754A6574O151q728j7142j5108m137R777K0079J6702j635j8453j9361p286O974
767a5593J5624J5531O478p851j7815j5955k857J2480J9581J2893k404j6601j8752
780a5241p060P751J5561J4777N152p827j7562j5877j611J4065J8809J0577l740
793A7774j4753j7406p444P397J6576J4814L769r689j6650j3522j185J3317J8359
806A1357J0458n212j5303j5752o269P264J6123J4884K436j0448j6449j1488k95
819a8694J2168J7683J0392n234j6389j5454m330Q410J4724J2903L096j0186j6341
$$ plain form
832 -7252 -18826 -18033 -5247 11939 20974 15361 -903 -15965 -18983 -9612 4360 15656 18198 8973
846 8973 -7462 -19757 -17906 -3012 13272 19727 13195 -1703 -15240 -18178 -9467 4547 15948
859 15948 17321 7888 -7846 -20011 -17360 -1419 14016 19135 11068 -2679 -13668 -17111 -10392
872 -10392 4745 16886 17195 6363 -9440 -18778 -15313 -1631 13509 18625 9867 -3112 -13504
885 -13504 -17192 -9232 5666 16989 17249 4923 -10921 -17898 -13109 62 13043 17305 10474 -2858
899 -2858 -15349 -16073 -6776 5393 16464 17043 3726 -11006 -17531 -12467 814 12889 16368 10144
913 10144 -4053 -15420 -15538 -6482 6837 16378 14257 3222 -9758 -18213 -12423 2258 13241
926 13241 16012 8312 -4650 -13623 -15516 -6763 8617 16209 13103 3021 -11271 -17705 -11096 2123
$$ packed form
832g252j1574P93J2786J7186R035n613j6264j5062l018R371J3972J1296K542r225
846H973j6435j2295J851J4894J6284O455o532j4898j3537k938Q711J4014J1401
859A5948J373r433j5734j2165K651J5941J5435N119q067j3747j0989l443O719
872a0392J5137J2141L09j0832j5803r338L465J3682J5140N116q758j2979j0392
885a3504l688P960J4898J1323K60j2326j5844o977M789J3171J2981M262o831j3332
899b858j2491p24R297J2169J1071N79j3317j4732o525N064J3281J2075L479o224
913A0144j4197j1367j18R056J3319R541k121j1035j2980q455N790J4681J0983
926A3241K771p700j2962q973j893Q753J5380P592l106j0082j4292o434O609J3219
$$ plain form
940 2123 13858 15621 6603 -4946 -13173 -15149 -5733 8081 15948 14317 862 -12909 -15431 -9383
954 -9383 2123 13787 14649 6536 -4795 -14269 -14162 -4420 7853 16762 13617 -1032 -12211 -14798
968 -14798 -8501 3790 12429 13390 7498 -5699 -15168 -13572 -3589 9039 16377 10683 -836 -11742
982 -11742 -15413 -7419 4560 11694 13701 6589 -6638 -14530 -13335 -2356 11065 14702 9039 -1075
996 -1075 -11739 -14049 -7089 3710 12770 14092 4036 -6585 -13708 -12752 -1149 10400 14196 9225
1010 9225 -2068 -11830 -13176 -7611 4288 14101 12266 3114 -7284 -13969 -10863 -793 9162 14242
1024 14242 9633 -2978 -11863 -12936 -6228 5530 12311 11714 3892 -7963 -13683 -9750 -953 9934
1038 9934 14544 7900 -3195 -11979 -13107 -4211 6080 11639 11790 2651 -7904 -12842 -10427 13
$$ packed form
940B123J1735J763r018j1549q227j976R416J3814P867j631j3455j3771k522O048
954i383J1506J1664Q62q113j1331r474J07R742J2273Q909l145j4649j1179k587
968a4798O297J2291Q639R61n892j3197r469J596R983J2628P338n694j1519j0906
982a1742l671P994J1979P134K007p112j3227p892J195J0979J3421L637n663j0114
996a075j0664k310O960J0799R060J322j0056j0621p123R56J1603J1549L796m971
1010I225j1293r762j346N565J1899R813j835r152j0398o685L106J0070R955N080
1024A4242m609j2611q885j073O708J1758O781n97p822j1855n720L933Q797J0887
1038I934M610o644j1095q784j128Q896J0291N559J51r139j0555m938K415J0440
$$ plain form
1052 13 11448 12997 6846 -3000 -12572 -11807 -3706 5271 12035 10969 2136 -7695 -13643 -10385 1980
1067 1980 11371 12520 6333 -4439 -11058 -10166 -4913 5163 13079 10634 1509 -8465 -13416 -8390 1845
1082 1845 10389 12698 4990 -5032 -10478 -10703 -4059 6829 11855 9913 1489 -9648 -13215 -6903
1096 -6903 2474 10456 11341 4434 -4023 -10929 -11099 -2691 6548 11658 10041 135 -10078 -11817 -6738
1111 -6738 2794 10549 10250 4414 -4371 -11802 -10081 -1612 6780 11885 8733 -702 -9046 -11562 -6454
1126 -6454 3724 10146 10229 3857 -5597 -10602 -9020 -2375 7307 12531 7392 -1568 -8834 -11292 -5705
1141 -5705 3663 10098 10003 3111 -5691 -10070 -9044 -1284 7999 10802 6942 -1111 -9765 -10945 -4062
1156 -4062 3792 9766 9699 2984 -5796 -10651 -8460 -84 7729 10623 6906 -1957 -9940 -9995 -4253 4024
$$ packed form
1052A3J1435J549o151r846r572P65Q101Q977O764j066q833r831n948L258J2365
1067A980R391J149o187j0772o619Q92N253J0076P916k445r125r974m951N026J0235
1082A845Q544K309p708j0022n446k25O644J0888N026j942q424j1137l567O312
1096f903R377P982Q85o907q457o906j70Q408R239N110j617r906j0213j739N079
1111f738R532P755k99n836q785p431J721Q469Q392N105l152r435q344k516N108
1126f454J0178O422Q3o372r454n005J582O645R682N224n139q960p266k458N587
1141e705R368O435r5o892q802m379J026P760R283K803l860q053q654j180O883
1156d062P854N974o7o715q780m855K191Q376P813K894l717q863p983n5N742Q277
$$ plain form
1172 4024 9959 8855 2392 -5728 -10856 -8073 334 7894 10398 5806 -2746 -9068 -9841 -3793 4842
1187 4842 9715 8552 1754 -6082 -10186 -7507 324 8320 10196 4990 -3002 -8674 -9021 -3335 5152
1202 5152 9664 8181 1095 -6635 -9539 -6707 822 8098 9944 4637 -3295 -9327 -8581 -2535 4732
1217 4732 9533 8017 608 -6793 -9712 -6304 1617 8201 9500 4386 -4000 -9417 -8189 -1997 5251
1232 5251 8830 7018 479 -7026 -9755 -5806 2275 8026 9012 3868 -4295 -8896 -7884 -1682 5796
1247 5796 8807 6461 23 -6669 -9514 -5456 2531 8743 8404 2801 -4166 -8386 -7425 -1764 5582
1262 5582 9102 6186 -860 -7051 -9228 -4805 2794 8455 7963 2083 -4471 -8192 -6719 -1109 5469
1277 5469 8870 6152 -1215 -7482 -8508 -3734 3175 8050 7694 2134 -4928 -8236 -6454 -600 5348
$$ packed form
1172D024N935j104o463q120n128K783Q407P560K504m592q552o322p73O048Q635
1187D842M873j163o798p836m104K679P831P996J876n206p992n672l47N686Q487
1202E152M512j483p086p730k904K832P529P276J846n307p932o032P46O046P267
1217D732M801j516p409p401k919L408P921O584J299n114q386n417J228O192P248
1232E251L579j812o539p505k729L949Q081N751R86n144q163m601J012O202P478
1247E796L011k346o438o692k845M058P987O212l39n603o967m220R61N661P346
1262E582L520k916p046o191k177M423P599N661m92n880o554l721J473N610O578
1277E469L401k718p367o267j026M774O909M875l56n560p062l308J782N854N948
$$ plain form
1292 5348 8481 5804 -1316 -7765 -8211 -3411 3450 7582 7138 1971 -4720 -8239 -6108 9 6101
1307 6101 8094 4893 -1576 -7560 -7958 -3011 4081 7901 6450 1425 -4520 -8245 -5915 757 6581
1322 6581 7960 4141 -2016 -7058 -7454 -3078 4100 7900 6400 439 -4964 -7808 -5212 575 6269
1337 6269 8070 3787 -2716 -6994 -6907 -2405 3950 7648 6180 442 -5749 -7313 -4734 761 6374
1352 6374 7571 3636 -3147 -7282 -6747 -1511 4135 7172 5932 158 -5553 -7214 -4341 1392 6509
1367 6509 7110 3490 -2668 -7724 -6210 -927 4134 7171 5323 -154 -5320 -7428 -4506 2144 6536
1382 6536 6352 2693 -3503 -6957 -5932 -1110 4681 6894 4429 -295 -5169 -7632 -4063 2235 6185
1397 6185 6773 1619 -3606 -6300 -5681 -821 4878 6808 4660 -555 -5940 -6320 -3121 1607 6550 6661
$$ packed form
1292E348L133k677p120o449m46M800O861M132m44n167o691l519K131O117O092
1307F101J993l201o469n984l98M947P092L820j451n025n945l725K330O672N824
1322F581J379l819o157n042l96M376P178L800j500n961n403k844K596N787N694
1337F269J801m283o503m278Q7M502O355L698j468n738o191j564K579N495N613
1352F374J197l935o783m135N35N236N646L037j240n774n711j661K873N733N117
1367F509O01l620o158n056J514N283N061L037j848n477n166k108K922O650M392
1382F536j84l659o196l454J025M822N791K213k465m724m874k463L569O298L950
1397F185N88n154n225k694O19M860N699J930k148n215n385l80L199M728M943J11
$$ plain form
1413 6661 1385 -3716 -6546 -5333 -248 4676 6632 4669 -1280 -5665 -6018 -3373 2334 6632 6096
1428 6096 1635 -3803 -6894 -4557 384 4638 6622 4132 -1417 -5673 -6307 -2819 3046 6124 5435
1443 5435 953 -4593 -6532 -4335 369 4898 6103 3337 -1086 -5743 -6455 -1982 3569 6222 5251
1458 5251 528 -4153 -5868 -4699 535 5182 6078 3050 -1973 -6229 -5889 -1838 3369 6544 4799
1473 4799 -128 -3915 -5862 -4130 981 4832 6283 2946 -2729 -6022 -5184 -1414 3338 5698 4366
1488 4366 496 -4635 -6155 -3684 1167 5047 6306 2499 -2811 -5616 -5484 -849 3579 5551 4376
1503 4376 381 -4618 -6029 -3436 1239 5622 5334 1914 -2329 -5712 -5079 -473 3414 5574 4462
1518 4462 -601 -4579 -5371 -3302 1798 5327 4964 1882 -2712 -5771 -4430 -907 4033 6093 3603
$$ packed form
1413F661n276n101k830J213N085M924J956j963n949m385l53K645N707M298n36
1428F096m461n438l091K337M941M254J984k490n549m256o34L488N865L078o89
1443E435m482n546j939K197M704M529J205k766m423m657p12M473N551K653r71
1458E251m723m681j715J169N234M647Q96l028n023m256L40M051N207L175j745
1473D799m927l787j947J732N111L851J451l337n675l293Q38L770M752K360j332
1488D366l870n131j520K471M851L880J259l807n310k805J32M635M428J972j175
1503D376l995m999j411K593M675M383k88l420m243l383O33M606L887K160j112
1518D462n063l978p92K069N100L529l63l082m594l059J341L523M940K060k490
$$ plain form
1533 3603 -1095 -4522 -5290 -2517 1878 5055 4993 1681 -3253 -5444 -4329 -656 4302 5588 2967 -959
1549 -959 -4677 -5200 -1945 1723 4926 5324 1456 -3229 -5341 -4406 168 4291 4786 2955 -1134 -4897
1565 -4897 -4862 -2054 1811 5431 4675 928 -3046 -5478 -3665 709 3914 5081 3180 -1549 -4635 -4600
1581 -4600 -2191 2415 5430 4613 823 -3537 -5170 -3326 472 3827 5229 2299 -1721 -4471 -4992
1596 -4992 -1634 2927 5022 4111 653 -3681 -5040 -2955 431 4082 4947 2290 -1731 -4874 -4620 -1008
1612 -1008 2617 4783 4076 172 -3802 -4717 -3391 1048 4310 4498 2107 -1888 -4875 -4385 -1152 2830
1628 2830 5001 3601 -127 -3570 -4793 -3134 1070 4245 4300 1911 -2250 -4500 -3941 -988 3174 5179
1644 5179 3386 -489 -3610 -4483 -2578 1322 4358 4573 1583 -2272 -4483 -3913 -719 3463 4860 3140
$$ packed form
1533C603m698l427p68K773M395L177o2l312m934k191J115L673M958J286k621l926
1549i59l718n23L255L668L203L98l868m685k112R35M574M123M95j831m089l763
1565d897L5K808L865L620p56l747l974k432J813M374L205J167j901m729l086L5
1581d600K409M606L015q17l790m360j633J844L798L355J402k930m020k750n21
1596d992L358M561K095r11l458m334j359K085L386L651Q65k657m021l143K54L612
1612a008L625K166p07l904l974r15J326M439L262J88k391l995k987M90L233L982
1628B830K171j400l728l443j223J659M204L175N5k389m161k250N59K953M162K005
1644E179j793l875l121q73J905L900L036K15k990l855k211N70L194M182J397j720
$$ plain form
1660 3140 -728 -3957 -4392 -2182 1156 4143 3974 1346 -2374 -4644 -3626 -266 3154 4493 2973
1675 2973 -580 -3956 -4498 -2159 1625 4156 3913 1362 -2530 -4876 -3409 -268 3645 4490 2563 -700
1691 -700 -3808 -4191 -2022 1916 4295 3893 1019 -2581 -4346 -3448 -109 3315 4128 2359 -1093 -3726
1707 -3726 -3937 -1592 1906 4358 3812 516 -2709 -4114 -2946 102 3252 4249 2306 -1170 -3570 -3769
1723 -3769 -1312 1958 4200 3624 470 -2779 -4229 -2737 382 3442 3918 1938 -1346 -3779 -3869 -1182
1739 -1182 2306 3958 3269 317 -2888 -4277 -2325 710 3545 3888 1895 -1496 -3952 -3624 -915 2258
1755 2258 3860 2891 248 -2842 -4138 -2576 843 3430 3820 1560 -1367 -3755 -3425 -730 2204 4121
1771 4121 2909 84 -3086 -3991 -2412 1080 3407 3649 1603 -1898 -3566 -3211 -1069 2489 4081 2790
$$ packed form
1660C140l868l229m35K210L338K987j69k628l720k270J018L360L420J339j520
1675B973l553l376n42K339L784K531k43k551l892k346J467L141L913Q45j927l263
1691g00l108l83K169L938K379m02k874l600j765Q98L339L424Q13j769l452k633
1707c726k11K345L498K452n46l296l225j405J168L048L150R97j943l476k400j99
1723c769K457L270K242n76l154l249j450J492L119L060M76j980l284k433r0K687
1739a182L488J652o89k952l205j389J952L035K835L43j993l391k456L28K709L173
1755B258J602r69k643l090j296J562L419K587L90k260k927k388L30K695K934J917
1771D121j212k825l170r05J579L492K327K42k046l501j668L55K142L558J592j291
$$ plain form
1787 2790 -538 -3179 -3546 -2024 978 3599 3424 1155 -1927 -3627 -2893 -437 2813 3674 2307 -491
1803 -491 -3129 -3750 -1794 1128 3441 3740 1249 -2114 -3659 -2847 -230 2521 3563 2594 -801 -3496
1819 -3496 -3717 -1489 1241 3483 3057 913 -1968 -3938 -2791 459 2803 3604 1984 -572 -2962 -3636
1835 -3636 -1896 1766 3502 2789 596 -2153 -3704 -2805 208 3004 3377 1871 -799 -2991 -3132 -1359
1851 -1359 1524 3541 2940 385 -2339 -3296 -2469 59 2731 3353 1743 -1383 -3451 -3022 -923 1465
1867 1465 3316 2979 278 -2262 -3196 -2127 712 2688 3018 1837 -1119 -3496 -3074 -819 1954 3447
1883 3447 2676 218 -2458 -3357 -1952 599 2723 3217 1592 -1450 -3040 -2880 -575 2222 3061 2142
1899 2142 108 -2538 -3378 -1751 506 3005 3451 947 -1538 -3008 -2815 -538 2344 3248 2202 -130
$$ packed form
1787B790l328k641l67J522L002K621j75k269l082j700P34K456L250Q61j367k798
1803d91k638o21J956K922K313K99k491l363j545Q12K617K751J042r69l395k695
1819c496k21K228K730K242m26k144k881j970J147L250K344Q01j620k556k390o74
1835c636J740L662J736p13k193k749j551Q99L013K796L73j506k670k192j41J773
1851a359K883K017o01k555k724r57Q27K528K672O22j610l126k068M29K099K388
1867A465J851l37k701k540r34J069K839J976L30j181k956k377M22K255K773J493
1883C447p71k458k676q99J405K551K124M94j625l042j590J60K305K797Q39r19
1899B142k034k646q40J627K257K499M46k504k485j470J93K277K882R04j046k332
$$ plain form
1915 -130 -2664 -2794 -1680 822 3355 2939 865 -1661 -3403 -2359 -177 1907 2967 2462 -559 -2458
1931 -2458 -2961 -1663 1340 3048 2883 1010 -1600 -2930 -2095 -433 1936 3253 2123 -475 -2590 -3291
1947 -3291 -1416 1378 2490 2774 937 -1583 -2970 -2399 -225 2328 3088 1825 -357 -2617 -2885 -780
1963 -780 1180 2727 2692 359 -1389 -2816 -2516 269 2444 2703 1824 -820 -2625 -2396 -1196 1291 2843
1980 2843 2247 423 -1785 -2944 -1989 329 2425 2926 1379 -916 -2210 -2478 -848 1559 2708 2413
1996 2413 464 -2105 -2806 -1657 61 2375 3058 1231 -1050 -2603 -2543 -849 1462 2755 2141 -41
2012 -41 -2119 -2602 -1617 548 2321 2591 1033 -930 -2539 -2193 -265 1372 2968 2191 -166 -1887 -2847
2029 -2847 -1827 634 2359 2376 1293 -904 -2578 -2198 -459 1488 2916 1776 -424 -1915 -2548 -1477
$$ packed form
1915a30k534j30J114K502K533m16k074k526j742J044K182K084J060n05l021j899
1931b458n03J298L003J708j65j873k610j330Q35J662K369J317j130k598k115p01
1947c291J875K794J112K84j837k520j387N71K174K553P60j263k182k260k68K105
1963g80J960J547l5k333j748j427L00K785K175K59q79k644j805K29J200K487J552
1980B843n96j824k208j159R55K318K096N01j547k295j294k68J630K407J149k95
1996B413j949k569p01J149J718K314O83j827k281j553O0J694K311J293o14k182
2012d1k078m83R85K165J773K70j558j963j609L46J928J637J596p77k357j721r60
2029b847J020K461J725J7j083k197j674L80J739J947J428j140k200j491o33J071
$$ plain form
2045 -1477 668 2052 2511 932 -1324 -2531 -2181 -402 2012 2494 1394 -81 -2053 -2525 -997 545
2061 545 2511 2421 610 -1559 -2516 -1980 13 1845 2460 1793 -481 -2239 -2447 -1546 830 2655 2129
2078 2129 803 -1391 -2686 -1913 1 1857 2340 1403 -549 -2060 -1993 -1238 965 2446 2094 583 -1376
2095 -1376 -2425 -1820 -395 1800 2641 1438 -703 -2037 -2428 -628 1196 2340 2092 465 -1634 -2434
2111 -2434 -1648 221 2047 2326 1356 -615 -2128 -2218 -888 938 2266 2340 341 -1531 -2276 -1538 209
2128 209 1860 2123 1111 -693 -2202 -1874 -857 1540 2546 1928 230 -1331 -2308 -1560 386 1794
2144 1794 2160 1267 -1046 -2344 -1882 -519 1399 2337 1522 98 -1678 -2315 -1388 382 2125 2255 1002
$$ packed form
2045a477K145J384M59j579k256j207L50J779K414M82j100j475j972m72J528J542
2061E45J966r0j811k169r57N36J993J832O15o67k274j758k08R01K376J825n26
2078B129j326k194j295P73J914J856M83r37j952j511O7P55K203J481l52j511j959
2095a376j049O05J425K195Q41j203k141j334l91J800J824J144k48j627k099q00
2111b434P86J869J826K79r70j971j513r0J330J826J328P4j999j872p45P38J747
2128B09J651K63j012j804j509L28J017K397J006o18j698j561r77P48J946J408
2144A794L66q93k313j298M62J363J918R38q15j424j776o37R27J770J743J30j253
$$ [...]
8191b23
##END NTUPLES=NMR FID
##END=
