##TITLE=1H_SR70_k
 D2O, 8 sc, 
 9.07.2021
##JCAMPDX= 6.0         $$ Bruker NMR JCAMP-DX V2.0
##DATA TYPE= NMR FID
##DATA CLASS= NTUPLES
##ORIGIN= UXNMR, Bruker Analytische Messtechnik GmbH
##OWNER= root
$$ XWIN-NMR		Version 3.5
$$ Fri Jul  9 13:19:35 2021 Russian Standard Time (UT+4h)  she@DPX200
##.OBSERVE FREQUENCY= 200.131506
##.OBSERVE NUCLEUS= ^1H
##.DELAY= (6, 6)
##.ACQUISITION MODE= SIMULTANEOUS
##.ACQUISITION SCHEME= undefined
##.AVERAGES= 8
##.DIGITISER RES= 18
##SPECTROMETER/DATA SYSTEM= spect
##.PULSE SEQUENCE= zg30
##.SOLVENT NAME= CDCl3
##.SHIFT REFERENCE= (INTERNAL, CDCl3, 0, 15.7039)
##AUDIT TRAIL= $$ (NUMBER, WHEN, WHO, WHERE, WHAT)
$$ ##TITLE= Audit trail, XWIN-NMR		Version 3.5
$$ ##JCAMPDX= 5.01
$$ ##ORIGIN= Bruker BioSpin GmbH
$$ ##OWNER= she
$$ F:/spectra/data/she/nmr/H-F/1/audita.txt
$$ ##AUDIT TRAIL=  $$ (NUMBER, WHEN, WHO, WHERE, WHAT)
(   1,<2021-07-09 13:17:59.76 +0400>,<she>,<DPX200>,
      <created by zg, POWCHK disabled, PULCHK disabled
       configuration hash MD5:
       00 E9 B6 7A A2 85 ED C7 34 08 36 98 17 FE 4E 26
       data hash MD5: 16K
       35 E3 3D 23 CF 7E 0D 93 84 F2 8B 09 3A B3 FC 66>)
$$ ##END=
$$ 
$$ hash MD5
$$ F8 16 07 44 ED B2 38 C8 A3 0C 2B 81 F3 F6 A2 ED
##$RELAX= 
##$RELAX= 
##$RELAX= 
##$RELAX= 
##$RELAX= 
##$RELAX= 
$$ Bruker specific parameters
$$ --------------------------
##$DU= <F:/spectra>
##$EXPNO= 1
##$NAME= <H-F>
##$PROCNO= 1
##$TYPE= <nmr>
##$USER= <she>
##$AMP= (0..31)
100 100 100 100 100 100 100 100 100 100 100 100 100 100 100 100 100 100 
100 100 100 100 100 100 100 100 100 100 100 100 100 100 
##$AQSEQ= 0
##$AQ_mod= 1
##$AUNM= <au_zg>
##$AUTOPOS= <>
##$BF1= 200.13
##$BF2= 200.13
##$BF3= 200.13
##$BF4= 200.13
##$BF5= 200.13
##$BF6= 200.13
##$BF7= 200.13
##$BF8= 200.13
##$BYTORDA= 1
##$CFDGTYP= 0
##$CFRGTYP= 5
##$CHEMSTR= <none>
##$CNST= (0..31)
1 1 145 1 1 1 1 1 1 1 1 1 1 1 1 1 1 1 1 1 1 1 1 1 1 1 1 1 1 1 1 1 
##$CPDPRG= <>
##$CPDPRG1= <>
##$CPDPRG2= <>
##$CPDPRG3= <>
##$CPDPRG4= <mlev>
##$CPDPRG5= <mlev>
##$CPDPRG6= <mlev>
##$CPDPRG7= <mlev>
##$CPDPRG8= <mlev>
##$CPDPRGB= <>
##$CPDPRGT= <>
##$D= (0..31)
0 1.2 0 0 0 0 0 0 0 0.06 0 0.03 0 0 0 0 0.0002 0 0 0 0 0 0 0 0 0 0 0 0 
0 0 0 
##$DATE= 1625822279
##$DBL= (0..7)
120 120 120 120 120 120 120 120 
##$DBP= (0..7)
150 150 150 150 150 150 150 150 
##$DBP07= 0
##$DBPNAM0= <>
##$DBPNAM1= <>
##$DBPNAM2= <>
##$DBPNAM3= <>
##$DBPNAM4= <>
##$DBPNAM5= <>
##$DBPNAM6= <>
##$DBPNAM7= <>
##$DBPOAL= (0..7)
0.5 0.5 0.5 0.5 0.5 0.5 0.5 0.5 
##$DBPOFFS= (0..7)
0 0 0 0 0 0 0 0 
##$DE= 6
##$DECBNUC= <off>
##$DECIM= 32
##$DECNUC= <off>
##$DECSTAT= 4
##$DIGMOD= 1
##$DIGTYP= 9
##$DL= (0..7)
0 120 120 120 120 120 120 120 
##$DP= (0..7)
150 150 150 150 150 150 150 150 
##$DP07= 0
##$DPNAME0= <>
##$DPNAME1= <>
##$DPNAME2= <>
##$DPNAME3= <>
##$DPNAME4= <>
##$DPNAME5= <>
##$DPNAME6= <>
##$DPNAME7= <>
##$DPOAL= (0..7)
0.5 0.5 0.5 0.5 0.5 0.5 0.5 0.5 
##$DPOFFS= (0..7)
0 0 0 0 0 0 0 0 
##$DQDMODE= 0
##$DR= 18
##$DS= 0
##$DSLIST= <SSSSSSSSSSSSSSS>
$$ [...]
##$SUBNAM2= <"">
##$SUBNAM3= <"">
##$SUBNAM4= <"">
##$SUBNAM5= <"">
##$SUBNAM6= <"">
##$SUBNAM7= <"">
##$SUBNAM8= <"">
##$SUBNAM9= <"">
##$SW= 20.0188882624521
##$SWIBOX= (0..15)
0 0 2 0 0 0 0 0 0 0 0 0 0 0 0 0 
##$SW_h= 4006.41025641026
##$TD= 16384
##$TD0= 1
##$TE= 0
##$TE2= 300
##$TE3= 300
##$TEG= 300
##$TL= (0..7)
0 120 120 120 120 120 120 120 
##$TP= (0..7)
150 150 150 150 150 150 150 150 
##$TP07= 0
##$TPNAME0= <>
##$TPNAME1= <>
##$TPNAME2= <>
##$TPNAME3= <>
##$TPNAME4= <>
##$TPNAME5= <>
##$TPNAME6= <>
##$TPNAME7= <>
##$TPOAL= (0..7)
0.5 0.5 0.5 0.5 0.5 0.5 0.5 0.5 
##$TPOFFS= (0..7)
0 0 0 0 0 0 0 0 
##$TUNHIN= 0
##$TUNHOUT= 0
##$TUNXOUT= 0
##$USERA1= <user>
##$USERA2= <user>
##$USERA3= <user>
##$USERA4= <user>
##$USERA5= <user>
##$V9= 5
##$VALIST= <valist>
##$VCLIST= <CCCCCCCCCCCCCCC>
##$VD= 0
##$VDLIST= <DDDDDDDDDDDDDDD>
##$VPLIST= <PPPPPPPPPPPPPPP>
##$VTLIST= <TTTTTTTTTTTTTTT>
##$WBST= 1024
##$WBSW= 4
##$XGAIN= (0..3)
0 0 0 0 
##$XL= 0
##$YL= 0
##$YMAX_a= 412921
##$YMIN_a= -520123
##$ZGOPTNS= <>
##$ZL1= 120
##$ZL2= 120
##$ZL3= 120
##$ZL4= 120
##$ABSF1= 10
##$ABSF2= 0
##$ABSG= 5
##$ABSL= 3
##$ALPHA= 0
##$AQORDER= 0
##$ASSFAC= 0
##$ASSFACI= 0
##$ASSFACX= 0
##$ASSWID= 0
##$AUNMP= <proc_1d>
##$AZFE= 0.1
##$AZFW= 0.1
##$BCFW= 1
##$BC_mod= 2
##$BYTORDP= 1
##$COROFFS= 0
##$CY= 11.3945322036743
##$DATMOD= 1
##$DC= 2
##$DFILT= <>
##$DTYPP= 0
##$F1P= 17.5019972093344
##$F2P= -2.517084195857
##$FCOR= 0.5
##$FTSIZE= 0
##$FT_mod= 4
##$GAMMA= 1
##$GB= 0.15
##$INTBC= 1
##$INTSCL= 1
##$ISEN= 128
##$LB= 0.24
##$LEV0= 0
##$LPBIN= 0
##$MAXI= 10000
##$MC2= 0
##$MEAN= 0
##$ME_mod= 0
##$MI= 1.114404
##$NCOEF= 0
##$NC_proc= 0
##$NLEV= 6
##$NOISF1= 3.799351
##$NOISF2= 2.8
##$NSP= 1
##$NTH_PI= 0
##$NZP= 0
##$OFFSET= 15.70392
##$PC= 1
##$PHC0= -12277.26
##$PHC1= 5.200995
##$PH_mod= 1
##$PKNL= yes
##$PPARMOD= 0
##$PSCAL= 0
##$PSIGN= 0
##$REVERSE= no
##$SF= 200.130013532006
##$SI= 16384
##$SIGF1= 3
##$SIGF2= 2
##$SINO= 400
##$SIOLD= 16384
##$SREGLST= <1H.CDCl3>
##$SSB= 0
##$STSI= 0
##$STSR= 0
##$SW_p= 3612.71676300578
##$SYMM= 0
##$S_DEV= 0
##$TDeff= 0
##$TDoff= 0
##$TI= <>
##$TILT= no
##$TM1= 0
##$TM2= 0
##$TOPLEV= 0
##$USERP1= <user>
##$USERP2= <user>
##$USERP3= <user>
##$USERP4= <user>
##$USERP5= <user>
##$WDW= 1
##$XDIM= 8192
##$YMAX_p= 0
##$YMIN_p= 0
$$ End of Bruker specific parameters
$$ ---------------------------------
##NTUPLES= NMR FID
##VAR_NAME=  TIME,          FID/REAL,        FID/IMAG
##SYMBOL=    X,             R,               I
##VAR_TYPE=  INDEPENDENT,   DEPENDENT,       DEPENDENT
##VAR_FORM=  AFFN,          ASDF,            ASDF
##VAR_DIM=   8192,          8192,            8192
##UNITS=     SECONDS,       ARBITRARY UNITS, ARBITRARY UNITS
##FACTOR=    0.0002496,     1,               1
##FIRST=     0,             0,               0
##LAST=      2.0444736,     0,               0
##MIN=       0,             -520123,         0
##MAX=       2.0444736,     412921,          0
$$ Real data points
##PAGE= N=1
##DATA TABLE= (X++(R..R)), XYDATA
$$ plain form
0 0 0 0 0 0 0 0 0 0 0 2 -8 8 -8 8 -12 16 -17 24 -32 33 -42 50 -58 73 -82 97 -115 131 -152 175 -198 227
32 227 -260 292 -333 373 -416 471 -523 585 -653 723 -804 890 -984 1088 -1201 1322 -1461
49 -1461 1607 -1770 1950 -2150 2373 -2622 2900 -3221 3586 -4010 4510 -5109 5842 -6766 7965
64 7965 -9596 11965 -15716 22607 -39475 173481 72801 -376778 -370898 -218763 78578 326229
76 326229 385936 123717 -194946 -386547 -310108 -18577 321209 410813 201398 -161270 -396108
87 -396108 -340066 -25782 276226 370255 217032 -72802 -332651 -352418 -109342 205906 358985
98 358985 269913 -3664 -286657 -376461 -179791 158852 370364 294670 18731 -253042 -347153
109 -347153 -196439 101401 306754 281316 93254 -145217 -332857 -296227 12258 323517
$$ packed form
0@%%%%%%%%%Kj0J6j6J6k0K8l3M1n6O5p5R2j08J31j55J79k12K46k83L27l73M25
32B27m87N52o25P06p89Q87r94J108j238J376j527J694j874K072k289K523k783
49a461L068l377L720m100M523m995N522o121O807p596Q520r619J0951j2608J4731
64G965j7561K1561k7681L8323o2082K12956j00680m49579N880J52135K97341K47651
76C26229N9707k62219l18663j91601P6439K91531L39786Q9604k09415l62668k34838
87c96108N6042L14284L02008R4029j53223k89834k59849j9767K43076L15248J53079
98C58985q9072k73577k82993q9804J96670L38643K11512p5694k75939k71773r4111
109c47153J50714K97840K05353k5438j88062k38471j87640L6630L08485L11259
$$ plain form
119 323517 346030 110197 -164594 -311389 -250725 -15832 224842 304524 180341 -71932
129 -71932 -283897 -291988 -88211 178167 325756 236204 -43332 -285862 -293538 -95449 140008
140 140008 279478 240249 22283 -223184 -295412 -151590 83270 257905 266081 81300 -179702
151 -179702 -307361 -199221 50460 253647 271642 95528 -145418 -273202 -202280 -348
161 -348 191431 258851 155718 -68183 -260580 -261396 -56292 191003 284098 163811 -63085
172 -63085 -229733 -235023 -84285 125414 250249 195476 3864 -186761 -253488 -144292 83796
183 83796 258859 229340 26778 -177647 -245130 -148217 48527 216196 227642 72790 -127239
194 -127239 -232236 -179259 -2697 183526 243321 122913 -91787 -238068 -206615 -23640
$$ packed form
119C23517K2513k35833k74791j46795O0664K34893K40674P9682j24183k52273
129g1932k11965q091K03777K66378J47589q9552k79536k42530p676J98089K35457
140A40008J39470l9229k17966k45467p2228J43822K34860J74635Q176j84781k61002
151a79702j27659J08140K49681K03187J7995j76114k40946j27784P0922K01932
161c48J91779O7420j03133k23901j92397q16K05104K47295R3095j20287k26896
172f3085j66648n290J50738K09699J24835n4773j91612j90625o6727J09196K28088
183H3796J75063k9519k02562k04425o7483R6913J96744J67669J1446j54852k00029
194a27239j04997N2977J76562J86223N9795j20408k14700j46281L1453J82975
$$ plain form
204 -23640 169952 232967 131462 -56371 -201305 -204389 -65735 115771 218205 174573 2174
215 2174 -185287 -238033 -103571 105561 223503 177049 14116 -153618 -215438 -123360 54818
226 54818 188809 192490 66498 -112480 -221265 -165293 19254 185814 210486 84207 -97196
237 -97196 -206287 -166916 -10754 148464 202315 114361 -53960 -183397 -184108 -56680 114777
248 114777 211282 151503 -26490 -181050 -194782 -71740 94993 194079 155217 4899 -143610
259 -143610 -187347 -105619 48528 177432 183023 49388 -124711 -203881 -130409 35308 169873
270 169873 179141 63478 -92988 -182102 -143706 -5182 136229 184013 102389 -55895 -178171
281 -178171 -170097 -35639 124770 191474 116496 -38770 -160810 -167300 -57983 91283 175389
$$ packed form
204b3640J93592O3015j01505j87833j44934l084J38654J81506J02434m3632j72399
215B174j87461n2746J34462K09132J17942m6454j62933j67734o1820R2078J78178
226E4818J33991L681j25992j78978j08785N5972J84547J66560K4672j26279j81403
237i7196j09091L9371J56162J59218N3851q7954j68321j29437p11J27428J71457
248A14777R6505n9779j77993j54560j3732J23042J66733R9086l8862j50318j48509
259a43610m3737Q1728J54147J28904N591j33635j74099p9170P3472J65717J34565
270A69873R268j15663j56466q9114L8396J38524J41411M7784q1624j58284j22276
281a78171Q074J34458J60409O6704p4978j55266j22040o490J09317J49266Q4106
$$ plain form
292 175389 134506 944 -132721 -177455 -96740 61241 177822 158053 22475 -123123 -178087
303 -178087 -106078 41082 154586 155260 51037 -85545 -167517 -132836 1545 136712 172508
314 172508 83753 -67183 -170333 -145492 -14429 120080 165142 96825 -38201 -147564 -151743
325 -151743 -47914 87992 162583 124460 -5114 -135412 -166820 -73923 71741 161642 134179
336 134179 11613 -116115 -158419 -88789 39756 139431 144026 48276 -86626 -161973 -118325
347 -118325 12925 134349 157595 65109 -74232 -154745 -121207 -6989 107089 149211 88848
358 88848 -37916 -139636 -140557 -40630 88915 156683 110437 -19826 -132981 -145018 -54951
369 -54951 69906 144477 117671 6546 -107312 -144543 -81612 39141 135978 135719 34675
$$ packed form
292A75389m0883j33562j33665m4734Q0715J57981J16581j9769j35578j45598n4964
303a78087P2009J47160J13504O74j04223j36582q1972L4681J34381J35167L5796
314A72508q8755j50936j03150K4841J31063J34509M5062o8317j35026j09363m179
325a51743J03829J35906P4591l8123j29574j30298l1408R2897J45664Q9901k7463
336A34179j22566j27728m2304O9630J28545R9675M595r5750j34902p5347M3648
347a18325J31250J21424K3246r2486j39341q0513L3538J14218J14078M2122o0363
358H8848j26764j01720r21R9927J29545O7768m6246j30263j13155j2037R0067
369e4951J24857P4571k6806j11125j13858l7231O2931J20753R6837k59j01044
$$ plain form
380 34675 -91922 -150188 -99823 22173 127757 138119 48519 -70766 -136256 -109048 -7223
391 -7223 103315 141671 77176 -43033 -132991 -128592 -29853 93550 145949 88300 -28490 -119616
403 -119616 -126898 -47457 66441 133273 105230 3454 -102033 -137123 -73021 47348 132852
414 132852 119168 19722 -91063 -135624 -82790 28185 115939 120956 42753 -65340 -129591
425 -129591 -101709 748 103165 130928 64848 -49398 -128887 -112914 -13789 90649 127061
436 127061 75030 -27658 -111476 -117067 -38947 66385 125028 96498 -3313 -104023 -127838
447 -127838 -55845 54546 122499 102331 10491 -87200 -120891 -70185 27749 107282 113446 36882
459 36882 -68976 -124368 -89105 9670 101196 119790 50621 -55116 -117299 -94635 -8240 82888
$$ packed form
380C4675j26597n8266N0365J21996J05584J0362q9600j19285o5490K7208J01825
391g223J10538L8356o4495j20209q9958M399R8739J23403N2399n7649j16790r1126
403a19616p282P9441J13898O6832k8043j01776j05487l5090O4102J20369Q5504
414A32852j3684r9446j10785m4561N2834J10975Q7754N017p8203j08093o4251
425a29591K7882J02457J02417K7763o6080j14246p9489J5973R9125J04438L6412
436A27061n2031j02688q3818n591P8120J05332N8643k8530r9811j00710k3815
447a27838P1993J10391O7953k0168r1840r7691l3691N0706R7934P9533O164p6564
459C6882j05858n5392L5263R8775R1526J8594o9169j05737o2183K2664Q6395R1128
$$ plain form
471 82888 117176 68004 -30776 -106518 -106728 -31935 67611 121224 84461 -15628 -100900 -111336
483 -111336 -43707 53287 112187 90343 4500 -81794 -110760 -63299 30185 105586 104611 25667
495 25667 -71366 -115842 -76032 19186 98896 104025 35967 -52191 -104527 -86433 -4903 82868
507 82868 109735 56647 -34781 -102955 -98450 -20319 73709 110247 66696 -21220 -92954 -99655
519 -99655 -34356 54611 102712 79648 1949 -80239 -106909 -53526 39573 101914 90137 14506
531 14506 -71833 -104876 -61846 23725 90049 93148 30985 -53343 -99848 -76069 2286 80628
543 80628 101718 47979 -41555 -100227 -83937 -7631 70977 96765 56932 -22490 -87751 -89858
555 -89858 -26969 53725 96510 73014 -5182 -82351 -97268 -39863 42764 94402 78747 5386
$$ packed form
471H2888L4288m9172r8780p5742k10P4793R9546N3613l6763j00089q5272j0436
483a11336O7629R6994N8900k1844q5843q6294k8966M7461R3484P5401r75p8944
495B5667r7033m4476L9810R5218P9710N129o8058q8158n2336J8094Q1530Q7771
507H2868K6867n3088r1428o8174M505P8131R4028L6538m3551q7916p1734o701
519i9655O5299Q8967M8101k3064p7699q2188k6670N3383R3099O2341j1777p5631
531A4506q6339l3043M3030Q5571O6324L099o2163q4328m6505K3779P8355P8342
543H0628K1090n3739q9534n8672J6290P6306P8608K5788l9833p9422o5261k107
555h9858O2889Q0694M2785k3496p8196p7169j4917N7405Q2627N1638j5655p3361
$$ plain form
567 5386 -70072 -92061 -51162 22150 83559 88429 25857 -56279 -95035 -66020 9433 79867
579 79867 91662 34985 -43909 -88831 -72930 -5408 67287 90183 48243 -24843 -81521 -83549
591 -83549 -22788 57114 92789 59814 -12967 -76671 -86353 -32727 44639 87199 66827 1328
603 1328 -64128 -85400 -47368 25854 82630 79186 17335 -56624 -89131 -57068 16462 77429
615 77429 79634 25897 -42432 -80921 -64362 -1692 63947 83690 43870 -28850 -82412 -74686
627 -74686 -11110 57792 82343 50531 -15935 -73668 -76944 -23050 43324 77770 61585 1008
639 1008 -65473 -82708 -36251 32525 76014 68573 11725 -56930 -82421 -45739 20678 69563
651 69563 71063 23378 -42091 -77752 -58206 3275 63215 78020 35585 -33007 -77066 -63722
$$ packed form
567E386p5458k1989M0899P3312O1409M870o2572q2136l8756K9015P5453P0434
579G9867J1795n6677p8894m4922J5901O7522P2695K2896m1940p3086n6678k028
591h3549O0761P9902L5675l2975p2781o3704r682N3626P7366M2560k0372o5499
603A328o5456k1272L8032P3222N6776l444o1851p3959l2507L2063P3530O0967
615G7429K205n3737o8329l8489J6559O2670O5639J9743l9820p2720n3562P726
627g4686O3576O8902K4551l1812o6466n7733l276N3894O6374L4446j6185o0577
639A008o6481j7235M6457O8776M3489p441n6848o8655k5491L6682O6417M8885
651F9563J500m7685o5469l5661J9546O1481N9940J4805m2435o8592m4059J3344
$$ plain form
663 -63722 -5833 55639 76492 42223 -20719 -66816 -66971 -21892 40558 77796 56786 -8369
675 -8369 -64898 -72724 -29850 32678 73608 60587 2945 -54603 -71076 -39393 18225 66207
687 66207 67647 18192 -44725 -73478 -50291 8486 62405 70328 26397 -35044 -69863 -55480
699 -55480 -2182 52825 69357 37313 -20223 -64588 -64001 -15817 44707 71820 46432 -11087
711 -11087 -60749 -66958 -24197 36062 67198 50248 847 -48624 -67247 -37455 22331 65273
723 65273 59891 11601 -44080 -68836 -43451 13857 59676 60969 20696 -33404 -64099 -49640
735 -49640 79 49765 65109 33382 -23603 -64139 -56718 -7844 44343 64207 39486 -14145
747 -14145 -57144 -58225 -18077 32984 61696 47983 -1505 -51487 -62892 -28283 24659 60503
$$ packed form
663f3722N7889O1472K0853l4269o2942m6097j55M5079O2450L7238k1010o5155
675h369n6529p826M2874O2528M0930j3021n7642n7548j6473L1683N7618M7982
687F6207J440m9455o2917k8753K3187N8777N3919P923m3931o1441l4819J4383
699e5480N3298N5007J6532l2044n7536m4365N87M8184O0524K7113k5388n7519
711a1087m9662o209M2761O0259L1136j6950m9401m9471j8623K9792N9786M2942
723F5273n382m8290n5681k4756K5385N7308M5819J293m0273n4100l0695J4459
735d9640M9719M9686J5344l1727n6985m0536P421M8874N2187J9864k4721n3631
747a4145m2999j081M0148N1061K8712j3713m9488m9982j1405L4609N2942L5844
$$ plain form
759 60503 53743 6914 -45049 -62502 -34600 15803 54329 55582 17347 -33432 -60808 -44877
771 -44877 3750 49962 60366 26299 -27011 -59206 -48749 -3931 43436 58865 32036 -16365
783 -16365 -52283 -52794 -16458 33247 60281 42341 -7219 -50201 -55960 -22734 26731 57472 45612
796 45612 1287 -41723 -54944 -31099 15566 53153 51306 12016 -34862 -57150 -38919 8199
808 8199 49518 53475 18991 -27261 -54307 -43175 -177 42086 53242 27506 -16679 -51112
820 -51112 -49437 -10375 36039 55144 35132 -9853 -48318 -51096 -16179 28595 51384 39252
832 39252 -305 -39822 -52396 -27095 18767 51025 46362 7767 -36488 -53448 -31627 12559
844 12559 45963 46783 15365 -26771 -50300 -38735 1711 40474 50358 24526 -20022 -50348 -42904
$$ packed form
759F0503o760m6829n1963j7453K7902N0403L8526J253l8235n0779k7376J5931
771d4877M8627M6212J0404l4067n3310l2195J0457M4818M7367J5429k6829m8401
783a6365l5918n11L6336M9705K7034j7940m9560m2982n759L3226M9465L0741j1860
796D5612m4325m3010j3221K3845M6665L7587j847l9290m6878k2288J8231M7118
808H199M1319L957l4484m6252k7046J1132M2998M2263J1156k5736m4185l4433
820e1112J675L9062M6414J9105k0012m4985l8465k778L4917M4774K2789j2132
832C9252l9557l9517j2574K5301M5862L2258m663l8595m4255j6960K1821M4186
844A2559L3404Q20l1418m2136k3529J1565M0446L8763R884k5832m4548l0326P444
$$ plain form
857 -42904 -4548 35276 49789 29973 -11802 -45827 -45297 -12625 27410 48789 36312 -2856
869 -2856 -40756 -48367 -21303 20539 48262 41287 3131 -36144 -48203 -26312 12792 43429 43395
882 43395 12067 -27462 -47492 -34589 3884 40579 47897 18547 -23246 -46542 -36762 -1968
894 -1968 34315 46347 25144 -13885 -42474 -41393 -11388 28202 47712 31919 -7412 -39998
906 -39998 -43735 -16593 22091 45339 35405 407 -34084 -44730 -23481 14863 42472 39230 8540
919 8540 -28068 -45959 -30003 8255 40120 41432 14179 -22708 -43539 -33332 1118 34584
931 34584 41993 20945 -14494 -41378 -39051 -6841 30712 44472 26314 -10001 -38887 -39572 -12152
944 -12152 23269 41569 31036 -1543 -33758 -42444 -19715 16781 40876 35949 4566 -30428
$$ packed form
857d2904L8356L9824J4513j9816m1775l4025N30L2672M0035K1379j2477l9168
869b856l7900p611K7064M1842K7723o975l8156l9275j2059K1891L9104L0637l4
882D3395l1328l9529k0030J2903L8473L6695P318k9350m1793k3296R780L4794
894a968L6283J2032k1203l9029k8589J081L0005L9590J9510j5793l9331l2586
906c9998l737K7142L8684K3248r934l4998l4491j0646K1249L8344K7609l242l0690
919H540l6608j7891J5956L8258L1865J312k7253l6887k0831J0207L4450L3466
931C4584P409k1048l5439k6884K327L2210L7553J3760j8158l6315k8886o85K7420
944a2152L5421J8300j0533l2579l2215q686K2729L6496K4095m927l1383l4994
$$ plain form
956 -30428 -42498 -23754 10716 37232 38205 11575 -23976 -41668 -28822 3586 33026 40225 18372
969 18372 -17783 -41074 -33665 -2237 29383 40351 22856 -11919 -37348 -35371 -8876 23499
981 23499 39704 28211 -4091 -33962 -39236 -15656 18973 39917 31574 -9 -29622 -38295 -20480
994 -20480 11789 36416 34694 7697 -23944 -38847 -26494 6003 34371 37549 12579 -19823
1006 -19823 -37201 -29302 -304 29701 38254 18257 -13821 -35368 -32635 -6544 24640 38475
1018 38475 23861 -7540 -33610 -35520 -11758 20604 37305 26748 -1753 -29117 -36037 -17102
1030 -17102 13958 34764 30959 5929 -24915 -38281 -22195 10165 33250 32131 9663 -19755
1042 -19755 -36023 -25990 3051 29165 34285 16148 -14292 -35418 -30550 -2518 26475 35162
$$ packed form
956c0428j2070J8744L4470K6516R73k6630l5551j7692J2846L2408K9440P199k1853
969A8372l6155k3291P409L1428L1620J0968j7495l4775k5429J977K6495L2375
981B3499J6205j1493l2302k9871n274K3580L4629K0944q343l1583k9613q673J7815
994b0480L2269K4627j722k6997l1641j4903J2353L2497K8368L178k4970l2402
1006a9823j7378P899K8998L0005Q553j9997l2078k1547K733K6091L1184J3835
1018C8475j4614l1401k6070j910K3762L2362J6701j0557k8501k7364o920J8935
1030a7102L1060K0806l805k5030l0844j3366J6086L2360K3085j119k2468k9418
1042a9755j6268J0033K9041K6114N120j8137l0440k1126M868K8032K8993Q687
$$ plain form
1054 35162 19541 -9567 -32266 -31906 -8110 20856 34952 24396 -4040 -29224 -33461 -13681
1066 -13681 15327 33992 28511 1832 -26568 -34672 -17499 10745 31534 30621 6597 -22154 -33741
1079 -33741 -21588 4125 28279 33551 13304 -17659 -34276 -25160 65 25304 33504 16979
1091 16979 -11716 -31372 -28159 -5723 21230 33491 21733 -6123 -29151 -31332 -10803 17440
1103 17440 33039 24170 -1235 -25047 -32071 -15744 12062 31347 27304 4023 -21416 -31830
1115 -31830 -20521 6414 29458 30241 8781 -17833 -31505 -23659 1793 26383 31000 13226 -12290
1128 -12290 -29552 -26953 -4294 22364 32424 17988 -8255 -28292 -28823 -8321 18301 30999
1140 30999 21616 -3023 -25739 -29877 -12641 13081 29680 25442 3180 -22706 -31576 -16659 9267
$$ packed form
1054C5162j5621k9108k2699L60K3796K8966J4096j0556k8436k5184m237J9780
1066a3681K9008J8665n481k6679k8400q104J7173K8244K0789r13k4024k8751j1587
1079c3741J2153K5713K4154N272k0247l0963j6617R116K5225K5239Q200j6525
1091A6979k8695j9656L213K2436K6953J2261j1758k7856k3028k181K0529K8243
1103A7440J5599q869k5405k3812p024J6327K7806J9285m043k3281k5439j0414
1115c1830J1309K6935K3044P83k1460k6614j3672P846K5452K4590M617j7774k5516
1128a2290j7262K599K2659K6658J0060j4436k6243k0037n31K0502K6622J2698
1140C0999r383k4639k2716m138J7236K5722J6599m238k2262k5886q870J4917K5926
$$ plain form
1153 9267 27536 26967 7322 -18140 -30926 -20592 4291 25063 28608 12270 -13296 -29958 -24349
1166 -24349 -1355 22357 29647 15996 -9699 -28261 -26025 -5376 18354 29063 19981 -4106
1178 -4106 -25459 -28087 -10536 14231 28819 23264 74 -22679 -28560 -14405 9991 27638 25074
1191 25074 4433 -18907 -28422 -18151 4535 24961 27269 9275 -15593 -28155 -21367 156
1203 156 22162 28351 13248 -11216 -26673 -23361 -3983 18537 27953 17221 -5880 -24812 -26261
1216 -26261 -8721 15531 28157 19774 -2106 -21823 -26652 -12406 11137 26351 22634 3271
1228 3271 -18761 -27336 -16400 7211 25205 24530 7078 -15264 -27128 -19313 2713 22153 25477
1241 25477 10936 -10939 -25997 -22065 -1966 19423 26352 14706 -7159 -24325 -24037 -6269 15989
$$ packed form
1153I267J8269n69j9645k5462j2786J0334K4883K0772L545j6338k5566j6662N609
1166b4349K2994K3712P290j3651k5695j8562K236K0649K3730J0709r082k4087
1178d106k1353k628J7551K4767J4588n555k3190k2753n881J4155K4396J7647k564
1191B5074k0641k3340r515J0271K2686K0426K308j7994k4868j2562O788K1523
1203A56K2006O189j5103k4464j5457L312J9378K2520R416j0732k3101j8932j449
1216b6261J7540K4252J2626q383k1880j9717m829J4246K3543J5214l717j9363
1228C271k2032q575J0936K3611J7994o75j7452k2342j1864P815K2026J9440L324
1241B5477j4541k1875j5058L932K0099K1389O929j1646k1865j7166K88J7768K2258
$$ plain form
1254 15989 26400 17565 -3218 -22078 -24956 -9952 11330 24775 21121 1785 -19104 -26270 -13575
1267 -13575 8359 23952 22758 5227 -16053 -25449 -16642 3714 20916 24130 9640 -12281 -25335
1280 -25335 -19644 -364 19135 25155 12974 -8615 -23654 -21498 -4263 15708 24834 15857 -4468
1293 -4468 -21328 -22744 -8118 12376 24468 18768 -784 -19407 -23933 -11840 9126 23307 20640
1306 20640 3007 -16106 -23697 -14927 4739 21396 22294 7185 -13090 -23799 -17878 1068 19613
1319 19613 23265 10021 -9475 -22346 -19902 -2959 16129 23484 13801 -5533 -21244 -21666 -6442
1332 -6442 13307 23264 16214 -1724 -19156 -22500 -9518 9701 22201 18511 2004 -16186 -22826
1345 -22826 -13124 6002 20990 20373 5555 -13219 -22596 -15633 3062 18989 21141 8903 -10138
$$ packed form
1254A5989J0411q835k0783j8860k878J5004K1282J3445l654j9336k0889p166J2695
1267a3575K1934J5593j194j7531k1280r396Q807K0356J7202L214j4490k1921j3054
1280b5335N691J9280J9499O020j2181k1589j5039K156J7235J9971R126q977k0325
1293d468j6860j416J4626K0494J2092n700j9552j8623m526J2093K0966J4181k667
1306B0640j7633j9113p591Q770J9666J6657Q98j5109k0275j0709N921J8946J8545
1319A9613L652j3244j9496j2871K444J6943J9088P355r683j9334j5711m22J5224
1332f442J9749R957p050j7938j7432l344J2982J9219J2500l690j6507j8190o640
1345b2826R702J9126J4988o17j4818j8774r377O963J8695J5927K152j2238j9041
$$ plain form
1358 -10138 -21569 -17904 -1057 16233 21762 12235 -6797 -20933 -19798 -4168 13848 21584 14368
1371 14368 -3416 -18832 -20239 -7702 10339 21325 17477 497 -16822 -21453 -10982 7135
1383 7135 20140 18559 3649 -14145 -21246 -13205 3595 18583 20238 6934 -10885 -20973 -16105
1396 -16105 52 16619 20558 9904 -7957 -19883 -17550 -3238 13751 20730 12733 -4372 -18152
1409 -18152 -19089 -6475 11136 20688 15148 -1245 -16461 -19772 -9027 8249 19729 16909 1790
1422 1790 -13819 -19904 -12089 4432 18341 18479 5275 -11386 -19985 -14313 1909 16418 18961
1435 18961 7995 -8109 -18964 -16144 -1739 14227 19620 11206 -5173 -17900 -17623 -4709 12041
1448 12041 19176 12949 -2057 -16194 -18665 -7396 8823 18529 15557 1499 -13882 -19282 -10599
$$ packed form
1358a0138j1431L665J6847J7290N529r527j9032j4136J135J5630J8016P736p216
1371A4368j7784j5416j407J2537J8041J0986l848j6980j7319m631J0471J8117
1383G135J3005j581j4910j7794p101Q041J6800J4988J655j3304j7819j0088M868
1396a6105J6157J6567L939j0654j7861j1926K333J4312J6989O979p997j7105j3780
1409a8152r37J2614J7611R552n540j6393j5216l311J0745J7276J1480k820j5119
1422A790j5609o085P815J6521J3909J38j3204j6661q599N672J6222J4509K543
1435A8961j0966j6104j0855K820J4405J5966N393q414j6379j2727K77J2914J6750
1448A2041P135o227j5006j4137k471J1269J6219R706k972j4058j5381n400Q683
$$ plain form
1461 -10599 5765 17770 17029 4238 -11727 -18960 -12653 2926 15914 17628 6881 -8732 -18126
1474 -18126 -14868 -768 14035 18620 9610 -6397 -17626 -16200 -3141 11743 18274 11724 -3437
1487 -3437 -15760 -16846 -6158 8698 17683 14474 -256 -14404 -17937 -8848 6526 17066 15708
1500 15708 2796 -12057 -17793 -11136 3143 15718 16762 5742 -9559 -17553 -12939 797 14254
1513 14254 17417 7844 -6952 -16716 -14785 -2266 11908 17597 10347 -4090 -15410 -16179 -5363
1526 -5363 9650 17737 12383 -1439 -14015 -16634 -7478 7335 16506 13757 1427 -11826 -16916
1539 -16916 -10156 4126 15678 15475 4133 -9876 -16990 -11616 1800 14187 15980 6757 -7352
1552 -7352 -16159 -13310 -812 11678 16342 9115 -4799 -15291 -14771 -3325 10286 16217 10977 -2410
$$ packed form
1461a0599J6364J2005p41j2791j5965p233O307J5579J2988J714j0747j5613r394
1474a8126L258J4100J4803M585r010j6007j1229J426J3059J4884O531o550j5161
1487c437j2323j086J0688J4856Q985l209j4730j4148l533R089J5374J0540j358
1500A5708j2912j4853n736O657J4279J2575J044j1020j5301p994M614J3736J3457
1513A4254L163r573j4796r764J931J2519J4174N689p250j4437j1320p69J0816
1526e363J5013Q087n354j3822j2576k619R156J4813R171k749j2330j3253n090
1539a6916O760J4282J1552k03j1342j4009p114N374J3416J2387J793r223j4109
1552g352q807K849J2498J2490M664p227j3914j0492N20J1446J3611N931n240j3387
$$ plain form
1566 -2410 -13920 -15597 -5798 7799 15622 12535 757 -12171 -16157 -8206 5235 15098 13681 3333
1580 3333 -10580 -16141 -9940 2924 13683 14552 5451 -7938 -15828 -12169 24 12075 15740 7585
1594 7585 -5878 -14893 -13209 -2198 10065 15452 9783 -3385 -13512 -13923 -4914 7941 15562 11548
1608 11548 -735 -12454 -14573 -6819 5894 14753 12903 1731 -10443 -14795 -9070 3427 13408
1621 13408 14020 4219 -8373 -14955 -10763 1008 12506 14529 6124 -6234 -14195 -12281 -1485 10709
1635 10709 14604 8320 -3264 -13154 -13513 -3923 8610 14682 9706 -1430 -11582 -13991 -5705 6634
1649 6634 13909 10981 1024 -10248 -14407 -8194 4299 13065 12282 3110 -8388 -14195 -9741 1897
1663 1897 11705 13133 5225 -6569 -13716 -10824 -398 10257 13536 7616 -4533 -13283 -12119 -2353
$$ packed form
1566b410j1510j677R799J3597P823l087j1778j2928l986P951J3441R863j417j0348
1580C333j3913n561O201J2864J0759Q69r101j3389p890L659J2193J2051L665q155
1594G585j3463r015J684J1011J2263N387n669j3168j0127m11R009J2855P621m014
1608A1548j2283j1719k119P754J2713Q859j850j1172j2174m352N725J2497R981
1621A3408O12r801j2592o582M192J1771J1498K023q405j2358p961J914J0796J2194
1635A0709L895o284j1584r890l59R590J2533O072m976j1136j0152k409Q286J2339
1649F634P275k928r957j1272m159O213J2493Q766p83r172j1498n807M454J1638
1663A897R808J428p908j1794p147K892J0426J0655L279n920j2149q750J164R766
$$ plain form
1677 -2353 8337 13648 9112 -2152 -11744 -12649 -4356 6406 12941 10594 428 -10604 -13284 -6426
1691 -6426 4619 12400 11634 2034 -8982 -13237 -8178 2518 11472 12254 4509 -6920 -13202 -9873
1705 -9873 50 10071 12802 6098 -5101 -12456 -10732 -1718 8596 12905 7971 -3141 -11218 -11375
1719 -11375 -3877 6965 12974 9269 -899 -10021 -12402 -5548 4913 12456 10288 1142 -8444 -12032
1733 -12032 -7257 2898 11103 11741 3458 -7094 -12198 -9000 1133 10201 12057 4750 -5426 -11801
1747 -11801 -10027 -1118 8673 11983 6724 -2894 -10913 -11014 -2717 7306 12153 8312 -1658 -9811 -11256
1762 -11256 -4542 5609 11450 9390 943 -8672 -11864 -6316 3393 11027 10325 2729 -7574 -11884
1776 -11884 -7530 1917 9990 10991 4526 -5366 -11418 -8943 60 8562 11404 6228 -3800 -10684
$$ packed form
1677b353J0690N311m536j1264r592r05Q293J0762O535k347j0166j1032k680O858
1691f426J1045P781p66r600j1016m255N059J0696Q954P82p745j1429o282L329
1705i873R923J0021K731o704j1199p355J724R014J0314M309m934j1112q077j57
1719a1375P498J0842O009l705j0168r122k381O854J0461P543k168r146r586l588
1733a2032M775J0155Q205O38q283j0552n104L198J0133R068J856p307j0176o375
1747a1801J774Q909R791L310n259r618q019j01Q297J0023M847l841r970q153j445
1762a1256O714J0151N841k060q447r615l192N548R709P634p02p596j0303m310
1776a1884M354R447Q073J001o465r892o052K475R003Q502K842n176j0028o884
$$ plain form
1790 -10684 -9739 -1897 7009 11382 7318 -1961 -9785 -10582 -3664 5696 10881 8526 -58 -8598 -11028
1805 -11028 -5112 4107 10609 9500 1527 -7529 -10934 -6551 1987 9599 10129 3332 -6144 -10692 -8253
1820 -8253 589 8722 10718 4798 -4307 -10314 -9157 -1164 7407 10999 6312 -2491 -9560 -9590 -3070
1835 -3070 5905 10702 7361 -1142 -8566 -9958 -4466 4394 10089 8050 708 -7506 -10176 -5844 3062
1850 3062 9598 9355 2334 -5989 -10324 -7229 964 8727 9726 3836 -4520 -9833 -8090 -621 7382
1865 7382 10189 5369 -2935 -9486 -8969 -2089 6251 10013 6467 -1368 -8518 -9182 -3545 4755 9474
1880 9474 7511 252 -7383 -9793 -4892 2947 9185 8686 1866 -6322 -9749 -5943 1730 8283 9227
1895 9227 3366 -5076 -9676 -7425 9 7363 9398 4534 -3569 -8761 -8241 -1450 6138 9502 5907
$$ packed form
1790a0684R45P842Q906M373m064r279p824p97O918R360N185k355q584q540k430
1805a1028N916R219O502j109p973r056l405M383Q538P612N30o797r476m548K439
1820h253Q842Q133J996n920r105o007J157P993Q571L592m687q803p069l0O520
1835c070Q975M797l341q503p424j392N492Q860N695k039p342q214k670M332Q906
1850C062O536k43p021q323m335L095Q193P763R99n890q356n313J743P469Q003
1865G382K807m820q304o551N17O880Q340L762l546p835p150o64N637Q300M719
1880I474j963p259p635k410M901P839O238m99o820q188l427L806P673O553R44
1895I227n861q442m600K251P434P354K035m864q103n192N20O791P588L364l595
$$ plain form
1910 5907 -2140 -8320 -8537 -2815 5194 9207 6959 -628 -7522 -9048 -4252 3716 9148 7804 1128
1925 1128 -6312 -9263 -5336 1961 8343 8329 2445 -5039 -8749 -6792 647 7323 8813 3448 -3746
1940 -3746 -8480 -7596 -621 6580 8939 4677 -2400 -8068 -7983 -2248 4877 8705 6094 -1210 -7373 -8337
1956 -8337 -3330 4044 8465 6923 586 -6405 -8592 -4603 2791 7630 7636 1618 -5201 -8504 -5806 1179
1972 1179 7536 7784 3191 -3922 -8278 -6433 -1 6248 8176 4557 -2748 -7950 -7395 -1372 5286
1987 5286 8319 5522 -1425 -7285 -7652 -2565 3915 8116 6027 101 -6282 -7978 -3838 2866 7850
2002 7850 6975 1190 -5463 -7777 -4992 1582 7323 7284 2431 -4418 -7797 -5780 331 6386 7806 3528
2018 3528 -3157 -7564 -6599 -1061 5142 7916 4612 -2089 -6635 -6968 -2190 4319 7760 5816 -691
$$ packed form
1910E907q047o180k17N722Q009M013k248p587o894j526M796P968N432j344o676
1925A128p440k951L927P297O382j4n884p484l710J957P439O676J490n365p194
1940c746m734Q84O975P201K359m262p077n668Q5N735P125L828k611p304o163r64
1956h337N007P374M421j542o337o991k187L989P394M839Oo018o819l303K698O985
1972A179O357K48m593p113m356J845O432O249J928l619p305n202N55O023O658
1987E286L033k797o947n860l67N087O480M201k089n926o383j696M140O704M984
2002G850q75n785o653k314K785O574N741l9m853o849l379K017O111O055J420m278
2018C528o685m407R65N538O203K774l304o701m546l33M778O509L441j944o507
$$ plain form
2033 -691 -6441 -7466 -3367 3146 7444 6216 733 -5171 -7444 -4440 2242 6853 6751 1910 -4467
2048 -4467 -7385 -5210 952 6436 7117 2950 -3239 -7338 -6237 -507 5283 7384 4010 -2214 -6690
2063 -6690 -6595 -1690 4527 7314 4701 -972 -6089 -7166 -2772 3456 7003 5664 222 -5400 -7165
2078 -7165 -3696 2303 6372 6292 1374 -4563 -7128 -4782 1263 6144 6462 2392 -3580 -7086 -5140 351
2094 351 5038 6489 3489 -2465 -6556 -5809 -1244 4389 6804 4217 -1054 -6004 -6361 -2236 3412 6593
2110 6593 5182 -94 -5385 -6793 -2891 2733 6216 5504 627 -4247 -6948 -4131 1533 5669 6064
2125 6064 1742 -3619 -6438 -4756 204 5467 6688 2842 -2526 -6086 -5280 -640 4569 6491 4125
2140 4125 -1666 -5610 -5706 -1694 3725 6390 4726 -993 -5328 -6091 -2926 2859 6260 4984 524 -4490
$$ packed form
2033f91n750j025M099O513M298j228n483n904k273L004O682M611j02m841o377
2048d467k918K175O162N484O81m167o189m099J101N730N790K101l374o224m476
2063f690R5M905O217K787k613n673n117j077M394O228L547j339n442n622j765
2078g165L469N999M069q0m918n937k565K346O045M881L18m070n972l506J946N491
2094C51M687J451l000n954m091P47M565N633K415k587n271m950l57M125N648L181
2110F593j411n276n291j408L902N624L483p12m877m874k701K817N664M136L95
2125F064m322n361k819J682M960N263J221l846n368l560Q06M640N209J922k366
2140D125n791l944r6M012N419K665j664n719m335p63L165N785L401j276m460n014
$$ plain form
2156 -4490 -6454 -3611 2111 5767 5606 1408 -3583 -6307 -4457 856 5251 5922 2517 -2843 -6050
2171 -6050 -4822 -256 4689 5874 3045 -1831 -5684 -5759 -1251 3696 5969 4089 -680 -5218 -6045 -2229
2187 -2229 2855 6202 4802 320 -4711 -6292 -3087 2010 5704 5172 920 -3997 -6050 -4058 969
2202 969 5105 5968 1918 -3441 -5645 -4425 123 4769 6048 2749 -2337 -5683 -4850 -1056 3826 5894
2218 5894 3754 -1514 -5332 -5423 -1538 3004 5996 4297 -365 -4639 -5737 -2670 2183 5527 4997 391
2234 391 -4190 -5860 -3366 1312 5205 5243 1657 -3013 -5849 -3957 384 4644 5672 2424 -2463 -5583
2250 -5583 -4655 -299 4011 5345 2985 -1419 -5211 -5098 -1580 3126 5308 3861 -671 -4596 -5387 -2213
2266 -2213 2689 5620 4388 528 -4013 -5647 -3150 1753 4930 4813 1356 -3213 -5603 -3891 784
$$ packed form
2156d490j964K843N722L656j61m198m991k724J850N313M395O71l405n360l207
2171f050J228M566M945J185k829m876l853p5M508M947K273j880m769m538q27L816
2187b229N084L347j400m482n031j581L205N097L694n32m252m917k053J992N027
2202I69M136Q63m050n359k204J220M548M646J279l299n086l346Q33L794M882K068
2218E894k140n268l818r1L885M542K992j699m662m274j098L067M853L344n30m606
2234C91m581j670K494M678L893L8l586m670k836J892M341M260J028l248m887l120
2250e583R28M356M310J334k360m404l792J13L518M706K182j447m532l925p91L174
2266b213M902K931j232l860m541j634K497M903L177j17l457m569k390J712M675
$$ plain form
2281 784 4679 5642 2117 -2655 -5755 -4174 -162 4150 5522 3170 -1732 -5275 -5239 -1249 3635 5716
2297 5716 3702 -1017 -4966 -5321 -1915 2667 5225 4232 -112 -4320 -5117 -2503 1942 5064 4839 867
2313 867 -3507 -5549 -3630 928 4768 5084 1808 -3172 -5241 -4022 286 4185 5358 2714 -2137
2328 -2137 -4984 -4749 -983 3407 5375 3338 -1312 -4644 -4853 -1763 2697 5348 3803 -294 -4008
2343 -4008 -5179 -2585 2058 5070 4282 803 -3710 -5325 -3229 1268 4732 4699 1576 -2723 -5334 -3787
2359 -3787 742 4247 4933 1864 -2148 -4998 -4018 -492 3688 5064 2776 -1411 -4724 -4724 -1270 2762
2375 2762 4959 3550 -417 -4275 -4955 -1920 2408 4862 4225 271 -3851 -4999 -2758 1418 4598
2390 4598 4543 1015 -2962 -5000 -3267 601 4412 4717 1888 -2418 -4662 -3828 -89 3698 4854 2471
$$ packed form
2281G84L895R63l525m772l100J581M012M312J372k352m902l543L6L990M884K081
2297E716k014m719l949l55L406M582K558r93m344m208p97K614M445L122k25l972
2313H67m374k042J919M558L840L16l276m980k069J219M308L899J173k644m851
2328b137k847K35L766M390J968k037m650l332k09L090M460K651j545m097l714
2343d008j171K594M643L012p88l479m513j615K096M497L464l3l123m299k611J547
2359c787M529L505O86l069m012k850R80L526M180J376k288m187l313%L454M032
2375B762K197j409l967l858o80L035M328K454o37l954m122j148K241M176L180
2390D598n5l528l977k038J733L868L811L05k829m306k244Q34L739L787J156k383
$$ plain form
2406 2471 -1469 -4481 -4303 -622 3273 4981 3379 -934 -4303 -4302 -1971 2149 4878 3518 25 -3766
2422 -3766 -4476 -2643 1544 4652 4180 877 -3197 -4980 -3061 897 4233 4475 1498 -2424 -4894 -3555
2438 -3555 70 3733 4704 2239 -1505 -4529 -3964 -559 3249 4918 2964 -1147 -4022 -4323 -1152 2644
2454 2644 4639 3339 -450 -3886 -4467 -2006 1926 4475 3863 680 -3439 -4513 -2946 1195 4201
2469 4201 4331 1196 -2419 -4811 -3125 495 3655 4417 1822 -2071 -4584 -3620 -422 3785 4546 2664
2485 2664 -1409 -4264 -4298 -1183 2936 4329 3071 -540 -3758 -4641 -1657 2035 4286 3847 15 -3421
2501 -3421 -4592 -2361 1277 4076 4275 868 -2442 -4570 -3178 474 3741 4362 1599 -2307 -4447
2516 -4447 -3635 87 3225 4618 2107 -1465 -4175 -3920 -854 2703 4414 3018 -735 -3949 -4284 -1527
$$ packed form
2406B471l940l012J78L681L895J708j602m313l369JK331M120K729j360l493l791
2422c766p10J833M187L108m72l303m074j783J919L958L336K42k977l922k470J339
2438c555L625L663R71k465l744l024N65L405L808J669j954m111k875l01L171L796
2454B644J995j300l789l436n81K461L932K549o12l183m119j074J567M141L006
2469D201J30l135l615k392J686L620L160P62k595l893k513R64L198M207P61j882
2485B664m073k855l4L115M119J393j258l611l218q83K984L692K251m39l832l436
2501c421j171K231L638K799J99l407l310k128J392L652L267O21k763l906k140
2516d447Q12L722L138J393k511l572k710K55L066L557J711j396l753l214l35K757
$$ plain form
2532 -1527 2181 4653 3672 26 -3399 -4323 -2188 1416 4271 3854 546 -2888 -4566 -2814 741 3698
2548 3698 4040 1528 -2139 -4307 -3392 200 3631 4751 2089 -1589 -4303 -3470 -606 2792 4314 2719
2564 2719 -1082 -3895 -4252 -1237 2416 4226 3201 -306 -3246 -4201 -2074 1556 4304 3634 364 -3107
2580 -3107 -4560 -2642 794 3919 4047 1307 -2452 -4435 -2943 342 3400 4194 1815 -1689 -4437
2595 -4437 -3756 -371 2988 4239 2459 -1084 -4080 -4022 -965 2470 4329 2963 -358 -3350 -4209 -1628
2611 -1628 2161 4098 3448 244 -3179 -4182 -2420 1138 3846 3903 1009 -2680 -4142 -2832 585 3341
2627 3341 4113 1789 -2105 -4113 -3521 -26 3253 4077 2214 -1447 -4059 -3875 -1098 2840 4320 2993
2643 2993 -732 -3760 -4254 -1682 2051 4026 3188 247 -3188 -4365 -2174 1834 4101 3844 762 -2608
$$ packed form
2532a527L708K472r81l646l425r24K135L604K855m17l308l434j678J752L555K957
2548C698L42k512l667k168R15L592L431J120k662l678k714Q33K864L398J522j595
2564B719l801k813l57L015L653J810j025l507k940r55K127L630K748o70l270l471
2580c107j453J918L436L125J28k740l759j983J492L285L058P94k379l504k748
2595d437O81L385L359J251j780l543k996N8L057L435J859j366l321k992q59K581
2611a628L789J937o50l204l423j003J762L558K708N7k894l689j462J310L417K756
2627C341P72k324l894k008N92L495L279Q24j863l661k612J84K777L938J480j327
2643B993l725l028m94K572L733J975q38k941l435j177K191M008K267k57l082l370
$$ plain form
2659 -2608 -3955 -2574 928 3688 3938 1331 -2032 -4058 -3337 96 3600 4076 1959 -1593 -3721 -3800
2675 -3800 -827 2951 4141 2617 -982 -3618 -3855 -1164 2134 4313 2961 -125 -3537 -3917 -1768
2690 -1768 1515 3928 3336 440 -3068 -3976 -2135 1224 3994 3920 1185 -2292 -3818 -2994 354 3267
2706 3267 3988 1714 -1914 -4335 -3237 -235 3137 3929 2153 -1075 -3795 -3399 -1071 2678 4098 2730
2722 2730 -507 -3723 -3750 -1396 1948 3935 3278 341 -2998 -3976 -2156 1135 3780 3798 892 -2561
2738 -2561 -4084 -2625 569 3524 3944 1369 -2165 -4038 -3176 178 2963 4038 2032 -1485 -3764
2753 -3764 -3485 -379 2701 3964 2451 -696 -3373 -3772 -824 2260 4019 2942 -68 -3231 -3708 -1832
2769 -1832 1507 3755 3548 688 -2647 -3790 -2345 1196 3741 3582 1081 -2217 -3797 -3146 645 3096
$$ packed form
2659b608j347J381L502K760K50k607l363k026P21L433L504M76k117l552k128p9
2675c800K973L778J190j524l599k636k37K691L298K179j352l086l412l80K149
2690a768L283K413n92k896l508r08J841L359K770p4k735l477j526Q24L348K913
2706C267P21k274l628k421J098L002L372P92j776l228k720L96K328L749J420j368
2722B730l237l216k7K354L344J987o57k937l339r78J820L291K645J8k906l453
2738b561j523J459L194K955M20k575l534j873Q62L354K785J075k006l517k279
2753c764K79L106L080J263j513l147k677l99K948L084J759j077l010l163m77J876
2769a832L339K248k07k860l335j143J445L541K545j59k501l298j580O51L791K451
$$ plain form
2785 3096 3732 1563 -1573 -3856 -3566 -244 3088 3736 2197 -1020 -3660 -3620 -776 2637 4032 2836
2801 2836 -230 -3306 -4082 -1519 1775 3924 3362 215 -3126 -3896 -2185 1286 3661 3782 933 -2569
2817 -2569 -4016 -2646 595 3301 3498 1591 -2014 -3952 -2896 41 3034 3893 2026 -1258 -3499
2832 -3499 -3487 -667 2437 3803 2396 -798 -3443 -3590 -1584 1919 3932 2860 -24 -3179 -3941 -1551
2848 -1551 1363 3681 3368 454 -2552 -3754 -2574 795 3602 3616 1172 -1997 -3727 -2529 292 3101
2864 3101 3927 1814 -1522 -3667 -3314 -226 2629 3929 2131 -921 -3538 -3626 -858 2155 3866 2990
2880 2990 -38 -3003 -3571 -1692 1896 3787 3010 158 -2880 -3781 -2279 1018 3540 3195 894 -2302
2896 -2302 -3773 -2623 630 3391 3496 1275 -1619 -3432 -2746 -119 2701 3734 2010 -1154 -3325
$$ packed form
2785C096O36k169l136k283K90L322L332O48j539l217k640M0K844L413J395j196
2801B836l066l076p76K563L294K149n62l147l341p70J711L471K375J21k849l502
2817b569j447J370L241K706J97j907l605j938J056K937K993Q59j867l284k241
2832c499J2K820L104J366j407l194k645j47K006L503K013j072k884l155p62K390
2848a551K914K318l13k914l006j202J180L369K807J4k444l169j730J198K821K809
2864C101Q26k113l336k145L53L088K855J300j798l052k617q8K768L013J711q76
2880B990l028k965n68J879L588J891p77k852l038r01J502L297K522l45k301l196
2896b302j471J150L253K761J05k221k894j813O86K627K820J033j724l164k171
$$ plain form
2911 -3325 -3289 -701 2472 3982 2363 -806 -3029 -3361 -1198 1939 3384 2953 174 -2945 -3538 -1785
2927 -1785 1333 3522 3050 659 -2476 -3538 -2409 662 3408 3428 1128 -2039 -3687 -2788 136 3200
2943 3200 3446 1614 -1401 -3413 -3001 -685 2643 3609 2176 -878 -3201 -3534 -1158 2162 3594 2387
2959 2387 -381 -2950 -3614 -1384 1776 3401 2746 305 -2338 -3767 -1823 1068 3404 3240 835 -2083
2975 -2083 -3589 -2343 263 3223 3343 1681 -1490 -3376 -2680 -55 2757 3528 1890 -1152 -3492 -3020
2991 -3020 -571 2231 3563 2349 -624 -3080 -3393 -1051 2017 3673 2629 -25 -2898 -3587 -1535
3006 -1535 1152 3281 3186 496 -2212 -3564 -2155 621 3117 3127 1247 -1801 -3370 -2474 67 2695
3022 2695 3342 1646 -1314 -3315 -2966 -546 2350 3518 2241 -840 -3297 -3174 -1126 1916 3467 2714
$$ packed form
2911c325L6K588L173J510j619l169k223l32K163L137J445m31k779l119n93J753
2927a785L118K189m72k391l135j062J129L071K746K0k300l167j648Q99K924L064
2943C200K46j832l015k012M12K316L328R66j433l054k323l33K376L320J432j207
2959B387k768k569o64K230L160J625o55k441k643j429J944K891K336j64k405k918
2975b083j506J246K606K960J20j662l171j886O96K625K812P71j638l042k340M72
2991c020K449K802J332j214k973k456l13K342L068J656j044k654k873o89K052
3006a535K687K129r5k690k708j352J409K776K496J0j880l048j569Q96K541K628
3022B695O47j696k960k001L49K420K896J168j277l081k457J23K048L042J551p53
$$ plain form
3038 2714 -429 -2632 -3294 -1699 1477 3407 3029 323 -2455 -3556 -1896 755 3307 3199 767 -2185
3054 -2185 -3600 -2554 421 2830 3341 1520 -1687 -3467 -2887 -85 2405 3393 1951 -1087 -3207 -3446
3070 -3446 -603 2268 3542 2461 -532 -3023 -3208 -1235 1673 3424 2708 359 -2914 -3401 -1762 1241
3086 1241 3240 2846 546 -2320 -3430 -2211 358 3057 3285 1257 -1783 -3414 -2519 -228 2808 3449
3102 3449 1571 -1342 -3315 -3111 -562 2248 3614 1951 -731 -3006 -3266 -1122 2051 3327 2571 -75
3118 -75 -2985 -3313 -1672 1589 3214 2984 275 -2394 -3585 -1947 999 3142 2971 1087 -1844 -3186
3134 -3186 -2475 173 2792 3211 1194 -1178 -3331 -2646 105 2772 3458 1853 -956 -3108 -3092 -786
3150 -786 2074 3596 2308 -391 -3077 -3360 -1291 1707 3415 2694 222 -2524 -3661 -1693 1300 3391
$$ packed form
3038B714l143k203o62J595L176J930l78k706k778j101J660K651K552j08k432k952
3054b185j415J046K975K409N11j821l207j780N80K802K490R88j442l038k120k39
3070c446K843K871J274j081k993k491j85J973K908J751p16k349l273m87J639L003
3086A241J999l94k300k866j110J219K569K699K28k028l040j631Q95K291L036O41
3102C449j878k913j973K04K549K810J366j663k682k275k60K144L173J276p56k646
3118g5k910l28J641L261J625k30k709k669j191J638K946K143j71j884k931j342
3134c186P11K648K619M19k017k372k153O85K751K667O86j605k809k152J6K306
3150g86K860J522j288k699k686k83K069K998J708p21k472k746j137J968K993K091
$$ plain form
3166 3391 3019 777 -2222 -3594 -2177 955 3116 3341 1031 -1806 -3145 -2476 27 2734 3375 1578
3182 1578 -1410 -3126 -3000 -527 2377 3589 2077 -696 -3037 -3139 -925 1648 3509 2630 -91 -2638
3198 -2638 -3298 -1540 1382 2994 3114 158 -2382 -3399 -1992 1059 3071 3169 703 -1977 -3406 -2475
3214 -2475 338 2705 2973 1277 -1589 -3258 -2588 -304 2285 3402 1933 -985 -3149 -3014 -970 2030
3230 2030 3263 2525 -583 -2902 -3244 -1317 1442 3226 2691 277 -2537 -3327 -1765 1088 3140 2874
3246 2874 737 -2023 -3505 -2237 701 2954 3240 1026 -1637 -3414 -2347 19 2736 3396 1634
3261 1634 -1261 -3014 -2588 -441 2193 3513 2225 -749 -2952 -3121 -1064 1733 3178 2528 -324 -2651
3277 -2651 -3094 -1435 1151 3406 2821 332 -2472 -3330 -1735 743 3071 3161 756 -2281 -2989 -2177 166
$$ packed form
3166C391l72k242k999j372J417L132K161K25k310k837j339O69K503K707O41j797
3182A578k988j716J26K473K904J212j512k773k341j02K214K573J861q79k721k547
3198b638o60J758K922J612J20k956k540j017J407L051K012R8k466k680j429R31
3214b475K813K367K68j696k866j669O70K284K589J117j469k918k164J35K044L000
3230B030J233p38l108k319l42J927K759J784n35k414k814p90J562K853K052k66
3246B874k137k760j482J268K938K253K86k214k663j777J067K366K717O60j762
3261A634k895j753M26K147K634J320j288k974k203j69K057K797J445o50k852k327
3277b651m43J659K586K255n85k489k804q58J595K478K328R0k405l037p08Q12K343
$$ plain form
3294 166 2594 3290 1279 -1602 -3195 -2747 -156 2330 3145 1853 -904 -2907 -2815 -647 1988 3263
3310 3263 2139 -606 -2645 -3137 -1283 1286 2962 2464 17 -2404 -3302 -1807 998 2899 2858 372
3326 372 -1863 -3312 -1868 948 2677 3140 1141 -1832 -3209 -2366 2 2537 2992 1596 -880 -2839
3342 -2839 -2787 -631 2117 2995 2026 -691 -2736 -3052 -1064 1642 3185 2451 -137 -2481 -3089 -1588 1124
3359 1124 2969 2793 481 -2197 -3355 -1705 702 2687 2555 811 -1467 -3006 -2177 229 2646 3071
3375 3071 1395 -1451 -3192 -2679 -164 2407 2935 1663 -857 -2692 -2601 -972 1979 2988 2080 -351
3391 -351 -2630 -2944 -1248 1485 3003 2558 392 -2247 -2725 -1704 899 2864 2668 582 -1965 -3019
3407 -3019 -2090 334 2535 2977 1151 -1431 -2938 -2342 -300 2127 3059 1630 -1224 -3017 -2757 -829
$$ packed form
3294A66K428O96k011k881j593M48K591K486Q15j292k757k003R2K168K635J275
3310C263j124k745k039m92J854K569J676m98k447k421q98J495K805J901m1k486
3326C72k235j449J444K816J729M63j999k973j377Q43K368K535M55j396k476j959
3342b839N2K156K748Q78r69k717k045l16J988K706J543p34k588k344o08J501K712
3359A124J845j76k312k678j158J650K407J985j32j744k278j539Q29K406K417M25
3375C071j676k846j741N13K515K571N28j272k520j835R1J629K951J009r08k431
3391c51k279l14J696K733J518m45k166k639m78J021K603J965j96k086k547j054
3407c019R29K424K201M42j826k582j507N96K042K427R32j429k854j793K60J928
$$ plain form
3423 -829 1939 2967 1958 -326 -2670 -2698 -877 1705 3155 2701 -180 -2526 -3003 -1277 919 2937
3439 2937 2610 504 -1788 -3033 -1830 871 2547 2873 732 -1480 -3159 -2421 267 2536 2708 1098
3455 1098 -1124 -2977 -2491 -592 2055 3124 1688 -839 -2639 -2558 -587 1776 2874 1996 -266 -2240
3471 -2240 -2749 -1497 1374 3032 2334 169 -2151 -2954 -1489 1159 2537 2880 663 -1805 -3045 -1902
3487 -1902 499 2468 2894 1162 -1401 -3031 -2386 -231 2269 2746 1564 -773 -2901 -2754 -605 1797
3503 1797 2984 2199 -455 -2436 -2873 -1164 1554 2862 2339 105 -2033 -2985 -1515 992 3049 2447
3519 2447 513 -2022 -2897 -1898 422 2741 2826 775 -1548 -2940 -2323 267 2400 2929 1399 -883
3535 -883 -2807 -2741 -481 2065 2788 1908 -661 -2532 -2703 -747 1641 2915 2036 -118 -2261 -2872 -1488
$$ packed form
3423h29K768J028j009k284k344k8J821K582J450m54k881k346m77J726K196K018
3439B937l27k106k292j245J203K701J676L26k141k212j679P38K688K269J72j610
3455A098k222j853M86J899K647J069j436k527j800Q1J971K363J098q78k262j974
3471b240n09J252K871J658o98k165k320q03J465K648J378L43k217k468j240J143
3487a902K401J969M26j732k563j630O45K155K500M77j182k337k128J47K149K402
3503A797J187p85k654j981m37J709K718J308n23k234k138r52J470K507K057o02
3519B447j934k535q75R99K320K319Q5k051k323j392O17K590K133N29j530k282
3535h83j924O6K260K546P23q80k569j871j71J956K388J274q79k154k143o11J384
$$ plain form
3552 -1488 980 2987 2551 277 -2028 -3028 -1631 653 2742 2787 873 -1391 -2929 -2169 -197 2347
3568 2347 3051 1336 -1201 -2850 -2414 -78 1820 2925 1713 -627 -2796 -2664 -650 1864 3038 2006
3584 2006 -354 -2555 -2651 -1005 1157 2857 2623 212 -2195 -2993 -1852 958 2499 2670 539 -1813
3600 -1813 -2876 -1922 442 2806 2795 1046 -1396 -2775 -2140 -143 2068 2783 1625 -1004 -2909 -2562
3616 -2562 -551 1812 2745 1879 -629 -2589 -2527 -917 1514 2955 2178 -31 -2082 -2585 -1494 1018
3632 1018 2850 2393 427 -1879 -2827 -1788 546 2407 2538 760 -1653 -2845 -2265 49 2509 2928
3648 2928 1314 -1163 -2620 -2292 -142 1691 2853 1612 -448 -2434 -2534 -541 1604 2811 2008 -147
3664 -147 -2514 -2698 -1179 841 2782 2336 281 -2078 -2492 -1768 867 2691 2475 768 -1821 -2879
$$ packed form
3552a488K468K007m36k274k305j000J397K284K089M5j914k264j538P60J972K544
3568B347P04j715k537j649M36K336J898J105j212k340k169J32K014K514J174j032
3584B006k360k201r6J646K162J700k34k411k407p98J141K810J541J71k131k352
3600a813j063R54K364K364j1j749k442j379O35J997K211P15j158k629j905L47
3616b562K011K363R33q66k508j960O2J610K431J441p77k209k051n03J091K512
3632A018J832m57j966k306r48J039K334J861J31j778k413j192N80K314K460M19
3648B928j614k477j457L28K150J833J162j241k060j986j00J993K145J207q03k155
3664a47k367j84J519K020J941m46k055k359m14P24K635J824k16j707k589j058
$$ plain form
3680 -2879 -1933 237 2305 2657 1155 -1129 -2726 -2451 -279 2070 3126 1425 -942 -2661 -2676 -674
3696 -674 1714 2922 1804 -383 -2269 -2661 -1093 1439 2464 2054 -52 -2244 -2710 -1329 620 2689
3712 2689 2465 491 -1795 -2687 -1874 477 2290 2564 747 -1418 -2626 -1871 42 2103 2638 1355
3728 1355 -1190 -2466 -2225 -241 1924 2646 1721 -575 -2545 -2660 -957 1437 2712 2122 -119 -2223
3744 -2223 -2689 -1289 947 2708 2264 26 -1994 -2632 -1503 479 2334 2489 519 -1508 -2769 -2175
3760 -2175 361 2269 2722 936 -1124 -2512 -2123 -153 1802 2634 1455 -998 -2453 -2575 -784 1252
3776 1252 2844 1832 -200 -2261 -2618 -1096 1063 2574 2354 158 -2059 -2638 -1581 1115 2300 2168
3792 2168 558 -1591 -2706 -1869 345 2345 2642 946 -1155 -2809 -2149 -174 2291 2605 1195 -825
$$ packed form
3680b879R46K170K068L52j502k284j597K75K172K349J056j701k367j719j5K002
3696f74K388J208j118k187j886l92J568K532J025m10k106k192m66J381J949K069
3712B689k24j974k286q92Q13K351J813K74j817k165j208P55J913K061N35j283
3728A355k545j276K41J984K165P22r25k296j970j15J703K394J275n90k241k104
3744b223m66J400K236J761m44k238k020o38J129J982J855J55j970k027j261N94
3760b175K536J908M53j786k060j388L89J970J955Q32j179k453j455j22J791K036
3776A252J592j012k032k061l57J522K159J511k20k196k217n79J057K696J185j32
3792B168j610k149j115Q37K214K000K97j696k101j654O60J975K465L14j410k020
$$ plain form
3808 -825 -2557 -2360 -394 1872 2424 1738 -282 -2479 -2625 -1019 1424 2444 2105 145 -2119 -2603 -1229
3825 -1229 939 2656 2236 575 -1578 -2455 -1422 475 2497 2409 865 -1666 -2621 -1922 -159 2228
3841 2228 2419 1109 -1200 -2613 -2291 -65 1881 2645 1541 -703 -2299 -2405 -816 1473 2427 2110
3857 2110 -101 -2166 -2402 -1261 1255 2665 2018 446 -1793 -2487 -1564 860 2513 2321 664 -1872
3873 -1872 -2667 -1885 713 2231 2495 1212 -1460 -2434 -1923 -351 1899 2738 1395 -760 -2381 -2225 -371
3890 -371 1545 2679 1805 -311 -2125 -2498 -810 1111 2624 2046 20 -1972 -2458 -1600 660 2655
3906 2655 2312 305 -1629 -2397 -1512 489 2303 2501 845 -1190 -2592 -1962 310 2065 2346 1249
3922 1249 -1049 -2425 -2168 -374 1604 2581 1658 -712 -2169 -2436 -901 1249 2445 1856 -113 -1843
$$ packed form
3808h25j732J97J966K266N52o86k020k197j46J606K443J020l39j960k264m84J374
3825a229K168J717m20j661k153q77J033J897K022q8j544k531r55O99J763K387
3841B228J91j310k309j413L22K226J946P64j104k244j596j06J589K289R54l17
3857B110k211k065k36J141K516J410o47j572k239o94R23K424J653j92j657k536
3873a872p95P82K598J518K64j283k672r74N11J572K250Q39j343k155j621J56J854
3890c71J916J134q74k116j814l73J688J921J513n78k026j992m86Q58K260J995
3906B655l43k007j934p68Q85K001J814J98j656k035j402O30K272J755K81j097
3922A249k298j376K57J794J978R77r23k370j457k67J535K150J196n89j969j730
$$ plain form
3938 -1843 -2379 -1084 979 2599 2075 206 -1462 -2566 -1628 697 2273 2228 541 -1447 -2684 -1671
3954 -1671 260 2037 2553 1059 -1290 -2345 -1944 -210 1659 2496 1356 -837 -2351 -2146 -612 1410
3970 1410 2576 1709 -177 -2090 -2545 -1132 935 2387 1930 256 -1744 -2057 -1378 450 2298 2274 663
3987 663 -1622 -2487 -1524 244 1830 2164 864 -1242 -2533 -1775 -323 1989 2276 1288 -745 -2395 -2106
4004 -2106 -592 1596 2524 1682 -504 -2070 -2236 -765 1224 2569 1838 -235 -2031 -2426 -1156 1002
4020 1002 2334 1863 429 -1634 -2113 -1491 486 2214 2197 696 -1221 -2276 -1757 -16 1794 2234 1157
4037 1157 -959 -2113 -2102 -280 1405 2326 1460 -635 -2234 -1895 -658 1486 2236 1533 14 -2051 -2245
4054 -2245 -862 933 2187 2037 106 -1540 -2462 -1328 516 1941 2111 525 -1201 -2146 -1779 34
$$ packed form
3938a843n36J295K063J620n24j869j668j104R38K325J576m5j687j988j237J013
3954a671J931J777N16j494k349j055M01J734J869Q37j140k193j514K05J534K022
3970A410J166q67j886j913m55J413K067J452m57j674k000l13O79J828J848k4j611
3987F63k285q65R63J768J586L34j300k106j291P58J452K312K87r88k033j650K89
4004b106J514K188R28q42k186j566j66J471J989J345p31k073j796l95J270K158
4020A002J332m71j434k063m79O22J977J728j7j501j917j055N19J741J810M40j077
4037A157k116j154J1J822J685R21q66k095j599L39J237K144P50p03j519k065j94
4054b245J383J795J254j50j931j646r22J134J844J425J70j586j726r45L67J813
$$ plain form
4070 34 2111 2345 967 -883 -2113 -1755 -342 1475 2162 1372 -566 -1863 -2160 -718 1318 2301 1684
4087 1684 -377 -1896 -2007 -864 1170 2323 1825 237 -1629 -2171 -1358 679 2208 2005 229 -1277
4103 -1277 -2023 -1547 548 2133 2014 822 -1222 -2169 -1547 24 1625 2201 1020 -745 -2160 -1819 -312
4120 -312 1547 2166 1359 -394 -1856 -1851 -472 1243 2078 1634 -14 -1733 -2403 -747 667 2188 1760
4137 1760 548 -1396 -2125 -1443 563 1949 1905 861 -837 -1999 -1695 183 1606 2421 1190 -799
4153 -799 -2317 -1889 -117 1415 2104 1250 -590 -2033 -2173 -600 924 1962 1479 -291 -1858 -2068 -891
4170 -891 780 2168 1755 280 -1827 -2173 -1176 729 1904 1899 476 -1389 -1993 -1433 373 1650 1906
4187 1906 910 -969 -1794 -1526 -191 1600 2027 1040 -741 -2142 -1987 -609 1331 2121 1297 -248 -1903
$$ packed form
4070C4K077K34j378j850j230L58J413J817O87p90j938j297k97J442K036R83o17
4087A684k061j519j11J143K034J153m98j588j866n42Q13K037J529k03j776j506
4103a277p46M76K095J585j19j192k044r47O22J571J601N76j181j765j415L41J507
4120c12J859O19q07j753j462NJ379J715Q35m44j648j719o70J656J414J521m28
4137A760j212j944p29O82K006J386m4j044j698j162L04J878J423Q15j231j989
4153g99j518M28J772J532O89q54j840j443j40J573J524J038m83j770j567k10J177
4170h91J671J388m13j475k107l46R97J905J175nj423j865o04N60J806J277K56
4187A906r96j879q25K68J335J791M27r87j781j401J55J378J940P90q24j545j655
$$ plain form
4204 -1903 -1982 -661 920 1906 1698 -36 -1645 -1949 -1585 675 1966 1829 359 -1409 -1896 -1223 363
4221 363 1661 1784 768 -1125 -2018 -1400 -47 1721 2017 940 -1231 -1710 -1840 -359 1288 2116 973
4238 973 -381 -1745 -1780 -954 817 1969 1543 -36 -1845 -1962 -995 601 1846 1560 518 -1555 -2513
4255 -2513 -1052 457 1683 1534 508 -1026 -1903 -1512 9 1580 1959 824 -879 -1890 -1631 -267
4271 -267 1402 1917 766 -614 -1711 -1735 -468 1261 2001 1431 15 -1811 -1836 -970 710 1646 1352 224
4289 224 -1175 -2201 -1078 755 1713 1551 271 -1222 -2008 -1173 61 1714 1759 609 -886 -1812 -1338
4306 -1338 -135 1358 2047 887 -698 -1866 -1749 -196 1131 1671 1285 -397 -1527 -1737 -738 751
4322 751 1927 1481 -57 -1678 -1603 -796 791 1718 1586 361 -1034 -1876 -1199 194 1730 1951 705
$$ packed form
4204a903p9J321J581R86k08j734j609l04L64K260J291j37j470j768m87O73J586
4221C63J298J23j016j893q93O18J353J768K96j077k171m79j30J481J647Q28j143
4238I73j354j364l5Q26J771J152m26j579j809j17R67J596J245k86j042k073r58
4255b513J461J509J226j49j026j534q77L91J521J571L79j135j703j011K59J364
4271b67J669N15j151j380j097k4J267J729P40n70j416j826k5Q66J680R36k94j128
4289B24j399j026J123J833R58j62j280j493p86Q35J234J653M5j150j495r26M74
4306a338J203J493O89j160j585j168J17J553J327N40l86j682j130k10R99J489
4322G51J176m46j538j621P5Q07J587R27j32j225j395q42O77J393J536K21j246
$$ plain form
4339 705 -743 -1999 -1529 22 1291 1761 976 -678 -1595 -1683 -243 1012 1799 1312 -563 -1592 -1959
4356 -1959 -460 1196 1651 1443 28 -1311 -1721 -997 688 1860 1279 177 -1253 -2076 -836 418
4372 418 1650 1618 612 -946 -1635 -1131 161 1542 1949 847 -961 -1632 -1759 -159 1229 1957 1283
4389 1283 -283 -1776 -1464 -112 1023 1711 1373 -243 -1459 -1996 -640 854 1716 1346 261 -1407
4405 -1407 -1959 -1302 290 1788 1658 307 -1046 -1508 -1245 285 1555 1700 705 -709 -1887 -1291 -66
4422 -66 1268 1352 866 -390 -1710 -1499 -406 1062 1843 1162 -262 -1499 -1688 -691 1043 1723 1338 -91
4440 -91 -1156 -1739 -919 510 1758 1467 493 -1132 -1766 -1080 503 1777 1605 545 -655 -1575 -1309 209
4458 209 1160 1557 1055 -502 -1689 -1503 -360 1079 2028 1086 -463 -1514 -1435 -767 973 1910 1264 -37
$$ packed form
4339G05j448j256M70J551J269M70p85j654r17q8J440J255P87m87j875j029l67
4356a959J499J656M55k08j415j339m10P24J685J172n81j102j430q23J240J254
4372D18J232l2j006j558o89N04J292J381M07j102j808o71j27J600J388P28o74
4389A283j566j493L12J352J135O88l38j616j216n37J356J494Q62l70j085j668
4405a407n52O57J592J498j30j351j353m62K63J530J270J45r95j414j178N96J225
4422f6J334Q4m86j256j320K11J093J468P81o81j424j237j89R97J734O80l85j429
4440i1j065n83Q20J429J248k91r74j625o34O86J583J274j72j060j200r20K66J518
4458B09R51L97n02j557j187J86J143J439R49r42j549j051P9O68J740R37o46j301
$$ plain form
4476 -37 -1295 -1497 -871 531 1796 1432 58 -1164 -1667 -1063 447 1704 1702 451 -1091 -1876 -976 171
4494 171 1236 1562 892 -805 -1582 -1310 -92 1331 1515 920 -475 -1599 -1622 -680 1041 1749 1435 -59
4512 -59 -1422 -1364 -738 665 1529 1323 110 -1079 -1758 -937 506 1665 1316 523 -1059 -1694 -1160 285
4530 285 1506 1489 480 -932 -1618 -1221 -20 1202 1738 846 -382 -1465 -1318 -161 1166 1583 849
4547 849 -133 -1182 -1515 -494 1094 1368 1299 212 -1340 -1641 -787 567 1497 1485 188 -866 -1513 -951
4565 -951 107 1682 1280 705 -665 -1555 -1185 -46 1573 1438 837 -383 -1364 -1289 -345 931 1417 1000
4583 1000 -191 -1245 -1505 -546 928 1631 1305 31 -871 -1681 -750 613 1429 1345 116 -1174 -1406 -698
4601 -698 306 1343 1462 522 -572 -1495 -1263 -45 1245 1442 689 -663 -1958 -1621 -175 902 1637
$$ packed form
4476c7j258k02O26J402J265l64j374j222n03O04J510J257kj251j542p85R00J147
4494A71J065L26o70j697p77K72J218J423J84n95j395j124k3R42J721P08l14j494
4512e9j363N8O26J403Q64k06j213j189o79Q21J443J159l49p93j582o35N34J445
4530B85J221j7j009j412o86L97J201J222N36q92j228j083J47J157J327M17p34
4547H49r82j049l33J021J588K74o9j087j552l01Q54J354R30j2j297j054o47N62
4565i51J058J575m02n75j370q90L70J139J619j35o01j220r81P5R44J276M86m17
4583A000j191j054k60R59J474P03l26j274r02q10R31J363Q16q4j229j290k32P08
4601f98J004J037J19r40j094r23K32J218J290J97p53j352j295L37J446J077P35
$$ plain form
4618 1637 794 -358 -1331 -1344 -455 761 1478 1053 -120 -975 -1367 -900 532 1532 1366 282 -860 -1752
4636 -1752 -812 325 1364 1258 164 -689 -1437 -844 309 1326 1362 660 -456 -1708 -1479 -95 1054
4653 1054 1238 1087 -363 -1514 -1293 -557 959 1637 1134 -70 -1311 -1533 -622 848 1637 1251 81
4670 81 -1235 -1526 -515 617 1381 1250 452 -1213 -1543 -1008 533 1267 1452 339 -786 -1527 -993 29
4688 29 1210 1363 717 -549 -1361 -1233 -523 864 1404 811 -120 -1177 -1481 -681 612 1564 1133 -85
4706 -85 -1304 -1584 -1102 530 1384 1106 239 -885 -1305 -842 319 1295 1489 389 -1157 -1475 -1099 -61
4724 -61 1156 1617 394 -828 -1224 -1490 -181 1201 1248 842 -200 -1450 -1375 -405 738 1561 1304 -300
4742 -300 -1229 -1728 -750 695 1730 1272 200 -855 -1642 -768 310 1157 1479 295 -601 -1236 -962 85
$$ packed form
4618A637q43j152r73j3Q89J216P17m25j173q55l92M67J432J000j66j084j142q92
4636a752R40J137J039j06j094q53p48N93J153J017L6p02j116j252K29J384J149
4653A054J84j51j450j151K21P36J516O78n03j204j241k22R11J470P89l86j170
4670H1j316k91J011J132P64j31p98j665l30N35J541P34J85j113j125p41N34J022
4688B9J181J53o46j266q12J28P10J387N40n93r31j057l04Q00J293R52m31j218
4706h5j219k80M82J632Q54k78q67j124m20M63J161R76J94j100j546l18L76J038
4724f1J217M61j223j222l96k66J309J382M7m06j042j250P5R70J143Q23k57j604
4742c00r29m99R78J445J035m58j072j055p87Q74J078Q47L22j184q96o35K74J047
$$ plain form
4760 85 1119 1265 774 -512 -1266 -1141 -353 1088 1408 628 -312 -1341 -1203 -609 997 1502 1112 -236
4778 -236 -1204 -1354 -473 808 1171 1216 -20 -1125 -1438 -814 326 1375 1245 303 -859 -1459 -1181 150
4796 150 1261 1327 654 -475 -1258 -1055 88 923 1325 528 -540 -1199 -1261 -535 858 1464 971 -197 -1090
4815 -1090 -1328 -689 760 1250 1099 142 -936 -1212 -831 702 1375 1215 32 -724 -1536 -1119 48 1252
4833 1252 1425 572 -669 -1263 -1108 -199 1071 1208 862 -589 -913 -1370 -332 924 1387 751 -449 -1144
4851 -1144 -1284 -339 769 1176 1217 -78 -953 -1282 -750 577 1174 1119 390 -891 -1247 -969 405 1084 1236
4870 1236 454 -842 -1329 -1077 49 1308 1295 654 -522 -1360 -1321 -276 930 1059 1049 -427 -1018 -1355
4888 -1355 -319 622 1244 1051 55 -1058 -1373 -864 588 1318 1244 255 -984 -1392 -1022 142 1072 1231
$$ packed form
4760H5J034J46m91j286p54J25P88J441L20p80r40j029J38N94J606N05l90j348
4778b36r68j50Q81J281L63M5j236j105l13O24J140J049j30r42j162o00K78J331
4796A50J111O6o73j129p83K03J143Q35M02p97j068o59o2P26J393O06m93j168q93
4815a090k38O39J449M90j51r57j078k76L81J533O73j60j183p56q12M17J167J204
4833A252J73q53j241n94J55R09J270J37l46j451l24m57J038J256M63o36j200o95
4851a144j40R45J108M07M1j295q75l29N32J327N97n5p29j281l56K78J374O79J52
4870A236p82j296m87K52J126J259j3o41j176q38L9J045J206J29j0j476n91l37
4888a355J036R41O22j93r96j113l15N09J452P30p4r89j239m08L70J164R30J59
$$ plain form
4906 1231 547 -921 -1379 -939 123 917 1466 754 -604 -1258 -1284 -36 690 1252 850 -179 -1327 -1173
4924 -1173 -278 621 1227 768 -57 -891 -1264 -728 532 1286 1302 234 -798 -1254 -623 433 1265 1144 289
4943 289 -797 -1484 -920 -121 1091 1351 477 -549 -1365 -1130 53 817 1125 536 -268 -1176 -1111 -377 987
4962 987 999 934 -239 -1065 -1306 -649 722 1327 1164 -182 -829 -1344 -791 390 991 1083 186 -734 -1387 -873
4982 -873 217 934 1230 529 -776 -1296 -783 105 1027 1466 736 -305 -1285 -1206 -145 892 1312 974 -286
5001 -286 -1285 -1366 -399 583 1029 921 29 -1052 -1241 -688 487 1153 1421 227 -1113 -1268 -828 297 896
5020 896 1068 305 -486 -1149 -969 93 1161 1265 723 -497 -1065 -1192 -119 969 1146 779 -273 -1075
5038 -1075 -1155 -338 920 1316 780 -104 -984 -1178 -724 347 978 1098 207 -1007 -1302 -747 225 1071 1195
$$ packed form
4906A231o84j468m58M40J062P94N49p12j358o54k6J248P26N62m02j029j148J54
4924a173Q95Q99O06m59q25q34l73N36J260P54J6j068j032m56O31J056Q32j21q55
4943B89j086o87N64P99J212K60q74j026q16K35J183P64L08n89q04r08O5P34J364
4962I87J2o5j173q26k41O57J371O05j63j346o47n15N53J181O01R2q97r20o53N14
4982h73J090P17K96p01j305n20N13Q88R22M39p30j041r80P9J061J037M20l38j260
5001b86r99q1R67R82M46j08q92j081j89N53J175O66K68j194j340j55M40J125N99
5020H96J72p63p91o63J80J062J068J04n42j220n68j27J073J088J77l67j052q02
5038a075q0Q17J258L96n36q84q80j94M54J071O31J20q91j214k95N55R72Q46J24
$$ plain form
5057 1195 468 -1000 -1363 -939 47 1009 1256 482 -732 -1292 -979 191 992 1360 805 -451 -1286 -1197 -441
5076 -441 662 1360 991 -219 -1020 -1191 -503 515 1551 1042 -145 -1086 -1153 -451 448 911 1268 250
5094 250 -832 -1282 -968 237 1107 1237 410 -600 -1209 -945 -106 971 1332 514 -467 -1417 -1111 -157 860
5113 860 1260 863 -163 -1326 -1220 -421 605 1288 931 -173 -896 -1417 -617 375 1195 1408 132 -966
5131 -966 -1193 -900 10 1055 986 294 -713 -1273 -909 50 1112 1203 651 -369 -1089 -945 -263 956 1239
5150 1239 686 -234 -882 -1084 -555 709 1449 846 16 -1037 -1382 -522 427 1289 998 -88 -680 -1226 -441
5169 -441 254 1236 1017 376 -527 -1203 -733 268 881 1079 626 -472 -1281 -1103 -120 919 985 657 -462
5188 -462 -1228 -1107 -353 683 1131 832 -65 -1219 -1160 -555 272 1177 752 129 -888 -1307 -728 288 1102
$$ packed form
5057A195p27j468l63M24R86R62K47p74j214n60L13J170Q01L68n55j256q35Q9P56
5076d41J103O98l69j210q01j71O88J018J036n09j187r41o7P02Q99M63L57j018
5094B50j082m50L14J205Q70J30q27j010o09K64Q39J077L61q18r81r50L06R54J017
5113H60M00l97j026j163J06P99J026O83l57j104p23n21Q00R92Q20K13j276j098
5131i66k27K93R10J045o9o92j007n60L64R59J062R1n52j020p20J44O82J219K83
5150A239n53r20o48k02N29J264P40o03q30j053l45Q60R49Q62k91j086n92n46P85
5169d41O95R82k19o41r03o76M70J001O13J98m53j098q09J78R83J039O6l28j119
5188d62p66J21P54J036M48k99q97j154N9O05Q27R05m25o23j017m19N79J016Q14
$$ plain form
5207 1102 1172 315 -903 -1088 -760 -42 1039 1286 563 -495 -1186 -917 83 1282 1382 721 -296 -993
5225 -993 -1037 -340 682 1425 974 -167 -1125 -1205 -507 228 1074 844 47 -811 -1060 -529 56 1179 902 196
5245 196 -857 -1101 -1057 142 1191 1120 349 -606 -1193 -1082 106 928 1315 571 -324 -1012 -1086 -126 526 878
5265 878 681 -123 -894 -946 -366 630 1293 657 -127 -958 -1372 -525 235 1137 1078 295 -835 -1271 -790 3
5285 3 1025 829 296 -529 -1029 -751 -94 1169 1075 646 -431 -1139 -739 -346 723 956 583 -211 -1296
5304 -1296 -1039 -252 645 1221 888 -246 -822 -1270 -455 576 948 1133 84 -876 -1364 -705 163 1024 941
5323 941 213 -446 -1382 -759 71 957 1278 578 -600 -1086 -1020 -62 919 1077 435 -137 -973 -1066 -183 600
5343 600 1048 1065 -180 -1117 -919 -424 537 726 932 -89 -888 -1164 -582 603 1060 1025 278 -732 -1137
$$ packed form
5207A102P0q57j218j85L28P18J081K47p23j058o91K69J000J199J00o61j017o97
5225i93m4O97J022P43m51j141r58q0O98P35Q46k30p97q58k49N31N85J123k77p06
5245A96j053k44M4J199J049p1p71r55n87J11J188Q22L87p44q95o88p4R60O52L52
5265H78j97q04p71n2N80R96O63o36p84q31m14Q47P60R02n9p83j130m36M81P93
5285CJ022j96n33q25n00K78O57J263r4m29j077p08M00L93J069K33l73p94j085
5304a296K57P87Q97N76l33j134n76m48Q15J031L72J85j049r60m88O59Q68Q61q3
5323I41p28o59r36O23Q30Q86L21p00j178m86O6R58R81J58o42n72q36r3Q83P83
5343F00M48J7j245r37J98M95R61J89K06j021p99k76N82J185M57l5p47j010m05
$$ plain form
5362 -1137 -914 159 1013 717 563 -616 -1004 -837 -132 634 1119 760 -367 -1047 -701 -105 844 1119 951
5381 951 -339 -1028 -933 -142 528 1188 1074 -37 -926 -1234 -526 225 1180 988 377 -720 -941 -533 443
5400 443 1113 816 378 -550 -1281 -752 -306 833 1111 501 -411 -1363 -983 -199 685 1277 405 -130 -914 -766
5420 -766 -332 398 1149 806 68 -1067 -837 -504 417 885 996 250 -696 -1165 -676 89 860 917 75 -704
5440 -704 -1287 -832 161 972 1045 626 -518 -1171 -746 -204 643 888 524 -162 -1177 -1039 -130 614 1009 798
5460 798 2 -1183 -993 -516 218 1078 1122 -27 -665 -1126 -680 403 969 995 -120 -842 -1087 -629 260
5479 260 984 945 353 -624 -961 -1008 128 883 913 729 -330 -1022 -760 -217 1061 998 678 -163 -1105 -854
5499 -854 -278 729 1239 841 73 -684 -1019 -472 232 922 820 225 -767 -1175 -625 -159 791 983 235 -474
$$ packed form
5362a137K23J073Q54k96j54j179l88J67P05P66M85l59j127o80L46N96R49K75j68
5381I51j290o89R5P91O70O60j14j111q89l08P08P51R55j92o11j097k21M08R76
5400D43O70k97m38r28p31N29M46J139K78o10r12r52L80P84Q84N92q72n35p84J48
5420g66M34P30P51l43p38j135K30L33R21M68J11p46r46m69M89P65P71N7q42p79
5440g04n83M55R93Q11P3m19j144o53M25N42Q47K45l64o86j015J38R09P44L95k11
5460G98p96j185J90M77P34Q60M4j149o38m61M46J083N66K6j115p22k45M58Q89
5479B60P24l9n92r77l37m7J136P55L0j84j059o92K62N43J278o3l20q41r42K51
5499h54N76J007N10l98p68p57l35N47P04O90j02n95r92m08N50M66R50J92p48p09
$$ plain form
5519 -474 -1093 -766 113 770 1022 218 -251 -916 -1132 -274 750 1014 785 -394 -871 -892 -421 693 1061
5538 1061 760 -180 -741 -1000 -425 379 935 864 124 -774 -1076 -639 283 1102 1267 209 -751 -1039 -962 92
5558 92 770 789 373 -489 -1305 -1160 113 586 987 379 -204 -1001 -1267 -393 503 1184 658 48 -858 -1106
5578 -1106 -554 239 1094 1007 -257 -718 -1120 -482 279 838 960 96 -650 -1082 -772 35 789 1050 302 -628
5598 -628 -968 -887 -164 744 1098 510 -162 -1058 -1060 -332 747 1016 759 -255 -991 -1000 -310 560 1024 979 -200
5619 -200 -769 -1058 -340 532 978 984 -6 -844 -1074 -944 122 798 1042 135 -685 -1020 -746 -30 806 848 313
5640 313 -289 -1064 -682 -344 885 1356 679 -225 -974 -1209 -508 202 988 629 44 -759 -1104 -559 433 954
5660 954 909 93 -659 -981 -566 369 766 862 243 -845 -775 -612 -65 985 1267 501 -370 -1059 -802 92
$$ packed form
5519d74o19L27Q79O57K52q04m69o65k16Q58J024K64k29j179m77k1M71J114L68
5538A061l01r40n61k59N75Q04N56p1p40q98l02M37R22Q19J65j058r60k88P7J054
5558I2O78J9m16q62q16J45J273M73M01o08n83p97k66Q74Q96O81n26o10r06k48
5578a106N52P93Q55q7j264m61m02O38P61N59J22q64p46m32L10Q07P54K61p48r30
5598f28l40Q1P23R08L54n88o72q96kP28J079K69k57j014p36rO90Q70M64m5j179
5619b00n69k89P18Q72M46Or90q38k30J30J066O76K44r07q20l35K74P16Q36M2n35
5640C13o02p75L82L38J229M71o77r04p49k35P01P10P86l59n85q03l45N45R92N21
5660I54m5q16p52l22M15R35L97R6o19j088P0J63N47J050K82p66q71o89K57Q94
$$ plain form
5680 92 821 1173 739 -484 -785 -952 -281 455 824 772 -189 -1101 -1081 -658 496 1208 876 50 -818 -883 -435
5701 -435 289 661 1027 173 -701 -1094 -697 143 865 1109 517 -532 -1211 -727 -69 700 863 551 -484
5720 -484 -1232 -1014 -491 612 1275 519 -58 -958 -1019 -469 346 1031 549 76 -816 -1014 -459 472 1000 1008 248
5741 248 -638 -1253 -638 406 558 786 452 -542 -1011 -718 -165 853 961 424 -211 -898 -792 -421 571
5760 571 1182 810 -495 -594 -1054 -305 498 1116 455 -228 -707 -893 -877 220 1136 674 245 -497 -920 -819
5780 -819 302 906 982 228 -592 -1069 -730 15 774 754 499 -411 -697 -800 156 618 596 486 -301 -777 -798
5801 -798 -127 579 1052 642 -259 -837 -904 -462 287 953 882 189 -850 -1005 -770 285 1035 950 325 -737
5821 -737 -811 -391 -120 470 1113 426 -508 -1087 -888 -174 697 714 425 -385 -879 -901 -96 528 920 673 -155
$$ packed form
5680I2P29L52m34j223l01j67O71P36L69n2r61r12K0M23J154P12l32q26q68o5M48
5701d35P24L72L66q54q74l93L97Q40P22K44n92j049o79M84O58P69J63l12j035
5720d84p48K18N23J103O63p56n77r00o1N50Q15O85m82m73q92j98N55R31N28Qp60
5741B48q86o15O15J044J52K28l34r94m69K93N53J018J08n37o35o87J06L71R92
5760E71O11l72j305r9m60P49Q03O18o61o83m79j86J6J097R16m62m29p42m23J01
5780h19J121O04P6p54q20m77L39P45P59k0k55r10k86j03R56M62k2j10p87m76k1
5801g98O71P06M73m10r01n78o7M42P49O66p1o93j039j55K35J055P50q5o25j062
5821g37p4M20K71N90O43o87r34n79J99P14Q71J7k89q10m94k2Q05O24L92k47q28
$$ plain form
5842 -155 -932 -684 -197 534 1066 487 -246 -801 -845 -389 438 1115 807 -317 -735 -1060 -570 258 638 933
5862 933 131 -531 -1018 -756 -14 703 980 305 -290 -828 -829 -15 662 1073 829 -79 -830 -898 -287 776 1110
5883 1110 701 43 -745 -1119 -602 285 704 724 353 -466 -879 -552 258 851 970 419 -160 -1237 -810 -200
5903 -200 754 735 579 -511 -991 -874 -178 668 1102 551 -256 -1057 -920 -186 460 1054 638 -48 -749 -785
5923 -785 -458 352 1292 915 58 -571 -880 -535 437 922 1049 183 -467 -1000 -493 229 669 925 203 -229
5943 -229 -1101 -864 96 901 846 596 -274 -1015 -784 -105 511 1004 671 -101 -705 -984 -281 549 924 784
5963 784 42 -712 -984 -392 454 868 834 225 -463 -775 -636 -83 792 694 272 -559 -785 -659 107 727 801
5984 801 387 -433 -768 -964 -153 663 931 375 -86 -1212 -1102 -514 746 827 844 -84 -805 -1027 -460 344
$$ packed form
5842a55p77K48M87P31N32n79p33n55m4M56Q27O77l08j124m18l25M90Q28L80K95
5862I33q02o62m87K62P42P17K77o75n95n38jQ14O77M11k44r08p51o8O11J063L34
5883A110m09o58p88l74N17Q87M19K0l71q19m13L27Q10N93J19n51n79j077M27O10
5903b00R54j9j56j090m80J17O96Q46M34n51q07q01J37P34O46N94m16o86p01l6
5923g85L27Q10R40l77q57o29l09L45R72M85J27q66o50n33N07P22M40K56p22m32
5943b29q72K37R60Q05n5k50q70p41K31O79O16M93l33p72o04k79P03Q30L75j40
5963G84p42p54k72N92Q46M14l4o09o88l12J39N53Q75r8m22q31k26J26P66O20P4
5984H01m14q20l35j96Q11Q16K68n56m61j126J10N88J260Q1J7r28p21k22N67Q04
$$ plain form
6004 344 870 700 77 -457 -955 -415 136 608 676 401 -637 -1075 -761 44 802 780 638 -312 -782 -919
6024 -919 134 719 995 460 -267 -786 -723 -288 626 907 463 -148 -890 -982 -148 284 746 731 50 -581 -764
6045 -764 -721 252 909 819 198 -473 -901 -801 94 600 842 467 -501 -832 -844 -265 637 748 295 -241 -1078
6066 -1078 -492 252 848 1139 563 -335 -651 -901 -474 558 859 445 19 -761 -871 -455 177 712 697 383
6086 383 -747 -951 -566 150 972 800 113 -624 -842 -650 -105 529 875 228 -330 -891 -692 -180 690 889
6106 889 482 -247 -1000 -996 12 589 809 672 -80 -790 -911 -298 525 715 876 136 -872 -1017 -389 260
6126 260 664 769 360 -268 -751 -362 -211 754 641 518 -474 -877 -629 106 397 907 642 -293 -670 -827
6146 -827 -71 511 834 579 -136 -949 -765 -378 183 885 631 120 -643 -775 -532 419 808 873 284 -343
$$ packed form
6004C44N26j70o23n34m98N40N51M72O8k75j038m38L14Q05P58k2j42r50m70j37
6024i19J053N85K76n35p27n19O3M35R14K81m44o11p42r2Q34M32M62j5o81o31j83
6045g64M3R73O57r0o21o71m28J00Q95N06K42l75r68l31j2N79R02J11m53n36q37
6066a078N86P44N96K91n76q98l16k50M27J032L01m14m26p80j10M16O32N35j5l14
6086C83j130k04L85P16Q22j72o87p37k18J92N45O34L46o47n58n61J99N12Q70J99
6106H89m07p29p53MJ008N77K20j37p52p10j21O13Q23J90J61p40j008j45O28O49
6126B60M04J05m09o28m83L89J51R65j13j23r92m03K48P35K91N10k65r35l77j57
6146h27P56N82L23k55p15q13J84L87N61P02k54n11p63j32K43R51L89O5n89o27
$$ plain form
6166 -343 -816 -439 239 678 998 199 -388 -748 -754 -14 829 782 286 -225 -702 -738 -132 524 1044 402 -144
6187 -144 -795 -444 -562 478 1009 775 -132 -565 -740 -283 405 828 549 33 -553 -944 -479 30 745 798
6207 798 166 -654 -809 -453 164 832 621 422 -255 -883 -688 -130 529 935 176 -559 -854 -752 -261 82
6227 82 740 760 148 -950 -985 -348 440 672 775 255 -320 -813 -444 117 510 469 277 -463 -875 -555 -14
6248 -14 686 793 298 -493 -790 -376 61 545 776 412 -205 -720 -569 -303 367 681 644 -42 -640 -490 -409
6269 -409 561 742 461 121 -528 -459 -379 220 720 683 139 -946 -665 -585 286 583 879 302 -508 -878 -527
6290 -527 -82 756 755 357 -233 -887 -548 -200 276 711 361 -11 -531 -537 -210 434 678 501 248 -399 -827
6311 -827 -319 391 523 512 261 -360 -548 -458 -43 605 532 291 -201 -657 -546 65 490 723 422 -428 -487
$$ packed form
6166c43m73L77O78M39L20p99n87l60oP40Q43m7m96n11m77l6O06O56N20o42n46
6187a44o51L51j18J040N31k34r07m33j75M57O88M23k79n16n86l91M65N09P15N3
6207G98o32q20j55L56O17O68k11j99o77o28J95N58O59M06p59p35k95J02M91L43
6227H2O58K0o12j098l5O37P88K32J03n20n75m93L69N61L93m1j92p40m12L20N41
6248a4P00J07m95p91k97M14M37M84K31l64o17n15J51K66O70L14l7o86n98J50Q1
6269d09R70J81k81l40o49O9Q0N99N00l7n44j085K81Q0Q71K97K96n77q10l70L51
6290e27M45Q38jl98n90o54L39L48M76M35l50l72n20oL27O44K44j77k53o47m28
6311h27N08P10J32j1k51o21j88R0M15O48p3k41m92m56J11O11M25K33l01q50n9
$$ plain form
6332 -487 -484 31 624 716 297 -274 -680 -430 -192 539 890 457 -27 -744 -731 -210 341 866 625 -107 -607
6353 -607 -602 -294 -124 786 770 -189 -300 -591 -461 296 457 545 -34 -443 -767 -546 55 466 827 214 -156
6374 -156 -907 -562 -250 445 513 345 -91 -690 -703 -170 99 700 677 178 -587 -856 -553 187 571 733 121
6395 121 -360 -576 -632 281 761 781 391 -179 -478 -583 43 560 665 492 -199 -389 -596 -81 162 792 436
6416 436 -138 -631 -623 -109 168 551 660 -137 -627 -546 -223 162 551 610 -152 -502 -621 -307 359 385 631 119
6438 119 -443 -637 -381 -218 421 786 353 -135 -593 -509 265 433 665 364 -380 -708 -666 -171 351 530 128
6459 128 -96 -693 -726 -369 340 639 633 -87 -576 -538 -259 334 429 484 173 -224 -623 -579 124 571 776 409
6481 409 -210 -668 -527 60 239 699 333 57 -733 -736 -136 397 675 445 -97 -670 -345 -222 207 601 615
$$ packed form
6332d87LN15N93R2m19n71m06K50K38P31L51m33m84p17J3N21N51N25k41p32n00
6353f07NL08J70R10j6r59j11k91J30P57J61Q8n79m09l24K21O01M11L61o13l70
6374a56p51L45L12O95O8j68m36n99j3N33K69O01k3m99p65k69L03P40L84J62o12
6395A21m81k16n6R13M80K0l90n70k99j05O26N17J05j73o91j90k07N15K43O30l56
6416D36n74m93QN14K77L83J09p97m90Q1L23L85L89N9p62l50j19L14O66K6K46n12
6438A19n62j94K56J63O39L65m33m88m58Q4P74J68K32l01p44l28M2M95N22J79m02
6459A28k24n97l3L57P09K99op20m89L8K79N93R5N5l11l97l99M4P03M47K05l67
6481D09o19m58J41N87J79M60l66k76p90lO00N33K78k30n42n73L25J23M29L94J4
$$ plain form
6502 615 -370 -454 -585 -66 375 985 618 203 -655 -705 -288 36 554 635 297 -217 -752 -551 110 637 703
6523 703 313 -290 -646 -639 20 555 492 382 -392 -578 -722 -37 489 743 463 37 -340 -661 -180 225 438
6544 438 536 -223 -615 -681 -460 280 570 825 459 -369 -510 -571 -125 445 753 117 -393 -558 -346 31 271
6565 271 513 209 -197 -729 -437 -16 366 945 598 86 -476 -690 -308 338 525 347 52 -355 -817 -355
6585 -355 423 651 410 335 -192 -751 -427 361 718 606 124 -217 -389 -414 -51 444 485 116 -263 -673 -334
6606 -334 -241 457 345 452 -299 -702 -347 -271 -65 481 640 -33 -576 -486 -264 100 544 502 -56 -153 -464 -334
6628 -334 221 395 569 158 -242 -446 -522 -295 490 499 255 -246 -425 -370 2 557 590 366 -39 -520 -637 -116
6650 -116 303 871 364 59 -547 -340 -174 331 653 352 13 -372 -502 -353 134 486 704 289 -372 -753
$$ packed form
6502F15r85q4j31N19M41O10l67m15q58n0M17L24N18Q1l38n14n35K01O61N27O6
6523G03l90o03l56PO59N35o3j10p74j86j44O85N26K54k80m26l77l21M81M05K13
6544D38R8p59l92o6K21P40K90K55l66q28j41o1M46N70L08o36n10j65K12L77K40
6565B71K42l04m06n32K92M21L82N79l47n12n62k14L82O46J87j78k95m07m62M62
6585c55P78K28k41p5n27n59L24P88L57j12m82l41j72k5L63M95M1l69l79m10L39
6606c34R3O98j12J07p51m03L55P6K06N46J59o73n43R0K22L64M44m2n58r7l11J30
6628c34N55J74J74m11m00k04p6K27P85Rk44n01j79N5L72N55L3k24m05m81j17N21
6650a16M19N68n07l05o06K07J66N05L22l01l39l85j30J49M87L52K18m15o61l81
$$ plain form
6670 -753 -350 271 222 451 283 -362 -812 -221 -38 325 595 371 -297 -534 -373 -100 463 580 283 276 -441
6691 -441 -511 137 140 358 421 211 -316 -440 -94 194 628 417 58 -422 -871 -376 259 563 669 356 -261
6712 -261 -707 -512 65 339 542 217 -194 -332 -588 91 551 596 295 -269 -572 -638 -256 337 623 530 -173
6733 -173 -464 -173 -202 -87 433 410 83 -453 -537 -124 170 475 380 39 -404 -487 -209 -87 373 615 93 -386
6755 -386 -595 -535 -348 695 470 409 200 -278 -301 -56 420 449 334 -121 -497 -576 -201 173 518 184 43
6776 43 -333 -745 -292 -16 614 685 255 -209 -637 -639 -170 507 374 -148 -314 -549 -463 -27 271 266 166 -70
6798 -70 -405 -474 -114 319 680 285 97 -282 -592 -73 -47 447 552 -68 -488 -462 -108 117 536 462 283 -406
6820 -406 -395 -387 44 262 220 30 -458 -694 -664 15 311 342 153 64 -354 -458 -10 271 502 321 204 -608
$$ packed form
6670g53M03O21m9K29j68o45m50N91J83L63K70k24o68k37J61K73N63J17k97pp17
6691d41p0O48LK18O3k10n27j24L46K88M34k11l59m80m49M95O35L04J06l13o17
6712b61m46J95N77K74K03l25m11j38k56O79M60M5l01n64l03o6L82N93K86r3p03
6733a73k91K91k9J15N20k3l27n36q4M13K94L05r5l41m43q3K78J22M60K42n22m79
6755c86k09O0J87J043k25o1k09m78k3K45M76K9j15m55l76p9L75L74L45l34j41
6776D3l76m12M53K76O30P1m30m64m28kM69O77j33n22j66k35Q6M36K98nj00k36
6798g0l35o9L60M33L61l95j88l79l10N19K6M94J05o20m20K6L54K25M19p4j79o89
6820d06J1QM31K18m2j90m88k36L0O79K96L1j89q9m18j04M48K81K31j81j17q12
$$ plain form
6842 -608 -439 -196 271 619 50 183 -423 -437 -180 174 102 154 232 -366 -443 -294 12 730 535 437 -32 -349
6864 -349 -563 219 348 360 315 -305 -566 -233 -92 185 509 319 163 -147 -724 -82 280 401 263 -233 -387
6885 -387 -302 -152 203 432 361 -57 -208 -669 -386 89 451 518 434 -202 -420 -723 211 379 391 188 -115 -659
6907 -659 -414 39 94 522 165 -129 -525 -315 -238 321 484 486 33 -404 -567 -123 448 317 406 -88 -325 -249
6929 -249 -329 -79 571 182 -50 -289 -460 -302 -50 432 223 113 -412 -522 -159 88 349 618 241 -303
6949 -303 -421 -375 -150 270 478 270 -96 -390 -585 -14 294 357 257 -216 -250 -516 -240 251 458 373 76
6970 76 -486 -538 -158 -22 665 612 96 -177 -547 -243 129 252 681 360 -110 -459 -610 66 235 245 586
6991 586 -200 -468 -446 -361 454 618 345 107 -528 -257 -306 262 339 336 172 -109 -187 -398 173 298 613 113
$$ packed form
6842f08J69K43M67L48n69J33o06j4K57L54p2N2P8n98p7J49L06P18j95r8m69l17
6864c49k14P82J29J2m5o20k61L33J41K77L24j90j56l10n77O42L62J21j38m96j54
6885c87Q5J50L55K29p1m18j51m61K83M75L62O7q4o36k18l03R34J68J2k03l03n44
6907f59K45M53N5M28l57k94l96K10P7N59J63Km53m37j63M44N71j31Q9m94k37P6
6929b49q0K50O50l89k32k39j71J58K52M82k09j10n25j10L63K47K61K69l77n44
6949c03j18M6K25M20K08k08l66k94j95N71L08O3j00m73l4k66K76M91K07q5k97
6970G6n62n2L80J36O87n3n16k73l70L04L72J23M29l21m70l49j51O76J69J0L41
6991E86p86k68K2Q5Q15J64k73k38o35K71m9N68P7lj64k81p8k11N71J25L15n00
$$ plain form
7013 113 -370 -548 -497 5 8 689 420 -341 -582 -587 -153 224 351 463 -314 -302 -218 -73 125 403 263 -230
7035 -230 -358 -625 -280 191 185 521 -25 -85 -601 -385 177 718 418 74 -224 -466 -32 -130 482 335 266 -209
7057 -209 -602 -605 -3 499 497 105 -71 -484 -399 22 285 612 177 -212 -297 -405 -227 207 633 188 261 -442
7079 -442 -456 -272 306 263 52 -162 -430 -490 -222 239 537 608 12 -112 -387 -294 -149 347 607 196 -389 -166
7101 -166 -279 -24 480 328 252 -148 -306 -273 28 97 317 189 -111 -257 -175 14 325 426 467 -86 -211 -393
7123 -393 -188 165 436 494 -230 -320 -496 -220 19 251 457 185 19 -341 -620 83 -16 337 268 -312 -377 -432
7145 -432 -97 272 611 250 144 -313 -391 -209 176 481 489 110 -118 -357 -246 161 331 266 225 -167 -525 -327
7167 -327 -263 304 435 142 -421 -408 -339 -216 361 561 573 -36 -579 -449 -327 214 689 313 188 -179 -374
$$ packed form
7013A13m83j78N1N02LO81k69p61k41nM34L77J27J12p77J2Q4J45J98K78j40m93
7035b30j28k67L45M71oL36n46o0n16K16N62N41l00l44k98k42M34r8O12j47o9m75
7057b09l93lO02N02kl92j76m13Q5M21K63L27m35l89q5j08J78M34M26m45P3p03
7079d42j4J84N78m3k11k14k68o0K68M61K98P1n96j24k75R3J45M96K60m11n85K23
7101a66j13K55N04j52p6m00j58L3L01O9K20j28l00j46Q2J89L11J01M1n53j25j82
7123c93K05L53K71N8p24r0j76K76K39K32K06k72j66l60k79P03r9L53o9n80o5n5
7145d32L35L69L39l61j06m57p8J82L85L05Ql79k28k39J11M07J70o5m1l92l58J98
7167c27O4N67J31k93n63J3O9J23N77K00J2o09n43J30J22N41M75l76j25l67j95
$$ plain form
7188 -374 -118 93 281 200 71 -314 -598 -146 171 475 313 -5 -366 -433 -328 -39 462 365 211 -447 -547
7209 -547 -303 -18 419 359 227 -68 -367 -492 -85 519 654 210 -134 -375 -56 -440 175 289 130 64 -443
7230 -443 -524 7 217 211 325 305 -113 -642 -164 -59 294 363 25 -127 -513 -478 44 502 381 126 -58 -330
7252 -330 -435 -332 243 295 454 -125 -277 -240 -390 369 473 366 48 -146 -316 -276 -84 399 194 -48 -316
7273 -316 -261 -206 81 308 253 259 -14 -469 -432 -4 501 352 131 -331 -452 -292 4 236 363 327 248 -408 -451
7296 -451 -365 573 517 393 -54 -322 -439 -328 64 246 424 -36 -426 -123 -208 368 215 504 149 -116 -767
7317 -767 -242 234 287 383 189 -163 -289 -172 132 417 611 197 -80 -164 -528 -5 519 299 108 -140 -472
7338 -472 -394 -98 407 344 427 264 -17 -455 62 262 359 385 76 -296 -161 -311 83 495 173 284 -185 -324
$$ packed form
7188c74K56K11J88q1j29l85k84M52L17L04j62l18l61o7J05K89N01r7j54o58j00
7209e47K44K85M37o0j32k95k99j25M07O04J35m44l44k41L19l84O15J14j59o6n07
7230d43q1N31K10oJ14k0m18n29M78J05L53O9l38j52l86L5N22M58j21k55j84k72
7252c30j05J03N75N2J59n79j52L7j50P59J04j07l18j94j70M0J92M83k05k42k68
7273c16N5N5K87K27n5Ok73m55L7M28N05j49k21m62j21J60K96K32J27l6p9o56m3
7296d51Q6R38n6j24m47k68j17J11L92J82J78m60l90L03q5N76j53K89l55k65o51
7317g67N25M76N3R6j94l52j26J17L04K85J94m14k77q4l64N23N24k20j91k48l32
7338d72P8K96N05o3Q3j63k81m38N17K00R7K6l09l72J35j50L94M12l22J11m69j39
$$ plain form
7360 -324 -683 -164 78 368 67 -134 -184 -445 55 211 435 135 137 -172 -393 83 59 391 217 -109 -249
7381 -249 -351 -133 -43 313 284 -119 -5 -535 -448 -105 393 352 157 -136 -438 -259 -13 376 334 38 -136 -287
7403 -287 -265 56 393 415 286 -120 -309 -388 -456 266 467 338 -6 -398 -371 -235 270 267 293 23 -148 -348 -117
7426 -117 -123 386 311 206 -208 -227 31 9 305 273 343 42 -374 -357 -121 127 96 77 -85 -543 -193 -231 -182 200
7450 200 193 -85 -510 -336 -441 362 637 187 158 -282 -118 -352 87 469 471 23 -304 -246 -63 -97 355 513
7472 513 32 143 -643 -106 -418 189 525 284 205 -412 -282 71 256 310 457 -127 -326 -442 0 203 468
7493 468 178 -131 -38 -215 -53 324 238 428 46 -94 -429 -325 -80 377 341 -129 -191 -302 -380 -108 325 313
7515 313 371 142 -221 -307 -152 348 413 584 93 -200 -400 -156 37 317 177 -21 -290 -319 -166 96 151 268
$$ packed form
7360c24l59N19K42K90l01k01n0k61N00J56K24l00Kl09k21M76k4L32j74l26j40
7381b49j02K18R0L56k9m03J14n30Q7L43M98m1j95k93l02J79K46L89m2k96j74j51
7403b87K2L21L37K2j29m06j89p9o8P22K01j29l44l92K7J36N05lK6k70j71k00K31
7426a17oN09p5j05m14j9K58k2K96l2P0l01m16J7K36K48l1j9j62m58L50l8M9L82
7450B00pk78m25J74j05Q03K75m50k9m40J64k34M39L82Km48l27N8J83l4M52J58
7472E13m81J11p86N37l12O07L36k41p9o17J30L53J85N4J47n84j99j16M42K03K65
7493D68k90l09R3j77J62L77q6J90l82j40l35J04K45M57l6m70o2j11p8K72M33j2
7515C13N8k29l63q6J55N00O5J71m91k93k00K44J93K80j40j98k69k9J53K62N5J17
$$ plain form
7537 268 172 -255 -384 -264 195 315 464 197 -210 -424 -321 -20 453 253 182 -301 -281 -63 101 449 439
7558 439 204 41 -197 -664 55 205 595 173 52 -350 -225 -435 194 357 241 39 -290 -344 73 152 150
7579 150 69 -14 102 -420 -243 269 464 652 198 -82 -174 -180 -274 316 370 84 -143 -403 -293 214 263 427 486
7602 486 155 -377 -437 -152 13 329 574 299 -294 -329 -61 47 193 218 49 77 -287 -83 292 331 158 63
7624 63 -77 -312 -208 -181 94 578 288 -73 -360 -119 152 56 481 223 -72 -268 -210 -129 -104 601 499 149
7646 149 -374 -287 -20 284 469 421 187 -13 -83 -300 209 498 395 -121 -231 -553 -515 -23 242 392 53
7667 53 -127 -265 -57 -81 203 644 302 -5 -662 7 -5 225 378 160 -46 -200 -401 -101 40 382 289
7688 289 -114 -170 -126 -121 -48 344 223 198 -65 -427 -302 -4 -40 216 33 -294 -28 -351 -80 82 140 536 -102
$$ packed form
7537B68r6m27j29J20M59J20J49k67m07k14J03L01M73k00p1m83K0K18J64L48j0
7558D39k35j63k38m67P19J50L90m22j21m02J25k10O29J63j16k02l29n4M17P9k
7579A50q1q3J16n22J77N12J95J88m54k80r2or4N90N4k86k27k60J10N07M9J64N9
7602D86l31n32o0K85J65L16K45k75n93l5K68J08J46K5j69K8l64K04L75L9j73r5
7624F3j40k35J04K7K75M84k90l61k87K41K71r6M25k58k95j96N8Q1K5P05j02l50
7646A49n23Q7K67L04J85m8k34k00p0k17N09K89j03n16j10l22L8M92K65J50l39
7667E3j80j38K08k4K84M41l42l07o57O69j2K30J53k18k06j54k01L00J41L42r3
7688B89m03n6M4NP3L92j21k5k63l62J25K98l6K56j83l27K66l23K71J62N8L96o38
$$ plain form
7711 -102 -372 -303 85 -84 330 195 -139 -176 -117 -124 188 221 144 -33 -379 -177 -412 291 417 309 122 -103
7733 -103 -457 -420 72 541 459 60 -315 -376 -277 142 327 519 49 -279 -504 -305 133 357 238 119 -107
7754 -107 -381 -158 142 406 158 470 -32 -503 -444 12 -37 331 421 177 -88 -540 -171 30 404 224 91
7775 91 -332 -430 -158 -44 305 332 11 28 -435 -428 68 294 397 44 -223 -195 -529 -217 76 247 388 116
7797 116 -406 -544 -32 134 272 377 230 -190 -366 -276 114 389 439 324 -267 -303 -369 46 578 143 156 -224
7819 -224 -161 -198 90 152 776 426 147 -445 -327 143 148 220 286 128 -88 -451 -228 243 283 180 -27 -360 -391
7842 -391 -109 303 396 280 -6 -179 -513 -225 276 549 499 94 -358 -397 -343 -252 333 341 500 -190 -192 -565 11
7865 11 323 220 164 -55 -345 -379 -264 11 132 172 12 -348 -437 -225 240 461 226 -128 -115 -501 -289 17
$$ packed form
7711a02k70O9L88j69M14j35l34l7N9pL12L3p7j77l46K02k35P03J26j08j87k25
7733a03l54L7M92M69q2l99l75o1R9M19J85J92m70l28k25J99M38K24j19j19k26
7754a07k74K23L00K64k48L12n02m71N9M56m9L68R0k44k65m52L69K01L74j80j33
7775I1m23r8K72J14L49K7l21J7m63PM96K26J03l53k67K8l34L12K93J71J41k72
7797A16n22j38N12J66J38J05j47m20j76R0L90K75N0j15n91l6o6M15N32m35J3l80
7819b24O3l7K88O2O24l50k79n92J18M70NP2O6j58k16l63K23M71M0j03k07l33l1
7842c91K82M12R3j16k86j73l34K88N01K73n0m05m52l9N4R1N85QJ59o90kl73N76
7865A1L12j03n6k19k90l4J15K75J21M0j60l60q9K12M65K21k35l54J3l86K12L06
$$ plain form
7887 17 272 469 270 -161 -489 -559 -115 274 344 268 -413 -416 -431 -43 294 541 458 -233 -323 -483 -159 155 409
7910 409 270 3 -433 -331 -169 334 237 268 264 -158 -364 -314 66 632 400 394 -44 -328 -81 -111 301 271 90
7933 90 -177 -364 -292 49 439 391 200 58 -133 -260 -181 122 306 376 7 -303 -458 56 411 152 321 79
7955 79 -182 -315 -422 116 232 230 244 -250 -399 -182 76 165 450 213 -163 -390 -124 -112 406 232 30 -294
7977 -294 -541 -379 16 292 94 69 119 -368 -112 -93 -32 266 91 -45 -614 -183 -175 -33 381 298 297 -242 -255
8000 -255 38 -19 198 313 143 -209 -269 -297 -1 264 497 287 -334 -500 -359 -114 34 423 189 28 -257
8021 -257 -540 -403 -191 418 146 -86 -475 -268 -97 -108 215 494 40 -405 -194 -483 189 173 317 151 84
8042 84 -320 -335 7 407 326 295 -211 -354 -229 45 342 352 452 -97 -458 -358 8 18 412 168 6 -238
$$ packed form
7887A7K55J97j99m31l28p0M44L89P0p6o81lj5L88L37K47q3o91r0j60L24L14K54
7910D09j39k67m36J02J62N03r7L1mm22k06N0L80N66k32om38k84K47l0M12l0j81
7933I0k67j87P2L41L90m8j91j42j91j27P9L03J84P0l69l10j55N14L55k59J69k42
7955G9k61j33j07N38J16kJ4m94j49K17K58Q9K85k37l76k27K66J2N18j74k02l24
7977b94k47J62L95K76j98k5N0m87K56J9O1K98j75j36n69M31QJ42M14q3jn39j3
8000b55K93n7K17J15j70l52o0k8K96K65K33k10o21j66J41K45J48L89k34j61k85
8021b57k83J37K12O09k72k32l89K07J71j1L23K79m54m45K11k89O72j6J44j66o7
8042H4m04j5L42M00q1l1n06j43J25K74K97J0J00n49l61J00L66J0L94k44j62k44
$$ plain form
8064 -238 -368 -94 346 112 28 -19 -269 -526 -248 -144 239 258 104 -346 -523 -270 60 482 86 66 83 -295
8086 -295 -133 9 420 299 183 4 -522 -83 -93 203 454 158 -107 -418 -208 -99 164 291 421 274
8106 274 -267 -194 -191 -32 210 539 336 -192 -378 -167 64 437 105 51 -217 -581 -343 -26 258 602 146
8127 146 -529 -233 -247 199 361 358 272 -90 -251 -251 77 244 326 73 -24 -462 -470 -242 233 342 389 -81 -99 -374
8151 -374 -203 151 232 327 5 -33 -372 -431 309 48 122 174 39 -583 -151 -217 252 447 190 100 -342 -235 -65
8174 -65 134 86 15 -151 -203 -214 50 154 350 398 -118 -67 -246 -57 -160 125 477
$$ packed form
8064b38j30K74M40k34q4m7k50k57K78J04L83J9j54m50j77K53L30M22l96k0J7l78
8086b95J62J42M11j21j16j79n26M39j0K96K51k96k65l11K10J09K63J27J30j47
8106B74n41P3LJ59K42L29k03n28j86K11K31L73l32n4k68l64K38L17K84L44m56
8127A46o75K96j4M46J62lq6l62j61%L28J67Q2k53r7m38qK28M75J09M7m70j8k75
8151c74J71L54Q1R5l22l8l39n9P40k61P4N2j35o22M32o6M69J95k57r0m42J07J70
8174f5J99m8p1j66n2j1K64J04J96M8n16N1j79J89j03K85L52
8191D77
$$ Imaginary data points
##PAGE= N=2
##DATA TABLE= (X++(I..I)), XYDATA
$$ plain form
0 0 0 0 0 0 0 0 0 0 0 0 0 -8 8 -8 8 -8 14 -16 17 -24 30 -32 40 -48 52 -65 74 -83 99 -112 128 -146 164 -188
34 -188 212 -236 265 -296 329 -370 409 -456 507 -558 620 -682 753 -831 916 -1007 1113 -1223
52 -1223 1349 -1490 1648 -1826 2032 -2263 2540 -2866 3262 -3752 4376 -5205 6365 -8097 10977
67 10977 -16637 32034 -166369 -520123 -268574 65902 309127 359377 206182 -141221 -374865
78 -374865 -338799 -70537 241715 412921 272833 -76542 -369776 -383893 -120132 235581
88 235581 398158 266011 -34753 -291139 -362645 -180499 143961 363124 307750 44602
98 44602 -240013 -364532 -239919 72307 343473 353820 91947 -222490 -357080 -242356
108 -242356 33615 289816 329983 125740 -138836 -289524 -279692 -85122 227869 390500
$$ packed form
0@%%%%%%%%%%%qJ6j6J6j6K2l0L3m1N4o2P2q8J00j17J39j57J82k11K40k74L10l52
34a88M00m48N01n61O25o99P79q65R63j065J178j302J435j584J747j923K120k336
52a223K572k839L138l474L858m295M803n406O128p014Q128r581J1570j4462J9074
67A0977k7614M8671j98403l53754K51549L34476K43225N0250j53195l47403k33644
78c74865L6066K68262L12252J71206j40088l49375k93234j4117K63761L55713
88B35581J62577j32147l00764k56386p1506J82146L24460K19163n5374k63148
98D4602k84615j24519J24613L12226K71166J0347k61873l14437j34590J14724
108b42356K75971K56201M0167k04243k64576j50688R832J94570L12991J62631
$$ plain form
118 390500 213193 -127043 -326119 -281080 -62840 192478 313607 212624 -28782 -248915
128 -248915 -304120 -142026 129263 306670 267339 34904 -237147 -334300 -165584 115855
138 115855 282378 251079 66252 -170515 -301633 -206389 43607 246830 270787 119005
148 119005 -119112 -290028 -249059 -13172 229224 293569 146329 -99885 -269957 -242426
158 -242426 -41811 176627 261300 172609 -26538 -217502 -269547 -120745 132507 288913
168 288913 219909 -12750 -221670 -258440 -116686 93390 237403 220185 45891 -161351
178 -161351 -251328 -167707 30980 220938 258278 93606 -146280 -262074 -180496 15862 192186
189 192186 239214 117471 -92340 -231386 -201490 -34985 151868 237835 158633 -41132 -216893
$$ packed form
118C90500j77307l40236j99076M5039K18240K55318J21129j00983k41406k20133
128b48915n5205J62094K71289J77407l9331k32435k72051r7153J68716K81439
138A15855J66523l1299j84827k36767j31118R5244K49996K03223K3957j51782
148A19005k38117j70916M0969K35887K42396O4345j47240k46214j70072K7531
158b42426K00615K18438Q4673q8691j99147j90964n2045J48802K53252J56406
168B88913o9004k32659k08920l6770J41754K10076J44013j7218j74294k07242
178a61351q9977Q3621J98687J89958L7340j64672k39886j15794Q1578J96358J76324
189A92186M7028j21743k09811j39046K9896J66505J86853Q5967p9202j99765j75761
$$ plain form
200 -216893 -232600 -75072 136874 243278 168956 -21847 -188028 -219466 -99115 88244
210 88244 211066 186910 36251 -143694 -233261 -152625 52673 219305 212086 50507 -133850
221 -133850 -216834 -151611 19187 176358 205239 91502 -81727 -200973 -186022 -31823 155496
232 155496 226267 124610 -63388 -199264 -190402 -47055 126241 206292 140613 -21861 -167905
243 -167905 -195331 -85308 83875 196094 173247 21863 -153094 -214074 -110800 68435
253 68435 188209 174558 40817 -122736 -195702 -127668 24578 156196 185493 85501 -84854
264 -84854 -198935 -163122 -4655 153551 195287 95486 -67224 -177707 -161794 -34025 116060
275 116060 183772 123256 -23547 -157508 -182129 -72732 92461 190356 147304 -3884 -148073
$$ packed form
200b16893j5707J57528K11946J06404p4322j90803j66181l1438J20351J87359
210H8244J22822k4156j50659j79945q9567Q0636K05298J66632p219j61579j84357
221a33850q2984O5223J70798J57171K8881j13737j73229j19246J4951J54199J87319
232A55496P0771j01657j87998j35876Q862J43347J73296Q0051o5679j62474j46044
243a67905k7426J10023J69183J12219k2847j51384j74957o0980J03274J79235
253F8435J19774j3651j33741j63553p2966O8034J52246J31618K9297r9992j70355
264h4854j14081L5813J58467J58206M1736r9801j62710j10483J5913J27769J50085
275A16060O7712o0516j46803j33961k4621J09397J65193R7895m3052j51188j44189
$$ plain form
286 -148073 -181189 -85364 66040 168846 153443 28938 -114479 -175614 -115792 24985 155672
297 155672 176854 62449 -99388 -181946 -131300 9592 141938 170680 76340 -66909 -158717
308 -158717 -143843 -29626 111422 175375 110656 -34756 -155516 -164549 -51248 100151 172432
319 172432 118814 -13760 -133181 -160588 -74833 65076 157004 137881 23277 -110220 -168769
330 -168769 -104264 39997 153916 153062 41659 -96497 -162942 -112293 16686 129733 150482
341 150482 68218 -60873 -151194 -136221 -19742 113429 163399 93888 -44137 -149629 -143374
352 -143374 -32802 95180 150317 103298 -12439 -123215 -148966 -66296 64968 149241 127860
363 127860 13468 -113962 -157410 -82393 49148 139768 131215 31767 -89888 -147314 -99500
$$ packed form
286a48073l3116R5825J51404J02806j5403j24505j43417o1135N9822J40777J30687
297A55672K1182j14405j61837q2558N0646J40892J32346K8742r4340j43249r1808
308a58717J4874J14217J41048O3953o4719j45412j20760r033J13301J51399P2281
319A72432n3618j32574j19421k7407Q5755J39909R1928j9123j14604j33497n8549
330a68769O4505J44261J13919q54j11403j38156o6445N0649J28979J13047K0749
341A50482q2264j29091r0321J4973J16479J33171M9970o9511j38025j05492O255
352a43374J10572J27982N5137m7019j15737j10776k5751Q2670J31264Q4273k1381
363A27860j14392j27430m3448P5017J31541R0620q553r9448j21655n7426M7814
$$ plain form
374 -99500 17117 120448 141674 62095 -65848 -147576 -119966 -5646 111490 147752 76272
385 76272 -50682 -135853 -122067 -26224 85222 139405 96971 -17501 -120714 -136572 -55513
396 -55513 67331 143901 113803 -2327 -112260 -136329 -65696 46865 126628 118163 25481
407 25481 -85039 -135599 -91364 19628 120095 133123 46790 -72356 -136441 -101769 4594
418 4594 106426 130145 61333 -47812 -122279 -112695 -23211 85206 133434 84378 -25048 -117334
430 -117334 -125480 -41765 73477 131819 92584 -9438 -100744 -122381 -58759 47854 120065
441 120065 107189 19185 -84094 -130207 -80528 30705 117819 116269 32212 -72026 -123852
452 -123852 -86575 10442 97491 116691 55737 -46512 -118818 -104628 -13180 86972 123765
$$ packed form
374i9500J16617J03331K1226p9579j27943q1728K7610J14320J17136L6262p1480
385G6272j26954q5171J3786R5843J11446N4183m2434j14472j03213j5858Q1059
396e5513J22844P6570l0098j16130j09933k4069P0633J12561P9763q465r2682
407B5481j10520n0560M4235J10992J00467J3028q6333j19146o4085L4672J06363
418D594J01832K3719o8812j09145p4467R584Q9484J08417M8228m9056j09426r2286
430a17334q146Q3715J15242N8342l9235j02022r1306k1637O3622J06613P2211
441A20065j2876q8004j03279m6113M9679J11233Q7114j550q4057j04238n1826
452a23852L7277R7017Q7049J9200o0954j02249p2306J4190R1448J00152L6793
$$ plain form
463 123765 71945 -32764 -113159 -109426 -27086 70643 116650 82349 -10002 -96828 -113934 -49606
475 -49606 49165 113600 99109 10455 -88374 -120305 -63155 36485 107255 101921 24964 -69660
487 -69660 -112668 -75887 12300 92821 109954 47477 -52183 -114039 -91655 -3183 87150 113577
499 113577 56066 -39480 -102513 -92696 -22044 65703 110397 74452 -16660 -94176 -103935 -41157
511 -41157 53897 110990 84487 -3660 -85190 -104654 -51885 37953 100351 90048 16619 -66460
523 -66460 -104652 -69748 18414 94753 100593 33050 -56511 -105303 -77746 5865 83538 99613
535 99613 45951 -38497 -96067 -85588 -14899 66848 102070 64302 -21314 -92799 -95794 -28087
547 -28087 59077 100705 69636 -8429 -78606 -94654 -43978 39590 93933 80760 12282 -66698
$$ packed form
463A23765n1820j04709q0395L733Q2340R7729M6007l4301r2351q6826j7106O4328
475d9606R8771O4435j4491q8654r8829l1931N7150R9640P0770n334p6957r4624
487f9660m3008L6781Q8187Q0521J7133o2477r9660o1856K2384Q8472R0333K6427
499A13577n7511r5546o3033R817P0652Q7747M4694l5945r1112p7516r759O2778
511d1157R5054N7093k6503q8147q1530j9464N2769Q9838O2398j0303p3429q3079
523f6460l8192L4904Q8162P6339N840o7543q9561m8792K7557Q3611P7673J6075
535I9613n3662q4448n7570J0479P0689Q1747L5222l7768q5616p1485k995O7707
547b8087Q7164M1628l1069p8065p0177j6048N0676Q3568N4343j3173o8478p8980
$$ plain form
559 -66698 -100634 -59446 27109 90508 87798 24076 -57485 -96875 -64155 11230 75198 89067
571 89067 42269 -38315 -93954 -78847 -6407 68282 95024 53392 -28704 -87651 -81478 -19638
583 -19638 54525 91841 62507 -12211 -75566 -85217 -37600 38864 91116 74842 2257 -68638
595 -68638 -89122 -47940 28315 85098 78248 15273 -55581 -86131 -56865 11075 72946 84344
607 84344 33994 -42372 -87830 -68678 -249 68022 87323 41806 -32768 -79625 -70739 -14653
619 -14653 52280 84088 55723 -13718 -73446 -81339 -29563 45929 85939 61211 -3972 -64141
631 -64141 -81239 -39742 32352 78744 66671 11702 -50829 -82577 -53811 18615 74676 73817
643 73817 23825 -42318 -81590 -61228 6608 66187 75687 33925 -30529 -74183 -65964 -9991
$$ packed form
559f6698l3936M1188Q6555O3399k710o3722q1561l9390L2720P5385O3968J3869
571H9067m6798q0584n5639J5107P2440P4689K6742m1632q2096n8947O173O1840
583a9638P4163L7316k9334p4718o3355r651M7617P6464N2252j6274p2585p0895
595f8638k0484M1182P6255N6783o850o2975p0854l0550K9266O7940O1871J1398
607H4344n0350p6366m5458J9152O8429O8271J9301m5517p4574m6857Q886N6086
619a4653O6933L1808k8365o9441n9728p893N1776P5492M0010k4728o5183o0169
631f4141j7098M1497P2094M6392j2073n4969o2531l1748K8766P2426N6061q59
643G3817m9992o6143l9272K0362O7836N9579R500m1762o4454m3654Q219N5973
$$ plain form
655 -9991 52893 78987 48491 -18259 -72057 -72848 -20267 45872 77699 53940 -7844 -63300 -71915
668 -71915 -30646 29656 70692 64422 9875 -55389 -78798 -42262 22199 68563 67375 18182
680 18182 -45362 -74866 -48972 9497 58985 69353 31579 -31759 -73032 -59451 -3705 53525
692 53525 73380 40397 -22763 -68195 -62715 -13842 43892 70803 47214 -9797 -58766 -66744
704 -66744 -28024 32148 70614 56635 1180 -53615 -69411 -36453 23433 66644 59749 9999
716 9999 -43324 -65123 -44451 8319 58190 66788 24490 -34577 -67597 -52676 415 53336
728 53336 66750 31402 -24735 -62056 -55691 -10946 41984 65267 42345 -11245 -57676 -63270
740 -63270 -21343 36116 65609 47676 -2784 -51138 -63395 -29073 25387 59674 52266 9364
$$ packed form
655i991O2884K6094l0496o6750n3798p91N2581O6139L1827k3759o1784n5456q615
668g1915M1269O0302M1036o270n4547o5264k3409L6536O4461M6364j188m9193
680A8182o3544k9504K5894N8469M9488J0368l7774o3338m1273J3581N5746N7230
692E3525J9855l2983o3160m5432N480M8873N7734K6911k3589n7011m8969p978
704f6744L8720O0172L8466j3979n5455n4795j5796L2958N9886M3211o895m9750
716I999n3323k1799K0672N2770M9871Q598m2298n9067l3020J4921N3091N2921
728E3336J3414l5348n6137l7321O365M4745N2930K3283k2922n3590m6431n594
740f3270M1927N7459K9493j7933n0460m8354j2257L4322N4460L4287p408m2902
$$ plain form
752 9364 -41414 -64579 -39616 14662 56891 58060 18917 -34938 -63706 -45258 6384 50756
764 50756 58250 25776 -24295 -58220 -50815 -6917 41967 61660 36788 -15576 -56631 -55349 -14417
777 -14417 36060 60092 41065 -6810 -48894 -55523 -24197 24005 56304 49633 5419 -43783
789 -43783 -59972 -31863 17588 53919 51987 12462 -36006 -56929 -37494 6929 46259 54889
801 54889 23202 -26675 -56187 -44738 -2293 42205 57168 29480 -19222 -52661 -47896 -10342
813 -10342 34942 55336 35387 -9302 -45905 -51438 -21350 26381 55337 42450 -443 -42013
825 -42013 -54218 -27094 20536 51870 44563 7346 -33545 -51996 -33956 8787 46145 50605
837 50605 17980 -27924 -53330 -39759 2707 42753 50755 22515 -20019 -48092 -43151 -7914
$$ packed form
752I364n0778k3165K4963N4278M2229J169l9143n3855k8768J8448N1642M4372
764E0756P494l2474n0071l3925P405M3898M8884J9693k4872n2364m1055J282M0932
777a4417N0477K4032j9027m7875m2084o629L1326M8202L2299o671m4214m9202
789d3783j6189K8109M9451L6331j932l9525m8468k0923J9435M4423L9330Q630
801E4889l1687m9877k9512J1449M2445M4498J4963k7688m8702l3439M765L7554
813a0342M5284K0394j9949m4689l6603n533L0088M7731K8956j2887m2893m1570
825d2013j2205K7124M7630L1334p307l7217m0891j8451J8040M2743L7358M460
837E0605l2625m5904k5406J3571M2466M0046Q002k8240m2534k8073M941L5237
$$ plain form
849 -7914 34256 51651 31710 -10812 -45854 -48346 -14893 29428 50843 35959 -3436 -40161
861 -40161 -49434 -21865 21017 47364 40381 5891 -34007 -50321 -29393 12434 44655 45367 13604
874 13604 -28847 -50381 -33787 6124 39933 45573 19935 -20290 -46056 -38952 -4545 33764
886 33764 48658 28266 -14200 -45981 -42553 -9204 28965 46514 31353 -5944 -39269 -44393
898 -44393 -18280 20508 45452 38032 2285 -35493 -47053 -24083 15057 42934 40250 8717
910 8717 -29098 -45425 -29387 6659 38634 43038 15932 -21998 -44023 -35144 -1094 35235 45218
923 45218 21979 -16434 -41968 -37491 -7038 29364 44176 27092 -8564 -37085 -41011 -15893
935 -15893 22374 45168 33213 -2615 -35158 -42268 -19490 17204 41106 35170 5250 -28535
$$ packed form
849g914M2170J7395j9941m2522l5042k492L3453M4321K1415j4884l9395l6725
861d0161r273K7569M2882K6347o983l4490l9898j6314K0928M1827L2221P12l1763
874A3604m2451k1534J6594L9911L3809N640k5638m0225k5766P104L4407L8309
886C3764J4894k0392m2466l1781L428L3349L8169J7549j5161l7297l3325n124
898d4393K6113L8788K4944p420l5747l7778j1560K2970L9140K7877k684l1533
910H717l7815j6327J6038L6046L1975M404k7106l7930k2025Q879L4050L6329R983
923D5218k3239l8413k5534M477L0453L6402J4812j7084l5656k8521l926K5118
935a5893L8267K2794j1955l5828l2543p110K2778L6694K3902n936k9920l3785
$$ plain form
947 -28535 -42434 -26238 9304 38327 39364 12423 -23712 -43266 -30536 3908 34575 39870
959 39870 17865 -16850 -40461 -34574 -2975 29238 40456 23869 -9655 -37372 -38566 -10287
$$ packed form
947b8535j3899J6196L5542K9023J037k6941l6135j9554J2730L4444L0667N295
959C9870k2005l4715k3611N887L1599L2213J1218j6587l3524k7717j194K8279
$$ [...]
8191a11
##END NTUPLES=NMR FID
##END=
