##TITLE=1H_SR6_K
 CDCl3, 8 sc, 
 27.1.2020
##JCAMPDX= 6.0         $$ Bruker NMR JCAMP-DX V2.0
##DATA TYPE= NMR FID
##DATA CLASS= NTUPLES
##ORIGIN= UXNMR, Bruker Analytische Messtechnik GmbH
##OWNER= root
$$ XWIN-NMR		Version 3.5
$$ Mon Jan 27 14:12:41 2020 Russian Standard Time (UT+4h)  she@DPX200
##.OBSERVE FREQUENCY= 200.1315
##.OBSERVE NUCLEUS= ^1H
##.DELAY= (6, 6)
##.ACQUISITION MODE= SIMULTANEOUS
##.ACQUISITION SCHEME= undefined
##.AVERAGES= 8
##.DIGITISER RES= 18
##SPECTROMETER/DATA SYSTEM= spect
##.PULSE SEQUENCE= zg30
##.SOLVENT NAME= CDCl3
##.SHIFT REFERENCE= (INTERNAL, CDCl3, 0, 15.7039)
##AUDIT TRAIL= $$ (NUMBER, WHEN, WHO, WHERE, WHAT)
$$ ##TITLE= Audit trail, XWIN-NMR		Version 3.5
$$ ##JCAMPDX= 5.01
$$ ##ORIGIN= Bruker BioSpin GmbH
$$ ##OWNER= she
$$ F:/spectra/data/she/nmr/H-F/1/audita.txt
$$ ##AUDIT TRAIL=  $$ (NUMBER, WHEN, WHO, WHERE, WHAT)
(   1,<2020-01-27 14:11:44.43 +0400>,<she>,<DPX200>,
      <created by zg, POWCHK disabled, PULCHK disabled
       configuration hash MD5:
       00 E9 B6 7A A2 85 ED C7 34 08 36 98 17 FE 4E 26
       data hash MD5: 16K
       3A 02 19 BC FA 07 C8 B6 8A 45 E3 C5 4E 00 45 D1>)
$$ ##END=
$$ 
$$ hash MD5
$$ E6 B3 91 C7 B8 C0 00 DB 71 6E 2B 58 95 E5 96 80
##$RELAX= 
##$RELAX= 
##$RELAX= 
##$RELAX= 
##$RELAX= 
##$RELAX= 
$$ Bruker specific parameters
$$ --------------------------
##$DU= <F:/spectra>
##$EXPNO= 1
##$NAME= <H-F>
##$PROCNO= 1
##$TYPE= <nmr>
##$USER= <she>
##$AMP= (0..31)
100 100 100 100 100 100 100 100 100 100 100 100 100 100 100 100 100 100 
100 100 100 100 100 100 100 100 100 100 100 100 100 100 
##$AQSEQ= 0
##$AQ_mod= 1
##$AUNM= <au_zg>
##$AUTOPOS= <>
##$BF1= 200.13
##$BF2= 200.13
##$BF3= 200.13
##$BF4= 200.13
##$BF5= 200.13
##$BF6= 200.13
##$BF7= 200.13
##$BF8= 200.13
##$BYTORDA= 1
##$CFDGTYP= 0
##$CFRGTYP= 5
##$CHEMSTR= <none>
##$CNST= (0..31)
1 1 145 1 1 1 1 1 1 1 1 1 1 1 1 1 1 1 1 1 1 1 1 1 1 1 1 1 1 1 1 1 
##$CPDPRG= <>
##$CPDPRG1= <>
##$CPDPRG2= <>
##$CPDPRG3= <>
##$CPDPRG4= <mlev>
##$CPDPRG5= <mlev>
##$CPDPRG6= <mlev>
##$CPDPRG7= <mlev>
##$CPDPRG8= <mlev>
##$CPDPRGB= <>
##$CPDPRGT= <>
##$D= (0..31)
0 1.2 0 0 0 0 0 0 0 0.06 0 0.03 0 0 0 0 0.0002 0 0 0 0 0 0 0 0 0 0 0 0 
0 0 0 
##$DATE= 1580119903
##$DBL= (0..7)
120 120 120 120 120 120 120 120 
##$DBP= (0..7)
150 150 150 150 150 150 150 150 
##$DBP07= 0
##$DBPNAM0= <>
##$DBPNAM1= <>
##$DBPNAM2= <>
##$DBPNAM3= <>
##$DBPNAM4= <>
##$DBPNAM5= <>
##$DBPNAM6= <>
##$DBPNAM7= <>
##$DBPOAL= (0..7)
0.5 0.5 0.5 0.5 0.5 0.5 0.5 0.5 
##$DBPOFFS= (0..7)
0 0 0 0 0 0 0 0 
##$DE= 6
##$DECBNUC= <off>
##$DECIM= 24
##$DECNUC= <off>
##$DECSTAT= 4
##$DIGMOD= 1
##$DIGTYP= 9
##$DL= (0..7)
0 120 120 120 120 120 120 120 
##$DP= (0..7)
150 150 150 150 150 150 150 150 
##$DP07= 0
##$DPNAME0= <>
##$DPNAME1= <>
##$DPNAME2= <>
##$DPNAME3= <>
##$DPNAME4= <>
##$DPNAME5= <>
##$DPNAME6= <>
##$DPNAME7= <>
##$DPOAL= (0..7)
0.5 0.5 0.5 0.5 0.5 0.5 0.5 0.5 
##$DPOFFS= (0..7)
0 0 0 0 0 0 0 0 
##$DQDMODE= 0
##$DR= 18
##$DS= 0
##$DSLIST= <SSSSSSSSSSSSSSS>
$$ [...]
##$SUBNAM2= <"">
##$SUBNAM3= <"">
##$SUBNAM4= <"">
##$SUBNAM5= <"">
##$SUBNAM6= <"">
##$SUBNAM7= <"">
##$SUBNAM8= <"">
##$SUBNAM9= <"">
##$SW= 24.9337058887773
##$SWIBOX= (0..15)
0 0 2 0 0 0 0 0 0 0 0 0 0 0 0 0 
##$SW_h= 4990.01996007984
##$TD= 16384
##$TD0= 1
##$TE= 0
##$TE2= 300
##$TE3= 300
##$TEG= 300
##$TL= (0..7)
0 120 120 120 120 120 120 120 
##$TP= (0..7)
150 150 150 150 150 150 150 150 
##$TP07= 0
##$TPNAME0= <>
##$TPNAME1= <>
##$TPNAME2= <>
##$TPNAME3= <>
##$TPNAME4= <>
##$TPNAME5= <>
##$TPNAME6= <>
##$TPNAME7= <>
##$TPOAL= (0..7)
0.5 0.5 0.5 0.5 0.5 0.5 0.5 0.5 
##$TPOFFS= (0..7)
0 0 0 0 0 0 0 0 
##$TUNHIN= 0
##$TUNHOUT= 0
##$TUNXOUT= 0
##$USERA1= <user>
##$USERA2= <user>
##$USERA3= <user>
##$USERA4= <user>
##$USERA5= <user>
##$V9= 5
##$VALIST= <valist>
##$VCLIST= <CCCCCCCCCCCCCCC>
##$VD= 0
##$VDLIST= <DDDDDDDDDDDDDDD>
##$VPLIST= <PPPPPPPPPPPPPPP>
##$VTLIST= <TTTTTTTTTTTTTTT>
##$WBST= 1024
##$WBSW= 4
##$XGAIN= (0..3)
0 0 0 0 
##$XL= 0
##$YL= 0
##$YMAX_a= 174043
##$YMIN_a= -80346
##$ZGOPTNS= <>
##$ZL1= 120
##$ZL2= 120
##$ZL3= 120
##$ZL4= 120
##$ABSF1= 10
##$ABSF2= 0
##$ABSG= 5
##$ABSL= 3
##$ALPHA= 0
##$AQORDER= 0
##$ASSFAC= 0
##$ASSFACI= 0
##$ASSFACX= 0
##$ASSWID= 0
##$AUNMP= <proc_1d>
##$AZFE= 0.1
##$AZFW= 0.1
##$BCFW= 1
##$BC_mod= 2
##$BYTORDP= 1
##$COROFFS= 0
##$CY= 11.3945322036743
##$DATMOD= 1
##$DC= 2
##$DFILT= <>
##$DTYPP= 0
##$F1P= 16.9975609425685
##$F2P= -3.02152046262296
##$FCOR= 0.5
##$FTSIZE= 0
##$FT_mod= 4
##$GAMMA= 1
##$GB= 0.15
##$INTBC= 1
##$INTSCL= 1
##$ISEN= 128
##$LB= 0.24
##$LEV0= 0
##$LPBIN= 0
##$MAXI= 10000
##$MC2= 0
##$MEAN= 0
##$ME_mod= 0
##$MI= 1.114404
##$NCOEF= 0
##$NC_proc= 0
##$NLEV= 6
##$NOISF1= 3.799351
##$NOISF2= 2.8
##$NSP= 1
##$NTH_PI= 0
##$NZP= 0
##$OFFSET= 15.70392
##$PC= 1
##$PHC0= -9786.249
##$PHC1= 14.8008
##$PH_mod= 1
##$PKNL= yes
##$PPARMOD= 0
##$PSCAL= 0
##$PSIGN= 0
##$REVERSE= no
##$SF= 200.130013532006
##$SI= 16384
##$SIGF1= 3
##$SIGF2= 2
##$SINO= 400
##$SIOLD= 16384
##$SREGLST= <1H.CDCl3>
##$SSB= 0
##$STSI= 0
##$STSR= 0
##$SW_p= 3612.71676300578
##$SYMM= 0
##$S_DEV= 0
##$TDeff= 0
##$TDoff= 0
##$TI= <>
##$TILT= no
##$TM1= 0
##$TM2= 0
##$TOPLEV= 0
##$USERP1= <user>
##$USERP2= <user>
##$USERP3= <user>
##$USERP4= <user>
##$USERP5= <user>
##$WDW= 1
##$XDIM= 8192
##$YMAX_p= 0
##$YMIN_p= 0
$$ End of Bruker specific parameters
$$ ---------------------------------
##NTUPLES= NMR FID
##VAR_NAME=  TIME,          FID/REAL,        FID/IMAG
##SYMBOL=    X,             R,               I
##VAR_TYPE=  INDEPENDENT,   DEPENDENT,       DEPENDENT
##VAR_FORM=  AFFN,          ASDF,            ASDF
##VAR_DIM=   8192,          8192,            8192
##UNITS=     SECONDS,       ARBITRARY UNITS, ARBITRARY UNITS
##FACTOR=    0.0002004,     1,               1
##FIRST=     0,             0,               0
##LAST=      1.6414764,     0,               0
##MIN=       0,             -80346,          0
##MAX=       1.6414764,     174043,          0
$$ Real data points
##PAGE= N=1
##DATA TABLE= (X++(R..R)), XYDATA
0 0 0 0 0 0 0 0 0 0 -1 8 -8 8 -8 13 -16 16 -24 24 -32 33 -40 48 -56 64 -73 86 -97 111 -126 143 -160 180
32 180 -202 227 -252 283 -316 348 -387 429 -475 524 -582 642 -714 792 -879 980 -1092 1222
50 1222 -1377 1560 -1783 2064 -2423 2908 -3599 4668 -6566 10974 -46837 36442 80370 -66923
64 -66923 -63077 35802 24698 -80346 -45813 46400 18633 -67292 -33198 31856 4602 -38441
76 -38441 7359 39206 -6427 -35402 3117 15053 -12528 611 43766 32167 -1272 10124
88 10124 26742 -5708 -25519 5911 27175 13743 24395 50602 26422 -14454 9114 52894
100 52894 32482 -6532 6323 25245 4357 5618 50759 57758 15731 8398 35223 16504 -17612
113 -17612 17006 68128 42485 1909 30882 56783 12417 -13198 37015 57394 1681 -13630
125 -13630 47124 61687 7375 6852 62657 51621 -11454 -2320 47809 21762 -28278 13404 78556
138 78556 45470 -16258 7627 48699 12927 -25169 13928 49595 15227 -12726 19694 37585
150 37585 6381 -5137 21782 21424 -10018 -12024 11876 13170 5049 20748 29167 5215 -11215
163 -11215 1413 3849 -12915 -8311 14980 12646 -5100 2188 15136 -783 -16672 -694 9595
176 9595 -11572 -22107 -1107 8042 -7547 -6222 11407 734 -25193 -21083 -3879 -13221 -23920
189 -23920 -1361 15715 -5951 -23028 -4446 635 -25276 -29886 -2103 -1 -27023 -22694 8495
202 8495 5596 -22802 -16957 5423 -9502 -37695 -23155 3109 -8161 -24055 -3672 12884 -11789
215 -11789 -32056 -14579 -2100 -20529 -27055 -4570 3500 -14597 -17574 -662 -1195 -19591 -20490
228 -20490 -8160 -12441 -22845 -14218 94 -2219 -8775 -4193 -3649 -15357 -19712 -11515 -8700 -11732
242 -11732 -6576 1061 -2116 -8026 -4545 -3077 -11278 -13647 -6037 -4609 -9683 -5713 4399 3022 -4873
257 -4873 -3019 438 -8755 -15740 -6982 1382 -2866 -3975 6085 7893 -4229 -7882 434 -460 -10430
272 -10430 -7268 5021 4656 -3365 1792 11121 4594 -6610 -3079 4076 -2128 -7345 2841 12567
286 12567 6341 1421 7350 8949 -1117 -5756 1833 5488 1482 2618 10424 11500 5866 4647 7253
301 7253 3863 -772 670 4983 5614 5748 9734 11980 8879 5776 5116 3646 1289 2550 6020 7666
317 7666 9373 10930 10633 8226 6175 5540 3559 2118 4722 7720 8758 9090 11185 11656 7690 4330
333 4330 4438 4450 2342 3312 7832 9872 9193 9071 9602 7118 3270 1832 2959 3007 4190 6532 8154
350 8154 7959 7104 6625 4327 1279 35 1195 1977 2182 4177 7063 6973 4550 2068 1301 -271 -2376
367 -2376 -2289 179 2174 3126 2968 2628 2132 127 -2749 -4950 -3833 -2901 -2122 -769 1326 1535 434
384 434 -1877 -3385 -5266 -6970 -6352 -4982 -3667 -2808 -1179 -983 -3036 -5020 -6188 -7572 -9025 -8203
400 -8203 -5665 -4457 -4337 -3174 -2731 -4393 -7744 -8827 -8552 -8818 -9468 -7357 -3854 -3586 -4549 -5169 -5491
417 -5491 -7273 -9223 -9736 -8674 -7662 -6110 -4076 -3711 -4045 -4107 -5286 -7991 -9110 -8074 -6264 -6151 -5244
434 -5244 -2895 -1548 -3126 -4388 -5011 -5742 -6893 -6605 -4585 -3434 -2389 -529 131 -1135 -2971 -2896 -3794
451 -3794 -4640 -4230 -1709 351 1015 1509 2204 1156 -775 -1375 -1197 -1341 -977 1197 3438 3660 3663 4250 3919
470 3919 1598 315 1133 1682 2334 3432 5920 6730 5795 5247 4212 3385 1984 1970 3742 4664 4957 6551
488 6551 7881 7355 5680 4685 4411 3435 2851 3754 6177 6990 7048 6887 7173 5931 4192 3128 3295 4030
506 4030 4830 5428 7114 7229 6592 5366 4543 3667 2405 2380 3298 4296 4588 5474 6263 5701 3815 2620 1812
525 1812 614 873 1556 3016 3866 3640 3585 2648 1379 77 -660 -719 -197 350 846 1946 2181 1415 502
544 502 -378 -1293 -2747 -2867 -1906 -270 147 -197 327 496 -1565 -3707 -3241 -2799 -3287 -3538 -1669 198
562 198 -1457 -2493 -1503 -1282 -3921 -6100 -4067 -2659 -4123 -4212 -794 265 -2635 -4436 -2829 -3561 -6394
579 -6394 -6407 -2602 -1622 -3524 -3073 -525 -1295 -4805 -4954 -3013 -3559 -5378 -3835 -1237 -1544 -2469 -1090
596 -1090 -218 -2849 -4917 -4173 -3011 -3587 -2662 -918 529 -1081 -1482 -1584 -2499 -3104 -3265 -2584 -1982 -1439
614 -1439 -631 -444 -243 -52 -632 -2143 -2829 -1795 -1619 -2179 -752 2381 1757 -700 -353 787 -1299 -3693
632 -3693 -1316 2025 639 -1458 1511 3731 232 -2113 798 2187 -1705 -3278 1262 3094 -93
647 -93 -231 3991 3882 -1284 -2575 1039 1296 -2134 -483 4282 3380 -468 541 3008 1114 -2177 -324
664 -324 2522 958 -1073 1498 3921 2026 619 2277 2233 -575 -1900 971 1767 1423 2469 3527
680 3527 2490 684 438 488 231 615 1812 1892 1389 2248 2980 1636 1153 2023 1409 -753 -628 2085 2453
699 2453 1020 2432 5033 2732 -1113 141 2877 414 -1044 2632 5241 2124 -686 3092 4591
714 4591 551 -967 2296 3344 -649 -772 3987 5232 942 1049 4375 2825 -1776 -1288 3529 3151
730 3151 -116 1879 5356 2765 -924 1144 3344 1017 -1482 1152 2896 1054 -90 2640 3419
745 3419 894 -253 973 438 -992 -423 1640 2072 1240 1305 1309 -222 -636 -184 -307 -467 283 603 125
764 125 -134 655 718 -1471 -1646 -382 -1259 -3026 -1473 886 240 -2087 -623 601 -2472 -4812 -2473
781 -2473 -419 -2103 -3586 -341 647 -2799 -4320 -783 -204 -4394 -4639 -1273 -1214 -4251 -3203 306
797 306 -397 -4096 -4094 -1258 -3153 -5711 -3395 -321 -1361 -3432 -2178 -509 -3060 -4998 -2729 -1595
813 -1595 -3280 -4111 -1893 -905 -2418 -2732 -1326 -1482 -3250 -3459 -2564 -2374 -2395 -1332 -367 -951 -1502 -1411 -2039
832 -2039 -2460 -1623 -950 -1176 -1216 165 134 -878 -629 447 -171 -1725 -1033 412 -176 -805 1223 2799
850 2799 672 -385 408 1132 -571 -777 1620 2471 822 662 2875 2615 447 359 2547 2149 74
867 74 921 3590 2687 1107 2480 3941 2310 512 1233 2734 2006 1241 3144 4143 2971 1511 2499
884 2499 2890 1516 1048 2283 2991 2132 2415 3049 3395 2683 1858 2181 1760 1131 1319 1917 2281 2646 2148
903 2148 2336 1840 1628 530 628 1207 1408 1406 1417 1645 1659 1160 151 456 652 -300 -365 427 1127 695 244
924 244 879 756 -838 -1046 -264 -242 -1152 -546 418 448 -658 -642 70 -967 -1727 -1339 -653 -1113 -1381 -938
944 -938 100 -528 -1057 -1004 -1274 -1781 -2295 -1798 -1155 -1054 -1169 -703 -951 -1121 -1843 -1560 -1475 -1401 -1651 -1427 -766
965 -766 -826 -1072 -992 -924 -1063 -1844 -1914 -1207 -894 -1269 -995 -84 -388 -1171 -1346 -983 -1003 -1514 -1213 -219 -158 -600
987 -600 -692 116 -104 -991 -830 -319 -671 -1033 -202 454 214 -148 75 349 -196 -753 -256 -55 -200 185 192
1008 192 811 283 230 382 293 -30 -5 674 476 696 843 983 776 507 545 62 -69 334 496 662 921
1029 921 933 1025 567 107 505 185 -78 175 657 483 348 762 1014 269 -56 -116 146 -581 -252 573 677
1050 677 276 192 924 252 -586 -481 236 189 -448 223 750 270 -315 194 143 -260 -532 -364 99 -472 -180
1071 -180 418 515 -366 -321 247 -369 -1022 -454 181 -173 34 450 691 -135 -422 -245 -213 -420 -461 107 216
1092 216 -16 362 484 -148 -231 62 296 -229 -405 213 1030 159 466 756 443 -211 231 326 62 -188 313
1113 313 1084 631 226 967 869 -254 26 703 438 229 465 1427 939 546 495 626 207 -145 465 798
1133 798 253 150 846 992 499 257 477 243 -277 -50 503 430 -142 434 731 400 -154 -160 300 -351 -513
1154 -513 -263 455 197 -429 215 -141 -626 -673 -352 -620 -609 -569 -18 -109 -645 -47 -450 -1023 -1188 -787 -941
1175 -941 -878 -1004 -349 -618 -899 -645 -708 -1252 -1397 -1081 -1152 -936 -1224 -718 -610 -1246 -1187 -988 -1403 -1370 -1410 -985
1197 -985 -1225 -994 -853 -563 -966 -1412 -1095 -1048 -1220 -1227 -541 -457 -788 -1134 -419 -569 -937 -1111 -501 -760 -924
1218 -924 -534 -116 185 -263 -289 27 -354 -746 -516 -24 -174 49 278 615 486 32 267 101 212 186 161
1239 161 723 560 550 970 859 662 748 377 504 1074 965 828 1461 1770 1336 1186 1388 1231 1183 1207 716
1260 716 1155 1284 1169 1653 1721 1472 1118 1154 1324 1242 1280 1474 1493 1513 1458 1178 1501 1027 1027 1223 1232 1040 784 1577
1284 1577 1204 1045 966 998 1052 549 516 491 772 631 728 475 621 490 250 440 381 207 -11 239 468 354
1306 354 -107 354 398 -863 -547 -422 -109 -591 -503 -295 -118 -550 -571 -684 -611 -1169 -905 -517 -720 -830 -1072
1327 -1072 -715 -665 -959 -1175 -1020 -1153 -1526 -1156 -925 -1053 -1114 -993 -1203 -1055 -1288 -1601 -1365 -1080 -1240 -1379
1347 -1379 -865 -629 -1022 -1473 -912 -846 -1097 -1411 -948 -771 -771 -605 -658 -721 -822 -1008 -806 -902 -806 -940 -491 -289
1369 -289 -198 -655 -524 -145 -469 -598 160 92 -206 54 1 111 -51 30 26 200 -200 -478 238 325 -104 461
1391 461 518 180 384 124 291 246 60 28 854 459 473 381 390 461 502 -179 467 393 87 556 859 734 208
1414 208 504 341 610 199 139 406 325 413 403 511 502 226 119 127 281 -56 77 184 550 210 131 274 444
1437 444 -46 -265 66 34 -107 99 469 405 120 -244 -1 49 -306 -313 367 132 93 -80 314 368 -95 -644
1459 -644 -153 186 -153 -164 114 83 77 11 162 16 -463 -526 -117 -44 -257 -42 248 223 -63 -7 -10 -3 -169 -255 79
1484 79 -24 202 30 338 299 -19 127 167 103 25 -86 513 228 168 251 216 498 277 423 466 316 80 325
1507 325 577 467 552 305 537 697 305 445 389 571 450 439 610 556 236 167 639 406 -53 206 594 546
1529 546 110 336 731 615 48 257 265 615 264 122 522 199 280 -283 95 80 -307 -52 251 -29 -396
1550 -396 38 35 -30 -116 -182 -351 -253 -263 -461 -325 -357 -170 -392 -222 -632 -593 -467 -326 -373 -483 -697 -359 -243
1573 -243 -768 -501 -563 -736 -885 -511 -176 -512 -1070 -837 -411 -739 -924 -1108 -630 -838 -1007 -665 -551 -386
1593 -386 -730 -656 -505 -661 -997 -598 -348 -549 -446 -428 -280 -627 -404 -541 -179 -622 -311 -498 -146 -298 -325
1614 -325 -284 99 -231 -264 64 -315 92 262 -109 16 151 70 246 24 -125 8 444 652 480 556 161
1635 161 712 523 54 591 592 676 523 386 515 604 394 806 794 517 260 476 870 380 726 497 757 789
1657 789 902 775 612 640 227 631 514 346 531 815 831 397 420 612 463 671 457 464 299 292 487 282
1679 282 242 349 327 169 190 308 80 -138 133 -77 390 -160 -114 75 -33 -117 -291 -165 -172 -555 -45 -191
1701 -191 -258 -651 -182 -420 -640 -774 -248 -427 -364 -236 -426 -338 -681 -359 -641 -364 -652 -446 -388 -739 -790 -498
1723 -498 -390 -478 -1003 -779 -326 -633 -512 -402 -586 -785 -619 -559 -379 -782 -442 -315 -456 -226 -387 -217 -275
1744 -275 -318 -306 -173 -258 -570 -272 -274 62 51 -163 119 -103 -211 125 -44 -47 101 137 -6 437 379 289 27 381
1768 381 322 401 326 171 425 236 226 520 636 371 383 573 894 216 551 727 574 365 452 644 553 460 356
1791 356 528 466 210 591 685 298 433 636 588 257 265 29 760 689 412 536 386 393 126 545 192 60 158
1814 158 409 118 72 346 236 -55 120 317 -37 -160 -36 -83 -15 55 208 -333 -138 -298 -226 -345 -227 -203
1836 -203 -202 -396 -367 121 30 -72 -692 -283 2 -605 -152 -203 -86 -383 -224 -400 -277 -350 -484 -293 -616 -360
1858 -360 -267 -352 -427 -386 -216 -501 -87 -563 -374 -338 -148 -511 -349 -240 -276 -6 -277 -90 -252 -329 -131 -221 -226
1881 -226 -222 -91 294 -211 -332 -281 142 116 -121 244 89 69 -17 93 334 266 153 253 100 281 207 99 365
1904 365 12 239 112 189 -7 148 148 302 321 358 398 536 231 42 193 392 513 150 242 381 97 37 -126
1927 -126 202 229 232 467 128 -21 -54 5 250 -12 -85 -174 21 -22 -98 -127 28 -8 -344 -145 -41 -422 -382 -201
1951 -201 -113 -209 -200 -169 -57 -211 -443 -23 -663 -212 -418 -474 -225 -456 -400 -464 -401 -384 -421 -299 -437 -560 -447 -516
1975 -516 -307 -644 -370 -418 -436 -42 -427 -388 -397 -192 -209 -310 -431 -439 -550 -121 -147 -296 -423 -231 124 -271 -264 -259
1999 -259 -31 113 -153 -126 -30 146 366 175 -108 -7 116 231 86 129 -8 436 317 278 317 266 240 363
2021 363 512 359 321 233 419 454 606 611 523 536 435 616 475 481 443 720 615 609 587 335 557 482 460 763 223
2046 223 562 407 442 316 458 753 752 296 390 356 161 434 498 496 394 417 323 433 422 103 23 366 92 31
2070 31 -11 189 -41 -310 -15 353 201 121 -500 39 -113 114 59 4 -255 49 -83 -126 -333 -126 -495 -264
2092 -264 -272 -134 -290 -206 -371 -350 -83 -336 -487 -615 -40 -537 -350 -567 -565 -468 -480 -250 -433 -637 -597 -655 -392
2115 -392 -477 -365 -564 -282 -413 -522 -553 -195 -518 -264 -222 -190 -414 -336 -259 -416 137 -211 -342 -216 -22 -344
2137 -344 -235 0 -64 -64 -27 -243 130 97 63 101 50 76 -51 116 -28 -41 170 88 -10 365 375 368 401 121 -13
2162 -13 421 482 461 116 418 125 294 402 529 237 530 319 407 167 195 422 394 366 300 -20 460 404 220
2185 220 190 129 616 149 356 280 230 9 177 261 450 127 191 199 90 15 236 25 262 47 -25 105 45 110
2209 110 -48 119 -91 -135 -61 -48 -392 -342 -226 98 -22 -52 -127 -484 -296 -196 -471 -242 -395 -353 -238 -267 -369
2232 -369 -240 -346 -325 -323 -128 -603 -619 -441 -172 -218 -442 -342 -386 -168 -172 -551 -360 -23 -758 -279 -224 -337 -5
2255 -5 -247 -153 120 -39 -182 17 1 313 -197 -290 30 -66 -256 -51 -223 -185 164 210 -150 116 56 114 515
2278 515 -55 163 -141 262 215 386 435 322 304 58 293 229 188 313 46 447 168 135 260 218 273 316 346
2301 346 383 438 436 248 312 422 337 317 106 364 438 186 100 257 591 -53 150 371 331 2 276 -149 243
2324 243 93 245 204 212 176 -72 336 226 60 48 63 -114 -110 1 -5 8 -71 -176 -102 -159 -228 -167 93 -283 -86
2349 -86 -94 -188 -378 -444 -102 -151 -46 -122 -371 -360 -364 -372 -430 -269 -300 -645 -215 -380 -540 -367 -268 -500 -139 -280 -277 -216
2375 -216 -200 -309 -295 -38 -280 -173 -202 -275 -294 -146 -242 -258 -51 -435 -331 104 -46 206 -197 28 36 173 -174
2398 -174 180 -120 202 61 261 13 91 253 45 -92 274 87 324 123 459 431 496 406 480 233 294 524
2420 524 350 343 217 402 301 279 218 131 346 316 241 481 381 510 410 628 224 216 313 470 179 359 248
2443 248 254 202 29 420 241 208 262 169 405 -89 -28 476 312 -57 -48 -7 -82 210 -171 -134 -141 140 -208 -101 -473
2468 -473 -59 -82 -187 -193 -245 -218 -321 -78 -186 -129 -456 -380 -42 -130 -373 -19 -597 -344 -248 -382 -354 -500 -322
2491 -322 -538 -563 -324 -712 -388 -360 -309 -753 -512 -428 -610 -418 -366 -316 -292 -357 -161 -439 -208 -319 -11 -387 -187
2514 -187 -363 -414 -154 -4 81 -423 250 -54 -10 -7 -279 -376 23 -209 40 355 45 298 -372 -121 -355 -146
2536 -146 94 21 156 106 460 242 -90 231 218 173 106 158 354 333 437 356 718 143 257 85 357 9 184
2559 184 272 250 245 227 364 272 103 180 305 117 296 595 13 404 560 220 -285 202 388 314 214 77 75
2582 75 358 -24 260 29 -12 -97 -155 69 49 153 -154 417 -185 -278 -108 68 -288 -181 180 -170 -88 -303
2604 -303 -247 -166 -187 -138 -183 -252 -276 106 -130 48 -373 -177 -595 -366 -84 -361 -322 -244 -296 -216 -12 -515 -131 -105
2628 -105 -67 -621 -178 -277 -233 -119 -153 -195 -378 193 -347 -110 -256 -131 -271 -43 -97 201 -143 -114 256 -205
2650 -205 26 -99 -18 -163 -39 -148 21 131 -114 162 -22 -86 141 164 42 -24 329 168 78 119 229 -34
2672 -34 128 -228 406 26 394 76 447 152 149 264 58 342 138 361 -174 224 382 191 -3 271 132
2693 132 163 -36 186 66 -137 314 192 395 320 0 90 -21 4 296 132 199 237 137 43 29 285 10 -132
2716 -132 -46 277 44 208 -198 -50 413 -136 4 -74 -460 -127 -191 -46 -140 -396 -273 124 -189 -211 -259 -249
2738 -249 -265 -75 62 -189 -293 -284 -453 -307 -69 -197 -431 -331 -456 -275 -425 -361 -78 -419 -282 -430 -370 -523
2760 -523 -101 -181 -288 -168 -413 -321 -273 -214 -231 -8 -133 -140 -279 -19 14 -464 -221 -183 132 11 89 22 -270 -200
2784 -200 -132 155 17 196 -22 -175 -14 196 119 60 214 415 382 212 -10 119 314 114 266 157 269
2805 269 102 36 367 -58 427 320 266 334 274 422 245 284 367 359 -2 238 230 217 248 316 172 243 393 156 300
2830 300 236 -91 -95 -213 319 242 312 222 -29 174 208 366 -148 17 168 22 -29 295 -34 8 404 -137 100
2853 100 -116 -97 87 -56 47 -262 -352 -72 136 22 44 136 -187 -230 -20 -309 -8 99 -317 -132 -457 -408
2875 -408 -129 -482 -387 -160 -222 -190 -122 -86 -30 -246 -268 -223 -211 -266 -181 -478 -315 -334 -123 -125 -63 -116 -114 -338 -465 -143
2901 -143 -372 161 -97 -181 -228 -112 9 -127 -6 -72 -36 -47 -77 -155 -221 21 -171 191 -15 344 369 398 -89
2924 -89 297 -98 478 188 -126 -25 89 90 91 314 300 92 298 502 235 304 42 385 236 111 208 372 86
2947 86 364 67 12 273 270 244 -12 109 351 70 7 -63 -13 252 236 -61 136 65 -152 381 181 69 260
2970 260 -34 260 130 -119 40 6 1 -23 244 -225 -32 181 -1 -168 86 -56 -74 -120 -289 -54 -245 49
2992 49 -226 -25 47 64 -245 -411 -280 -34 -480 -267 -218 -348 -212 -266 -38 -274 -150 -607 -165 -395 -304 25
3014 25 -243 -237 -232 -316 -310 -131 -409 -72 -151 -313 -274 -296 -201 5 -69 97 -152 38 -150 151 6 -390 -203 69
3038 69 -244 -94 60 -192 -206 91 112 -89 364 -125 200 279 168 -27 146 192 -166 -86 317 -134 108 134
3060 134 295 132 34 27 107 316 91 187 149 463 195 104 71 309 230 330 293 272 446 507 145 279 254 320 246
3085 246 135 246 181 230 130 257 152 294 391 183 89 -10 260 213 169 6 -212 49 17 -44 299 198 -40
3108 -40 -62 -182 -87 70 -211 229 -56 -158 46 -132 24 -228 -10 -30 126 -267 266 -73 -335 -184 -74
3129 -74 -142 -384 -305 -26 -21 -329 9 -181 -116 -104 -83 33 -312 118 -128 -75 -324 -200 -252 -139 -97 -149 -76 -220
3153 -220 -259 11 -256 -102 55 -7 379 -205 -190 -28 -152 -55 37 -39 -61 338 -68 90 276 332 200 66 108
3176 108 -218 250 77 -215 80 161 7 -38 34 360 126 19 443 0 67 158 22 126 -96 47 231 310
3198 310 199 471 504 9 83 85 441 128 72 350 236 93 -78 260 204 311 99 432 300 74 126 285
3220 285 -83 396 233 308 -181 150 -37 80 -93 106 -86 55 76 543 -7 67 87 -33 14 78 248 -297
3242 -297 -30 -215 3 -161 -350 9 -155 -232 258 -125 -345 -272 -247 -100 -274 -148 -143 -425 -114 -236 -363 -229
3264 -229 -335 -169 -10 -43 -520 -401 87 -151 -23 -119 -65 -245 -267 -392 -215 -99 -176 -74 -167 -112 -358 -513
3286 -513 -115 18 -10 -200 -322 125 -171 -253 -238 -151 -216 135 83 -224 80 -79 -234 157 -20 94 130 164 215
3309 215 -48 -183 -112 64 186 322 160 57 265 203 41 160 101 268 87 179 49 273 -121 278 210 259
3331 259 423 166 335 141 31 438 537 359 331 435 229 537 379 30 67 244 194 -70 228 410 59
3352 59 218 246 241 199 158 28 354 463 63 39 67 -157 -199 102 -111 25 54 207 -76 -101 131 -171 -153 -265
3376 -265 63 138 31 99 170 213 -150 -387 -279 31 -57 -173 -294 17 -94 197 -79 -43 -329 -182 -186 -165 -230
3399 -230 -271 -210 150 -180 -320 -257 -228 -80 -180 -165 -377 -17 -14 -293 67 57 -118 -229 -43 97 -298 -43 5
3422 5 -171 157 -96 -17 124 122 36 69 -60 -76 14 -103 129 -31 272 -105 103 -60 23 40 -31 156 490 136
3446 136 468 -33 -48 214 81 492 102 -260 374 209 233 -311 237 491 160 359 285 166 60 237 268
3467 268 389 364 112 250 448 244 48 -223 89 159 384 -23 98 -239 160 236 -150 131 473 106 91
3488 91 -202 -25 -109 -220 -260 -27 93 -93 214 -31 -98 -107 -246 -99 -107 179 -259 206 -49 -7 -115 -122 -94 -244
3512 -244 -363 -183 -122 -190 -422 -22 -178 -212 -234 -378 -2 17 -187 -148 -139 -162 -325 -343 -81 23 75 -344 -276 7
3536 7 -257 -23 -121 -15 -152 -174 -6 -379 -76 -253 -115 -20 -108 -303 -277 148 -109 41 -113 20 -32 -149 184
3559 184 -27 -336 22 -36 148 140 86 -46 65 82 79 483 -51 189 451 278 170 168 133 140 163 202 417 74 11
3584 11 89 194 34 -4 -68 82 164 280 127 -132 220 321 409 27 248 90 227 55 234 149 398 -13
3606 -13 18 -27 -1 112 234 22 34 117 54 180 -155 346 94 -88 -88 29 279 91 -299 115 -122 46 3
3629 3 -320 -57 -80 77 54 91 -96 45 -145 -30 -24 126 -110 191 48 73 112 -40 -96 -360 250 -23 -119 -142
3653 -142 -319 -100 -181 -154 -336 -173 -298 -145 -24 -243 -147 -221 -175 -237 -98 -167 -80 -128 146 -27 -271 -247 -230 63
3677 63 -212 132 -135 -22 -270 -259 36 -38 -11 153 -27 -81 -16 -90 -97 -67 -87 -188 12 184 -18 259 -86 101
3701 101 -66 139 466 149 245 230 55 -152 101 -65 -29 376 235 36 133 50 208 319 204 59 313 511
3723 511 2 215 188 357 -173 207 101 68 156 299 -51 208 242 247 401 139 219 63 127 55 -69 65 120
3746 120 -286 148 252 217 14 155 0 191 -263 -62 122 -70 -42 -273 -252 223 -83 -97 -164 -203 -328 -132
3768 -132 -281 -121 76 -289 -41 -285 -39 -208 -77 -285 -452 170 -345 -348 44 130 -329 -248 -265 -52 38 -162
3790 -162 -339 -250 -378 -162 -205 -166 -244 61 93 16 -167 126 -102 49 23 -71 -158 -236 -403 -153 -24 -141 133
3813 133 -31 -87 -141 -318 329 264 -135 -38 104 2 194 209 -61 8 28 -262 240 -143 16 338 154 222 84
3836 84 213 -175 233 201 39 164 234 192 156 129 -44 205 467 140 490 308 77 156 112 347 140 92 82
3859 82 -30 73 385 36 399 -41 259 -1 281 65 75 -3 233 118 215 -70 152 89 -87 187 121 192
3881 192 79 50 16 28 -118 -225 462 -268 -124 32 188 129 -343 -395 16 -10 6 -230 -152 329 -216 230 -180
3904 -180 -40 -267 -198 51 -160 101 -319 -125 53 -68 17 -393 -291 -131 -208 122 -68 -313 -227 162 -124
3925 -124 152 36 -85 121 -363 27 41 -38 -131 -235 -53 -117 -252 140 175 32 -10 166 -176 -86 2 -138 80
3948 80 -278 -61 167 166 108 31 188 196 -31 97 -77 55 -165 37 106 130 190 153 -44 34 -90 223 -269 80
3972 80 278 114 317 119 177 -47 175 188 112 325 324 158 -83 47 38 101 86 116 75 289 90 109 -29 121
3996 121 63 126 38 263 274 -55 -3 205 100 -66 262 -175 -76 -184 266 -81 -139 253 5 -31 -10 154 -69
4019 -69 -5 225 -240 -265 -158 -134 -347 122 100 63 8 -202 74 -102 32 -234 118 -77 -144 -555 -222 86 -117
4042 -117 -35 -204 -151 -278 -94 -175 -9 -78 29 -308 -134 -52 -131 -327 30 -167 -250 -217 123 -321 -184 -88 -15
4065 -15 -287 -120 -84 -34 76 -167 -212 -72 -141 -75 -53 127 -88 3 158 70 231 3 -20 -27 -15 -119 246 -89
4089 -89 5 -137 145 -185 228 332 91 288 234 48 38 233 172 -181 22 114 108 375 -68 -16 273 -196 37
4112 37 271 -142 72 60 208 18 354 422 207 77 247 -279 159 32 83 188 97 41 59 -124 -106 361 227
4135 227 213 23 193 26 -81 207 158 -138 87 300 112 -70 79 33 66 -71 -128 70 52 -230 -145 -163 -380
4158 -380 -80 -186 -42 -238 -129 -115 -36 -99 -298 -182 62 -212 -68 -175 -87 -299 -248 -2 -285 114 -232 -121
4180 -121 -53 -2 -176 -249 73 -207 102 -63 -277 70 126 -195 -54 -69 34 -36 113 -41 -35 -191 -280 195 -116
4203 -116 214 200 71 -260 265 -65 -107 268 105 -71 175 -120 359 -34 -32 140 -188 401 296 253 471 136
4225 136 127 171 297 180 -93 321 147 140 270 330 227 -20 129 108 152 54 -89 76 147 164 -63 -14 -76 274
4249 274 425 155 72 168 159 192 123 -295 58 116 -215 108 0 225 50 -21 147 212 254 190 -182 -71 -109 138
4273 138 -102 -249 5 99 -112 -77 41 -115 136 -131 -95 -133 -111 115 148 182 -275 -202 9 -193 -269 -64 -123
4296 -123 -67 -256 43 -196 -5 -296 44 -121 -103 -292 -129 115 -122 -161 -107 -30 -186 -40 -366 -300 -120 -32
4318 -32 -196 -4 -167 -193 -152 -216 -159 -114 17 24 241 -397 -18 -211 -136 196 -34 70 334 -67 117 -80 -50
4341 -50 78 -157 36 137 -113 233 -90 84 21 87 127 71 115 169 84 198 -201 -56 204 -27 256 282 499
4364 499 76 -50 418 469 8 324 60 177 61 12 -126 -120 73 -70 59 78 -9 65 201 -113 115 -107
4386 -107 95 112 438 158 42 -12 63 -257 71 181 161 99 -56 122 206 55 -72 -21 -37 -57 -80 -27 -170 -273
4410 -273 135 -37 165 286 -163 71 47 -18 20 150 -16 -201 -32 154 -127 -9 -141 -152 -122 -151 -265 -304
4432 -304 31 -216 -220 -303 -144 -131 136 -46 -346 -169 -220 -188 -178 -47 -54 -468 -195 -3 96 -393 -88 109 147 -147
4456 -147 -125 -264 -105 -200 61 -107 -175 -38 -200 -93 142 2 282 226 -27 235 114 66 68 -8 -95 393 -304
4479 -304 -50 -17 -80 343 99 199 39 -106 208 -57 -29 112 -1 272 159 -8 287 66 221 -69 -62 139
4501 139 256 375 90 -6 118 151 56 -15 459 27 294 -45 199 43 11 209 -206 338 104 31 -103 213
4523 213 65 290 -54 411 19 -98 -110 -9 38 -13 82 21 -69 -293 -171 -7 279 30 173 194 -202 -85
4545 -85 -124 86 148 -199 -259 -132 -93 43 -113 -140 -78 58 90 -152 -277 -126 -234 188 -416 -389 -199 -187 -72
4568 -72 -192 -439 -218 -105 -198 -98 -190 -298 59 -118 71 49 86 -13 16 80 -256 -1 -183 256 125 248 -104
4591 -104 -71 -31 22 -43 181 168 -295 145 -51 162 -254 -35 140 198 195 -89 -196 153 172 -18 -100 110 -282
4614 -282 230 -201 72 -3 194 255 291 -57 105 298 -87 66 -118 -14 -33 164 386 377 -164 235 -11 21
4636 21 443 230 259 61 -158 42 185 -39 4 -229 336 -25 302 -107 172 -28 -165 37 328 84 -21
4657 -21 -36 6 99 157 -68 -188 70 -200 -241 -18 146 -116 138 -118 -138 152 -24 25 -85 -308 319 -174 100
4680 100 -238 148 -203 84 -16 -59 -58 -93 -94 -21 -439 -251 42 -354 -268 -123 -61 -101 -5 258 -222 -74 -59 -89
4704 -89 152 -178 -282 131 -179 -405 -259 -190 21 137 257 -152 325 -45 160 -246 -278 53 -94 -26 -199
4725 -199 -248 14 -112 -89 83 215 122 -100 8 17 126 -161 447 359 146 -46 24 239 -240 56 429 75
4747 75 92 -98 160 232 121 77 194 354 220 162 87 174 376 480 -15 130 -82 -74 64 148 -10 -22 -264 76
4771 76 233 60 73 87 84 -14 214 41 113 87 -179 12 109 -225 59 -23 23 14 -133 -408 17 137 -92 112
4795 112 -15 156 -322 -177 -99 140 -15 104 11 -152 -257 -101 -201 -432 -12 -162 -68 -12 49 71 -85 -300
4817 -300 275 42 -266 -14 -215 -575 148 -123 -138 -185 -120 -31 -349 -266 -138 -132 -65 40 145 49 -130 18 -241
4840 -241 172 -79 41 -54 213 111 -77 -340 -168 26 60 -13 44 -65 204 -130 -184 -88 20 307 152 116
4862 116 118 -34 286 -46 279 -133 -98 269 109 177 225 409 -66 -140 413 218 -133 267 -69 100 155 338
4884 338 6 165 -29 -260 142 224 190 132 281 125 41 96 218 3 64 207 48 -197 268 -58 248 0
4906 0 5 -365 109 58 93 -64 132 213 100 -300 -165 -131 67 -116 -187 -282 -329 -104 -257 42 -117 160 -47 -163
4930 -163 -168 -76 148 92 -280 -231 -46 93 -246 -20 166 87 -167 82 85 -109 39 -66 -78 209 -65 37 -257
4953 -257 122 -419 -112 321 -309 25 -23 -7 -83 -121 9 71 -166 -234 87 159 59 26 -205 -3 -2 -57 242 121
4977 121 343 34 -69 342 180 35 173 -150 -88 -22 162 95 173 -249 25 24 -176 51 204 211 114 -38 -3
5000 -3 280 11 68 -57 -67 87 298 -57 273 447 46 136 57 -75 261 322 155 2 187 40 -128 -210 151
5023 151 101 345 237 149 295 364 49 95 220 -112 51 167 363 110 -128 172 118 256 150 126 224 12
5045 12 24 342 95 -101 183 -3 18 146 84 272 93 -39 94 -178 0 -71 -32 174 -193 -133 -36 -110 44
5068 44 -87 -176 -192 -39 182 -149 -158 55 -302 -343 103 -98 136 -287 -237 -55 -124 -170 -83 -138 -57 -58 -49 -233 -8
5093 -8 -185 48 83 -64 -93 -181 -55 36 -250 -16 -17 -53 -154 -58 117 17 -177 328 153 -242 235 188 -211 -23
5117 -23 40 -70 -31 48 279 -128 31 140 -82 -208 278 39 -269 97 -177 -86 186 202 -13 136 175 30
5139 30 105 -276 124 -122 59 -114 22 233 -47 59 -8 99 -60 -56 73 -52 69 146 288 145 110 -33
5161 -33 -80 161 -140 138 -56 156 87 -112 -47 207 115 332 96 73 -2 -129 -279 -353 49 87 -309 -212 -67
5184 -67 -174 -251 -287 -359 322 42 -136 89 56 64 78 -24 -235 -346 -145 7 75 -102 -261 -293 -133 -84 -34 189
5208 189 114 -124 59 36 -222 -3 -95 21 -288 -2 -276 -71 -33 119 -219 -193 -174 -195 -37 82 -56 -76 -37
5231 -37 88 -313 208 290 162 -28 -72 225 -121 145 -105 117 -142 -70 279 -69 241 2 -113 -270 -164
5252 -164 219 76 104 -122 -73 -98 12 -40 -171 137 374 -207 77 76 31 -134 251 -67 -64 297 45 121 235
5275 235 252 2 125 197 66 148 345 89 -226 260 -95 75 185 71 115 376 -280 -219 -8 -52 -196 -47
5297 -47 76 -186 44 14 201 -53 189 58 101 -72 64 76 -197 198 -205 257 -48 -149 128 -282 226
5318 226 -114 -160 -110 -179 -174 -86 -126 -96 -127 87 -306 219 -25 -155 62 -1 -187 228 62 -63 -113 -293 -71 -160
5342 -160 20 34 -49 -64 -6 -69 -153 267 -34 -4 3 38 72 -16 -324 -95 25 -90 -99 -43 -12 31 -12 -16 61 70 192 -294
5370 -294 -191 -13 57 -11 90 90 136 -29 140 127 -75 -280 -72 131 -320 -8 -173 36 127 -52 81 135 50
5393 50 -20 90 -114 143 195 360 146 253 158 2 -155 259 48 147 161 -70 -101 7 224 523 114 213 3
5416 3 27 52 366 -155 269 254 397 44 -185 177 -119 -10 -76 222 284 134 4 34 -161 165 -184 -205 93
5439 93 176 -90 -10 -20 -77 227 -69 -269 -285 -177 -183 48 -109 -1 -159 -36 -146 -89 -188 -26 -122 -17 -361 -314
5463 -314 8 -137 -13 7 253 65 -149 -43 -15 -49 -23 124 -97 -128 -97 -2 -197 65 65 257 -254 -13 -230
5486 -230 -353 99 -81 108 318 -261 -24 54 -83 142 62 232 -169 -223 54 177 -294 142 166 -133 -86 -68
5508 -68 371 -210 -159 -27 68 124 193 -87 -137 101 -222 -156 196 43 301 328 112 22 -123 -142 -26 -166 72
5531 72 276 58 132 298 6 17 197 -299 74 -103 81 164 -23 -276 97 89 3 241 195 48 161 0 -263
5554 -263 -93 134 265 194 46 122 76 -33 -62 -288 -141 -50 -10 -280 -83 12 -103 -185 169 -187 -68 -42 -31
5577 -31 -71 -253 72 -84 74 -256 44 -27 -106 -7 269 -237 -191 -109 -19 126 -183 -122 34 -92 -92 -178 -259 -38
5601 -38 -19 -215 68 351 -432 -365 65 -157 125 22 -99 243 83 -53 125 199 156 -24 -16 -86 -51 -101 66
5624 66 43 97 -74 -259 -233 -313 281 -115 -36 353 45 -88 86 105 153 54 -395 -433 224 -230 279 237 -136 -99
5648 -99 -63 -119 90 147 436 -49 -133 119 144 101 -110 77 126 -349 -12 -40 -62 -41 -137 -12 -58 -28 52 -31 -132
5673 -132 -273 70 185 -336 76 -85 64 51 -123 -91 -14 -391 113 -73 -24 -130 126 125 221 -13 -234 -10
5695 -10 -95 -31 168 -34 18 -154 -60 -190 -221 184 -158 -89 257 617 13 421 61 94 -122 -303 -155 134 113
5718 113 -256 -154 -125 96 -177 132 67 102 25 -423 -102 14 -215 21 288 -218 69 78 -396 -95 13 -238
5740 -238 115 -29 -95 -233 -54 -156 167 1 -16 -152 92 112 -227 59 34 -407 -30 -74 -113 40 -216 -117
5762 -117 71 154 80 -122 -159 -56 171 100 -133 78 4 128 204 146 125 281 163 343 306 -119 93 131 247
5785 247 -73 -134 -113 -165 207 -164 176 74 -30 -272 -167 -35 131 59 -215 -193 74 64 152 21 -185 -10
5807 -10 -125 223 191 -202 32 115 125 184 81 58 181 -150 -327 -278 13 -73 -94 -40 6 -62 -176 -30 117 -95
5831 -95 -157 -61 -225 -102 -110 -104 -217 104 -149 -16 92 -234 -12 -13 100 -195 -130 -142 47 2 161 -211 -266 73
5855 73 11 -82 -83 -201 -260 -92 49 -153 144 220 77 15 -228 -273 14 -56 -138 108 -51 -48 -48 -332 34 -111 42
5880 42 155 31 87 123 -165 -97 -158 -89 165 -277 -103 331 32 110 -180 127 455 -143 201 132 134 109 -16 -341
5904 -341 155 34 -50 303 278 60 41 320 -176 85 149 -255 -208 -138 6 82 126 172 79 76 138 -142 -106 6 162
5929 162 -379 -129 98 182 -142 395 58 156 193 116 -248 -158 76 9 -11 -74 10 -232 -69 -101 -38 102 65 -38
5953 -38 -233 95 -94 -32 76 353 25 147 -204 27 -123 -149 -28 -215 62 -184 -27 -175 -3 128 226
5974 226 103 -10 -82 -86 11 -105 -165 -146 -84 -119 -192 14 -1 -163 -268 46 -147 -23 11 -151 -8 62 -239 -4
5998 -4 -241 34 175 -169 25 46 300 285 99 82 -134 -46 -106 31 258 -25 56 257 -12 -6 -138 45 26 80
6022 80 -62 25 10 -255 80 -212 360 49 55 -184 -35 -120 10 229 116 -176 225 -145 182 65 -304 191
6044 191 266 -99 -185 55 42 115 -100 130 31 -130 -120 127 126 52 -195 -181 165 -1 113 62 -75 25 256 48
6068 48 -76 -85 319 74 59 79 -207 -77 -82 -10 -118 -222 30 -55 -110 185 -141 32 -133 -1 -21 -177 -145 -134
6092 -134 -237 -366 -203 -225 -102 41 -1 -48 -89 108 -137 -34 8 -118 -124 58 -198 140 50 159 153 199 -160 4
6116 4 -150 -236 152 82 111 -210 -24 102 -12 53 -159 81 -159 -161 -12 -110 56 59 96 65 182 -128 6 -209
6140 -209 -160 -258 -209 -136 5 -50 111 200 38 12 201 162 -81 -45 -122 153 -106 -36 124 86 -44 -89 110 -291
6164 -291 93 251 174 253 -227 -126 80 -9 -7 -170 -211 -24 39 117 157 72 215 15 78 100 -171 7 207 35
6188 35 293 -212 -218 -41 203 -67 156 4 132 -70 -39 56 -88 216 -193 12 -3 -186 21 -1 -5 51 -134
6211 -134 144 -258 -114 94 14 -23 -229 -199 67 -168 183 18 -174 -75 -51 -167 -156 -176 -157 -149 -341 14 19 -186
6235 -186 -36 311 43 -53 36 -335 57 -50 -74 -191 -178 -5 -53 -119 -75 -305 -93 41 -136 -211 -251 -109 119
6258 119 36 149 -155 -171 183 -15 85 -8 -57 -143 121 -58 76 -246 -119 -28 91 -18 -203 -4 170 -240
6280 -240 -207 -73 -127 -95 135 -47 -9 9 126 184 21 76 -26 4 225 127 -71 282 -45 -4 74 -17 103 102 222
6305 222 -223 125 -293 -17 23 113 -61 -72 174 303 216 180 101 -171 72 35 30 -29 146 -68 -182 -340 22
6328 22 -585 127 65 -29 186 24 24 6 19 79 -150 136 49 -12 -44 -34 93 -280 46 -40 241 -62 -28 31 -107
6353 -107 122 -241 -141 -201 -39 -289 -36 59 -19 76 146 -129 -46 -238 48 180 29 -18 -90 112 1 172 -150
6376 -150 -150 171 -83 -117 -99 -187 -23 24 85 -237 -316 -323 -90 77 -190 -41 34 41 207 -308 123 70 132 91 -8 -130
6402 -130 268 230 42 -75 32 165 26 -207 -26 110 26 127 -109 -38 -16 186 70 -493 161 117 -108 -197
6424 -197 -202 2 148 86 218 194 187 188 -16 179 22 314 -211 -1 -222 4 150 -31 -59 -52 65 -61 162 298
6448 298 57 79 157 129 -57 277 262 61 -76 -24 -135 -8 143 -98 -14 32 -270 -30 -94 -228 -99 -172 -227
6471 -227 3 -224 -111 21 96 -12 85 -155 -73 -41 16 -107 -1 177 37 215 -26 -133 -139 -250 -413 -29
6493 -29 -194 -8 -343 148 33 51 156 94 -70 -239 206 -92 5 -67 -80 -216 -121 -158 -12 184 -83 -55 -89
6516 -89 -206 79 -9 24 -109 -86 -124 -39 373 -310 -303 199 68 189 81 -417 5 -64 169 180 -186 100 69 219
6540 219 132 71 29 159 209 65 66 160 286 185 -35 61 -86 118 84 56 54 352 192 61 31 -54 -156 -284 45
6565 45 179 168 122 47 96 81 199 -71 198 235 11 168 132 237 268 347 -88 135 161 11 149 12 -356 -51
6589 -51 -13 129 -225 34 163 97 -161 -105 142 48 -88 196 -64 215 -31 -65 -52 -99 -105 -404 174 -76 -152 -15
6613 -15 -169 -2 -160 5 37 131 -280 113 -188 8 -190 -133 -78 -15 -50 -202 249 -180 -128 -84 112 20 275
6636 275 -161 -39 57 -33 120 -232 -240 -68 -181 -224 60 295 -185 -129 -150 -127 -68 -154 93 -158 -198 283 105 -215
6660 -215 420 -214 204 -253 -54 -388 112 -56 -202 73 96 -5 -144 39 164 289 -38 84 102 143 233
6681 233 -217 -132 244 7 -300 29 -99 119 138 196 -269 -131 169 4 291 171 310 110 54 174 -16
6702 -16 136 -156 53 364 156 -61 -21 41 293 -101 116 -209 188 -55 -35 60 -303 -2 107 299 -26 -303
6724 -303 98 -51 5 -117 -17 112 365 155 -18 -105 195 -45 -87 196 95 12 58 201 11 8 -106 20
6746 20 -325 150 285 122 -210 -47 -200 -341 40 -85 79 125 -35 -168 21 -187 -237 -96 -12 -215 -16
6767 -16 166 215 -124 214 8 -19 96 50 -99 -81 161 -64 -4 59 -303 -212 -91 -56 64 -23 134 186 -6 222
6791 222 -155 -63 -51 -182 114 393 -445 -147 -280 -347 -119 77 -240 -47 176 -44 -289 -64 261 269 307 255
6813 255 96 -236 -90 35 -144 123 -25 198 107 107 183 31 -122 -159 -176 133 140 59 -176 -148 24 -99 64
6836 64 21 -63 -167 208 375 -70 204 38 -230 148 103 -2 -4 -159 -65 -58 111 41 -200 -260 -13 -37 113 -24
6860 -24 -120 -223 -32 29 15 104 63 136 416 -154 181 -12 -325 66 23 83 54 13 165 135 -175 50 -8 203
6884 203 -1 -60 -160 -28 -171 33 70 -120 -183 -91 -235 18 -163 87 18 159 -273 3 220 -183 -83 -137
6906 -137 -325 10 58 129 -114 -22 -310 -188 -25 -290 -97 25 -3 -26 7 -116 40 -31 24 163 -123 -52 -207
6929 -207 -342 -58 309 35 -108 5 69 82 -225 92 -105 -99 -68 19 -138 89 151 114 -52 -32 100 141 159 -227
6953 -227 -182 -91 67 -31 361 29 136 -53 319 140 100 89 -96 50 117 -72 237 -404 -135 -225 -65 -266
6975 -266 -146 114 166 93 32 -196 23 -27 47 -40 -106 -173 -43 -181 -172 25 -212 -285 102 -139 37 213 -178 164
6999 164 238 -104 -30 -8 -21 83 155 -67 -251 235 -48 18 300 -119 26 -149 -50 17 27 -215 -84 -12 -189
7022 -189 -72 43 100 -61 -42 -327 -8 -149 186 60 282 118 -185 10 -85 -30 -68 81 -175 -283 -8 -234
7044 -234 -275 10 119 -24 -117 -108 -23 -9 62 -2 61 -102 119 -6 -84 171 154 37 -27 -155 -144 -2 -248 127
7068 127 96 -26 294 27 -35 394 184 -100 -96 -181 -108 72 -238 40 -3 -40 -31 139 91 -30 101 55 128 210 -214
7093 -214 197 143 106 60 38 81 104 28 32 -114 201 239 70 -42 55 249 272 -32 68 -26 -248 123 -78 76
7117 76 -105 -34 -40 -38 111 164 -221 112 38 -127 -62 72 117 158 -19 130 166 94 311 -57 135 119 70 31 34 -146
7143 -146 -286 -50 152 -109 51 280 -24 -109 110 -178 -10 248 51 -157 -457 -7 29 64 -141 254 -99
7164 -99 305 0 126 21 9 116 -109 -94 -271 -162 97 97 76 29 119 -42 -184 69 185 -115 -111 306 103
7187 103 107 -151 -29 209 49 -126 191 132 -14 111 -34 119 193 139 64 51 173 71 -226 -170 -182 250 31
7210 31 -148 47 8 47 237 437 66 -347 111 -204 -81 189 -61 -23 201 -49 -49 -39 25 -4 -50 122 -33
7233 -33 -31 168 130 192 -318 -103 256 -28 -112 -75 -17 -100 -46 -97 -105 117 165 212 -35 -66 -158 -182 71 -225 -247 162
7259 162 -119 138 1 190 81 -24 138 -119 -85 -63 -200 66 -219 -207 -92 -243 55 -99 -85 -144 -266 -39
7281 -39 -323 58 109 -178 -330 -261 50 142 65 10 -47 117 8 -119 -76 38 49 99 -166 23 -370 49 64 -199
7305 -199 34 -173 55 142 -33 67 127 108 151 57 -15 -146 295 166 6 -168 -24 174 -147 -73 158 133 -224
7328 -224 175 54 152 -82 -173 -190 -84 287 -199 240 -100 80 71 4 7 -254 35 -192 -97 16 -240 346 -87
7351 -87 41 -45 10 -6 -298 32 -215 -167 -145 97 -24 200 35 40 292 439 -69 108 128 198 -166 299 -108
7374 -108 -62 204 266 97 166 -13 -159 117 12 220 120 -67 -296 121 65 -26 -67 -84 167 171 -113 -553 -77
7397 -77 -209 -237 241 77 -142 -169 -8 -281 -126 -105 -92 -146 129 -162 -73 -187 -209 -194 36 37 222 66 -9 -137
7421 -137 202 -166 -311 -114 -70 -79 -173 121 118 39 -230 -95 -17 300 99 44 -160 241 228 -157 -124 51 -193 61
7445 61 -145 48 -38 127 18 188 8 171 237 -21 -4 -288 15 -55 258 334 306 -42 -90 52 82 58 217
7468 217 321 142 143 209 79 -33 45 284 32 89 87 199 -318 47 93 184 -201 244 -111 -58 -100 29 -92 24
7492 24 -13 204 -67 -159 255 -213 -141 18 133 86 -119 -157 69 0 161 82 294 -1 12 -190 86 305 -50
7515 -50 -279 3 -21 -15 -175 118 33 -334 -231 131 378 130 118 22 -144 52 -52 -34 -152 19 -179 -23 -25
7538 -25 55 19 -222 -197 131 149 -119 -130 214 278 -9 -2 -173 80 -122 67 -106 -190 66 -30 -98 96 -130 -82
7562 -82 38 3 -27 -102 79 44 28 82 -49 -222 -149 77 -195 -66 -11 198 -96 -65 193 144 91 44 155 -1
7586 -1 204 91 225 218 -146 -108 19 -131 -22 47 -168 -130 -47 216 -105 120 -65 -229 164 -41 276 340 -44
7609 -44 190 -4 -312 72 -56 193 -73 -86 61 -51 -87 125 211 -133 -56 -177 56 22 -185 103 -110 236
7631 236 31 1 99 -157 212 -24 146 -97 -2 -213 -65 -98 -77 -140 -50 -57 -181 -22 298 -137 14 25 27 -54
7655 -54 63 -24 -44 50 -173 -151 -9 36 128 59 -18 238 -186 191 -52 -138 36 366 -2 185 82 55 77 268
7679 268 62 334 -63 375 150 40 -125 -180 174 38 -106 -343 -29 -158 172 221 215 2 -45 -29 -171 318
7701 318 184 -277 -18 110 35 -89 -15 230 17 71 -11 191 -176 -94 20 -179 143 7 199 -239 -268 -5
7723 -5 159 183 141 50 -414 93 -24 13 166 326 235 -25 128 43 351 101 -59 -126 -13 -19 193 -64 37 -30
7747 -30 -38 -89 -57 173 -172 -207 1 -239 68 214 -330 47 144 -38 170 246 127 137 39 9 -200 -255 -373 5
7771 5 10 -280 92 42 -71 -58 -87 -46 -175 11 -307 -49 -79 30 101 -58 -38 107 -1 -271 24 -182 72 3
7795 3 134 103 14 -35 71 -299 -36 -33 -85 55 -140 -32 53 -214 224 167 -214 -256 73 52 -80 -68 -312 -86
7819 -86 -85 -49 -72 -194 9 -17 172 -13 -56 -99 93 264 49 194 -282 -67 311 -57 89 7 -312 53 -231
7842 -231 240 -120 -5 55 92 -89 -11 90 96 90 -103 1 -87 87 228 -282 76 -6 -144 273 12 151 190
7865 190 70 30 -36 95 64 -95 -106 -43 117 18 137 -91 -80 -81 -25 -112 -157 -170 -53 -99 102 33 -110 11 -242
7890 -242 -30 138 -52 53 -189 111 -97 -83 177 50 -62 -42 18 -5 -165 -176 -50 -85 -103 -61 211 -140 63
7913 63 105 -222 -94 165 76 105 -209 -356 328 -3 -23 -108 85 298 24 -100 255 -105 80 -122 3 3 -150
7936 -150 109 -396 7 -437 91 -96 -184 28 25 208 -22 -131 -93 -202 -25 -376 -326 54 167 103 158 35
7958 35 49 -100 209 0 20 -13 193 -124 -118 221 -131 288 -56 -143 -221 -230 89 123 -81 39 -73 189 118 54
7982 54 258 -155 -37 -26 -280 104 -53 294 112 -39 -153 -53 160 -44 21 95 300 98 -30 209 -195
8003 -195 24 -49 -240 1 38 86 -58 44 47 96 -2 -29 17 -118 -60 -39 139 175 -269 -168 -3 -124 206 -57
8027 -57 -130 -319 202 -110 -201 0 65 -121 -279 -251 -211 172 -78 -195 104 118 -101 21 -80 190 -43 -414
8049 -414 190 35 -3 -256 -106 139 -198 43 -299 23 91 310 -109 -308 346 -206 105 161 -2 -99 13
8070 13 35 66 -52 -157 -8 -112 59 98 190 27 43 -88 -21 -16 -151 -71 256 172 -44 -169 121 9 -183 -222
8094 -222 -43 -39 11 -121 43 273 107 -2 -132 176 -152 -152 15 -114 98 302 169 170 58 -90 58 -113
8116 -113 -27 236 156 -27 28 -200 4 66 14 -116 -170 -109 -139 -75 163 63 224 -30 -94 24 20 185 38 -1
8140 -1 -36 -219 -91 286 102 45 301 -76 -272 176 -115 37 -110 -245 -67 -59 241 41 -276 45 123 148 45
8163 45 -151 -166 183 -37 -387 -6 -19 -27 66 -7 -232 -506 -250 -141 -53 -352 -36 182 104 34 26 31 -247 10 252
8188 252 107 134 -31
8191c1
$$ Imaginary data points
##PAGE= N=2
##DATA TABLE= (X++(I..I)), XYDATA
0 0 0 0 0 0 0 0 0 -8 8 -8 8 -8 16 -16 21 -24 32 -33 40 -48 56 -66 78 -88 104 -116 132 -152 170 -194 218
31 218 -245 274 -308 341 -381 424 -471 522 -579 642 -710 787 -871 966 -1070 1191 -1325 1483
49 1483 -1665 1882 -2143 2461 -2866 3400 -4135 5217 -6977 10329 -19002 87375 174043 -21630
63 -21630 -32803 67233 67638 -39874 -5106 92068 68590 -23324 12264 85053 56895 -740
75 -740 36374 68047 21297 -11059 34583 56481 27677 28835 64303 47486 5564 12683 36021
88 36021 13334 -970 34492 60186 38561 32267 47884 25657 -10392 13255 55320 31663
100 31663 -11792 4111 33968 20053 13548 46109 45656 -2922 -15308 17086 11750 -16047 13641
113 13641 56560 24719 -24892 -2004 28369 -9189 -35594 12478 35965 -16677 -34069 24664
125 24664 39740 -18776 -28803 23334 14996 -47441 -37990 18993 3994 -43307 -7195 50310
137 50310 9685 -57853 -32743 17180 -12156 -50260 -10824 26355 -11416 -43817 -11595 9931
149 9931 -22889 -38948 -10901 -6303 -35197 -34616 -4723 -1094 -16690 -10952 -5566 -28722 -43410
162 -43410 -24783 -13465 -26317 -22614 -580 -3581 -25377 -21695 -7583 -19631 -34184 -17969 -4164
175 -4164 -21571 -31378 -8426 2471 -15076 -19865 -5204 -12419 -35316 -27719 -3711 -7331 -19502
188 -19502 -2014 10972 -13048 -31706 -12927 -1883 -22839 -26858 1898 6643 -19260 -17335 12205
201 12205 8339 -22360 -19157 5720 -4929 -29067 -11919 17628 6938 -13734 1562 16216
213 16216 -7307 -26606 -4881 12829 -3422 -10697 11124 18526 -2268 -8296 8700 9101 -9201
226 -9201 -9185 6951 6526 -3132 4931 18089 12245 1194 3005 4971 -3921 -5318 6075 11301 7389
241 7389 9259 14616 9497 1358 4363 7105 1721 590 9257 12764 7196 9393 16916 13394 3148
256 3148 3666 8742 3181 -918 9032 18830 13329 8472 14840 15057 2267 -1671 8907 10441 2635
271 2635 5322 17466 15821 5745 7747 15248 8129 -3365 1980 11293 7327 2632 11710 19003
285 19003 10342 1970 6735 8822 292 -2191 7412 12457 7757 6736 12388 11562 3663 1491 4679
300 4679 3386 171 2897 8249 8892 6849 8291 8161 3261 -748 -5 378 138 2315 6290 6740 5308
317 5308 4444 2739 -450 -2497 -1985 -2030 -1585 1543 4245 3729 2251 1732 529 -4115 -6295 -4375 -2779
334 -2779 -2568 -1444 2005 2896 -86 -2524 -3264 -4808 -7591 -7206 -4574 -2558 -2159 -883 -313 -2475 -5203
351 -5203 -6444 -8011 -9512 -8684 -5476 -4163 -3772 -3206 -2052 -3981 -7796 -9579 -9552 -8814 -8812 -7215 -4540
368 -4540 -2950 -3509 -5313 -6559 -7769 -9258 -10589 -10034 -7627 -5537 -4338 -3951 -3685 -4293 -6744 -8850
384 -8850 -8874 -9012 -8444 -6584 -4081 -2881 -2699 -3065 -4041 -6248 -7962 -7900 -7179 -6402 -4219 -1606 -691 -1542
402 -1542 -1986 -2436 -3970 -6257 -5945 -3672 -2324 -1961 443 2651 2107 -583 -1449 -1796 -2650 -2895 -1580
419 -1580 665 2479 3789 3998 3226 2064 1147 497 -402 -249 2282 4660 4797 5042 6760 6206 3890
436 3890 1970 2318 2821 2937 4008 6336 7333 7718 7493 6632 4899 3380 3692 4266 4428 5845 8289 8982
454 8982 8223 7110 6827 5210 3459 3644 4680 5410 5852 7814 8800 7565 6088 5571 4710 2868 2534
471 2534 3772 5810 5761 6644 7502 6698 4615 3089 2454 1684 1560 2459 4435 5045 4412 4537 4513 2784 821
490 821 -79 291 697 559 1745 3446 3278 2110 972 242 -1458 -2867 -3021 -1507 -251 224 432 272
508 272 -423 -2003 -3294 -3931 -4032 -4481 -3260 -1804 -1186 -1360 -1506 -1966 -3662 -5225 -5648 -5279 -5147 -4222
526 -4222 -3003 -1910 -2413 -3144 -3998 -5034 -6245 -6663 -6065 -5031 -4380 -3673 -2642 -2704 -3552 -4832 -6136 -6152
544 -6152 -6463 -5975 -5307 -4195 -2237 -2212 -3561 -3435 -3850 -5377 -6961 -5275 -3151 -3250 -3396 -1803 -288 -2067
562 -2067 -4143 -3146 -2364 -4576 -5294 -2713 -212 -1435 -1922 653 1270 -2453 -4301 -2271 -1375 -3160 -2519
579 -2519 1625 2212 -145 -720 1310 301 -2796 -2317 408 -41 -1309 601 3189 2301 321 947 1583
596 1583 -562 -1737 -68 2028 1831 2284 3714 3577 1662 392 970 1013 402 1220 2499 2712 3048 3193
614 3193 2872 2153 2206 1585 473 496 2113 2960 2055 3465 4733 3484 406 689 1978 983 -424 1866
632 1866 5049 3305 547 2486 4758 1229 -1403 1554 3661 429 -1002 3446 5617 1604 585
647 585 3971 3428 -1339 -2249 2562 3493 296 1243 5359 3830 -891 -374 2608 1005 -1871 12 3629
664 3629 1830 -240 1893 3978 1540 -934 435 1266 -1159 -1228 1704 2883 1444 1707 2132 915
680 915 -1113 -1001 385 407 540 1849 1726 731 1078 1605 63 -755 247 21 -1439 -892 2280 2117
698 2117 78 347 2283 -87 -3509 -1851 1231 -125 -1882 940 3501 -410 -3130 -77 1588
713 1588 -2315 -3972 217 1608 -2029 -2625 1814 2538 -2340 -3114 361 -514 -4941 -3393 1790 1259
729 1259 -2573 -1521 1413 -949 -5234 -3086 345 -1665 -3939 -1561 817 -1810 -3287 -881 -312
744 -312 -3240 -4504 -2758 -2216 -3488 -2291 -567 -859 -2496 -2444 -2512 -3630 -4038 -2862 -2071 -2378 -1717 -1480
762 -1480 -2251 -3180 -2192 -2427 -3680 -3802 -2077 -2335 -3477 -2333 279 -780 -3109 -2773 -1434 -3364 -5611
779 -5611 -2337 435 -1547 -3199 -526 345 -3003 -4338 -1010 136 -3247 -3692 399 968 -2465 -1815
795 -1815 1630 914 -3239 -2559 557 -183 -2406 -146 3043 1570 -1306 2 1653 -208 -2092 471
811 471 2418 755 -66 2147 2915 1182 566 1703 1891 471 569 2109 2316 2225 3076 3432 2506 1531 1273
830 1273 1501 1597 2327 3161 3285 2921 3528 3403 1917 1967 2827 2490 1432 2291 3752 2999 2308 3549 4414
849 4414 2300 746 2356 2967 1551 1426 3795 4380 2100 1546 3122 2830 789 929 2964 2505 488
866 488 1327 3477 2896 782 1281 2496 708 -945 431 2245 1213 306 1597 2428 525 -1271 -210
883 -210 453 -316 -1021 270 1187 -92 -686 163 218 -1039 -1526 -883 -1129 -1559 -1399 -90 -14 -638 -1080 -1639
903 -1639 -1767 -1937 -2280 -2214 -1339 -1136 -1145 -1662 -1089 -1364 -2032 -2689 -2131 -1800 -2243 -2778 -1120 -999 -1746 -2209 -1583
924 -1583 -2034 -3219 -2939 -1962 -1523 -2127 -1726 -724 -1032 -2176 -2067 -1553 -1886 -2498 -1920 -1018 -1021 -1563 -714 -129
944 -129 -907 -1722 -1671 -1343 -1543 -1602 -816 169 -444 -486 -370 -453 -800 -1141 -723 -281 -30 -216 163 659 366 -35
966 -35 -17 203 -301 -375 63 300 760 583 972 996 1060 -188 -99 557 432 -6 575 1647 1603 867 839 924 829
989 829 192 265 917 896 452 1329 1876 882 645 649 504 262 111 804 1153 729 473 1125 917 427 161 298
1011 298 369 226 8 956 731 1079 726 615 39 255 85 -75 83 402 753 422 518 511 329 -604 -331
1032 -331 -239 -300 -548 239 578 461 -429 103 152 -488 -800 -516 -126 -709 -220 573 255 -316 -375 97 -292
1053 -292 -1011 -895 213 -300 -52 249 339 34 -466 104 -1 -734 -722 4 408 -126 179 304 543 -485
1073 -485 -488 -79 -252 -668 187 611 174 408 540 519 -278 -483 -319 117 -417 300 921 668 468 613 589
1094 589 48 -429 -36 574 -1 278 798 621 299 102 138 13 -439 35 388 223 328 265 830 215 -139
1115 -139 -87 -119 -559 -641 314 138 -302 212 443 333 -240 -470 94 -277 -662 -381 113 29 -616 -144 -204 -715
1137 -715 -894 -405 -682 -1261 -839 -214 -369 -781 -482 -469 -733 -1354 -918 -574 -1003 -1080 -689 -285 -816 -996 -762
1158 -762 -623 -1313 -1088 -747 -684 -1121 -555 14 -374 -870 -762 -607 -1126 -1313 -624 -272 -684 -323 -236 -357 -681
1179 -681 -743 -317 -611 -649 -351 67 -114 -149 305 153 35 -539 -191 -138 -355 282 598 544 86 491 514 298
1201 298 125 595 878 552 636 970 1398 611 791 897 1239 582 777 1039 831 1007 1027 1844 1325 1079 1202
1222 1202 1138 1036 1002 1273 1379 1414 1553 1510 1289 1213 1057 958 1053 1194 1429 1236 1663 1432 1201 1436 1066 888
1244 888 429 674 819 963 1221 956 970 1227 1028 622 620 728 441 815 628 795 814 326 364 496 94 -269
1266 -269 20 135 189 -332 141 361 -466 -666 -290 -414 -715 -890 -336 -569 -757 -1182 -529 -576 -784 -1292 -1048
1287 -1048 -963 -1014 -1431 -1010 -664 -863 -917 -839 -925 -1592 -1601 -1393 -1281 -1227 -1602 -1023 -1259 -1369 -1320 -1508 -1285 -1393 -1374
1310 -1374 -1642 -923 -1492 -1229 -816 -928 -1104 -1500 -1132 -1173 -986 -1077 -768 -513 -984 -798 -665 -878 -675 -933
1330 -933 -797 -451 -741 -618 -134 -503 -278 -299 -225 -173 -501 -417 -199 247 23 -329 97 302 -225 -198 -104 79
1352 79 436 341 372 754 714 259 578 536 704 417 427 775 795 585 805 1091 699 527 808 1081 344 284 808
1375 808 1081 1270 732 846 1127 680 427 701 759 457 687 995 876 576 621 1000 786 293 519 306 641
1396 641 392 213 1045 749 398 124 635 575 241 178 538 596 -66 390 571 48 217 136 204 150 -309 -18
1418 -18 366 293 189 -124 312 -229 -255 -426 12 84 -118 -255 139 182 -26 -231 -29 -23 -419 -374 -48 32 -640
1441 -640 -183 157 -12 -99 -593 -36 -12 -412 -503 -163 290 -353 -187 -82 -156 -23 -331 169 229 -256 30 -39
1463 -39 91 -79 -71 204 207 -318 -118 319 239 41 10 294 382 -221 59 364 25 151 341 663 189 606 157
1486 157 70 451 69 147 -14 264 132 128 598 461 362 77 231 203 -137 106 343 241 135 113 341 445
1508 445 -185 -283 -59 -189 -180 56 249 98 -231 -134 13 -221 -511 -191 222 -150 -394 -599 -58 -364 -421 -546
1530 -546 -585 -222 -842 -349 -299 -506 -400 -116 -269 -536 -540 -753 -587 -334 -687 -703 -321 -545 -472 -635 -638 -768 -698
1553 -698 -889 -650 -494 -845 -459 -668 -584 -396 -694 -690 -571 -659 -625 -253 -351 -481 -828 -501 -218 -481 -637 -33
1575 -33 -232 -429 -287 156 105 -131 -289 101 -174 -162 -98 99 393 330 279 407 178 55 341 311 -9 287
1597 287 526 433 329 717 227 589 438 354 352 770 231 637 986 662 905 736 853 704 578 607 467 614
1619 614 1099 871 696 809 790 520 637 812 920 382 645 450 976 685 280 624 607 410 368 657 488
1640 488 468 449 843 605 392 147 636 449 261 -31 41 434 172 242 -19 186 -48 114 -37 -82 -364 -263
1662 -263 39 139 -385 -60 -149 -376 -306 -165 -304 -580 -598 -467 -609 -382 -359 -571 -681 -681 -437 -611 -822 -779
1684 -779 -786 -380 -355 -790 -642 -579 -891 -682 -668 -891 -725 -461 -704 -768 -541 -570 -714 -799 -501 -586 -521 -659 -434
1707 -434 -215 -484 -213 -505 -265 -469 -693 -379 -665 -460 -64 114 -224 -378 -80 342 -216 -502 -91 209
1727 209 34 308 42 493 382 66 93 300 440 313 275 597 568 445 690 404 421 577 567 258 780 666
1749 666 455 661 495 596 643 270 619 572 424 608 668 702 546 765 485 717 548 848 334 571 396
1770 396 690 626 317 -73 270 793 376 187 508 502 261 364 533 369 14 266 317 52 -79 107 -90
1791 -90 61 -53 180 148 -26 -116 41 -93 -231 -122 -72 -146 -419 -433 -482 -343 -473 -479 -305 -179 -468 -344 -476
1814 -476 -631 -373 -423 -313 -380 -551 -272 -427 -807 -397 -300 -494 -757 -300 -613 -638 -594 -551 -5 -616 -459 -709
1836 -709 -249 -115 -405 -318 -308 -111 -543 -48 -209 -313 153 -27 -291 -363 -101 -142 -46 -381 79 -115 -247 219
1858 219 331 60 -166 215 291 117 -552 89 115 50 110 292 297 185 110 180 287 -31 -38 600 313 354 473 188
1882 188 276 248 864 40 91 286 298 297 120 294 12 268 64 401 375 164 306 292 89 -13 244 122 219
1905 219 75 162 168 481 183 -2 -147 -38 -265 -242 8 -269 -161 205 -204 -210 -162 -119 -181 -304 -110 -169 -285
1928 -285 -512 -366 -184 -336 -581 -350 -418 -426 -424 -543 -100 -205 -63 70 -336 -278 -71 -260 -497 -221 -319 -478
1950 -478 -272 -467 -413 -116 -374 -247 34 125 -226 -95 -1 -343 -331 -54 -23 -234 -259 -343 116 -195 -8 77 48
1973 48 -110 146 -42 46 242 145 281 61 187 -31 350 520 274 224 125 382 46 260 512 255 786 416
1995 416 411 595 473 759 465 470 419 318 702 674 598 326 696 439 446 366 416 654 521 488 467 480 512 559 418
2020 418 330 511 422 257 147 271 302 319 350 154 150 277 -114 -130 200 4 125 44 -58 37 -234 83 66 -188
2044 -188 67 -395 -133 60 -209 -92 60 -210 -155 -245 -72 -429 -447 -179 -598 -91 -333 -356 -474 -494 -539 -687
2066 -687 -503 -477 -758 -597 -558 -669 -130 -692 -864 -529 -789 -490 -686 -611 -576 -316 -395 -589 -459 -528 -506 -404
2088 -404 -740 -395 -480 -448 -570 -286 -502 -456 -516 -259 -255 -360 -488 -239 -421 -188 -383 -302 -284 156 -169 -46 56
2111 56 133 316 81 127 -8 -68 265 -83 -147 -95 60 332 368 290 336 103 89 272 271 460 264 479 273 276 246
2136 246 404 564 424 144 266 561 650 576 322 543 580 332 38 149 253 156 652 151 378 167 193 70
2158 70 87 -10 -161 220 238 -114 25 86 287 224 240 266 108 -234 252 21 235 214 37 -166 -143 -10 -116
2181 -116 -59 -1 -72 -223 -161 -178 -206 -233 -171 -173 -412 -320 -487 -399 -25 -208 -282 -337 -341 -299 -320 -451 -370 -431 -268 -235 -249
2208 -249 -137 -463 -352 -444 -334 -539 -257 -402 -219 -215 -148 -234 -347 -85 -24 -433 -172 -373 -122 -26 26 -298 -183
2231 -183 -163 -368 7 -113 -135 -218 -121 22 -176 -149 174 -184 -13 61 198 251 153 303 397 72 91 359 199
2254 199 171 367 -25 239 437 209 531 258 229 181 493 310 552 367 137 321 522 187 168 235 177 186 446
2277 446 429 143 478 94 284 342 434 247 -33 130 266 215 197 162 59 45 142 68 60 60 118 -223 80 -226 -51
2302 -51 58 -12 122 140 -22 7 -366 -160 -135 -282 -248 -162 -168 -206 -347 -64 -320 -151 -170 -466 -269 -315 -267 -66
2326 -66 -69 -408 -317 -286 -188 -387 -32 -126 -125 -410 -321 -583 -135 -234 -49 -178 -260 -303 -165 -239 -368 -587 -158 -39 -93
2351 -93 -277 -266 -136 -221 170 60 -83 -141 311 100 266 -257 -165 34 -54 347 204 246 -123 54 -157 176
2373 176 121 239 133 370 442 238 247 272 306 221 43 398 344 291 333 264 210 401 105 149 92 408 500 189 271
2398 271 229 281 475 265 310 194 331 231 320 58 532 214 318 321 93 212 152 -117 58 74 148 78 25 84
2422 84 -57 190 11 -82 -234 -249 116 -166 -40 -111 -318 -101 -284 -150 -16 -113 -357 -194 -372 -382 -120 -101
2444 -101 -337 -274 -346 -360 -260 -471 -295 -269 -387 -271 -314 -358 -429 -243 -342 -246 -358 -284 -478 -461 -577 -450 -72 -446
2468 -446 -350 -200 -296 -234 -533 -640 -272 -439 -136 -181 -229 -113 -280 -340 -290 -369 -231 -215 -161 -168 -95 -208 -103 -176 -7
2493 -7 212 169 -72 94 64 -92 -30 363 79 429 123 166 156 185 129 6 223 155 187 74 119 69 300 94
2517 94 10 52 162 302 119 189 267 518 531 528 235 389 612 479 344 186 215 541 300 223 436 506 485 292
2541 292 489 76 52 11 213 169 71 347 214 494 -3 196 251 276 221 -13 -73 -145 239 103 376 -37 228
2564 228 8 26 66 -340 15 -252 -87 45 -357 -314 -247 -313 46 -106 -239 -333 -235 -149 -249 -176 -164 -351 -143
2587 -143 -356 -398 -61 -274 -382 -67 -354 -256 3 -446 -281 -473 -349 -123 -179 -128 -24 -250 -200 -191 -244 -78 -174
2610 -174 -14 82 -57 -122 -113 -167 33 66 -22 -48 50 -29 6 160 131 -24 279 101 -57 120 20 -160 91 72
2634 72 159 278 29 277 107 196 -164 247 238 -12 143 409 384 229 282 149 295 82 149 356 219 223 147 258
2658 258 229 336 8 463 189 115 113 272 -10 -16 138 123 93 0 303 -55 221 200 -21 119 -62 19 0 -276
2682 -276 -156 -179 99 89 -83 -296 -200 -82 -232 68 -51 138 31 -84 -90 -219 144 -336 -159 -180 -372 -45
2704 -45 -147 -184 -123 -287 -196 -35 -272 -264 -274 -31 -189 -14 -269 -398 -345 -623 -153 -318 -272 -190 -309 -52 -161
2727 -161 -226 -173 -95 -257 -329 -202 -214 -355 -69 29 -150 -422 -68 17 -12 145 -105 -317 -26 -144 -188 -76 -143
2750 -143 -99 -80 32 -81 22 90 -215 107 182 175 -167 158 169 197 105 -14 162 -114 220 274 178 63 105 239
2774 239 326 -53 -9 182 263 163 67 716 203 424 173 422 258 183 497 248 240 227 244 112 -69 113 -78
2797 -78 15 223 103 -44 191 478 181 572 177 245 217 155 5 245 -116 -40 15 -159 -263 146 170 -45 -83
2820 -83 -20 126 -176 16 -120 -57 -70 -206 -441 -33 -127 -332 -509 -214 8 -369 -304 -11 -575 -132 -494 -480
2842 -480 -281 -225 -217 -121 -308 -107 -380 -67 -219 -32 -81 -400 -231 -145 -490 62 -461 -310 -159 -508 -218 -217 -107
2865 -107 -277 -155 -243 -388 -72 -413 42 -242 9 5 56 -116 -77 -183 -76 -117 -188 -288 96 -207 71 190
2887 190 -61 -168 35 390 74 398 4 -57 79 227 147 32 441 79 128 196 410 308 352 199 196 386
2909 386 218 -23 229 205 231 239 126 118 242 256 159 116 104 217 464 99 -108 162 32 -135 368 170 75 80
2933 80 -39 178 241 132 159 -56 190 427 67 66 25 26 49 -112 -28 -27 -167 159 25 -46 -183 -59 -25 -306 -385
2958 -385 -163 -207 -358 -235 -109 -180 -160 -96 -336 -305 -171 -177 -172 -352 -320 -114 -42 -308 -230 103 -124 -269 -147 -315
2982 -315 38 -38 -89 -216 -279 -302 -324 -116 -274 -360 -452 -119 -332 -340 -53 -298 -290 -282 -277 -99 -266 20 -180 -221 -304 3
3008 3 -33 6 -68 82 268 -67 -35 -51 64 373 -153 -70 205 24 202 184 158 404 221 217 525 496 274 366 160
3033 160 59 22 199 315 341 287 235 288 415 31 223 655 304 258 -173 379 372 154 327 454 299 162 296
3056 296 585 -96 455 254 221 300 163 -190 -140 17 144 120 -312 -98 18 203 194 -296 138 36 -80 95
3078 95 -192 -127 103 -13 -142 -294 -118 128 -209 -55 -322 -98 -117 -510 -227 -7 -373 -84 -49 -220 -193 -42
3100 -42 -406 -260 -339 -384 -220 -78 -370 -57 48 67 -28 -6 -245 -331 -110 -197 -264 -157 -261 -226 -125 -29 -245 65
3124 65 -155 75 54 -144 -275 -211 -333 -355 -46 -228 -46 -109 -105 -99 47 107 -43 -216 83 56 -75 128 -40 -58
3148 -58 36 259 91 167 67 100 164 195 196 192 188 94 163 23 217 182 150 414 353 -184 334 118 88 -42 258 306
3174 306 249 241 39 381 223 -46 -45 147 -197 180 70 108 179 -59 140 110 321 -89 111 -65 92 -81 -27
3197 -27 -91 21 -51 -195 115 103 -100 43 -99 36 109 -508 -118 148 -91 -229 -25 -375 -201 -361 -131 -311
3219 -311 4 -150 -272 -314 -133 -159 -379 -325 -125 -108 -366 -176 -349 -539 -146 -157 -215 -329 -84 -377 6 -292
3241 -292 -135 -103 -210 -442 -329 -71 -218 -279 -18 -3 76 -34 -218 37 -182 -288 -372 -36 -39 90 -233 -464
3263 -464 -137 -58 61 -283 -178 218 -57 -22 213 0 39 155 57 280 -45 263 -213 103 158 81 182 221
3285 221 161 324 -4 234 146 150 186 -61 -23 90 148 95 245 201 408 266 499 222 193 199 239 82 -133 255
3309 255 38 269 -8 472 219 -144 174 85 246 300 227 347 -194 0 134 21 40 33 373 -31 185 -239
3331 -239 -26 -23 -112 -113 -58 200 8 4 -372 306 -152 -330 29 -160 -147 55 249 54 -152 131 -316 87 -128
3354 -128 119 -102 -320 -81 -314 -315 -155 -140 -84 -225 -130 -352 -92 -303 -95 -291 -167 -121 -189 -398 86 -254
3376 -254 -214 -217 -109 -273 -14 -336 129 -157 -92 25 -291 -11 -136 -407 -130 194 90 -265 -242 -89 159 -184
3398 -184 -227 178 -34 -194 -63 -234 1 -297 -113 118 335 61 104 155 -83 -227 -84 -285 227 434 134
3419 134 -16 131 113 244 -64 -204 79 90 163 167 171 397 164 472 32 209 268 84 121 -108 -34 -238 232
3442 232 63 -112 -7 190 103 404 -83 -208 256 48 -178 34 54 3 -263 339 18 159 147 -52 137
3463 137 16 -3 -149 154 2 -157 -166 -331 -13 54 31 -280 -159 -456 -189 -319 -34 -525 -218 -217 -232 -341 -311
3486 -311 -71 46 -201 -50 -308 -84 -288 -106 -35 -249 70 -53 92 -201 -106 88 -75 -266 56 -104 -364
3507 -364 -175 -9 -332 -356 -246 -104 -222 -268 -239 -142 31 -123 78 -49 97 -111 29 -177 -196 132 -97 20
3529 20 154 256 -57 -255 -180 161 82 -12 314 82 211 111 143 129 65 327 43 239 36 241 130 169 410
3552 410 369 86 185 60 130 298 337 -33 263 22 115 335 328 -65 106 242 65 291 156 99 143 84 345
3575 345 432 130 -56 184 470 117 -80 -75 -85 5 -280 47 -39 101 18 -281 141 -316 93 -5 -56 -148 -253
3598 -253 185 -186 -39 30 -175 69 112 59 -317 -56 102 -122 -206 40 -108 -99 -68 73 90 -214 -78 -8 -145
3621 -145 -60 -43 -257 -386 -381 156 -323 -230 -335 89 -292 -403 36 -160 -187 -186 -307 -111 -229 256 -73 15 -468
3644 -468 215 138 9 -97 -124 22 97 -71 -4 21 -27 -73 265 -41 26 258 -113 63 180 94 350 -4 164
3667 164 -58 35 202 57 68 188 294 247 -19 348 237 -194 -116 197 281 320 148 240 38 37 393 176 167 40
3691 40 -12 354 -386 70 310 403 -129 -27 207 -102 -187 215 18 -136 46 -250 32 258 236 135 152 -334
3713 -334 -149 223 292 -141 103 88 49 -27 -450 -143 -122 -63 -311 -22 -111 -229 -227 -3 -10 -5 14 132 -320 -80 19
3738 19 -318 -59 133 -100 -192 120 -113 -129 -303 -49 -305 -11 57 -279 -182 -46 -51 -256 -90 -91 -131 -126 -265 -382
3762 -382 -286 -6 -32 -464 75 -338 -362 -287 142 138 -273 -66 43 83 -108 89 -69 21 145 -78 55 -60 -222
3785 -222 -65 131 141 -57 -9 124 197 236 122 272 -102 161 279 -47 299 -37 -31 186 354 -72 148 -44
3807 -44 7 70 412 142 178 229 -28 212 61 145 259 -52 184 98 240 177 333 -69 54 84 212 243 18
3830 18 25 179 269 357 106 139 317 82 66 60 217 -64 -51 -65 61 8 -36 15 -87 -139 65 339 -63 -18 199
3855 199 -98 -160 347 -68 -62 -130 -214 -200 231 128 -318 -121 -18 -197 39 26 -253 -109 -25 43 -186 -89 -84 -349
3879 -349 65 -476 -99 -385 -47 -56 -445 -212 -231 -249 -157 -128 -252 -200 -201 -156 -78 -116 -106 -47 33 -54 -416 -356 -167 -422
3905 -422 131 -221 -78 45 -78 -212 100 -81 -97 165 50 -40 -1 64 -150 105 -130 -26 74 146 -22 342
3927 342 85 69 183 92 33 -63 129 244 165 132 332 49 198 83 333 234 81 253 122 133 63 42 244
3950 244 24 -65 214 28 236 400 -82 118 176 118 188 174 244 49 -85 75 302 304 -95 116 36 -30 -114 512
3974 512 -232 34 202 142 61 -133 69 120 79 -299 26 -243 13 33 -275 17 -101 -157 -200 -172 75 12 -120
3997 -120 -90 -386 -184 -132 -399 -260 -354 -141 -117 135 -337 -116 1 121 -90 -44 -55 -198 -125 -324 -30 -316
4019 -316 -363 -214 2 -112 -101 -103 -325 -76 -141 -141 -283 -229 95 -128 -393 -143 29 24 -223 -261 -54 -93 -24 165
4043 165 -183 -24 128 -75 -299 4 -89 165 62 38 -54 -89 116 37 -106 249 362 46 293 -64 -161 72
4065 72 60 21 347 32 179 179 -35 -72 144 11 256 146 131 34 40 316 78 24 318 264 271 147 313 72 272
4090 272 319 170 381 3 -140 -4 70 119 171 102 -36 427 139 -104 -58 -200 37 157 -68 -191 -101 -26 -240
4113 -240 -320 -19 27 198 -66 -94 97 -121 -17 270 -46 -103 -112 106 -374 -73 -88 -96 -103 -96 -136 -144 -118 127 -243 -330
4139 -330 -126 -276 11 146 -25 -36 263 -187 -147 -54 -59 0 64 50 17 -218 475 -192 -163 -317 -72 -45 -83 -239
4163 -239 -306 248 -490 145 -109 72 -115 184 -262 -165 48 246 -16 58 -194 -65 131 32 47 -39 38 123 -240
4186 -240 307 -126 278 -187 179 300 -80 -123 36 405 -117 35 173 52 237 208 241 27 159 -4 -249
4207 -249 333 344 172 -30 216 -11 155 274 90 421 164 -21 212 213 -70 157 102 22 97 -24 -12 -165
4229 -165 122 -17 39 -156 71 94 -82 -77 -210 -85 160 -34 80 48 43 71 -204 -77 -36 130 205 -548 -137
4252 -137 20 -25 -69 -68 61 -92 -11 -398 -11 10 -202 130 -80 -109 45 -213 -55 -189 -239 -215 -162 -89 -110 -424
4276 -424 -73 -271 -238 -168 -82 -53 -396 -223 -20 -79 -239 177 -144 83 10 143 79 55 -102 -429 -116 -24 7
4299 7 -183 79 82 -402 109 224 -155 -226 170 -113 -113 -27 33 -214 56 69 -243 202 261 367 117 -78 162 -55
4323 -55 119 146 -32 61 198 184 116 -148 111 -54 149 383 90 -148 92 -215 107 168 -77 -23 48 -171 288
4346 288 43 203 58 17 63 27 113 -66 155 79 202 193 84 -42 283 -169 -174 181 110 -28 -203 -36 78
4369 78 250 100 37 161 -19 -374 -180 -120 44 -30 -15 -148 -218 -274 -145 -109 -59 -103 -277 -16 -94 224 -87 -100
4393 -100 -201 4 -107 -326 26 -69 -126 -143 -223 -21 95 20 -3 -171 48 -301 44 -226 -230 122 -2 -240 23
4416 23 -210 -79 2 -276 126 -185 -234 24 -150 -1 86 -121 -290 -63 406 145 -8 -263 -241 98 -11 60
4438 60 138 -89 224 73 -99 168 184 187 8 287 -104 251 252 -56 345 -180 357 342 63 168 196 -68 208
4461 208 18 -49 75 135 -14 139 79 -29 -99 193 359 88 -20 211 259 -71 349 -185 203 326 -214 165
4483 165 -37 -29 246 464 22 -202 21 -172 -35 83 18 71 -60 138 -115 33 175 -119 294 -103 544
4504 544 -112 -143 -77 51 126 -89 -216 -50 -324 -134 -221 -34 149 -121 -256 -76 48 109 -47 108 -2 -118
4526 -118 -196 -3 148 -107 -49 -274 -496 180 -84 -262 84 -451 -233 -47 233 -226 -12 79 17 135 -252
4547 -252 91 -75 109 -180 -113 -284 64 -103 25 99 -199 -199 -84 -232 -106 51 -64 -258 144 -191 -81
4568 -81 348 161 6 -21 105 28 -49 32 -68 118 58 -66 3 74 26 -21 189 124 -60 82 146 71 189 365
4592 365 256 106 358 113 150 46 71 82 -176 60 146 52 97 14 -67 133 193 247 201 -35 92 -56 44 307
4616 307 -265 28 -238 0 63 172 352 -458 -9 -170 -142 5 96 -87 41 204 194 57 99 94 -339 -24
4638 -24 152 -149 173 397 -202 -100 188 -218 -16 -90 -182 107 -93 -66 59 -156 -148 -6 14 -75 -296 -445 -242
4661 -242 -36 -105 -192 237 65 -64 -164 234 171 -126 -447 -393 -192 212 192 -266 -52 -140 -111 -78 -19 -54 -88 -121
4685 -121 217 -28 -242 41 115 -24 93 -291 -80 -2 318 -28 -197 221 195 -153 177 276 43 108 19 -21
4707 -21 -408 19 157 98 -277 20 128 -47 478 287 65 12 103 -166 159 -49 160 -71 280 -98 134
4728 134 58 88 63 275 96 26 63 102 -224 -6 -126 289 369 33 27 -15 -159 170 289 -43 159 100 139 215
4752 215 -220 104 256 191 161 117 -53 -219 124 24 -40 -83 -40 82 -227 -23 -113 -91 4 9 -60 -231 -209 -26
4776 -26 -168 -552 -88 -221 -57 97 3 -187 -321 -31 -387 -532 212 -371 -20 44 -263 -159 -73 -110 -142 -125
4798 -125 -114 -1 -139 18 19 -93 -61 -191 -251 45 93 72 33 305 154 -41 -86 334 -20 103 -58 115 108 -180
4822 -180 -308 -135 -277 32 -53 -142 -135 121 -308 60 -69 110 18 22 50 126 -117 62 -102 118 54 22 -38 310
4846 310 -32 87 -149 -206 206 370 31 164 276 -238 564 97 150 -39 186 205 -35 46 88 59 95 -5
4868 -5 187 164 -100 -33 -15 44 11 220 136 -50 -74 238 201 304 401 -26 -174 -43 7 -319 -82 -12 58 243 116
4893 116 -8 -75 -251 238 -173 13 -67 85 -124 -288 62 -293 -348 8 -9 -65 13 -6 91 6 -96 -302 -266
4916 -266 -298 -194 -111 -173 -131 -54 -202 -31 -291 -30 16 54 -204 -190 -306 -43 155 106 173 31 44 99 115 -7
4940 -7 147 -188 -123 -141 115 -85 -81 -184 -168 -54 -149 30 -437 -217 -237 -167 -83 -27 -31 -20 -143 -237 65 -74 107
4965 107 -109 537 -249 116 216 -31 200 -20 241 32 -59 67 -45 -15 221 -9 -100 83 -104 73 238
4986 238 333 215 49 28 187 -60 43 -152 -130 189 228 152 56 163 -65 -183 -42 130 -101 175 13 537
5008 537 10 171 -89 8 -171 -84 -111 143 137 -109 -186 155 1 -307 316 42 -184 13 -38 -123 41 34 -156
5031 -156 -154 -156 -324 -163 -305 -6 -116 -111 -34 46 -226 -354 -17 -58 -267 -158 -50 -168 -75 -198 -210 49 -348 -149
5055 -149 11 -137 -83 68 -282 -147 -460 129 -344 -82 26 -45 -27 171 -38 7 82 157 176 201 -104 -3 -283
5078 -283 243 326 82 198 59 125 -47 125 -110 257 204 -57 178 198 93 54 61 261 -35 115 -224 227
5100 227 143 -155 41 -181 217 143 -102 92 -259 324 276 171 -181 317 -206 -21 13 -15 -11 -10 258 67 520
5123 520 -50 -363 216 35 119 45 -108 2 107 100 90 -26 -207 -183 -92 338 -140 2 -184 -157 -190 -85 82
5146 82 -96 230 25 -237 267 -153 -10 -40 195 -10 -413 -142 -143 -129 -45 35 -98 214 161 -67 -190 -214 -177
5169 -177 -232 -99 23 59 26 -83 92 -181 -126 -174 -120 -34 -63 -103 -294 -201 -153 -197 99 -83 -214 170 -153 -141
5193 -141 -32 -98 -38 49 135 -171 108 21 -222 -164 -226 -28 280 139 -104 -322 78 251 31 75 -59 375 -362
5216 -362 48 -30 259 125 66 59 21 70 63 161 54 428 110 289 26 149 103 195 269 113 -73 96 -112 157
5240 157 158 162 247 187 -10 224 37 358 152 204 77 57 233 -43 477 -8 18 -26 -6 78 111 205 24 161 -133
5265 -133 -143 155 21 219 19 12 242 17 -145 130 -112 6 -72 488 -43 -275 -302 -55 62 118 -44 -128
5287 -128 154 -10 48 -4 -223 33 77 -108 59 -314 -145 -404 53 220 -191 103 167 -35 -81 -268 -149 149
5309 149 126 112 -94 -257 99 -262 -80 -18 159 196 -37 91 -102 36 -285 -67 -46 -256 -167 -172 54 -211 -245
5332 -245 -3 225 -63 138 55 -94 -46 178 94 364 375 -248 -139 -27 6 -1 -157 102 184 -17 -321 -224 105
5355 105 153 237 0 -71 -94 174 293 -123 57 1 44 152 -163 27 -272 351 -226 -30 549 -17 41 -160
5377 -160 126 274 23 260 -156 117 13 38 -269 319 216 -53 -172 247 -196 103 89 323 107 89 174
5398 174 302 -59 -265 7 -164 134 304 72 -166 -147 -37 -63 36 155 72 372 -238 -31 -111 -295 -6 190
5420 190 1 -219 -367 0 56 -84 121 -330 292 224 -161 -137 -31 -102 -519 -75 -195 -117 45 -178 93 299
5442 299 211 25 -132 -35 -55 -88 51 53 -167 75 -86 -228 -171 -9 -76 -24 -142 -35 -18 64 163 -35 -59 175
5466 175 164 -37 -85 0 10 360 47 87 -20 20 193 -95 223 60 84 234 444 -265 80 18 -174 5 268
5489 268 -144 -6 152 413 66 13 102 -23 170 226 114 101 -142 265 206 -13 120 273 -70 202 121 -79
5511 -79 102 66 106 173 -61 -28 23 79 -171 -209 -66 68 204 216 -5 -28 -181 46 40 -148 -149 -15 -47 161 170 128
5537 128 -80 -28 -334 -111 -40 -146 -92 89 -20 52 -165 -41 305 -107 122 -51 -14 -102 -194 -65 -213 -158 -58
5560 -58 -322 -107 -466 -17 23 -103 -43 -576 -101 -42 139 86 148 60 25 -31 -257 -61 -298 -288 28 -160 -163 -27
5584 -27 -145 -117 -54 -125 -130 -66 -127 -37 -90 20 -122 91 179 3 161 41 212 -182 12 169 -133 -109 268 -212
5608 -212 -206 -83 91 -194 49 -213 -136 159 -294 145 195 43 101 155 -61 -39 -3 -12 -254 78 183 127 175 100
5632 100 -310 -210 22 126 -4 -20 -57 321 -39 112 110 9 147 107 56 90 -52 -295 168 254 207 -136 -78
5655 -78 -187 -176 -76 63 72 48 46 94 -48 37 -36 301 -173 -189 -150 45 41 -78 -56 -211 140 -26 -7 -230 -151 -5
5681 -5 172 60 -123 -55 -181 -171 -171 -188 -213 -99 66 -31 -258 -2 321 -201 61 -143 -97 -318 1 -195 -238 -72
5705 -72 -37 -109 -21 -104 -58 -46 236 -246 -97 -132 -74 1 -22 -10 4 361 10 -31 -134 -45 -50 -78 43 242 86 -105
5731 -105 136 98 39 75 148 -220 -47 -45 -147 165 -154 -170 2 13 155 77 93 -101 -301 -118 62 468 -127
5754 -127 242 -137 162 225 -33 37 -28 121 13 -287 73 48 215 -79 102 -59 -269 238 -43 142 -120
5775 -120 227 190 -185 241 -28 83 -37 228 -227 -156 85 -104 -106 92 -156 -154 -286 31 -40 -192 103 108 155
5798 155 72 -175 53 38 102 168 -2 -36 -311 -252 -38 -29 -69 -299 198 -170 246 -298 -181 38 -190 -139 -194 40
5822 40 -246 -291 -54 -278 -130 22 -18 -145 -109 -101 -171 -6 -1 -43 -220 164 113 -134 147 -140 -271 109 92 -69
5846 -69 20 30 -112 -122 -208 -57 -328 44 -135 -91 -341 131 84 -122 214 -196 59 351 184 -58 59 297
5868 297 -109 536 188 30 -94 -193 -137 -78 135 193 -132 18 -35 15 78 -191 -135 -58 226 85 -70 240 -176
5891 -176 2 267 197 49 -125 87 146 158 79 68 168 -291 -84 119 -10 61 -150 0 162 -44 -234 207
5913 207 47 225 -383 292 35 -114 -27 -28 213 162 316 -244 275 -143 -136 95 -138 -117 -63 -129 86 56 131 -198
5937 -198 -36 -82 -26 102 -151 -144 -15 3 23 -45 -121 136 99 -171 -20 -85 -414 85 67 -184 -30 -58 -24 -205
5961 -205 -52 86 193 205 74 96 -38 -176 175 338 -329 -84 22 140 74 5 122 40 -56 -57 123 -34 89
5984 89 -20 157 -189 14 65 -41 -146 -275 4 208 -256 57 -48 188 -211 -12 -56 -18 -7 135 133 24
6006 24 157 71 138 -91 290 346 25 -37 -120 176 -213 33 28 324 143 -298 64 59 102 238 210 -268 95 204
6030 204 98 146 102 203 91 95 -224 21 -343 -79 -249 4 144 -94 -49 145 87 -262 66 -185 -93 118
6052 118 1 -175 -234 -199 -31 64 -50 -181 36 79 158 -93 58 128 -182 -125 -36 -200 -15 229 2 -59 -294
6075 -294 63 -67 101 -59 20 7 -159 -179 -31 70 132 -157 -77 275 149 -108 131 117 95 121 105 7 -15 205
6099 205 -3 -135 -69 168 -97 -62 78 149 -157 191 69 20 -272 -43 19 -104 218 -190 -198 -203 254 -60 -163
6122 -163 -282 -97 265 32 -202 76 153 154 -135 -164 133 133 117 -207 -172 163 72 -68 104 -35 308 166 109
6145 109 144 187 52 48 171 -133 167 -58 -68 153 -184 172 173 -144 -19 -33 -116 53 254 109 148 -213 146
6168 146 -182 -170 300 198 175 68 -110 43 98 65 -59 -112 -245 -123 7 15 30 -133 -264 43 212 -252 -183
6191 -183 39 117 -233 -23 -182 -27 -194 73 -206 0 45 81 -146 -120 74 -222 211 37 -128 -219 -228 -139 -61
6214 -61 -46 225 30 -28 222 161 40 53 151 -483 -258 -15 -124 -80 46 -88 42 8 -179 4 30 -2 49 77
6238 77 67 -104 -100 -70 126 134 106 244 -192 80 -2 17 273 61 -8 218 -48 99 23 -71 -86 201 202 249 64 143
6264 143 200 292 25 54 -37 -6 21 55 177 218 -353 168 133 -123 -59 132 86 89 141 -74 -75 116 148 -39 123 167
6290 167 190 -184 16 78 122 61 -116 78 185 120 -67 -392 -331 -92 133 188 15 -43 265 121 36 411 237
6313 237 20 55 194 155 -59 5 104 1 -72 -101 100 -51 -166 -91 -310 -80 -188 -87 -78 -38 296 -104 -151 -162
6337 -162 75 -89 -10 -55 -43 -76 -323 -187 -132 -21 177 -12 57 -35 66 -11 2 -139 -332 -106 -201 29 -131
6360 -131 149 -127 335 -112 -167 -95 59 -108 -177 75 -187 -63 -40 248 -81 6 -136 61 -31 -70 47 146 315
6383 315 160 216 305 114 -191 -9 -76 615 -104 -201 -13 109 -294 191 92 177 -43 -9 -62 173 180 44 75 -5
6407 -5 -38 121 368 154 -53 -261 -28 88 100 -223 -148 318 158 -220 235 -4 -55 -133 -1 77 -35 12 79
6430 79 -12 -24 25 -108 -70 321 -216 -366 48 -436 31 228 102 -58 26 39 75 -119 -68 64 96 -175 -267 -258
6454 -258 116 87 -152 -89 158 22 -249 -175 -128 27 -8 130 210 -73 -342 289 -46 -139 -68 -289 58 -273 -94
6477 -94 -275 -148 -109 -268 -26 78 79 48 -112 156 -64 -101 -62 -178 -317 55 290 -497 72 -126 93 -95
6499 -95 272 -281 95 -5 16 61 144 245 119 19 -152 74 12 -30 201 257 -34 145 167 109 -28 165 -252
6522 -252 -23 182 -4 246 -106 87 -140 166 -121 139 -35 104 233 160 178 200 110 -84 52 -121 283
6543 283 421 6 42 51 45 93 160 -194 -135 138 269 -84 -300 -89 136 192 -86 117 57 62 49 -138 35 157
6567 157 -71 -8 -198 -40 -401 69 157 13 127 134 -128 -28 -282 -122 -75 -174 -16 2 -178 -233 -171 -138 100
6590 100 -86 -79 -106 26 -24 22 -67 69 -28 -7 -8 -155 -99 -104 -24 -84 -206 119 -378 -214 289 -44 -47 231 -64 243
6616 243 -248 -49 109 -27 150 -132 -2 29 -201 72 -161 -262 -128 -173 103 -185 8 120 147 76 -126
6637 -126 -185 189 -42 99 -139 -14 24 -111 139 317 117 335 287 -79 77 -50 -249 44 143 -51 -173
6658 -173 -18 39 286 -186 48 -189 -149 -95 329 -103 277 61 50 22 256 338 222 200 -48 181 -84 -87 76
6681 76 158 -180 -149 113 -103 105 27 47 174 -310 7 78 45 -123 169 -353 -304 -4 120 -169 27 102 -62
6704 -62 -242 142 31 -171 -299 28 246 141 113 -9 -228 -260 142 156 -243 166 -181 241 32 -39 -73 -52
6726 -52 66 67 134 -90 132 188 -149 -325 76 -50 41 -238 -23 476 47 -74 -257 43 105 -98 -119 182 -104
6749 -104 15 -109 21 58 20 -55 250 228 -206 423 168 81 89 -32 -49 -56 28 -69 -154 27 168 136 -169 73 115
6774 115 140 36 -26 -104 -58 112 57 -9 288 -97 55 206 -78 -540 -98 130 65 114 146 -108 328 -208 -214 -64
6798 -64 157 88 105 27 215 12 -164 239 207 -13 -143 168 177 72 22 152 37 36 192 131 208 144 86 91 42 97
6824 97 -214 187 -225 -201 157 -97 -126 36 -34 -299 -61 333 -244 -209 70 40 12 -173 -17 137 -85 -191
6846 -191 -135 -269 -133 -71 24 -87 -149 -11 -47 69 -262 -114 313 50 -22 -13 -34 253 30 -124 -343 -82 -268
6869 -268 157 -136 -162 114 -140 135 -235 -79 -35 -88 -85 211 210 -43 6 -36 -105 -134 246 -123 59 -223 13 -246
6893 -246 -42 -169 -128 407 26 66 -109 -192 -13 48 219 -140 173 223 1 63 -193 327 197 301 57 194
6915 194 192 409 -115 130 153 -94 49 -92 29 224 139 160 59 146 116 113 -27 28 124 282 -51 -57 192 -17
6939 -17 -18 -176 -76 21 -20 98 -20 -168 54 -238 -104 -279 -26 62 -26 51 -82 156 162 138 116 -260 -33 -306
6963 -306 220 -145 149 46 77 151 -61 100 135 -71 -81 -13 -97 7 12 -225 -52 -213 -21 -262 153 44 82
6986 82 197 -20 3 58 193 -203 -60 88 -165 -292 114 136 -69 -153 88 -82 35 -63 111 4 45 -200
7008 -200 149 -67 -104 266 140 -55 150 37 61 -380 44 206 -137 -88 -128 0 8 56 231 -29 -74 -122 4
7031 4 -173 -8 41 138 -152 -114 -122 -138 26 -220 -105 -24 115 140 70 -66 25 -114 -92 90 101 82 -117 -232 -27
7056 -27 -42 -206 163 159 -111 -207 -104 -121 378 -9 231 80 -32 215 -83 87 96 43 -59 -118 -170 -16 -124 114
7080 114 82 -156 -353 -44 -159 -62 38 -49 -170 -377 -29 122 37 54 47 -168 -125 -57 -165 96 -21 -173 52
7103 52 -150 216 -71 -247 -286 -34 124 110 -168 -171 -170 -249 325 -46 -45 -70 -61 -18 16 -331 -14 -70 216 55 -140
7128 -140 32 -14 167 -215 65 -71 -85 -93 163 -446 -8 -21 -379 64 167 172 -58 -31 -151 104 -203 -14 -45
7151 -45 89 429 40 -35 285 -38 134 50 3 131 -203 22 265 -3 68 -54 52 -8 -139 186 288 95
7173 95 75 -99 65 10 -27 198 304 19 -94 43 -15 341 427 38 -103 -156 171 -35 -35 118 -2 1 299 241
7197 241 -129 75 -59 -122 -290 151 -127 -111 104 28 152 62 -226 126 215 -31 27 -7 121 -62 28 -58 145
7220 145 133 282 112 -200 -135 -112 -77 179 -130 -162 -62 149 -139 -224 -214 -120 237 -64 90 170 -285 142 -103
7243 -103 178 203 87 96 -386 -6 -57 241 -87 -51 -314 -143 177 -117 78 -18 47 426 58 243 57 -75
7265 -75 20 98 285 -54 -45 -213 -87 -156 67 -16 -268 35 189 -79 200 116 -43 -139 71 -84 123 253 305
7288 305 271 73 45 -177 -102 193 -143 44 -75 252 -279 164 150 62 188 -1 119 -243 241 157 -12 29
7310 29 6 143 165 55 58 -33 -167 -150 172 -72 -158 27 -64 0 90 16 -370 305 -177 -113 -39 95 -20 -151 -106
7335 -106 -135 -11 -139 -109 234 -29 -164 9 -5 -120 -169 24 -262 23 -42 -71 71 136 -33 -295 -28 13 39
7358 39 -163 -96 -37 239 80 -21 -66 -226 96 -80 -205 -126 37 -171 101 142 -186 16 57 -39 -327 -150 256
7381 256 23 85 -143 20 -54 -20 22 -82 45 124 -276 66 -64 -183 -40 66 -90 170 -62 -164 118 -295
7403 -295 -15 -263 193 -246 -261 87 116 26 154 68 -213 -57 -153 52 -63 -42 82 -6 -327 -162 185 15
7425 15 -260 -71 68 -172 136 38 49 -24 -13 233 110 228 -115 -280 163 46 20 -109 126 -66 125 59
7447 59 -36 -69 -23 281 -113 292 -177 45 -95 240 -22 105 -349 -86 221 -80 -154 308 35 71 -80 -202
7469 -202 -8 -135 -61 68 -39 -112 83 -119 135 -252 44 -110 44 -97 35 62 338 -303 -165 -18 -171
7490 -171 285 -187 36 -28 -58 -110 -139 -62 -99 52 -266 87 -139 -128 -29 91 -119 31 -246 -111 83 -170 9
7513 9 -228 -166 -257 -88 -295 111 -112 -143 -160 -150 243 230 -172 -137 -145 -275 -225 -24 5 41 31 37 -143 100 -182 144
7539 144 250 -162 124 408 279 -244 235 242 288 -224 -119 126 -411 62 353 -247 -55 180 84 247 -25
7560 -25 326 53 -74 60 35 -73 42 114 -147 -118 283 237 15 158 -92 162 163 -193 -110 116 85 121 -194
7583 -194 261 93 101 -52 81 8 -242 -29 77 -88 -41 44 215 89 3 55 -103 354 26 -78 -162 42 84
7606 84 171 -133 43 -195 62 175 174 -135 -37 -16 132 107 -75 -64 -209 52 -196 -78 -285 -129 28 -311 -155
7629 -155 -157 -323 307 35 120 95 -280 -189 -78 -21 201 -11 192 358 -306 119 -75 49 -56 -2 94 -162 -150
7652 -150 -19 187 48 -11 -82 79 216 155 -40 189 -191 -98 241 -26 29 138 -74 54 76 -144 -51 -82 83
7675 83 -101 134 -23 -1 504 -69 168 -79 -130 66 149 268 -56 -117 -17 13 -10 437 188 76 7 -76 129
7698 129 13 47 76 -144 -86 152 145 117 73 -17 14 -74 -219 14 -22 -188 -81 203 210 -165 138 -84 22 30 -28
7723 -28 -56 -149 40 -175 -307 -48 -205 164 -56 -53 -94 131 -109 -302 -4 -114 62 -141 -206 7 221 -21
7745 -21 64 66 31 -36 -97 -99 -47 6 99 196 64 -134 -189 63 184 187 -294 66 364 119 -60 -64 -291 23 -81 -259
7771 -259 -52 -229 -42 218 -199 6 124 43 25 -101 119 111 -116 91 15 -222 196 183 156 158 74 -175 99
7794 99 90 -73 127 -204 -9 153 -81 28 1 29 -76 186 -114 -217 -172 108 19 32 -94 13 -89 -30 144
7817 144 153 -6 -136 29 46 -202 46 332 117 -308 -251 -139 209 137 -19 -166 -62 215 370 201 -98 -140
7839 -140 -240 268 9 95 53 6 -86 -52 -84 137 45 250 -237 -216 48 12 146 126 201 253 63 -30 -117 -47 -141
7864 -141 -215 87 153 -101 -111 211 -90 23 -240 75 -243 -72 -78 -307 -44 -36 94 -6 -40 -172 -16 7 -159
7887 -159 -53 2 -22 -12 -115 -48 25 -14 103 11 17 -274 -237 444 139 119 -18 -97 -48 -276 -201 67 255 -178 13
7912 13 133 358 7 -99 182 -120 203 288 -23 -160 154 -15 -44 -66 57 173 247 362 54 107 -115 31
7934 31 -292 11 -94 96 129 -37 90 50 -47 37 4 -74 132 -62 -267 40 82 140 -305 -4 77 -67 161
7957 161 107 -150 27 188 85 203 -163 225 207 -24 -292 369 -75 178 173 41 -177 60 -46 61 130 40
7979 40 -191 190 -177 9 199 -87 77 -215 65 108 110 -45 -29 -231 -125 237 -242 -14 7 -48 -120 -115 253
8002 253 115 16 151 -73 -223 130 141 59 -113 -12 -49 -40 223 -289 -18 134 96 -296 48 36 5 6 -89 18
8026 18 -114 -112 -525 -241 481 -75 89 -43 -212 190 386 -87 -19 11 26 -241 -231 -129 -36 -284 30 11 31
8049 31 170 -335 -7 55 -67 92 -161 -345 9 287 -253 285 -101 58 -130 37 -146 -263 -112 149 156
8070 156 133 181 10 -12 81 152 74 -12 64 179 -133 -147 -61 -10 209 -113 173 310 145 126 249 -13 80 54 62
8095 62 255 146 -151 20 46 58 -48 45 -2 -295 -241 -211 -212 -102 13 -275 180 3 -22 342 73 160 147 -199
8119 -199 -199 -69 -63 -205 -4 411 -89 -19 -140 -38 60 -23 20 -176 137 121 -499 -174 -292 41 68 116 180 -19
8143 -19 -123 121 173 -44 -130 382 -90 -34 -199 -156 121 -247 -68 -245 -313 -11 77 -227 3 -247 101 256
8165 256 153 -131 -106 -195 306 -108 28 177 0 66 -347 -69 -120 -9 -2 -98 -47 -99 189 -69 -125 -12 -26 -17
8189 -17 -149 -70
8191g0
##END NTUPLES=NMR FID
##END=
