##TITLE=1H_SR69_oil
 CDCl3, 8 sc, 
 7.07.2021
##JCAMPDX= 6.0         $$ Bruker NMR JCAMP-DX V2.0
##DATA TYPE= NMR FID
##DATA CLASS= NTUPLES
##ORIGIN= UXNMR, Bruker Analytische Messtechnik GmbH
##OWNER= root
$$ XWIN-NMR		Version 3.5
$$ Wed Jul  7 13:41:33 2021 Russian Standard Time (UT+4h)  she@DPX200
##.OBSERVE FREQUENCY= 200.131506
##.OBSERVE NUCLEUS= ^1H
##.DELAY= (6, 6)
##.ACQUISITION MODE= SIMULTANEOUS
##.ACQUISITION SCHEME= undefined
##.AVERAGES= 8
##.DIGITISER RES= 18
##SPECTROMETER/DATA SYSTEM= spect
##.PULSE SEQUENCE= zg30
##.SOLVENT NAME= CDCl3
##.SHIFT REFERENCE= (INTERNAL, CDCl3, 0, 15.7039)
##AUDIT TRAIL= $$ (NUMBER, WHEN, WHO, WHERE, WHAT)
$$ ##TITLE= Audit trail, XWIN-NMR		Version 3.5
$$ ##JCAMPDX= 5.01
$$ ##ORIGIN= Bruker BioSpin GmbH
$$ ##OWNER= she
$$ F:/spectra/data/she/nmr/H-F/1/audita.txt
$$ ##AUDIT TRAIL=  $$ (NUMBER, WHEN, WHO, WHERE, WHAT)
(   1,<2021-07-07 13:40:45.07 +0400>,<she>,<DPX200>,
      <created by zg, POWCHK disabled, PULCHK disabled
       configuration hash MD5:
       00 E9 B6 7A A2 85 ED C7 34 08 36 98 17 FE 4E 26
       data hash MD5: 16K
       87 E5 F6 30 B2 05 52 BB 59 FC 9B 29 8B 6D 6B B5>)
$$ ##END=
$$ 
$$ hash MD5
$$ BF 5A F8 69 95 3D 69 AC F7 14 FC B0 15 C2 90 26
##$RELAX= 
##$RELAX= 
##$RELAX= 
##$RELAX= 
##$RELAX= 
##$RELAX= 
$$ Bruker specific parameters
$$ --------------------------
##$DU= <F:/spectra>
##$EXPNO= 1
##$NAME= <H-F>
##$PROCNO= 1
##$TYPE= <nmr>
##$USER= <she>
##$AMP= (0..31)
100 100 100 100 100 100 100 100 100 100 100 100 100 100 100 100 100 100 
100 100 100 100 100 100 100 100 100 100 100 100 100 100 
##$AQSEQ= 0
##$AQ_mod= 1
##$AUNM= <au_zg>
##$AUTOPOS= <>
##$BF1= 200.13
##$BF2= 200.13
##$BF3= 200.13
##$BF4= 200.13
##$BF5= 200.13
##$BF6= 200.13
##$BF7= 200.13
##$BF8= 200.13
##$BYTORDA= 1
##$CFDGTYP= 0
##$CFRGTYP= 5
##$CHEMSTR= <none>
##$CNST= (0..31)
1 1 145 1 1 1 1 1 1 1 1 1 1 1 1 1 1 1 1 1 1 1 1 1 1 1 1 1 1 1 1 1 
##$CPDPRG= <>
##$CPDPRG1= <>
##$CPDPRG2= <>
##$CPDPRG3= <>
##$CPDPRG4= <mlev>
##$CPDPRG5= <mlev>
##$CPDPRG6= <mlev>
##$CPDPRG7= <mlev>
##$CPDPRG8= <mlev>
##$CPDPRGB= <>
##$CPDPRGT= <>
##$D= (0..31)
0 1.2 0 0 0 0 0 0 0 0.06 0 0.03 0 0 0 0 0.0002 0 0 0 0 0 0 0 0 0 0 0 0 
0 0 0 
##$DATE= 1625650844
##$DBL= (0..7)
120 120 120 120 120 120 120 120 
##$DBP= (0..7)
150 150 150 150 150 150 150 150 
##$DBP07= 0
##$DBPNAM0= <>
##$DBPNAM1= <>
##$DBPNAM2= <>
##$DBPNAM3= <>
##$DBPNAM4= <>
##$DBPNAM5= <>
##$DBPNAM6= <>
##$DBPNAM7= <>
##$DBPOAL= (0..7)
0.5 0.5 0.5 0.5 0.5 0.5 0.5 0.5 
##$DBPOFFS= (0..7)
0 0 0 0 0 0 0 0 
##$DE= 6
##$DECBNUC= <off>
##$DECIM= 32
##$DECNUC= <off>
##$DECSTAT= 4
##$DIGMOD= 1
##$DIGTYP= 9
##$DL= (0..7)
0 120 120 120 120 120 120 120 
##$DP= (0..7)
150 150 150 150 150 150 150 150 
##$DP07= 0
##$DPNAME0= <>
##$DPNAME1= <>
##$DPNAME2= <>
##$DPNAME3= <>
##$DPNAME4= <>
##$DPNAME5= <>
##$DPNAME6= <>
##$DPNAME7= <>
##$DPOAL= (0..7)
0.5 0.5 0.5 0.5 0.5 0.5 0.5 0.5 
##$DPOFFS= (0..7)
0 0 0 0 0 0 0 0 
##$DQDMODE= 0
##$DR= 18
##$DS= 0
##$DSLIST= <SSSSSSSSSSSSSSS>
$$ [...]
##$SUBNAM2= <"">
##$SUBNAM3= <"">
##$SUBNAM4= <"">
##$SUBNAM5= <"">
##$SUBNAM6= <"">
##$SUBNAM7= <"">
##$SUBNAM8= <"">
##$SUBNAM9= <"">
##$SW= 20.0188882624521
##$SWIBOX= (0..15)
0 0 2 0 0 0 0 0 0 0 0 0 0 0 0 0 
##$SW_h= 4006.41025641026
##$TD= 16384
##$TD0= 1
##$TE= 0
##$TE2= 300
##$TE3= 300
##$TEG= 300
##$TL= (0..7)
0 120 120 120 120 120 120 120 
##$TP= (0..7)
150 150 150 150 150 150 150 150 
##$TP07= 0
##$TPNAME0= <>
##$TPNAME1= <>
##$TPNAME2= <>
##$TPNAME3= <>
##$TPNAME4= <>
##$TPNAME5= <>
##$TPNAME6= <>
##$TPNAME7= <>
##$TPOAL= (0..7)
0.5 0.5 0.5 0.5 0.5 0.5 0.5 0.5 
##$TPOFFS= (0..7)
0 0 0 0 0 0 0 0 
##$TUNHIN= 0
##$TUNHOUT= 0
##$TUNXOUT= 0
##$USERA1= <user>
##$USERA2= <user>
##$USERA3= <user>
##$USERA4= <user>
##$USERA5= <user>
##$V9= 5
##$VALIST= <valist>
##$VCLIST= <CCCCCCCCCCCCCCC>
##$VD= 0
##$VDLIST= <DDDDDDDDDDDDDDD>
##$VPLIST= <PPPPPPPPPPPPPPP>
##$VTLIST= <TTTTTTTTTTTTTTT>
##$WBST= 1024
##$WBSW= 4
##$XGAIN= (0..3)
0 0 0 0 
##$XL= 0
##$YL= 0
##$YMAX_a= 153386
##$YMIN_a= -194055
##$ZGOPTNS= <>
##$ZL1= 120
##$ZL2= 120
##$ZL3= 120
##$ZL4= 120
##$ABSF1= 10
##$ABSF2= 0
##$ABSG= 5
##$ABSL= 3
##$ALPHA= 0
##$AQORDER= 0
##$ASSFAC= 0
##$ASSFACI= 0
##$ASSFACX= 0
##$ASSWID= 0
##$AUNMP= <proc_1d>
##$AZFE= 0.1
##$AZFW= 0.1
##$BCFW= 1
##$BC_mod= 2
##$BYTORDP= 1
##$COROFFS= 0
##$CY= 11.3945322036743
##$DATMOD= 1
##$DC= 2
##$DFILT= <>
##$DTYPP= 0
##$F1P= 15.9154993809931
##$F2P= -4.1035820241983
##$FCOR= 0.5
##$FTSIZE= 0
##$FT_mod= 4
##$GAMMA= 1
##$GB= 0.15
##$INTBC= 1
##$INTSCL= 1
##$ISEN= 128
##$LB= 0.24
##$LEV0= 0
##$LPBIN= 0
##$MAXI= 10000
##$MC2= 0
##$MEAN= 0
##$ME_mod= 0
##$MI= 1.114404
##$NCOEF= 0
##$NC_proc= 0
##$NLEV= 6
##$NOISF1= 3.799351
##$NOISF2= 2.8
##$NSP= 1
##$NTH_PI= 0
##$NZP= 0
##$OFFSET= 15.70392
##$PC= 1
##$PHC0= -12282.35
##$PHC1= 22.201
##$PH_mod= 1
##$PKNL= yes
##$PPARMOD= 0
##$PSCAL= 0
##$PSIGN= 0
##$REVERSE= no
##$SF= 200.130013532006
##$SI= 16384
##$SIGF1= 3
##$SIGF2= 2
##$SINO= 400
##$SIOLD= 16384
##$SREGLST= <1H.CDCl3>
##$SSB= 0
##$STSI= 0
##$STSR= 0
##$SW_p= 3612.71676300578
##$SYMM= 0
##$S_DEV= 0
##$TDeff= 0
##$TDoff= 0
##$TI= <>
##$TILT= no
##$TM1= 0
##$TM2= 0
##$TOPLEV= 0
##$USERP1= <user>
##$USERP2= <user>
##$USERP3= <user>
##$USERP4= <user>
##$USERP5= <user>
##$WDW= 1
##$XDIM= 8192
##$YMAX_p= 0
##$YMIN_p= 0
$$ End of Bruker specific parameters
$$ ---------------------------------
##NTUPLES= NMR FID
##VAR_NAME=  TIME,          FID/REAL,        FID/IMAG
##SYMBOL=    X,             R,               I
##VAR_TYPE=  INDEPENDENT,   DEPENDENT,       DEPENDENT
##VAR_FORM=  AFFN,          ASDF,            ASDF
##VAR_DIM=   8192,          8192,            8192
##UNITS=     SECONDS,       ARBITRARY UNITS, ARBITRARY UNITS
##FACTOR=    0.0002496,     1,               1
##FIRST=     0,             0,               0
##LAST=      2.0444736,     0,               0
##MIN=       0,             -194055,         0
##MAX=       2.0444736,     153386,          0
$$ Real data points
##PAGE= N=1
##DATA TABLE= (X++(R..R)), XYDATA
0@%%%%%%%%%%%%qJ6j6J6k4L2l9M7n6O4p2Q8j04J21j45J68j92K24k56K95l36L78
$$ 0 0 0 0 0 0 0 0 0 0 0 0 0 -8 8 -8 8 -16 16 -23 24 -32 32 -40 48 -56 65 -80 88 -104 120 -136 159 -177 201
34B01m29M84n44O12o87P67q55R51j055J171j298J436j582J743j923K119k335K573
$$ 201 -228 256 -288 324 -363 404 -451 500 -555 616 -682 754 -828 915 -1008 1111 -1224 1349
52A349k834L123l449L815m225M694n237N870o620P526q649J0080j1973J4614j8582
$$ 1349 -1485 1638 -1811 2004 -2221 2473 -2764 3106 -3514 4012 -4637 5443 -6530 8084 -10498
67a0498K5308l9659J25799j15232o5814K33482j62934k0473J58354j14862j05367
$$ -10498 14810 -24849 100950 -14282 -80096 153386 -9548 -30021 128333 13471 -91896
78i1896J56895l9484n4886J01077m4599r0790R0567k668m7542N3534j9242n6739
$$ -91896 64999 25515 -29371 71706 27107 -63683 26884 24216 -23326 30208 10966 -45773
90d5773N5360R20k8950L4640q062k8883K1854j6194Q105M3970l6894l1359L1778
$$ -45773 9587 10507 -18443 16197 8135 -20748 1106 -15088 -6983 36987 93 -31266 512
103E12j1426J2969L2500n3454j0038M6631m0963J2640O8419p2815l6006Q3923
$$ 512 -10914 2055 34555 -18899 -28937 17694 -23269 -10629 57790 -15025 -51031 32892
115C2892l5730k4673Q6953o3475p1560J11015q471q0915R0192m166j05818Q4028
$$ 32892 -2838 -27511 59442 -4033 -75593 35422 26951 -53964 36228 32062 -73756 10272
127A0272M1972r9506N3485M8984j06718K3630Q1482o6979o109N7489n4462j2334
$$ 10272 52244 -47262 6223 55207 -51511 -27881 53601 -13378 -19487 38002 -16460 -28794
139b8794N7360k8370j1049L5906l5343j3303M3385j3155j2134K0697k4270p126
$$ -28794 28566 196 -10853 25053 -10290 -23593 19792 6637 -5497 15200 -9070 -16196
151a6196L3252r912j2420J2257j3929j128K0101p881k170L639j8299J0469J7162
$$ -16196 17056 7144 -5276 6981 -6948 -8076 12025 4144 1974 5613 -12686 -2217 14945
164A4945j8309M832P958k8216J5658K6260l3044L629K7716l7423Q9M4078l1086
$$ 14945 -3364 1468 9426 -18790 -3132 23128 -9916 -6287 21429 -15994 -15905 28173 -2913
177b913j5234M0538k8411k0798N1108j4615l4883L8879o189l5846L9170P975m0276
$$ -2913 -18147 22391 -6020 -26818 24290 9675 -25208 13671 7482 -28364 10806 18781 -21495
190b1495K3189J1031l4071K1753J9829l3596O281J8933k3349O435J9858k1572
$$ -21495 1694 12725 -21346 407 20236 -13360 -7079 11854 -11495 -5060 14798 -6774
202f774k381J7630j2993j381J5274j1114o726J1969l666l006O758m251l215L833
$$ -6774 -9155 8475 -4518 -5899 9375 -1739 -8465 3504 -162 -3168 3590 -661 -3876 -43
216d3k57K207n44m268L878q15m315Q977p31j0522Q122K283j0908J0649N409j6730
$$ -43 -300 1907 1363 -2905 973 158 -4157 4820 4089 -6433 1689 3972 -6936 3713 9122 -7608
232g608O153R978j4726N288J3192j7125j061J5771j1834l605J6601j0590r305
$$ -7608 -1455 8523 -6203 -915 12277 -4848 -5909 9862 -1972 -5577 11024 434 -8871
245h871J6089l988j0180J3429j719j2467J0946K511j1245P363M141j0926M358
$$ -8871 7218 3230 -6950 6479 4760 -7707 3239 5750 -5495 1868 6009 -4917 -559
258e59O298q623J127O478o190j014N912l470k575L914r69k378K623O77k941K47
$$ -559 5739 -2884 -1757 4721 -1469 -2483 3429 -41 -2616 1298 329 -2049 574 1251 -1690 -1443
274a443J942j278p22K264m38l010J718K205l348Q27L081l767j327M862k060k682
$$ -1443 499 -779 -1501 763 325 -2685 -967 1238 -2110 -1283 1798 -1969 -3296 1566 -494 -3176
290c176M812j458m225M333R24m271L035J662m579J716K935l565O00L334l362p23
$$ -3176 1636 178 -4047 286 1210 -3061 -26 1636 -2943 -1227 1708 -1857 -1257 2077 -1285 -2008
306b008L786j868k028L623m01l108K457J137k802J202K135k593l39K561j581j208
$$ -2008 1778 -90 -2118 1505 1104 -2004 453 1590 -1212 -10 2125 -468 -807 1754 173 -1035
322a035K974n14k536K287O29l000K030J769l197P65K598l092r1L446k411j751
$$ -1035 1939 1425 -1111 1176 1805 -1195 835 2604 -593 172 2770 -322 -413 3033 622 -1129
338a129L575j459k535L422rl196K396P91l207J524J719k373M92J631k274k5J988
$$ -1129 2446 987 -1548 1874 1865 -1331 1065 1856 -1351 173 1892 -481 11 1642 -632 -657 1331
355A331j555p01J662n77j144J095O2j044M54O38o64n65J014r7j092O87O22j550
$$ 1331 -224 -925 737 160 -984 111 173 -871 -417 221 -443 -1008 6 -91 -1183 -496 126 -1424
373a424K81J493j372l04J822j348j064K377o99j879K615j47k781K423R98l237
$$ -1424 -1143 350 -1022 -1326 496 -852 -1916 461 -238 -2117 498 351 -2430 -7 991 -2246
389b246J767J926l214N08K836k679l99L159k266r80L253j623j848L189n21k411
$$ -2246 -479 1447 -1767 -1259 1577 -1102 -1501 1658 -608 -1588 1665 42 -1806 1383 862 -1549
405a549K214P00k537J429J511k380M80J906j865l54K018r44r27J519l18j519J306
$$ -1549 665 1365 -1172 257 1768 -612 -132 1774 -91 -445 1573 629 -298 1221 903 -616 690
422F90J017j924P20J354j842l99K144p22j762J977k6k103J656R88k434N03J813
$$ 690 1707 -217 503 1857 15 -384 1760 1038 -724 1253 1227 -876 780 1768 -666 -163 1650
439A650k190K1K394k072j210K568p32j897K464k65k819K210J069k765J115J748
$$ 1650 -540 -519 1875 -197 -1407 1161 429 -1468 996 731 -2088 122 1191 -1574 -459 1289
455A289k825o1L016j833j582K623p28k290K961M52l333J722J436l076J210K895
$$ 1289 -1536 -1597 1419 -414 -1996 627 -101 -2391 570 1022 -2311 -589 847 -2229 -1019 1876
471A876l246o17L341k178j356L848j320l087L197L99l059K715J455m184J287K841
$$ 1876 -1370 -1987 1354 -824 -2180 1668 348 -2739 458 857 -2202 513 1968 -2216 -929 1912
487A912l055J89L129k979j172L763r88k308K839m93k820K643J497l046J041J630
$$ 1912 -1143 -954 2175 -804 -1976 1787 799 -1509 1330 837 -1983 660 2157 -889 152 1782
503A782k631K03L090j725j922K399m35j989K550Q56k992K43K288j817j67K878
$$ 1782 -849 -646 2444 719 -1203 1196 761 -1228 1322 2178 -814 -571 1717 -100 -267 2611
519B611k285k222L355k43k486K962L48m576K413L013m214Q69L276m475o17N452
$$ 2611 326 -1896 1459 1216 -1270 1692 2040 -2536 -123 2890 -1324 -455 2821 -1654 -2271 3181
535C181k777k695M284j865l556N091L27m940L192J212m529K679L329m954J29L505
$$ 3181 404 -2291 1993 128 -3428 1663 1990 -2950 242 1454 -3075 -396 2933 -2021 -1892 1613
551A613l267n13M496k404k818L383l21k457L144J40l393J098K305j985K74K068
$$ 1613 -1654 -2167 2329 -75 -2893 490 169 -2288 856 996 -2397 -1299 1006 -979 -705 1363
567A363k260j574K960M33j925J222L69k799J292L138k422j302K817j953j356M123
$$ 1363 -897 -2471 489 922 -1003 219 588 -2211 -919 2219 -203 -1505 1312 -641 -1997 2126
583B126k35m151K778J106l961L076K686n169M56L897l768L17M770l977k730N123
$$ 2126 1891 -2260 518 1624 -2337 739 3425 -1744 -1288 2609 -1159 -842 3928 -49 -2779 2344
599B344j347k519M387j113m751L766J751l805K275J682m614R29L739k469r28K559
$$ 2344 997 -1522 2865 1752 -2999 767 2518 -1287 988 2670 -1944 -1015 2724 255 -673 1886
615A886k308j479L688k66k668J774J49k285J631J897k273r48J789j119o95K623
$$ 1886 -422 -1901 1787 1521 -1147 627 776 -1509 122 2019 -254 -1202 587 -532 -1227 1396
631A396l33l011J195J559j824J002J613k891j025L388j152j486L018j383l270
$$ 1396 1063 -1948 -753 806 -1018 -16 1597 -1294 -2319 1069 -83 -1569 1449 66 -3204
646c204L372J310l422K090J179m094J643L504l409m21L008k843q63M129j306k641
$$ -3204 168 1478 -1944 146 1325 -2769 -1126 2378 -1031 -1452 1556 -1287 -2150 1979 673 -1968
662a968K810q50k293L411P16l470J199J531k412J302K353k782j024K469p56r07
$$ -1968 842 -8 -2301 1110 1826 -1644 -445 1086 -1326 -24 2329 -453 -1477 992 236 -671
678f71K224q76k065J413J049j150M42J105j945m44K093k33j207J259l70j741J709
$$ -671 1553 677 -1388 25 1074 -76 366 1471 -474 -918 1175 942 -265 994 624 -1117 592
695E92J152j882O4J249j739J02K319j354j559J892n78j293K518k09k719J341R34
$$ 592 1744 -138 -74 1175 -564 -462 1857 503 -1056 836 258 -1035 1483 1274 -1445 -104 830
712H30k024J335J571k744o5K173j374m90K014j453j527K135N7j553J567j79j846
$$ 830 -1194 141 1712 -1032 -1097 1076 -298 -788 1226 -227 -1754 381 438 -1115 452 273 -1573
729a573J077J236j508J86R36j156l54J602m51j020J108j93j250J295O39j360K7
$$ -1573 -496 740 -768 -582 354 -802 -1156 446 -5 -1025 83 -110 -1360 -65 574 -786 -759
746g59J267j207k0J511q40j038J118L5r97J323J89j626R16R18j119K86R03j373
$$ -759 508 -699 -719 792 -48 -1086 32 67 -930 393 582 -1044 -128 790 -329 -43 860 -513
764e13M9J382q30o63J316m31r32J152K91j247N88O50j069R6J228r29l25J005n36
$$ -513 -464 918 88 -575 741 310 -622 530 821 -426 162 812 -257 -161 1067 138 -187 818 282
783B82n50J016M4r92M26M77r22M74O07j031p8R95n17l51P45m36p73J019Oq30O12
$$ 282 -268 748 792 -200 226 703 -219 255 862 -169 -247 748 231 -120 625 189 -584 435 441 -389 223
804B23K16j029O14M85p16q1O55n97m27J030p35k51O97k77m79P60j10n61K11L76
$$ 223 439 -590 24 509 -207 -288 367 -230 -657 373 -362 -613 84 -193 -672 88 -22 -583 -372 4
824Dp12K95L80k57l30M08p3k90M76k1n06K88L38m55K35J21k47m4N53j79m24N11
$$ 4 -708 -413 -33 -290 -620 -212 -285 -575 -99 -120 -626 -338 0 -455 -220 -99 -346 -390 163 -16 -440 71
846G1L9m85K11O11p65K02N07o25J77M08k48k31O40l82m83Q21k94m84Q57Lp29M54
$$ 71 110 -375 -164 447 -318 -116 391 -234 -57 351 103 -128 512 130 -353 468 174 -310 547 550 -179 275
868B75L94p51K08O43p86M2P07o76k2N50l96j76N17k84k64M43j66l08K50O4k46
$$ 275 669 -82 126 769 -17 25 732 56 34 584 188 12 529 245 -19 424 258 -50 200 264 18
889A8N8K18k99K1J50p2l01J15J71j72p7J71j25q4J51j29l29L07J96m84M24J38
$$ 18 76 294 -5 16 166 94 -207 -92 79 -93 -170 1 -124 -208 -57 -186 -515 -208 -12 -496 -72 66
911F6n83L10K78n06M8L99m05k12O96m92j71O89k49k94L17Q5o73N89J2m58N05K82
$$ 66 -517 -207 71 -435 -387 12 -393 -605 91 -401 -572 117 -132 -426 -109 -24 -697 -108 -96 -554 -49 233
933B33o43J82M13n49J54M51k59k18M19Ml14L92R5m85K46m7M7j38K98k47J10N4
$$ 233 -410 -228 185 -364 -210 241 -18 -236 183 187 -127 265 360 -125 121 74 121 -17 281 34 144 198
955A98M1p8QK47k30j6J37j25r2M31j89k28J89N4m27M85R5o52L74Q8l34M4J93l39
$$ 198 239 161 169 416 186 170 307 182 90 521 332 104 293 347 -80 405 500 -152 222 310 -24 20 213 -126
979a26p6N30l33k70N84l22l32N77j99l43K70J96n95M15J19l74N5K27j62l76M97
$$ -126 -202 328 -5 -275 309 -13 -345 232 33 -310 -40 156 -439 -24 95 -279 -224 3 -159 -535 -38
1000c8m1j73J94k28j3P7J27l16K40J00j39j27L71j48k81L42j12k23K58L51n71
$$ -38 -79 -252 -58 -286 -299 -222 -95 -411 -171 -71 -210 -337 34 -114 -395 -53 -165 -388 -130 221 -350
1021c50J17L71r6k28L18k31p4L33l20o9L92J55m99J86R1k31K39K58l36K5L13k04
$$ -350 -233 138 42 -186 132 -99 -173 160 -160 -229 163 318 -181 5 96 -135 104 362 26 51 364 160
1043A60j12L26j4n85O06m2j88P1J44l56K84K08k81k38K44nl02N67j66m09L38P8
$$ 160 48 374 360 -225 381 339 151 222 366 10 294 502 221 -17 227 222 -80 487 321 -88 250 328
1065C28m87J83L81n55R9L92l45j40L81j69k58K94ql78J77M47p81J16M98k81m7
$$ 328 -159 24 405 -150 -51 341 -4 -144 237 68 -190 104 96 -282 -105 342 -439 -323 175 -106 -153
1086a53M34o09k35N57r4j91M7J90m45L97L09n48j12L18k79K10L72k18n13N28n0
$$ -153 281 -328 -563 -6 -100 -291 -244 -54 -499 -102 207 -341 -453 -135 -414 -204 168 -50 -563 -35 -85
1107h5l52N10l8l67Q1L40j24jL10n39j91O53p3k27L40j23k89K76L16l98Q3J41
$$ -85 -437 73 35 -332 -251 89 -35 -36 274 -265 -456 197 124 -103 237 114 -175 101 417 19 102 243
1129B43m39L0P17l17k87M17k41j16K31J66k86m7K36l16J42M32m81j80M08k35Q2
$$ 243 -196 -166 551 234 -53 364 123 7 238 404 118 71 307 -9 133 565 84 -96 312 77 159
1150A59K14K9p11M55J60k69j4K91l54k75N83k36r2L10l71j24L60J45l14j8J67
$$ 159 373 402 -309 146 306 37 23 314 -40 -315 268 32 -60 250 -121 -245 115 260 -54 -72 95
1171I5m53P2P03m64k94L74k60j15L82J4n24K49K11k50L33Ln05m0N11j39j02K08
$$ 95 -358 -286 417 -47 -341 33 -227 -342 40 54 -470 -221 -10 -260 73 76 -429 -469 42 -97 -199 9
1193Ij84l50O27nk26OJ73m77L75J97k25m1L37m78r4N28J16k82j4jl9J16K88l14
$$ 9 -175 -525 102 97 -129 -123 50 -427 -52 145 -80 -121 216 -262 -356 172 288 6 -8 -9 -48 68 356 42
1217D2rJ78j22NK97k01m44L74K22l16K34Q7l53j1L28l19K17J37m38j63N27m0m05
$$ 42 33 211 89 94 391 190 -254 120 342 26 260 347 -6 -17 311 -8 209 346 -92 -255 272 232 -173
1240a73K79r7p2K09O7O7k49J87l67K60K47p2k39R0r2j32K22j53j27j07K13j58
$$ -173 106 9 -63 146 213 280 31 218 -149 111 358 286 47 137 45 -87 135 -18 -145 -252 -39 -197
1262a97K82J54n34k7K93J07k04J19p6k33K15K2j51J09R1l22J47K74j17j27j2m
$$ -197 85 239 -295 -322 -29 78 -126 -7 -83 -316 -101 -79 -230 -121 -30 -352 -205 69 -48 -175 -187 -191
1284a91j37L47J1j28K2L2k77K28J92j04j35L08k92K26M0j83j5q5K96m7J95p5k82
$$ -191 -328 19 30 -98 -76 -44 -321 -93 99 -5 -140 168 -124 102 142 -41 -56 -141 155 108 303 228 -54
1307e4L7M2O5N9P5j10k43M58r2k29J99m0j02J16Q7j70J69j53k16K62k3j27j6P2
$$ -54 -17 25 90 149 224 114 -129 329 237 8 207 167 65 181 268 98 267 114 -102 160 137 10 -6 66
1331F6j4p0N4J05p3j68K50k02K29j40l9j04j4R2K94j38j88qLmJ6R0j22j12P8J5
$$ 66 52 -18 36 141 68 -100 150 -52 177 37 -2 -106 -120 -28 266 128 -60 -68 -65 -69 -53 37 -85 -197 -119 -104
1357a04q2m9M0N5j63K04L2j29K14k53kK14j00n7N7K8N7j90J47r7j3O5j20O9J87
$$ -104 -186 -235 -195 -140 -303 -99 -67 -196 18 -235 -237 -23 -123 -180 -123 -95 -38 -228 -81 -178 -191 -126 -246 -177 10
1382A0j25J18j9q9l2K6L48k30J2O3n1J34p8j44J59J11k28P7R3j30J93k20J92j21
$$ 10 -115 3 -16 -105 -137 -111 237 7 19 82 31 165 87 -57 102 213 -15 62 155 25 218 -2 190 69
1406F9J0L0O7K3n0P3q8j4j40J21M4n2N6j54J08r2J10J6j22P8r9R9n7L0r9RJ87
$$ 69 79 109 176 199 149 222 134 120 -20 101 145 93 149 -5 103 11 121 137 15 93 -6 93 36 66 -33 -24 163
1433A63k80K50k15p4n5J85J2q0P6L3r8j47K10j57P9p7K46l37J66M9r1j3J80p3
$$ 163 -117 133 -82 -156 -211 -26 -14 -94 -18 15 -83 -230 -20 -177 -98 -175 71 -266 -100 -51 -142 -155 25 -48
1457d8j65J70j45K3J57j61nj5L00k49n9J30l5PJ24P6k52J31r3J03J75j39m8L8
$$ -48 -213 -43 -188 -165 -8 -169 -174 -189 111 -138 -197 -67 -102 -95 29 105 -147 -16 -109 -6 169 30 -18 20
1481B0k7J02j36J37j30J87p9Jl9J85n0l13K84k8n5J12o8j97M12k69J02j75K65
$$ 20 -7 95 -41 96 -34 153 74 75 36 221 171 -142 142 114 59 171 103 -94 318 49 151 -24 241
1504B41k09kJ50m2J09k02j47K29r6O9m8j14K30j44k7R7j20rJ07K4k01K36m8k1
$$ 241 32 30 180 138 247 45 -102 127 31 100 52 -62 168 24 -3 94 -26 -35 72 96 -105 131 83 62
1528F2M7j71J27p2J49k27Po1mj6J0L8K7k0q0J8j96L63j43K1N6q5j58K33k0J64
$$ 62 109 -62 65 -7 142 -85 -78 -139 -143 -159 -149 -111 -84 -104 -184 -166 -362 1 -142 -121 -65 -150 -308 -75 -95 69
1554F9Rj38p0J95k89J45l3J19j66J54M8q9M8mJ65j62k5K20p8qnk05K4J78kj2P6
$$ 69 78 -60 -130 65 -224 -79 -112 7 -159 -5 43 -46 2 -2 163 1 -24 196 118 110 105 -100 -76 102 100 88 164
1581A64m8k18K26L7M3k04J95j61l0j5Q3J02K4k07M3K11j44j15L07j27Nk69Q0K58
$$ 164 116 -102 124 161 204 0 195 34 4 -11 72 174 198 -9 34 245 101 -14 293 166 171 -98 -18 240
1605B40k49l2Mj10J98J02o7k13J25l7J1M2N0j56K2J6K6j5k9oO6o5M7j50R3Q8j10
$$ 240 -9 -41 -37 -147 51 153 86 -127 -2 -39 -28 14 64 -92 -70 -54 -28 -43 -72 -78 -12 -77 -30 -180 -87 1 -109
1632a09K90j83k38J11o1pJ29J09k33O2J52j79N5L9n0N1J8P5j51R9mn5r0K61l1
$$ -109 181 -2 -240 -129 -190 -197 -68 41 -192 -130 22 -157 -102 -63 -113 -62 -44 31 -120 -21 -25 -80 -170 91 60
1657F0n3O0R6r0p3O3L6O1Q7k11R3M0j59J64j09O0j09K0N8j22R8l1KP2PK0j06Q2
$$ 60 7 67 163 73 0 63 99 160 247 36 129 169 10 174 65 125 16 36 94 -28 70 39 41 113 120 140 34 116
1685A16r4rQ6M4l39L06m0k27L92k5k95o8J85Rl8j3k68J71J00o7R5J22k51Q4M6
$$ 116 22 13 99 143 -196 110 70 -157 235 210 -85 -153 32 41 3 -10 -278 -107 -7 -74 21 143 -108 -24 22
1710B2J66k70k1R2k02J16K85l31N7m3P3o8K49j57l08K47J62k13Q9n8Q2q0J77j50
$$ 22 188 -82 -103 -11 -213 -97 188 -143 -86 -129 -56 -124 125 -32 -340 -93 69 -144 -55 -113 -31 -111 66 -84
1734h4J07K8j17p3J41O8j76J47j44P9m0K81j47l5jq9oM9j5J96j01j20j03L28J47
$$ -84 23 51 -66 -139 2 70 -106 41 -103 -24 -64 217 70 35 34 -55 -61 -12 -27 169 68 -52 -155 173 320
1759C20k24K9k4j36J31L0qk03L32j71N5l5J9p1l2R5j03kK80k35l81L97J9j20J
$$ 320 96 125 101 -35 96 126 118 -85 247 76 131 96 115 44 12 107 4 2 282 47 -334 63 82 -38 -37
1784c7J35m1k3J76j59j8L4j40j32K73J6j04j29l0K49P2l1l94K92J1p9J77j68r1
$$ -37 98 57 34 210 51 33 67 -73 -205 68 84 -20 -149 -179 70 142 111 -283 9 20 -59 118 -50 -141
1808a41p2J98j0k16K12rj60O8P9q3J03n9j22J65L7Oj47Q8O0r5j24L17j03k2N2
$$ -141 -213 -15 -25 -241 -29 -38 -198 -130 -51 -134 -31 -90 -212 -47 -10 -4 -151 -63 -3 -98 -222 95 -8 -30 22
1833B2j86J38J27j40r1J43Q1l9j73J3J48K06p5rOp8j20J09L9J47j04%j88m6J57
$$ 22 -164 -26 101 -39 -130 13 94 55 -118 -105 43 249 174 165 171 93 -27 82 121 268 164 164 -24 -70 87
1858H7pm7R1L2j71J68p1K4n6J57j24pJ04p3j22j34K51k45K54Jlj87J43j22j55
$$ 87 80 33 124 156 -15 153 82 106 50 207 83 76 180 107 -15 -149 102 -143 111 112 109 -78 65 -57 -212
1883b12L39l01J45J08l6j13K46q6p5r7K21k65l6J56p2K3R2K4j51K21j90j48J32
$$ -212 127 -174 -29 79 43 -70 176 90 15 -82 139 -126 -162 -6 -78 -55 37 61 -90 131 -59 -207 -75
1906g5o7J15j03K03j51o0J99Nl16J25K01j15j25Q9J29j02r3J93J0p6R9p1l7k2
$$ -75 -142 -27 -130 73 -78 -138 61 66 -250 -125 76 -39 -164 -75 54 -48 -141 52 62 -14 85 14 -23 -45
1930d5K9j2J06J52l12J96p8n0J87j09n6l1N6q6J7l2M0k1P9J10k27K56n4j49J12
$$ -45 -16 -28 78 230 -82 114 36 -14 173 64 8 -23 33 -53 -36 -68 -28 -49 30 140 -87 169 115 -34 78
1955G8n3J3J85m5j04O6j63L6J22K5L5j69m6J93k53J04J28k9m4r5k7P2O4m8k2k12
$$ 78 25 38 223 178 74 140 -23 13 135 160 195 26 -20 173 -80 24 152 123 79 -16 -43 29 93 45 23 -189
1981a89M50k25j30K46k91N3L5Q9n8J4j71M4mj07K28J02K4j82R2o0j15k7K57j40
$$ -189 261 36 -94 152 -139 -86 -51 38 -20 -6 -177 -133 -137 -244 -16 86 110 -72 20 -40 -155 -182 75 -65
2005f5L7L5j41J06k07K33j4l0r7J79L1k10j08L06j70J92o0p7MR9M4n5K3N8k09
$$ -65 -28 7 -134 -28 -235 -2 -16 -46 -143 36 67 -143 -251 55 -115 77 17 -60 -56 43 87 32 55 113 -96
2030i6J28J77p1L7j22P3L3j49R6L3j15J58j31pl3R5j54J33o2K5L0j3j20J9n1K29
$$ -96 32 209 138 175 53 126 159 10 106 139 24 182 51 44 11 106 -48 85 23 48 78 65 -55 -36 -87 142
2056A42j70N9j78R7J63k39L30k21J3o4J28J9J18l2j52N0O3k14M3l56L99%k8k20
$$ 142 -28 31 -147 -50 113 -126 204 -17 -4 -68 60 79 197 165 13 63 126 -88 -45 -401 -2 -2 -30 -250
2080b50L26J10j40O7k08J19Mj84J79MQj32j0K53l02L48j44j59P6L7l08K24O6l9
$$ -250 76 186 46 113 -95 24 28 -156 23 27 35 -97 -107 146 -156 192 48 -111 -35 2 -306 -82 -16 -55
2104e5K7J02M7m9L1O7l3m0k9j9J56j21j79J6J51jkQ3Oj66J27l0n0k2L09k13p6
$$ -55 -28 74 121 72 103 170 137 97 68 49 205 84 -95 -79 72 71 69 152 158 -8 119 89 39 17 326 113 37
2131C7j08J18R1p8J03k42J89J22j16j42J68j54O2j39J08j09J41M5j1r5kqL6O3
$$ 37 -71 47 138 60 163 -79 110 232 116 -26 142 -12 50 -89 19 -90 51 96 85 -10 -12 -20 16 79
2155G9p5j72l0K94j38J5j05M4Q0j20J73J13k16q7P4J05l6N8j12k80K66L1l8J28
$$ 79 4 -168 -198 96 -42 -27 -132 -88 -8 -128 45 158 -58 -145 -71 34 -2 56 -56 -336 -70 -39 -77 51
2179E1l6m4q1K49k52P3m0J88j84r5O4p9J52l8lK54j54j68O5J82p9r8R8m6R5J08
$$ 51 15 -29 -110 139 -113 -40 -80 108 -76 -171 -107 -186 -34 -72 -75 179 25 -143 -78 104 25 -73 25 -21 74 182
2205A82o0p8o8J64j17l3J18K1n2r2k4J61P8Kj63j0P7J60p0j66O3j95K45rN6qk3
$$ 182 122 44 -24 140 23 -10 108 129 77 -15 -39 122 200 202 39 29 106 266 196 30 93 -102 143 134 190 182 159
2232A59k24N9Rj73J71L3j43K06j93N7O7J05j46K4j94K46m5n4p3R6J02j58L2J8
$$ 159 -65 -6 3 -170 1 34 -109 97 -96 -39 28 133 -13 11 -183 63 18 -36 -109 -13 89 -69 -37 -19
2256a9RL4Qk1r2M7ljM8N6M7j05K0k29J81j7L6k02J53J91k13J63J43l30J27l6J24
$$ -19 -10 24 32 11 -81 -34 -37 -38 10 66 113 8 28 -201 -20 -37 -1 -203 -50 141 -72 91 234 -96 31 -5 119
2283A19j24J31j95j73K48K04r0p9r1p8J3K88o4J29q3PN0k93O2J82l5r8m5J15J20
$$ 119 -5 126 -69 -242 6 210 120 41 -50 -128 -115 173 109 238 155 162 212 -81 -19 163 128 30 -15 100 220
2308B20l3j03Q9j23O7n6j4K6o9J39j00m7o6M7k4O2M6Nl9j92P5N7r0K3J16M5P0
$$ 220 187 84 173 50 117 61 47 73 4 143 43 -4 -70 -23 -47 15 61 66 27 -165 -90 -33 -123 -100 16 61 131
2335A31k74K13j87Q8J54k89J74J1L4j14j7N3N3kM0l17J01K48p3p9J08k41L6K88
$$ 131 -143 70 -117 -29 125 -164 10 21 55 -59 -76 -23 30 28 68 -249 -148 100 27 -52 56 -185 -149 139
2359A39k82K3M2R7k36J39OlJ56j09j23Q5R3J74m68J65J73N4P8j18K2q2j51J50
$$ 139 -143 -120 -78 19 -217 -78 -72 -75 81 -28 -151 -66 27 201 -267 -102 71 125 203 85 107 25 -126 24
2383B4K4p0k8K11o8p8K9P3o2N2k1k7j23J32PP2k70o4K33l5J65k52O3l3J14%J20
$$ 24 48 -22 -50 161 93 15 44 117 55 107 86 59 -64 68 75 147 -123 -187 46 11 176 -76 -13 -46 68 68 188
2410A88q6j82J30P9o6j87K22j35K11j19p2j10K7J62o9J52k97M9J45k39J70n4J44
$$ 188 102 -80 50 129 63 -124 98 -37 174 55 -17 -127 -100 62 -7 145 -152 -103 42 -197 -27 -81 63
2433F3j12J1K04j35q6M2Q1k31J74n8OQ6j30J91p8qj33J14kJ0j39R6l2O1m6R4O6
$$ 63 -49 -38 166 31 -55 -13 68 -163 11 -47 -41 45 -85 106 28 20 -113 1 -1 9 -130 -34 -66 -5 -51 43 109
2460A09j99P0OP4l01J79q3L1K42k09J88l2j55r8K74Jj0K7k11lK15j01NN9j6j07
$$ 109 -90 -20 -14 60 -241 -62 -145 -114 128 -81 107 75 -80 -178 96 97 87 114 -97 -100 115 14 19 78 62 -45
2486d5p0J32P5J4o9L6p0j25K04m4J08j19O2o9R1j27N5K7j29J37j27jj29K5J31
$$ -45 -115 17 92 106 37 73 3 -122 82 38 146 27 89 20 111 -16 39 66 -63 74 -53 -54 -183 -158 -27
2511b7nR9K9l4j45Q5J77l53P9L15m24J05Q5M2r3M2K9K7l5k0L8j05J56j0r4J88
$$ -27 -32 67 96 62 -83 2 179 -174 -95 220 -204 -99 -14 28 -65 -23 6 33 -2 -22 16 -89 67 57 -37 151
2537A51k13J39o0k2j0K1o9j7K25k54M5qK03j8j9r9j05N7N2LJ7j4r1L6R3j3p0P7
$$ 151 -62 77 17 -5 -15 6 -63 -80 145 -109 -64 -72 131 113 94 -5 -110 -53 -1 2 19 5 -86 -50 43 30 -40 37
2565C7k0l4K20n0j91M3J25j57R8P3k5L9q6j13Q6j4l5L0P5K0j9j29Q3n7j91K45
$$ 37 17 -17 203 153 -38 5 130 -27 71 144 119 158 72 -41 45 31 -4 26 101 121 102 -27 56 -1 -192 53
2591E3R6j06k4j45O7nP8pJ64l12LJ09RP6n4l0L4j32K79j54L2P4j66p3l9J00o5
$$ 53 149 43 19 -126 -59 -64 14 7 171 -141 -138 -29 -20 56 2 -28 6 -126 153 -1 31 105 -61 -134 -173 -73 -138
2618a38Q4R0k21J46J29n7j94J62K7o3J40r6j2k74K30r3m0K90r6K9j00L0J01j67
$$ -138 -54 36 -185 -39 90 33 -161 1 28 -35 105 9 -3 -277 -47 -140 -180 110 14 43 -57 -27 74 -93
2642i3J60k10j7J67P1j10J09l9j01K68j62O8j06O0k36K79J57j10o9O2k32rK53
$$ -93 67 -143 -160 7 78 -32 77 38 -63 205 43 111 5 65 -171 108 265 155 86 148 -84 -93 160
2665A60j88J44j03N0p5O9M9mN9j29K7J24l4j24J16k5M1k06JK0Lk3P9J4Mk74K32
$$ 160 -28 116 13 63 -12 57 106 102 161 32 59 183 149 25 141 116 157 -49 -48 -28 -25 -48 31 45 49 -225 7
2692GOM0k8K5q1N8j08Q4J08J5J42m02O1J18j93N9Q8j3m5O5j19J48r0l6L3j9J56
$$ 7 13 53 25 50 -31 27 -81 3 111 126 268 -134 -73 45 -148 -89 -1 -14 -59 6 -113 35 -55 -91 -58 -77 79
2719G9o9k2M5M8On5J8j89J2J25J30K1j04MKj74J27l6J7K35k30L1K8j74K97r8j84
$$ 79 10 -12 33 81 87 32 50 -139 -127 -2 128 149 45 49 51 -123 4 -32 -15 220 -10 21 49 -125 172 74 -110
2746a10J33q1L2Q4L0j41KQ6o0k6J65j30k3L0O3j2n4n9N7m8L3k9r6J82Rr0k7M7
$$ -110 23 -58 -26 58 88 -53 -51 35 -25 -51 114 -16 -39 -9 54 42 -12 -71 -14 -62 -29 -58 -154 28 37 -53 -80 -33
2774c3P1Q4j80M6J00n9j83J51j64J77n2j16K32m3J4L2j52N0r3r6L29l7j42L5K7
$$ -33 38 122 -58 -12 88 29 -154 -3 -167 10 -42 -158 74 31 45 77 -75 -25 -118 -214 115 78 -64 -29 -2
2799bQ6pj91o3J52J43q9J05l4L8L3k57q0J60M0M1o6J1j08l8J36l9n5P1o6L0j39
$$ -2 84 77 -114 -177 -25 118 29 134 100 138 171 -86 -166 -6 34 75 9 20 -88 -126 10 -29 -84 -13 -79 -49 -188
2826a88J55J25j27Q9J7j37j9J90Mk30J86k54J94Nm8K5J28n0K7K2j43J53j2lM3
$$ -188 -33 92 -35 54 71 -66 -85 105 109 -121 65 -189 5 10 -38 -13 115 65 92 114 -29 124 112 109 152
2851A52l08L05l6j65o6K04j03J73j01r2o8R0n9J44j16K8M5Rj4j9J86k09q7J53
$$ 152 -156 149 113 -52 -118 86 -17 156 55 -37 -105 -15 -74 70 -46 -18 27 36 22 3 189 -20 -107 46
2875D6o8o2O9P5q5N1M1k3N1o7k5j33J85r5O8M2L8j17o5L5R2q0o4K86Q8l14J63
$$ 46 -22 -84 -15 60 -25 26 67 44 95 28 3 -130 55 -40 28 70 108 -9 -74 -39 53 -27 -91 195 283 -31 132
2902A32o6j30J12j45M7R5j32K05k24J25L3j79J16m5J9J39k13J50j13Q7N6q2K07
$$ 132 66 -64 48 -97 -50 45 -87 118 -106 19 52 -127 -11 -56 -37 102 -111 39 -74 13 69 -13 194
2925A94k07j8k3J84k11J00K2j02K10l27J09J26o4J51j15q2N3R2k24J72o0j00J91
$$ 194 -13 -31 -54 130 -81 19 41 -61 149 -178 -69 57 -7 144 29 -53 0 92 -132 40 -20 -120 71
2948G1M3q6O2l0j04J8K4K6q8M1M3q9J12k07K27k00m0Q9K6K3Q2P1k10Q2P4j12l5
$$ 71 114 28 90 60 -44 -26 -2 24 -64 -23 20 -69 43 -164 63 -137 -177 -88 -62 -39 43 114 -96 -14 60 -52 -87
2975h7PR8j22J13Kj27J40o5N5N9j5M2m4j0QL6j36J76l55J60j52J06K48k86M6J00
$$ -87 -80 18 -104 9 11 -116 24 -41 14 73 58 100 56 46 54 90 -46 130 -225 -65 -217 -111 137 -149 -103 -3
3001cO7j4J26l29J50O0k25J52K7L1j60L03j43j6j30J83k49K26J27O3k48J04j73
$$ -3 64 50 176 -153 -3 57 -168 -16 11 42 -118 185 42 26 -104 79 -170 56 183 246 -2 102 -71
3024g1K9L0k4R8MM1j49K99k57l9Q9K4j02j6Q3k6r8m3J51J45k01K1MJ11j71K06
$$ -71 -42 -12 -36 62 66 107 -42 257 0 -39 50 74 -28 -44 39 13 -85 -128 23 168 -33 -12 -8 103 -68 138
3050A38l16J23n3K09j20q4J27Q2j98j12K95k15J46O3o6l8j27M5kO7n3P9j00K02
$$ 138 -178 -55 -108 101 -19 -103 24 106 -92 -204 91 -124 22 85 19 -19 -146 -101 -103 -36 -89 -10 -110 92
3074I2L8j09j47J17M2P9j07j30J43J50j04j75K11j40n1K19q7j52o4ML01r4j40
$$ 92 130 21 -126 -9 33 112 5 -125 18 168 64 -111 100 -40 -91 128 41 -111 -175 -171 130 36 -104
3097a04J42On7j59R9L4K4J4J37j63r2K62q6k37L9K24j42j3O2%J38m9O5j28j78
$$ -104 38 44 -13 -172 -73 -39 -15 -1 136 -27 -119 143 57 -180 -141 83 -59 -72 -10 -10 128 79 144 16 -162
3122a62J84k25K63k17O7R7k9n1K15o6p7j4j1K12m4j93N2k3J77k44J05K7P6o7n3
$$ -162 22 -203 60 -157 -90 7 -22 -73 142 76 -1 -15 -26 186 142 -51 1 -22 155 -89 16 43 119 52 -1
3147am8J4Rm2L6j19L55j64j45K9o2J74L3j93k1K29K5j60N9k9j08J88j21o1Q1j57
$$ -1 -49 -35 -26 -68 -32 -151 204 40 -105 -76 -138 36 69 -124 -145 84 109 -51 8 -21 -129 59 -62 -123 -42 -199
3173a99K08o0J97k7J3j42l2R7j15P7L0j03P8j16k8l3J49l5K6P5J21k2k39J27M9
$$ -199 9 -51 146 119 132 -10 -42 55 -60 17 47 -56 22 -94 -122 -155 -6 -41 -15 60 181 159 -80 47 96
3198I6q6J1J8J12l14J17J09j55Q2K10k34M8r7J21J05l09j2O6J96j69J08M9l3o3
$$ 96 10 21 39 151 -163 -46 63 -92 -10 200 -34 14 -83 38 143 -166 -178 -112 84 -85 23 72 39 -24
3222b4%k7J38k00q5J67R6j13J23j34J15L7j18j8O3o1J32j68o1J77o2R1J14k14
$$ -24 -24 -51 87 -113 -198 -31 65 -48 75 -59 56 93 -25 -43 20 -41 91 -77 -138 39 -23 68 182 -32
3246c2j21M9R5j05J90k98J64L3N1j45J55k3N6r3Q3K8Pp7P0L8k28J23J42j69l4
$$ -32 -153 -104 -9 -114 76 -222 -58 -25 26 -119 36 13 69 -24 59 87 94 17 87 125 -103 20 162 -7 -41
3271d1p0K9J9M3kR5l1p9J12M7m7j63J75Jj02J01p3k5M6j31P0j50J94L2j11J04
$$ -41 -111 -82 -63 -20 -22 73 42 -37 75 122 75 -88 87 88 -14 87 14 -11 35 -96 -26 -176 18 50 -61 43
3297D3J33k90K49j89N1j78K53o9M2r6J16nQ9j67m7M7j37M8K08r2J7K8j3q1P5L0
$$ 43 176 -114 135 -54 -3 -181 72 3 45 -51 65 60 149 -18 -65 -18 -155 -107 101 9 26 54 41 -40 35 65
3323F5j06R4r9p4J26m3p5J66l9m5k11J61L4J44rJ55q9k76M1J21q3M6M0N2N7k52
$$ 65 -41 53 -46 -120 6 -37 -112 54 15 -30 -241 -80 -46 98 89 244 155 -121 -80 41 -42 4 44 96 153 -99
3349i9J90j94J7Q2N1j24K07k58J10J34k02P3J18k1p1n2J50l3q1J2L5J38k79J72
$$ -99 91 -103 -86 -4 47 -77 130 -128 -18 116 -86 -13 105 84 13 -39 111 78 -3 9 44 182 -97 75
3373G5J3l02m5K57OJ08k34K29k24J3L6m7M0N0K51l34l1N3K58j13k06J58j0K33
$$ 75 88 -214 -259 -2 4 112 -122 107 -117 -104 -68 -115 -75 -25 226 -108 -139 -86 172 59 -147 11 1 234
3397B34k80N1q5M6R0P9k1j49pp1L21j47j98L8J11N9j8n1rj28J56K7k9K3j03L3
$$ 234 -46 5 -80 -34 56 135 114 -35 -42 -113 208 61 -137 -99 12 71 53 2 -7 -135 21 48 19 42 -61 -28
3423b8K1O1q2j34L10J7j14O2j7j23J04q1o5m2J40pj5L3m0o3R8j18K05r2J05p1
$$ -28 -7 54 -28 -162 148 165 51 113 96 -27 77 -4 -69 -111 29 22 7 40 0 -63 35 -83 122 30 135 64
3449F4lK5J7j93P0Q7J09k81M8K32p7k7j17J70k20K7J64j44k7ML5NJ10k3kj50N
$$ 64 61 86 103 -90 -20 67 176 -105 -57 175 98 71 -46 124 -96 -69 95 -49 -76 -72 -37 -32 78 55 53 -97 -92
3476i2N8O7QJ05k25K08k34J14o3J32l5J05j20M9j04pJ23q3QrJ3rj96J70M2L6j52
$$ -92 -34 33 41 146 -79 129 -105 9 -54 78 43 148 28 77 -27 -34 89 6 14 5 18 9 -187 -17 25 61 -91
3503i1K68j10r2J16j80p8K57q9K0QJ35m9k31J23K5O8j89K50k92N5k0K32j12M8
$$ -91 177 67 -25 91 -89 -167 90 1 21 29 164 115 -116 7 32 100 -89 161 -131 -76 -96 136 24 72
3527G2J8J6m0j07J15m6j09O0M5o7K95k83N0l8k0J14j05j07K16p5J09j06J23r7
$$ 72 90 106 66 -41 74 28 -81 -21 24 -43 252 -31 19 -19 -39 75 -30 -137 79 4 113 7 130 33
3551C3m5K8n3J8L8N2k4J00o5m6l5J3p7J90k24n6K55k9r5N7m7l0kQ8n0P3j60J65
$$ 33 -12 16 -37 -19 19 71 47 147 82 36 1 14 -63 127 -97 -153 102 73 -22 35 -12 -42 -44 44 -6 67 -93 72
3579G2l1n4J31j2q1j7mk2R2K0M4j26L2j92J48n6J40k7j11J22r8J34r6J5J02q1
$$ 72 41 -13 118 106 25 8 4 -18 74 94 138 12 44 -148 0 -56 84 57 -54 68 -30 104 8 23 125 44
3605D4l0pj99L07k95J68R6p0J68j15p0p5J7J27l6k32J64n5Q6P4l9j4j59j8K8M7
$$ 44 14 7 -192 115 -180 -12 84 14 182 67 -3 -78 -61 66 30 -202 -38 -93 -7 67 28 14 -145 -163 -135 -88
3631h8%P6L5j9j95K69k53J39PJ09j00M3n8j79Q5l1J32j8J1J22j13K7n2m1J27O0
$$ -88 -88 -12 23 4 -191 78 -175 -36 -29 80 -20 23 -35 -214 -129 -160 -28 -46 -35 87 -26 1 -51 -92 35 95
3657I5k64J28k1J61r3M1M6j69J63j30P1q3J03j68K4J02N7j27p8N4P2NO1klL5n1
$$ 95 -169 -41 -62 99 6 47 93 -76 87 -43 28 -55 48 -120 -96 6 63 -64 -142 -88 -16 -11 50 48 45 80 29
3684B9N9j74K4j28Q0K36j34m8J18p7J60q7r4J74j77mL0L2j48J64LMr7J28r2J2
$$ 29 88 -86 -62 -190 -110 126 -8 -56 62 -15 145 58 -36 138 -39 -43 -13 19 -129 35 38 42 -55 73 -19 -7
3710gk34K55J29M3j03j10J30J4n5%l5j04K64l68K02M9n3J27k31N9N1j18K49j83
$$ -7 -241 14 143 186 83 -27 103 117 62 62 27 -77 187 -181 21 70 17 144 -87 -28 23 -95 154 -29
3734b9K2j7J2L9j18lJ61j20L35k52N3r4M2l5%Mj11P6K2K1p1J03j07N%j5RM8j9
$$ -29 -7 -24 -12 27 -91 -94 67 -53 282 30 83 -11 31 -4 -4 0 -111 -35 -13 8 -63 40 -67 -62 -62 -77 -68 -20 -39
3763c9J06j15J09k60J76m4J5L16k93J49k29J18J3om8k7K82k40qj7J14j95J98K2
$$ -39 67 -48 61 -199 -23 -67 -52 264 -29 120 -109 9 22 16 -32 -59 223 -17 -25 -42 72 -123 75 97
3787I7k37R9n0R0K0k2J76j82Q3P6r7O3j53N2o6J17j50L8oO5R9j73J24jq4J03j92
$$ 97 -140 -41 -91 -1 19 -3 173 -9 74 150 53 116 -37 15 -51 66 -84 -46 -52 13 112 -61 63 62 -22 81 -111
3814a11J39k9j11L40k91Q4p5P3N0p3j18J66o4K3j5K04l71K32m0o0J18j03j56n0
$$ -111 28 -1 -112 228 -63 21 -54 19 69 -4 -122 44 -20 3 -12 192 -179 53 13 -47 71 -32 -188 -238
3838b38J68L7J06rj80J86M9k4o3r3J28j22J62J9j04j4N5k4j23J42R7j96j38J85
$$ -238 -70 -33 73 64 -116 70 119 95 32 -61 67 -55 107 126 22 8 63 39 -84 58 155 -41 -179 6
3862Fj31J7P0L4P2r8L6Oj58K09j14J05m8j21J02N6M2o5l7ll5OJ20p1nj60J03J03
$$ 6 -125 -108 -38 -4 68 -30 6 12 -146 63 -51 54 6 -115 -13 43 85 20 -17 -20 -55 -49 71 0 -5 -165 -62 41
3890D1JN6m6R8O7l13J95o7l9L2J1o9N8n2R7q4k0R1q0J47j36q7j9Q4M6Q5k04J33
$$ 41 42 98 52 150 217 -96 99 32 -7 25 36 -33 25 -27 70 -14 -34 57 -23 124 -12 -99 -118 -34 12 97 -107 26
3918B6r5n1K71k26M8q6K6K35p2K1j0j66m5J31o1k0P3j2L8J29l14J20K7J01J6l04
$$ 26 -69 -120 151 -75 -27 -113 -87 148 76 97 87 -79 -124 7 -54 -74 -1 -13 25 154 -160 -40 -13 88 104 -200
3944b00M12j86JL0k4J36j64m8J07q1Q5j6N5j21L7K2k07J12n1J77j43J51j45Q4
$$ -200 212 26 27 57 33 169 5 -43 64 -17 68 52 107 -14 23 45 -162 -50 -101 76 -67 84 -61 23
3968B3N9q6j11P3j70J60j5OM8K2J1j1j42R2k5L4j8L0R2O9j28K1j18J8P6J21j23
$$ 23 82 -4 -115 -42 -212 -52 -67 -61 -13 9 20 9 -133 -41 -66 -32 -50 -20 72 141 13 34 -84 -66 10 131 8
3995Hn1j0p2L28n6o0r7j57J03J50Kj44K77k50J78j36J6j76J64L9m1r9J9Qk9J15
$$ 8 -43 -53 -125 203 147 87 -10 -167 -64 86 88 -56 221 -29 149 13 29 -147 17 56 15 -84 -65 -57 -86 29
4021B9o3m2K4oO2n5J11p9J44k11j17P6N5K57k85J17j22J05Q6k51J79j53N2NKJ21
$$ 29 -34 -76 -52 -58 4 -51 60 -19 125 -86 -203 -127 -72 185 -100 17 -105 0 86 -165 14 -139 -87 -82 -80 41
4047D1lj84J49L2j49j6N6R3q0O1Q4r2m6p4J47p5j33J34ok2O1P8j2l7K4J92j08
$$ 41 38 -146 3 35 -114 -130 -74 19 -61 0 84 -8 -54 -128 19 -56 -189 -55 -61 -83 -22 56 44 7 31 223 115
4074A15j37K7n4J45k26K5K18k52J3L07k40J57m8R3q3j08P8l7O6j28J88q1J8N7
$$ 115 -22 5 -49 96 -130 -105 113 -139 -126 181 -59 98 50 143 60 -48 30 -7 59 -69 119 38 56 113
4098A13j27Q9k23qO1lK60j78M9n4L1J29j60M6n7J28j15k5J28r6r3K5R8j19j6J17
$$ 113 -14 75 -148 -156 -95 -98 162 -16 33 -21 10 139 -21 25 -32 96 -19 -44 84 -12 -105 -80 18 -101 -117 0
4124@o0K7R3l5p0P2p8J96J1j05J5j09J55r7K7r9J36m5O6m5j76J35j34K53j84Q3
$$ 0 -60 -33 60 25 -45 27 -51 145 156 51 66 -43 112 15 42 -57 79 34 100 55 -121 14 -120 133 -51 32
4150C2M2k67K97o9j25J53j75J63p4K8j10P2R7jj63J28l7p4K62j62q0P5O2q0q7
$$ 32 74 -193 104 35 -90 63 -112 51 -23 5 -105 -33 64 63 -100 28 -9 -83 179 17 -63 12 74 -6 -93
4175i3L9J23j21R5j03L0R2j81K00Rk49J22j86K88L1j17m5J01k10K25j1P7j14n9
$$ -93 -54 69 -52 43 -60 -30 62 -119 81 90 -159 -37 -223 65 96 -21 -66 35 -175 50 39 116 2 -57
4199e7P8J8q5j11J88O7l23J42K27m8r5r9K60k07n7J5LJ66J9m6j25q1J38J32j3
$$ -57 21 39 -46 -157 31 98 -225 -83 144 96 1 -98 162 -45 -102 -87 -84 82 101 55 -70 -151 -13 119 106
4224A06k34J84j08K2J31q7K23j77o2J96k48k6J15j31K9j2J35j7Q6k01n3k4K67
$$ 106 -128 56 -52 -30 101 14 237 60 -2 194 -54 -80 35 -96 -67 -79 56 39 125 -76 -129 -153 114
4247A14M6k6j32n5J07m0K5M2j00Lk8N6P6k15J48p6L8p6J54k22J80Qj89J56JP5
$$ 114 160 134 2 -53 54 14 39 81 -19 -16 -44 12 88 -127 21 -55 -17 -93 61 -161 19 27 -162 -6 -5 70
4273G0j93P3m5n3J29N9j25J3J19O7j2j80Q5q9J41k5m2j21K16M6k96K77j51j07
$$ 70 -123 -50 -95 -148 -19 40 -85 -72 47 114 102 -78 7 -82 59 34 -8 -129 87 133 -163 114 -37 -144
4297a44R7J05k56J54n7L3J30N8j21J84k20O3J8m9O3j1q9J2L9j13J75k1Qk19J98
$$ -144 -47 58 -198 -44 -101 -68 62 120 -1 183 -37 26 44 -5 58 47 -42 -30 9 -104 71 50 58 -161 37
4322C7J0qP7lj38P5K7j27J65j20j20J02J01lj02k3Rl2J40j63M3J70j54k1J13j33
$$ 37 47 39 116 113 -25 50 77 -50 115 -5 -125 -23 78 75 -27 -50 -41 -73 67 -96 -53 117 -37 -58 55 -78
4348g8o5K37L2j03j7N7r4Mj28J05J08N4l37K77k4o5J08k08K06q1l7m4j6J67P1
$$ -78 -143 94 126 23 6 63 -31 -27 -155 -50 58 112 -225 52 28 -37 71 -137 69 -12 -49 -93 -109 58 129
4373A29j30j18J42o5L8M9k8m5j33R1j83K23L2n4n0M9kO0j70J85n8O6o2Q4j40K
$$ 129 -1 -119 23 -42 -4 45 17 -28 -161 -70 -253 -30 2 -52 -102 -53 -55 5 -165 20 -38 28 -34 50 -90 -88
4399h8L04m7j36j2n7K2J33p4j17K45k19J38k35Q2q3K54k76L27j44J25j26N3j09
$$ -88 216 169 33 21 -36 -14 119 45 -72 173 -46 92 -143 -61 -144 110 -166 161 17 142 16 69 -40
4422d0r4m2J27qL9j37M7J06%r7J35j60P4J32k05J29J16n3J4J13k16L6k0J44j32
$$ -40 -134 -176 -49 -57 -18 -155 -108 -2 -2 -99 36 -124 -50 82 -123 6 122 69 83 196 -20 16 -4 140 8
4447HL2l4m2R9m8R9p5J03l2Pj78k5K3R4j07P4O7j08K4k2p6K18j71OJ25j72M4J5
$$ 8 40 6 -36 63 15 114 39 142 110 117 -61 -86 -63 31 -76 -2 65 -43 -19 -41 -117 101 -70 -64 61 -111 -67 -52
4475e2M4p1J35j43j2J4K54j74l9J74j21n8K1O9M6p4J14q4N5j31K3O6P3k3m9k39
$$ -52 -8 -79 56 -87 -99 -85 169 -5 -44 130 9 -49 -28 41 87 13 127 43 98 -33 -10 56 129 106 57 -182
4501a82L12O7l88J49J9N7j43K17p1j9K3j02M1j03J66Jo5J47J1k84J15o8M7J47
$$ -182 130 197 -191 -42 -23 34 -109 108 37 18 41 -61 -20 -123 43 44 -21 126 137 -147 -32 -100 -53 94
4525I4n2k06J39j53K07p6n2J98j84N6j42J52rL6k15K06Rj52K17q6n6J74j08P8
$$ 94 42 -164 -25 -178 29 -47 -99 99 -85 -29 -171 -19 -28 8 -207 -1 8 -144 73 -13 -69 105 -3 75
4549G5k34J29Ml3J71j12J05j50MJ08j43J99j98k6N2M6p9l7J70l5J44j41O9j12
$$ 75 -159 -30 -26 -59 112 0 105 -45 -41 67 -76 123 -75 -101 -49 -3 -82 -119 51 16 160 19 88 -24
4573b4N0j74K17m4qJ65j62j5R1j86n5J30J6j0j03J88j53J68l0j86K73k55K54j42
$$ -24 26 -148 69 25 17 182 20 5 96 -90 -145 -15 1 -9 -112 76 -77 91 61 -125 148 -107 147 5
4597EJ12Mk40N5K3M5m2O0K3j80QJ65k51J88J2q7J13j22J6R0j67J33M7J31k74J27
$$ 5 117 121 -119 -64 -41 4 -38 22 45 -135 -127 38 -213 -25 -13 -100 13 -109 -93 -3 -170 -37 10 141 -133 -6
4623fJ05j37J27j71M4M1K5o4J39j7n1j09%J41p8J20N6l60J77j89K23L7q7J97k65
$$ -6 99 -38 89 -82 -38 3 28 -36 103 86 35 -74 -74 67 -11 109 165 -195 -18 -207 16 53 -34 163 -102
4648a02K66q1j23Pj27l3K69k02R8J7L5J60k03j13N8J0L8O6j3r0l5Q2J02j65J76
$$ -102 164 83 -40 -33 -160 -193 76 -126 -28 -11 24 184 -19 -132 -74 -64 -26 40 27 -63 -98 -16 86 -79 97
4673I7r1k36J72q0K29J6j92K23o9K0k9J8j91N5J65k38K0J79j71K00k8M3j42QM2
$$ 97 6 -230 -58 -138 91 107 -85 138 69 89 60 78 -113 -58 107 -131 -111 68 -103 97 69 112 -30 -22 20
4698B0O4j03R0n6r6L3J9J35j03l3P3k53J29O6J8o5R9r9K45k04j05K82j40N0J50
$$ 20 84 -19 71 15 -81 -48 -29 106 3 -30 43 -210 -81 -15 3 -62 37 -62 183 -21 -126 156 16 66 216
4723B16k76M2L2qJ9m6J44k2L7j9k8r6P9l5Q7l5k90K44n4J06r6M7j79k3K20q3M
$$ 216 -60 -18 14 6 25 -21 123 101 138 119 91 -5 74 39 126 91 -199 45 -9 97 1 48 -131 -154 66 -17 -13
4750a3J23Q1l50J20M3M6QlN3j47m8J09J0J65K7j72j71M4J20J92l43rJ71r8L5p6
$$ -13 110 191 -159 -39 4 50 58 55 108 -39 -87 22 32 197 224 52 -119 -75 45 237 -106 -115 56 -42 -7 -83
4776h3K41j55K26k71j83K56j03J21j86K13l21K96o3Pq7L8J37J11k40o0R7j25k6
$$ -83 158 3 229 -42 -225 31 -72 49 -137 76 -245 51 -12 -5 -92 -54 83 194 -46 -106 -9 -134 -160
4799a60J20J41j48Q3J07j29J02k04K7k2J63J3j18j08J37K6M1M1p6k6O9K8l01K73
$$ -160 -40 101 -47 36 143 14 116 -88 -61 -83 80 93 -25 -133 4 30 71 112 36 10 79 107 -194 79
4823G9m2j09R0J35n1o3j02l1O6L5P6mr3J79j36p0Q2n6j16j2J11l2L0j2K15k88
$$ 79 37 -72 18 153 102 39 -63 -94 -28 7 83 79 -14 165 29 -41 41 -15 -131 -143 -32 -64 -34 -46 169 -119
4849a19J79j33K8L1J4q3J76k9m5j16P2J06j39J04j06K0j00J56K8j27J01J26J6
$$ -119 60 -73 -45 -14 0 -83 93 64 19 -97 -25 81 -58 46 -60 -40 -140 16 44 -83 18 144 160
4872A60k08P4j3L2K2k48K88M1n6K2p7K17k37l9n1Q3J5Q9M3j40m9J72k48K1J8o0
$$ 160 -48 26 13 45 67 -181 107 148 92 114 37 254 17 -22 -73 10 25 114 157 17 -32 140 -108 -87 -69 -129
4898a29QJ37m5K16m3j04O2k75M9J13O3n4l8J06j60n3O0K24k86K05r7k4j73J96
$$ -129 -121 16 -29 187 144 40 102 -173 -124 -11 52 -2 -40 66 -94 -147 -87 137 -149 56 -41 -65 -238 -42
4922d2J51j86j21N5K20j1j2j99M1l7J94j07n3J31RJ0j96J79J06M1k30Q3N6M2l2
$$ -42 109 -77 -198 -143 77 66 54 -145 -104 -141 53 -54 -107 24 33 43 -153 26 132 173 -57 26 82 124 92
4947I2q0k9N6q6M3n2lM5N1j5J3N0p3J6J26j42rJ04j69J06J10j02rk30J88j12R9
$$ 92 12 -17 39 -47 -4 -56 -59 -14 37 22 35 85 12 28 154 12 3 107 -62 44 154 52 43 -187 1 -111 -12
4974a2l9K66j66j4P7q3k8j0q8LJ46o3K7o1k5K80k79k1M3oJ9n3J76QJ5j83N0J95
$$ -12 -51 215 49 35 112 29 1 -9 -97 -94 52 -11 16 -45 -70 210 -69 -90 -47 -53 -34 -87 89 97 112 -71 -21 174
5002A74k11j69K26O2k5m9mj54J27K7L8O9j95j4P6m7Jj7N3O8m2m7O5j38pJ96L7
$$ 174 -37 -206 20 82 57 8 4 -150 -23 4 42 111 -84 -98 -22 -69 -68 -85 -32 36 -6 -53 12 -126 -133 63 100
5029A00q0j24O1J80p2P1M7l09j6J61P7j01OO4j80O6L07k28k4Jk36K61J10j72q2
$$ 100 20 -104 -43 137 65 136 183 -126 -142 19 96 -5 1 65 -115 -49 258 30 6 7 -229 32 142 -30 -112
5054a12J81N5j51O6j39J75k7L7j09N9KK0j98J18L4J01j65R5J4Jj80L4j1J38l2
$$ -112 69 124 -27 39 -100 75 48 85 -24 35 37 57 -141 -23 11 112 -53 42 56 57 -123 -89 -100 38 6
5079Fj54J64n9P2j35J85r9J3J50k8j20J07j00K6l3M7j02l0J97m9l3j57J08J12
$$ 6 -148 16 -43 29 -106 79 -20 -7 143 115 -5 102 2 28 -5 42 -60 -90 107 58 25 -132 -24 88
5103H8J6j32k1j3O3K2r8M5J96j46O2K9k54J7K1J97R6J5l70J61m7p9K73j73K9O9
$$ 88 104 -28 -49 -62 1 23 -75 -30 166 20 82 111 -143 -126 -105 92 188 203 -167 -6 -53 -132 141 -32 -3 66
5129F6k58K47r0J08n4l6J98j03l0Rj42J29p1L4k58M05k50j97J88K26m9k81J98
$$ 66 -192 55 -35 73 19 -17 181 78 48 57 -85 44 -27 7 -251 154 -96 -293 -105 121 72 -209 -11
5152a1j00J61N8j27o9P1j28J15J03j34mK05k28M7K2j1K4NO5j73NK00k30P8j9P3
$$ -11 -111 50 108 -19 -88 -17 -145 -30 73 -61 -65 140 -88 -41 -19 -30 -6 -1 64 -109 -104 96 -134 -56 -75 -2
5178bK6J12j50r2K50m1J32l32J49k8oJ08j03J06p5j39M3J7k4J32n5n9m5J21j52
$$ -2 24 136 -14 -106 144 103 235 -97 52 24 18 126 23 129 54 -85 -42 -25 -49 83 28 -31 -76 45 -107
5203a07J61m7Rj5J47r9k78J80L5J50j56K0J11r3J76k71K48l3j27j0r2J06M4r7
$$ -107 54 7 16 1 148 49 -229 -49 -14 136 -20 0 111 18 194 -77 171 138 11 1 -91 15 59 -38
5227c8O4q8J07K8n9n9J45L8k28O8j13K02o4K57k14lJ38k90K18q9j6m8L5J8O0k10
$$ -38 26 -62 45 73 14 -45 100 138 -90 -22 -135 67 3 260 46 43 181 -109 109 20 4 -44 -9 9 69 -141
5253a41N6K9P8j88K13O4J33j22j16j07L33r8n4J36l15N0J28J1M3r0j5R2p5J22
$$ -141 -85 -56 22 -166 47 111 244 122 6 -101 232 134 80 216 -99 -49 79 90 133 43 28 120 45 167
5277A67o6N7j39k61L6K63M4j34qj30K0J82O5j28J60m5j51K46n7k14J77j69L9J55
$$ 167 101 158 19 -242 -206 57 101 -33 -41 -171 -151 31 96 -32 128 83 -68 178 121 -93 84 -85 -46 109
5301A09k55M1J06j5r1P3O6L1p7J6P5l1pj65J69M3m6k17K33N7Mj80J11j92K04O5
$$ 109 -146 -105 1 -14 -105 -32 34 65 -12 4 79 48 41 -124 45 88 42 -175 58 115 119 -61 50 -142 62 127
5327A27l7r4j02Q1M9l9K58k44O8l3j2N9j24J39Pj98m6K58j21j63K19J64l25J25
$$ 127 90 -4 -106 -25 24 -15 243 -1 67 34 22 81 -43 96 103 -95 -141 117 -4 -167 52 216 -109 16
5351A6k5K6O4q3J23j31l7O7j93K71j38J7J46jk45J57l2j78J62k3P9j76J77o7r
$$ 16 -9 17 81 -2 121 -10 -47 20 -173 98 -40 -23 123 122 -123 34 2 -176 -14 -37 42 -134 43 -24 -33
5376c3J5N3m3j32J67l9J10m3j60J11N2j45K5j76O0K62n9m5R7K7m6NJ2L4n2p4N0
$$ -33 -18 35 -8 -140 27 -12 98 55 -105 6 58 -87 -62 -238 -178 84 25 -20 77 104 58 63 75 109 57 -17 33
5403C3O7j04J18k23J25Jj69P7N9J07k45J87j38J97m2M0m0j07L8K8L7k5J46j05
$$ 33 100 -4 114 -109 16 17 -152 -75 -16 91 -154 33 -105 92 50 90 50 -57 -19 9 46 21 167 62
5427F2m3p9Q1N7j67P4jln9J0N2kJ07m2j34J23l7k0L5j79N1J58r0J68O0k85P6n
$$ 62 19 -60 21 78 -89 -15 -16 -19 -78 -68 -16 -18 89 47 -87 36 -1 -21 14 -165 -114 44 -46 122 182 -103 -27 -32
5455c2J74j69J50k89J66J00J16l41Q3kO7O4m7k10J94j22N9K9K8n1Np9Q3J19R3
$$ -32 142 -27 123 -166 0 100 216 -125 -42 -44 23 87 40 -170 24 -98 -39 -10 18 -33 -28 -107 -24 95 188
5480A88p5j65K36j4k4k02K23k42J96j45O0Q9m6J5k11P0lJ38p7R6n2k11Q3Q7j27
$$ 188 113 -52 184 170 146 -56 167 -75 121 -24 36 125 79 94 -117 -47 -50 88 11 107 55 -156 -73 14 -113
5505a13J37j72J03R6n1j6Q7J22l37R1L8N3J13j39j87P9J45k7j21JJ05j05K13m6
$$ -113 24 -148 -45 51 0 -16 71 193 -144 -53 -15 38 151 12 -175 -96 49 22 -99 -98 7 -98 115 69
5529F9l2j1K7m6k0l1n6k1PO6J78j22%m5O0M7k42M8K26rj0n4j9j06R5j16N6M4J
$$ 69 37 26 53 7 -13 -44 -100 -121 -114 -48 130 8 8 -37 23 70 -172 -124 102 93 83 29 10 -96 -1 -117 -61 -17 -16
5558a6nK10k52J3qm4Q5K20j03j12KRj5K3J2m3R9j12L5n9O2Q7J28k88M7k05K55
$$ -16 -21 189 -63 -50 -58 -102 -17 203 100 -12 -10 -1 -16 7 19 -24 75 -37 -2 -61 1 88 216 -72 -25 -230 25
5585B5j35O9J50k29Q7J6m5NKJ24m8m2l4N8M4J33j79r5J54jj6M2J1l0j53J61p9
$$ 25 -110 -41 109 -120 -33 -17 -62 -57 -55 69 21 -21 -55 3 47 180 1 -94 60 59 43 85 96 66 -87 74 -5
5612eN8n1N4j39O1K46o9k62Q8n6J73nn0L4J8r0j03P2P1P8o9N7m9o8K53k51o5r
$$ -5 53 2 56 -83 -22 224 155 -107 -19 -75 98 93 43 77 95 5 -98 -26 45 123 54 111 62 -6 247 -4 -69 -78
5640g8N3k9J85l2m6l6p9k7N2P9j03n2O2J13j66J64j71J64j2j10R4P8k06P8L8r
$$ -78 -25 -54 131 99 53 17 -62 -89 -37 42 -61 -113 -51 62 -104 60 -111 53 41 -69 25 103 -103 -25 13 4
5666Dk33J88J44m7J2m6j07J04M6j57J39R2o0Q0j61N2J9k06K03L2%p6j6M8j9J53
$$ 4 -229 -41 103 56 68 22 -85 19 65 -92 47 139 79 159 -2 50 69 -137 66 98 98 22 6 54 35 188
5692A88k19J97j74J05n6L8n4j86R3r1R8R2m6j23j7L96j91Q4j71L1j01M1P6rQ7
$$ 188 -31 166 -8 97 41 79 25 -161 -68 -159 -61 31 -15 -138 -155 241 50 134 -37 -6 -107 -66 10 1 88
5717H8J0j37J00k9j34J50N8k59O2J23J37o5j53p3J83j7J39j50j07J53j46J58j16
$$ 88 98 -39 61 32 -102 48 106 -153 -91 32 169 104 -49 -122 61 44 183 33 -74 79 -67 91 -25
5740b5K45k22Om9k5K13k1j48Q3J5j12K22j71P1l7Q0j90K8O5p5j75J27K33j94M2
$$ -25 220 -2 4 -45 -70 143 122 -26 57 72 -40 182 11 82 45 125 -65 -37 28 -47 -222 -95 138 -56 -14
5765a4Lk2N0O9j42J64o7o5J47j38L2K0K0m6K5o3Q3n3qr2K0K25j64J08Lj24m6m1
$$ -14 -11 -33 17 86 -56 108 41 -24 123 -15 17 37 57 11 36 -27 56 3 -5 -97 -77 148 -16 92 95 -29 -75 -116
5793a16R3J27j38j59J57K27j59Mm9N9j20M8j9m7J09kp6K2lJ8o6J69K3k63J47N0
$$ -116 -23 104 -34 -193 -36 191 32 36 -13 46 -74 -26 -45 -92 17 15 -61 -39 -42 -24 -90 79 102 -161 -14 36
5819C6J12j87p6J63j51K37k0Q6k21nJ4Q9Rn9j66J96J2o4RR6Lj6k63N0K01m0K3
$$ 36 148 -39 -115 48 -103 134 114 200 -21 -26 -12 77 86 27 -139 57 69 5 14 110 113 97 -166 -116 85 45 68
5846F8j28N1m5qJ19J9Lm5J4jK25l31N6l3r2M3J89o7j5k0j3N8j90K16j00N1Pm0
$$ 68 -60 -9 -54 -62 57 76 79 34 48 47 272 -59 -3 -36 -128 -85 104 37 22 2 -11 47 -143 73 -27 24 31 -9
5874iJ43k23Nj6k0K39m0L0j40J34j2j96J71j84J48R0j03j9M2j84J35mn4m6P8J99
$$ -9 134 -89 -84 -100 -120 119 79 109 -31 103 91 -105 66 -118 30 120 17 -2 40 -144 -9 -13 -67 -113 -35 164
5900A64r9L0j72O1L5j75J05P5l2J55j68K3J21j09r8K09k02K5J35j94J77j17N1
$$ 164 65 95 -77 -16 19 -156 -51 24 -8 147 -21 2 123 14 -84 125 -77 -52 83 -111 66 -51 0
5923@N0L9l8j66K90k11l0L7nJ8K07l03J03M7p1P2n5%N3l4K6q6j13L40j43k40K61
$$ 0 50 89 51 -115 175 -36 -66 -29 -34 -16 191 -112 -9 38 -33 39 -16 -16 37 3 29 -57 -170 170 27 -213 48
5950D8O1j58J43O3j80J58k19R4L2jOj06N6m7n4L1K2P3Q0j29K7n2k2K11l6j13q0
$$ 48 109 -49 94 157 -23 135 -84 10 42 41 47 -59 -3 -50 -104 -73 -51 22 102 -27 0 -52 -74 137 101 -12 -92
5977i2J79l2j01J49q0n4J66k04P4R8J0o5k9J41k49J50k9n7j2n4J86j85P2M6j16
$$ -92 87 55 -46 103 23 -31 135 -69 5 103 113 48 19 160 -89 61 32 -25 -37 -91 95 -90 -18 28 -88
6002h8j1J42j44J86l7L9Nn4O2o8J06l16J13R8N4p3R5k27L25q0n9J38k36q1R0q3
$$ -88 -99 43 -101 85 48 87 92 38 100 32 138 -178 -65 33 87 14 109 -118 207 127 68 206 -30 -111 -21 -104
6028a04%M6M7O0j77K2L7o3J79p0j9L3n8k0O2O4O2r8K6K2j72p7QK22p9Q3l4o5J44
$$ -104 -104 -58 -11 49 -128 -106 -69 -132 47 -23 -42 -9 -67 -87 -25 39 101 3 29 51 -121 -198 -190 32 -47 36 2 -63 81
6057H1j5m4p5N5P3j06J62j19k4K4l3l3O6J15j24j6m0p0J83M3k02k6P0J54k08J70
$$ 81 66 22 -53 2 75 -31 131 12 -12 12 -21 -54 12 127 3 -13 -53 -123 60 103 -99 -125 -55 99 -109 61
6083F1k9j06m8q0J84J70q8j56K61j17k2l8j25K72p0n3kJ6m8N2Nj25n0P6P7j1j80
$$ 61 32 -74 -122 -202 -18 152 64 -92 169 52 30 -8 -133 139 69 16 14 30 -18 34 39 -86 -136 -60 17 6 -174
6110a74L05j02O2j12J41q9k3K6j10J99o2j20RrJ37Kj68J39N5j95R0n1K6k8O1J8
$$ -174 131 29 91 -21 120 31 8 34 -76 123 61 -59 -50 -59 78 80 -88 51 106 -89 1 -50 -24 -52 9 27
6136B7rOj69K29j11j44J48Q3o5K1q3R2N1k6l3k5J0l7J29j65J45k8o6j54P4J09
$$ 27 18 24 -145 84 -27 -171 -23 60 -5 16 -67 25 76 50 17 -8 2 -35 94 -71 74 46 -20 -174 -100 9
6162IJ6J5k71K15L1K4L6O5m8j26J5q8M7J6J42k06m7J99j34m7N1K2J23J29n3k87
$$ 9 25 40 -231 -16 15 39 75 140 92 -34 -19 -107 -60 -44 98 -108 -155 44 -90 -137 -86 -64 59 188 135 -152
6188a52R8l1J37J9k9qQo6j8J19q6M3O9k37J08J0j21J74J74l03L8j12K47R7k40
$$ -152 -54 -85 52 71 42 34 42 -24 -42 77 -9 34 103 -134 -26 -16 -137 37 211 -92 -54 -166 81 178 -62
6213f2J87m09J74N2Kk4k0K59j05J02k52R6M5l0p6J73J55k39P0k09QK87n5q4L3
$$ -62 125 -284 -110 -58 -56 -80 -100 159 54 156 -96 0 45 15 -61 112 267 28 98 -111 -103 184 129 45 78
6238G8Kj55k1K73m7p1k4K8j17L1MO5L1j6j8k1j31m5J14J39q9j59J28o1j0R8j48
$$ 78 80 -75 -96 177 130 59 35 63 -54 -23 -19 46 77 61 43 22 -109 -154 -40 99 10 -149 -21 -82 -92 6 -142
6265a42K5K29p0k08K86j28J07Q9k9k64k8J39n0L0o9J3O7K5j61K11j32K5J84j46
$$ -142 -117 112 42 -166 120 -8 99 188 159 -105 -133 6 -44 -14 -83 -70 -3 22 -139 72 -60 -35 149 3
6289CP1j00P3j72K15j12j3P3n1N0Pp3K2J02L6j11j04J85j41J38j02J76j71n7R1
$$ 3 74 -26 47 -125 90 -22 -35 38 -13 37 44 -29 -7 95 131 20 -84 101 -40 98 -4 172 1 -56 35
6314C5J76j12r5j10L5N5J9p3n9N0k9L14k25O3M2m2O9q3J16m2q2o5J43o4o7n5O2
$$ 35 211 99 4 -106 -71 -16 3 -70 -129 -79 -108 206 -19 44 86 44 113 30 146 104 22 -43 100 36 -31 -86 -24
6341b4J31k01K45j66L4l3N4n1P5j93J03J08j03q7L9p5K13mk5Q8Pj20r1M1J39o4
$$ -24 107 -94 151 -15 19 -14 40 -11 64 -129 -26 82 -21 -108 -69 -144 69 65 40 128 135 15 -76 -35 104 40
6367D0M1m6K0k87L69M4k95P1P8o3j35L31j92R5l0k9J7j3J05l5j64M3L9j56J83
$$ 40 81 35 55 -232 137 181 -114 -43 35 -28 -163 168 -24 71 41 12 29 16 121 86 -78 -35 4 -152 31
6392C1P1k45J16m0K70j63R2j21o9QQ7k49K86j66O6N5p6J25j94J30j33O5L2j2J25
$$ 31 102 -143 -27 -67 203 40 132 11 -58 -50 37 -212 74 -92 -26 29 -47 78 -116 14 -119 -54 -22 -34 91
6417I1n8j46K06l52K99j33R6R9m3j00m5K6J3M7j31q9K27M0k14K32n9J05J1k29
$$ 91 33 -113 93 -259 40 -93 3 102 59 -41 -86 -60 -47 0 -131 -220 7 47 -167 65 6 111 122 -107
6441a07M6K7R3q1j19K50j23k6J8k2Q9klR0k56R2m3n1J22J01j14J31q7K25l04q
$$ -107 -61 -34 59 -22 -141 109 -14 -40 -22 -44 45 43 40 130 -126 -34 -77 -128 -6 95 -19 112 25 250 -54 -62
6467f2j20J43J2P7N8j38J08j43M8pJ1n8P7kj18L3J67l6k3r0Q6o1J61q6n5p5J10
$$ -62 -182 -39 -27 50 108 -30 78 -65 -17 -24 -13 -71 6 4 -114 -81 86 50 27 -63 23 -38 123 37 -18 -93 17
6494A7q6q8O2J07p6k03J46K32k27m9J46p3K63r6l9J0j7j65K24Pn5j15J60j29K36
$$ 17 -69 -157 -95 12 -64 -267 -121 111 -116 -165 -19 -92 171 75 36 46 29 -136 88 95 40 -75 85 -44 192
6519A92l1j48j76K02O8j69J24j89k0Q8J27Lj40J17j51J67j1j07Q1K5N4o3k72L68
$$ 192 161 13 -163 39 107 -62 62 -127 -147 -59 68 71 -69 48 -103 64 53 -54 27 52 106 43 -229 139
6543A39j01p7N6k4l9J42k03J28j3L7Lo1p3J21K6K3j56R1n1O5n5N1O1j05O7J0o
$$ 139 38 -39 17 -7 -46 96 -107 21 8 45 48 -13 -86 35 61 84 -72 19 -32 33 -22 29 90 -15 52 62 56
6570E6R7k32n1j4J87J07k21J48n3J56l01J85j63m1O3J84J4r0R8m52K67J11j18
$$ 56 153 -79 -130 -144 43 150 -71 77 24 180 -121 64 -99 -140 -77 107 121 31 129 -323 -56 55 -63
6593f3J65j20K36j75r2J24k12K39nj31n9J39J01k20n7J63k7J07p9j9N7j89K47
$$ -63 102 -18 218 43 -49 75 -137 102 97 -34 -93 46 147 -73 -130 33 6 113 34 15 72 -117 130
6616A30j16j28J19k3J71j51j7jn3R9J5l11L40L6o5q6Q4n5n2M2Q0j03j0l3K84o9
$$ 130 14 -114 5 -18 153 2 -15 -16 -69 30 45 -266 74 110 45 -41 43 -12 -64 -22 58 -45 -55 -88 196 127
6642A27r5L2j45K0m8m9K00KQ3n1Q0o4k07n3K99l3k1m5K5m0j02J93o1n4m4o0J86
$$ 127 32 64 -81 -61 -109 -158 42 44 127 76 156 92 -115 -168 131 98 77 32 57 17 -85 108 47 -7 -51 -111 75
6669G5o4k3R6j61R1l5J18j17j21L5J03l8J5nj7R2Qr2J47j37k09M12p8j26J14j92
$$ 75 11 -12 84 -77 14 -21 97 -20 -141 -106 -3 -41 -26 -31 -48 44 52 -40 107 -30 -239 173 95 -31 83 -109
6695a09Q5pK4R4m4k6j3j15J12J23j71M3J44k33o7J41m9P0J13J21l89J38J14r2
$$ -109 -24 -31 -7 87 43 17 4 -111 1 124 -47 -4 140 -93 -160 -19 -68 2 115 236 -153 -15 99 7
6719GJ56k25j22J09Q9p7q9J72N6p3J23L4j71J08n7j54J31K0l4l1J28k63J41Q5
$$ 7 163 -62 -184 -75 14 -63 -152 20 76 3 126 160 -11 97 40 -114 17 37 3 -28 100 -163 -22 63
6743F3j00j3pM1K7m2J01k05J77j1k23J36P4O9q2J57j74r0N2P5r5k9J25j55J81
$$ 63 -37 -50 -57 -16 11 -31 70 -135 42 31 -192 -56 18 87 5 162 -12 -102 -50 25 -70 -99 26 -129 52
6768E2q5O0j6l7J73j44p7Om7R9J0P1M2k30L07l86L20p5K%M9j2r5l6J43L4j45p0
$$ 52 -33 27 11 -26 147 3 -74 -68 -115 -16 -6 65 107 -123 184 -202 118 43 45 45 94 82 -13 -49 94 128 -17 -87
6796h7l2R7O7j58NP2J57k65K9m4K2K58j20L8N5j73j52J85N1q6J07K2r0M9J52k16
$$ -87 -119 -22 45 -113 -108 -36 121 -144 -115 -159 -137 121 1 39 94 -79 -231 -46 5 -81 26 48 -42 7 159 -57
6822e7J78Q2l70K18l45K69J57K2j31j00J41j93J03r4K5n0K74j85J57j56J65m1
$$ -57 121 203 -167 51 -294 -25 132 154 23 -77 64 -129 -26 -120 -95 -145 129 -56 101 -55 110 69
6844F9r5j0P8j69J60n6m9J05j37pN2M2m7n1O0K1p6j27K64m2j27J34k8J80o5R1
$$ 69 -26 -36 42 -127 33 -23 -72 33 -104 -111 -59 -17 -64 -115 -55 -34 -110 -237 27 -15 -142 -8 -36 144 79 170
6870A70j08J9m4K18k79o3K8P4M2l9j29J92o7K0o8K57j13r3L2m9J43j99J04J24
$$ 170 62 81 37 255 -24 -87 -59 15 57 18 -111 81 14 34 -34 223 110 17 49 0 143 -56 48 172
6894A72j80j78J95j01M2j8J94N3j85jl5j04N0P0J29j02M1P5k5j76QO0j8O4q0j04
$$ 172 -8 -186 9 -92 -50 -68 126 179 -6 -7 -42 -146 -96 -26 103 1 42 117 92 -84 -76 -16 -34 30 -50 -154
6920a54R2RL8J0R1J7j29M0M9rj54J71j11j3R6M0p0j10J28n7OJ27M3j38j13J26
$$ -154 -62 -53 -15 -5 86 103 -26 14 63 54 -100 71 -40 -53 43 83 13 -97 31 -26 -20 107 150 12 -101 25
6946B5m4p9K19j33k3K9J4M3o7k9j07K62k00m5K61k73P1L2J01m2J07j50M3J48l18
$$ 25 -19 -98 121 -12 -35 -6 8 51 -16 -45 -152 110 -90 -135 126 -147 -76 -44 57 15 122 -28 15 163 -155
6971a55J87q2O7mO1n8j50J34J26j23K5oJ4P3j42J78k0j94q5k4J18M7P3R7j68O2
$$ -155 32 -50 17 13 74 16 -134 0 126 3 28 22 36 109 -33 145 125 -69 -154 -178 -60 -13 60 157 -11 51
6997E1j16N0m8J01j6p2J62j5j97J36P8k2l5j75K96j47n5K8j2j2J90j06J02q1o9
$$ 51 -65 -15 -63 38 22 -50 112 97 -100 36 114 92 57 -118 178 31 -24 4 -8 -20 170 64 166 85 16
7022A6lQ0M5kk58O3J08j20J46o3O4k29L8P2qN5Q0j2K0r1K5n2J04j4Rk9j55rj7
$$ 16 13 93 138 136 -122 -59 49 -71 75 12 76 -153 -115 -43 -51 4 84 72 92 1 26 -26 78 64 73 44 -111 -120 -137
7051a37J71J16j45N2j6j41K51l26J50O8N0j0j26L7k8p9J13O7j06R5o1q7J14jn7
$$ -137 34 150 5 57 41 -100 151 -175 -25 43 93 83 -43 -6 -34 -113 0 67 -39 56 -5 -92 22 21 -36
7076c6N6o8J10m7k4l4J10q8M3j70J61q2J46k8Kj17OR1j9p1q3J96j53K28j14R9
$$ -36 20 -48 62 15 -9 -43 67 -21 22 -148 13 -69 77 49 51 -66 -60 31 12 -59 -142 54 -99 129 15 114
7102A14J32k47KR3o9K9O5k23Q6r1j0J96qj23j31Q8J47n6N3j11L6pl0R6o2N6N7
$$ 114 246 -1 1 94 25 54 119 -104 -18 -109 -119 77 69 -54 -185 -97 50 -6 47 -64 -28 -35 -65 31 -31 25 82
7129H2j43J11K8k58kK29L2p5o6J8J27l7P2q8J7j90J98l0o1K3k1L3J28k20N4J48
$$ 82 -61 50 78 -180 -182 47 79 4 -62 -44 83 46 118 30 47 -143 55 25 -36 -13 -34 -1 127 -93 -39 109
7155A09j70Q2j25K97k16L0j4N9o5k07L10j57n6J72L7k57K37P2p7j28m1J67k66
$$ 109 -61 21 -104 193 -23 7 -7 52 -13 -220 90 -67 -123 49 86 -171 66 138 61 -67 -108 59 -207
7178b07O3K27l96J65L1J26K8k5m4J23o1PO7j61K47j97J14j0k42J53M1K7L0o4k1
$$ -207 -144 83 -313 -148 -117 9 37 12 -32 91 30 37 104 -57 190 -7 107 97 -145 8 49 76 106 42 21
7203B1n2Q2Kq8J20n6qj39K7L3Kj8NK1m7J83O6k3j25l5J00k85L20r3p8J85m4m7
$$ 21 -31 51 53 -35 85 29 21 -118 -91 -58 -56 -74 -69 -48 -95 88 154 131 6 -29 71 -214 106 13 -65 120 76 29
7231B9J26k87J47q5J4R3J50nn9j59q8O7K02q7O4j9j28J48J22k43OM3j81J57r7
$$ 29 155 -132 15 -70 -56 37 187 182 123 -36 -124 -57 145 58 122 103 -25 123 245 2 8 51 -130 27 -70
7256g0j1RP7J29l08K23j8n5O1l2n0R3p2K5k8J11jk1r6k8P1l2LP7M0r8m1J69k7
$$ -70 -81 -72 5 134 -174 49 31 -24 37 5 -45 48 -24 1 -27 84 83 62 -34 -62 9 -23 -20 57 97 -1 -42 127 100
7285A00j67K13k26P6J3l9p5P0j7pM3K3pJ04p9j47m1K17N5k26J83o4k18Q5J22j76
$$ 100 -67 146 -80 -4 9 -30 -105 -35 -52 -59 -16 7 0 104 25 -122 -163 54 109 -117 66 2 -216 -131 -9 -185
7311a85J71l4r2K42k78J02p1K58k87P1Q7q8J5J7JM9kP1n7j55K80k40J96r0J17
$$ -185 -14 -48 -140 102 -176 -74 -145 113 -174 -103 -16 -104 -89 -72 -71 -22 -24 47 -10 -165 115 -125 71 -19 98
7336I8o6o7L5J41j90o8J23j93L07JN6J22l50O1j06J40n6O0o0K6L1R8j20L7j24
$$ 98 32 -35 0 141 -49 -117 6 -187 120 121 177 299 -51 10 -96 44 -12 48 -12 14 45 143 23 60 -64
7361f4J95j69J25j54J09m1%K27j56j04L7Lo1J45l1J13k82J93j43J44p7R7m8j92
$$ -64 131 -38 87 -67 42 1 1 228 72 -32 5 8 -53 92 61 174 -108 85 -58 86 9 106 58 -134
7385a34L0j4q7K13q6J66j92J47J11o4R9j87j8P3P4J1m2o7Pn4p0j5J21J79j95j4
$$ -134 -104 -118 -205 8 -78 88 -104 43 154 90 189 2 -16 57 131 142 100 33 40 -14 -84 -99 22 201 6 -8
7411hJ37q6j25Kk9K11m4Q4p0j9J8m8j1J40j61J00p4j20K2p7J38kJJ8m4j5J66m3
$$ -8 129 43 -82 -80 -109 102 58 142 72 53 71 23 12 152 -9 91 17 -103 -81 -158 -20 -22 -21 -3 -47 -62 104 61
7439F1m0k31R1P7r5K45k64P4K13o5r7N0j5j03J16J19k52R6p6J52o3k6r4K34k78
$$ 61 21 -210 -119 -42 -137 108 -156 -82 131 66 -31 19 4 -99 17 136 -116 -20 -96 56 -7 -33 -127 107 -171
7464a71J40M8N0q1j21K05n4j04j14K41n7oO5L9n0P2k5j68K03j70r4K33j09j89
$$ -171 -31 17 67 -14 -135 70 16 -88 -202 39 -18 -24 41 80 30 102 77 -91 112 -58 -152 81 -28 -217
7488b17J70J16J68j00j3k50J2mj1J05K1k9N5O9o6N8k6qN7j10K7j19L7L7q3J79
$$ -217 -47 69 237 137 124 -126 -114 -118 -129 -24 -3 -32 23 92 26 84 58 50 107 -3 24 -95 -58 -21 -104 75
7514G5n1jn3J08j5N1j49k3m6K11j86M1O5K0j43K13n9m4rQ3j60Q6n7k07O8J23k2
$$ 75 24 23 -30 78 63 114 -35 -58 -104 107 -79 -38 27 47 -96 117 58 14 5 88 -72 14 -43 -250 -182 -59 -81
7541h1J71P3k34l7p9K53K4j96K2P2J18k54L11n9j78J67p1k34K89k78K67N9o0j45
$$ -81 90 163 -71 -108 -187 66 90 -106 -84 -12 106 -148 163 104 -74 93 22 -212 77 -201 66 125 65 -80
7565h0R6J21j69R3j32K23j85J30j69J83%j98R6m2K48j84Q3q4j50J68l3j41R4j57
$$ -80 16 137 -32 61 -71 152 -33 97 -72 111 111 -87 9 -33 215 31 114 30 -120 48 15 -126 -32 -189
7589a89J46M4k7l3J8R8k2q5n1Q9j9P9Q6o6q9J44k23K70j20J31k68K37j33R1o3
$$ -189 -43 1 -26 -59 -41 57 35 -50 -101 -12 -31 48 134 68 -21 123 -100 170 50 181 -87 150 17 108 45
7614D5J0Q1j63K41j15j55J32K4R1j48Q6q4j91N5J49k04Q6j44L09j03Q5j09j65
$$ 45 55 136 -27 214 99 -56 76 100 191 43 129 45 -146 -91 58 -146 -60 -204 105 2 87 -22 -187
7637a87N3M3O4J8Jk21K60j72j19K35J29rk9j43L1K06j90k0R2K3r1k0q9J01K23
$$ -187 -134 -91 -27 -9 -8 -229 31 -141 -260 -25 104 95 66 -77 -46 160 -30 -50 42 65 -26 -46 -135 -34 189
7662A89q8O7j37ML8o6j24mJ10o8J67k35L03j91N5q4N3o2J88o0k28L14j54j04J24
$$ 189 101 168 31 35 73 7 -117 -121 -11 -79 88 -147 156 -35 20 -64 -11 -73 115 55 -173 141 -13 -117 7
7687GL9n5o4pM0J89k32J08l2j39J69M9m2Mj8r4Q7O9j41P1OJ05p8j44J35j1j5m9
$$ 7 46 -9 -73 -80 -40 149 -83 25 -7 -146 23 72 30 34 16 -78 9 78 -63 8 14 119 41 -103 32 21 6 -43
7715d3OJ65j33rp4m3J45RO7j61j15J69n2L4L8j20J17R2rm4J7j32O4%J0P3L8j13
$$ -43 -37 128 -5 -14 -88 -131 14 23 90 -71 -186 -17 -69 -35 3 -117 0 92 83 39 56 -76 -12 -12 -2 71 109 -4
7743dR8k34K33r7Q1R9j34q6K3j4J67o9m9N6p2R9k26J51j04N6j22K2K28j11J7o6
$$ -4 94 -140 93 -4 77 176 42 -44 -21 -35 132 63 14 70 -2 97 -129 22 -82 -26 -148 -126 102 -9 8 -58
7769e8o4Q5l8l1J03J35j54J26Qj45j2J00j03M6O5q2oR4q9p6J90j35oJ00j20n1
$$ -58 -122 -37 -75 -106 -3 132 -22 104 112 -33 -45 55 -48 -2 63 -19 -25 69 -20 -96 94 -41 -47 53 -67 -118
7795a18J94r5k12K39q3J02k8L1k1Q1j61J26P5k41J66k3q8Q6j07J25K9l8kr6pj07
$$ -118 76 -19 -231 8 -75 27 -1 30 9 90 -71 55 130 -111 55 32 -56 30 -77 48 77 39 37 -59 -66 -173
7821a73K69o9K9l5j0R4r3Oj0R3j64%k3L4j56K57mq4J14n0k8J33k91K27k1k09Q5
$$ -173 96 27 56 21 11 105 12 18 8 101 -63 -63 -86 -52 -208 49 45 -39 75 25 -3 130 -161 66 45 -164 -79
7848g9l4qQ5k4N7N9l8RoJ5j01J63j20J47k99J71N7j56OQ0J20j58Q5M5k06J19j11
$$ -79 -113 -121 -36 -60 -3 56 18 27 21 36 -65 98 -22 125 -174 -3 54 -102 -96 -16 104 -54 31 76 -130 -11 -122
7875a22O3R1M6j48L6k4k2K81j86OL6j31l2P9M4j30N0p1L55j77m0o1N1K7P3P8j66
$$ -122 -59 32 78 -70 -34 -58 -80 201 15 21 57 -74 -106 -27 17 -113 -63 -134 221 44 4 -57 -6 21 94 172 6
7902Fm0Rj67L54j14K1p0m6r7K26o8J5J25K6j04M2j73J2m7L47j85k2j01J93j88
$$ 6 -34 -25 -192 162 48 69 -1 -47 -144 82 14 29 154 180 76 118 -55 -43 -90 257 72 50 -51 142 -46
7927d6L6K8l2J26j7p3o9N0O5j53J48n3K4o9O6q8K0K8M4K8K3o1j48J77j49J76k76
$$ -46 -10 18 -14 112 95 22 -47 3 68 -85 63 10 34 -35 31 -57 -37 -9 35 63 86 25 -123 54 -95 81 -195
7954a95J88J12j18J98j46K4k38K12j62O8J13j13L4j28J16L7j7M0l8m8N5l6J21
$$ -195 -7 105 -13 185 39 63 -175 37 -125 -57 56 -57 -23 -151 -35 2 -15 25 -13 -61 -6 -42 79
7977G9L3j87n0J38j85K44j71J18j2rp5J71p2M2j61O5j95L47q4j57nJ13k4J5M0
$$ 79 112 -75 -125 13 -172 72 -99 19 7 -2 -77 94 22 64 -97 -32 -227 120 36 -121 -126 -13 -37 -22 18
8002A8L0j75J24J40q8N4n5K6j39M3O9r2Q7N6m5J8m1KL0N3m0Olm0Q1j08j7%J01
$$ 18 48 -127 -3 137 49 103 48 74 -65 -22 47 -45 42 98 53 71 30 32 62 115 75 81 78 38 119 11 -6 -6 95
8031I5j36KP3K4no7k2o7m2J89P6k0r9j18J00m0M6o4J53J8j41O4j43N4P1K2m8N7
$$ 95 -41 -39 34 58 53 -14 -36 -103 -145 44 120 100 1 -117 -17 -57 -11 -75 78 96 -45 19 -124 -70 1 23 -25 32
8059C2l3Q5k1Jq7j09J51N5j07l0R9m7j02J41p7J62K7k24J00k7j8J04j20j70J93
$$ 32 -1 84 63 64 -23 -132 19 74 -33 -63 36 -11 -113 28 -49 113 140 -84 16 -11 -29 75 -45 -215 -22
8084b2J9L1j27Q9LM6Q1k40P9J6n6j0O8P3L6P6j05j40J49J6j38J29j50J02k10R9
$$ -22 -3 28 -99 -10 -7 39 120 -120 -41 -25 -81 -91 -23 50 86 162 57 -83 66 82 -56 73 -77 25 -185 -86
8110h6M7J10j10J71k14J43r2j90J21J12J07j85P5P6q1j22O8J03K7j82M9L3J70
$$ -86 -39 71 -39 132 -82 61 -31 -221 -100 12 119 -66 9 85 4 -118 -50 53 80 -102 -53 -20 150
8133A50r5L9m6r6J76j57L1p5K66q0j51q5N3k9J69j95L09k71J27j00j05%J46P7
$$ 150 55 94 48 -48 128 -29 2 -73 193 113 -38 -123 -70 -99 70 -125 184 -87 40 -60 -165 -165 -19 58
8157E8P4k65L5J30j14J91j25R4j17J50j15o9J2N3K6o9K3J2O4j13L5m9j4P7q4j1
$$ 58 132 -133 -98 32 -82 109 -16 78 -39 111 -4 -73 -61 -8 18 -51 -28 -16 48 -65 -30 -79 -93 -16 -100 -111
8183a11K31k29J97J5k07J38q8o8
$$ -111 120 -109 88 103 -104 34 -54 -122
8191a22
$$ Imaginary data points
##PAGE= N=2
##DATA TABLE= (X++(I..I)), XYDATA
0@%%%%%%%%%%%%%%Qj6J6j6J6k2L0l2L9m7N1n9P2q2R0j04J20j37J55j77K01k25
$$ 0 0 0 0 0 0 0 0 0 0 0 0 0 0 0 8 -8 8 -8 8 -14 16 -16 23 -24 27 -32 40 -42 48 -56 64 -73 82 -95 106 -119
36a19K51k79L13l51L89m31M78n28N85o48P14p86Q65r52J050j158J274j404J554
$$ -119 132 -147 166 -185 204 -227 251 -277 308 -340 374 -412 453 -499 551 -607 667 -737 817
55H17j724J915k136K395k703L075l534M119m892N963p534J0069j4793K6307r9692
$$ 817 -907 1008 -1128 1267 -1436 1639 -1895 2224 -2668 3295 -4239 5830 -8963 17344 -82348
70h2348j11707K84229p2063j15359J73195m8425j45897J60527K9885j11737P8393
$$ -82348 -194055 90174 18111 -97248 75947 27522 -118375 42152 72037 -39700 38693
81C8693K397j11176P9470M3418p6566L2924J3762o4907M5504L0015m6988K0732
$$ 38693 41090 -70086 9384 52802 -23764 9160 22922 -41985 3519 33534 -13454 7278
93G278R479l9091K0462O858j0011L4051k5053m3936M0138J0356j1830K6695l6660
$$ 7278 16757 -22334 -1872 4986 -5025 29026 3973 -39963 175 10531 -1299 25396 -11264
106a1264k6794N8303j4806k0997O0908m5761o0243Q7160J768o1880O7373k0020
$$ -11264 -38058 20245 5439 -15558 45350 -411 -60654 26506 28274 -33606 33767 13747
118A3747q8912R6129L6530j05129N4450M2030j08722M9371Q2029j01420O437Q0531
$$ 13747 -75165 20964 57494 -47635 6815 48845 -59877 -10506 71523 -29897 -23460 57071
130E7071q9145j2185J03707n1374m6313O8555k9779l6705O3577j0830l7658L6701
$$ 57071 -32074 -44259 59448 8074 -38239 30316 537 -36168 27409 16579 -21079 15622
142A5622j5240k7226M5271j123l1099J9718p973j5726L2910k335k5547J3317k010
$$ 15622 382 -26844 18427 17304 -13795 5923 -2050 -17776 15134 12799 -12748 569 -1441
155a441p496K0124m289j3226P183r575K895K1091j6455p796J5557j8294L125L1263
$$ -1441 -8937 11187 6898 -6328 855 -8720 -5825 15266 -1189 -8985 6572 -11722 -8597 22666
169B2666k6432j3630L3635k2319j5973M5686j7020l3234L9448p346l3756M4139
$$ 22666 -3766 -17396 16239 -6080 -22053 23633 6613 -26621 12827 5481 -28275 15864
181A5864L420m7514K9559J5697m1216K5913K3768m4262R020K8005l1755O482L0000
$$ 15864 19284 -28230 1329 17026 -24190 1723 25491 -18771 -9751 18254 -13501 -7019 22981
194B2981l1222o773K8984j7178o011K4265j6076j2101K2009o392r854J6000o228
$$ 22981 -8241 -15014 13970 -3208 -9219 15046 -1030 -13131 8878 2486 -7368 8632 2404
207B404j1624J3014R25p944O365j138n613N088J200q07J74l898K017K546m671
$$ 2404 -9220 3794 4719 -3225 3140 2002 -3611 1477 2677 1870 2044 -1854 163 2709 -1962
222a962N304K271j1136M655P677j0553M252R134j5165J58J4968j1677k635J5332
$$ -1962 3342 5613 -5523 -868 6809 -3744 508 9642 -5523 -5365 9603 -2074 -4709 10623
236A0623j2438q106J8302n800j0924J5545l910j4465J5000K498j4278R852M273
$$ 10623 -1815 -9921 8381 2581 -8343 7202 3292 -11173 3827 6325 -7953 1899 6172
249F172j4446P111Q053j2365K942Q207j0110K05R445p569k301Q018m159l734O558
$$ 6172 -8274 -1163 6890 -5475 -2533 5674 -4436 -4231 5214 -2355 -4656 3362 -797 -4531 2027
264B027j546m635M168Q27l571K025J741k958k16K467m65j574J852L32k920J345
$$ 2027 481 -4154 14 841 -2730 -705 1036 -1922 -2138 329 -136 -1710 142 474 -2446 -1101
280a101K733k476q22L486k429k492N009m94l931L435J104m849L160K922m666J087
$$ -1101 1632 -844 -1666 1820 -609 -3101 1908 1414 -2517 918 2022 -2827 333 3255 -1411 -324
296c24L386m256K23M189l071j209L784j902k433L892l89l191L029O57l446J386
$$ -324 3062 -1194 -971 3218 147 -1062 2722 820 -1613 2279 1890 -1301 1728 2385 -1061 325
312C25K414k835j35K766k090j416K792o71k062K238M58k900J334J744k930P46
$$ 325 2739 -96 -231 2535 445 -971 1821 1150 -912 1326 1784 -1116 218 1962 -968 -222
328b22K629l134o25L313k298j374L398j158k831L189j24l209K738J195l730J403
$$ -222 2407 -727 -1352 1961 -337 -1711 1687 529 -2302 887 763 -2446 292 1487 -2243 -840
344h40K082k999M94K374k126p45K199j337j031K225n78j428J601k75j257R29Q00
$$ -840 1242 -1757 -1263 1111 -1015 -1760 439 -898 -1929 296 -282 -1710 -109 -384 -1641 -712 88
361H8j201K92P25n60n98J010M27j344O01J030j136k64J509p24r05J674k68j779
$$ 88 -1113 -821 -96 -656 -1254 -244 183 -1161 -560 470 -666 -930 579 -145 -1050 624 356 -1423
379a423K133J60k248J865R68k687J224K260l102K23K966k667o22L324k001j437
$$ -1423 710 870 -1378 487 1455 -1232 -8 2252 -850 -627 2339 -328 -950 2374 373 -1064
395a064L109j009k220K951k68k691K456O31k869J594J489k727P31K183k189n38
$$ -1064 2045 1036 -1184 1767 1499 -1192 1264 1895 -974 620 2109 -618 113 2296 107 -431
411d31K037j338r21J796l19j753J439N38j961J007J293k034q6J838j386p30J954
$$ -431 1606 268 -653 1143 824 -929 510 1048 -913 94 1387 -647 -733 1105 -281 -1011 943
428I43n20k094J613O65k024Q68J576k431R4K218j699q27K513j132k146K678L5
$$ 943 423 -1671 -58 607 -1417 -549 1027 -1404 -1310 908 -791 -1618 895 -237 -2383 295 330
445C30k269J812P50k579J081K158k589j95K542k120q52L278j025k376K440L05
$$ 330 -1939 -127 623 -1956 -875 1283 -1306 -1501 1041 -1079 -1931 1347 322 -2054 386 691
461F91k667K073J345k806M68K325k367n5L089k147j996L553r19k368L555n5l956
$$ 691 -1976 97 1442 -1364 -896 1429 -938 -993 2096 -51 -2047 1506 587 -1781 1774 1719 -2237
478b237K569K145l463J130K691l884k54L997k342j444L132j460k494L899L8l363
$$ -2237 332 2477 -986 144 2835 -1049 -1303 2694 352 -1092 2040 580 -1914 1985 2023 -1340
494a340K234Q89l258J779K351l398Q5K414k015r41L339j171k616K075O98k197
$$ -1340 894 1783 -1475 304 2655 -743 -658 1756 -259 -1200 2139 968 -1648 427 1125 -1072
510a072J462J223k632n57K806j203j226K567j212k684K800J268l253J614J543
$$ -1072 390 1613 -1019 -1576 1230 27 -1199 1368 156 -2528 272 1540 -1713 -99 1444
525A444l971R65M055l378j442M085k784k248N298r79m400L806N03m332L918K038
$$ 1444 -2527 -1562 2493 -885 -2327 1758 -1026 -3274 2024 1045 -3355 451 954 -3378 540 2578
541B578n153J088L382m064R77M379m247j829M459j614j978M250j373l933L126
$$ 2578 -2575 -1487 1895 -2169 -1192 3187 -1060 -2889 1570 -44 -2022 2228 855 -3078 48
556D8J559k830J744J298l545N54L055j548r12K086j517j870L069J018k772M85
$$ 48 1607 -1223 521 1819 -1726 -1172 1883 335 -577 1509 -8 -1878 1191 2209 -563 -78
572g8J334k171L73L276j886k610K938k23k502L371Q65m800J685K792l396J054
$$ -78 1256 -915 -542 2734 848 -1762 1176 953 -1549 1822 2687 -2113 -428 2364 -1032 22
588B2L454m572r70M842k311j997M320k246l920M982O12m391L372Q11n240K633
$$ 22 3476 -1096 -2066 2776 465 -1532 2788 542 -3378 1604 2216 -2175 1197 2008 -3232 -599
604e99L579m118J55L044l803l36M556j947k641K799q12k200L208O25l276Q80J226
$$ -599 2980 -1138 -983 2061 -1742 -2078 2478 531 -2110 689 -123 -2323 885 1510 -1766 -886 340
621C40j959R75K154k002j588J941J89j369J688M98k977O91K479j429l00J750j899
$$ 340 -1619 -644 1510 -492 -2080 -139 50 -1319 369 867 -2110 -1419 1060 -369 -669 1081 -818
638h18j608L376R8k547J950L00l303K582K389l675L92K485l189M09M116k799k058
$$ -818 -2426 950 1048 -1499 451 751 -2552 30 2419 -1256 -864 1621 -1568 -1159 2957 158 -1900
655a900L551j582j880M026m09l845K515R95k609J881J649l346J10K674k044K9
$$ -1900 1651 69 -1811 2215 1806 -2039 476 1471 -1138 743 2392 -954 -844 1830 -214 -185
671a85K641k311j656K652j2j516J361L7k349J325J637j378l52J176j411p96K306
$$ -185 2456 145 -1511 1141 1129 -387 974 1011 -1338 -13 1624 246 -106 1070 -341 -1137 1169
688A169q9j811Q85K80j531J078J591k227m22J947j298p04K336r37k243J965M84
$$ 1169 1080 -731 154 434 -1097 -19 1572 -655 -1077 870 -428 -1132 1204 267 -1976 -11 473
705D73j744J595Q36l018Q06J911j757O3J951k303o33K658p20j511J969p09j871
$$ 473 -1271 324 1160 -1858 -1052 859 -898 -835 1116 -1187 -1820 838 118 -1393 576 -133 -2004
722b004K128O96k021Q89Q94j926O82J640j152q74J447p75n55J790k86j469Q54
$$ -2004 124 820 -1201 -312 582 -1344 -662 978 -174 -1048 399 -376 -931 859 573 -896 -42
739d2M59j022Q71R24j428l31J365n58n44J391n00j402J140P14j336O61O30j362
$$ -42 417 -605 266 1190 -238 -569 796 238 -306 1085 585 -817 323 1037 -299 362 992 -370
757c70K63J411j087m04J094q15n95J531k81j193R71p3j024Q44Q30j460K32Q72
$$ -370 -107 1304 217 -187 907 92 -503 1028 747 -446 525 452 -572 272 1102 -358 -126 746
775G46r58j36J152p24n98Q63k0p32P37J06j051L03N68n04o6P92q56m60J051k73
$$ 746 -212 -348 804 80 -518 345 325 -407 330 436 -615 -312 256 -248 -314 478 -378 -838 213 -60
795f0o85R60j35j039P92N68r92K31M47q87J04J021p16l14Q38m31n13Q96o4p19
$$ -60 -745 215 80 -959 -167 401 -591 -360 87 -800 -696 325 -391 -705 133 -298 -811 85 21 -698
815f98O77J74q45P32K50q72L39L96n28J12O54l40n21P15O5n42O62k33l47J95M07
$$ -698 -21 153 -692 40 290 -582 -243 153 -375 -263 391 51 -470 245 310 -232 430 197 -150 45 452
836D52l54P8L36l17j03L39L3o63N42J76m24J45M36l39k09N44n13j55O65m19m41
$$ 452 98 176 512 195 92 431 464 -199 343 519 95 240 676 337 128 672 159 4 669 250 -191
857a91O78j42n66M25K52p54M48M20p56J82O40p28j23P58o22j96O52l16n79N73
$$ -191 487 345 -221 204 456 -298 150 570 -186 -4 636 -92 -215 543 -79 -275 377 61 -518 55
877E5j84k62L72J48n00M06M4n24K03R7l24J09J91o8o7J37j17k08K15J78j08l27
$$ 55 -129 -391 -19 129 -371 35 79 -445 -242 -145 -469 -360 -169 -237 -304 -167 -284 -492 -277 -99 -207 -534
899e34L08M1k02K46J50n47L90J73m67J85L92m07m3N64n10j20Q69n31j81P03k04
$$ -534 -226 -185 -387 -141 9 -538 -148 25 -442 -257 135 -272 -315 249 -261 -381 488 -43 -224 479 275
920B75n23M51K02p01O02P9n45L21L50o75K62M78m12j80N75m31p4M77k79k79M58
$$ 275 -248 203 405 -296 306 385 -160 161 511 -164 98 576 164 -16 559 128 54 531 252 -27 431
941D31m1n40L05K92m05Q5J96j22j35L30k50j00r5N6j8KL49l25L4P4j97j4L05n2
$$ 431 390 -150 155 447 42 127 323 201 66 396 146 46 -49 7 -11 -9 340 15 49 123 -74 -88 217 165
965A65n14L56M4l63K64J75l98l6K18l21n6O40k72l60L23lm89N61j15l92M24R8
$$ 165 -349 7 51 -312 -48 127 -271 -307 -89 -410 -466 174 -98 -458 -135 -138 -627 -66 -181 -573 -149 -51
987e1m54M71R2l70j82N57l78jL93k88k1L13q4k38K12o5lq2L13l42P9J86r9j92
$$ -51 -505 -34 58 -312 -494 63 -315 -316 77 -211 -232 81 -3 -241 -29 -94 -97 -179 134 -208 -129 57 -42 -234
1011b34K81K19l86K40J75l54qN37l68j36N92m86n0N45j95l32K64J88n21L15M01
$$ -234 47 266 -120 120 295 -59 -67 470 102 -34 558 72 22 567 372 40 304 492 -29 286 687
1032F87n73LL67l03j07M88n33q7M53k26k27L30r4l02J15K21m50R5K28k56R9K41
$$ 687 114 117 484 181 74 562 29 -58 395 169 -58 272 178 -124 -9 212 -238 -143 85 -171 -72 169
1054A69k07k72M04j20l40L28j2n00K71L44l01r2M38l44m3L79j48k59K68j0l01
$$ 169 -38 -310 94 -26 -366 -38 -50 -550 -279 65 -236 -328 110 -234 -277 102 -46 -305 -37 -47 -348
1075c48Q3M03l62K7J98m79J41M42k2m23L26j14l70P52N2o16j10M51k78K37J54
$$ -348 -265 138 -224 -197 1 -478 -337 105 83 -340 -14 -128 -498 254 306 -310 -420 31 -247 -10 144
1096A44k42j05L14j31l8M40j75n02L80J11q6O2J73m07Q6M35k63l59O62l93l43
$$ 144 -98 -203 111 -20 -58 382 207 -295 85 196 110 172 345 -62 24 459 196 -163 499 106 -237
1117b37O85J6l08K7J49m40L33K12l73j38L75k57J8L69j60l22J29ml08M79K41o24
$$ -237 448 464 156 183 332 -108 225 437 64 -74 301 44 62 431 271 -51 78 74 -234 245 486 -138
1139a38j11M79k83N9K48l89j69M26nj22J34k98k85J22L98j83o1J86l79j3L57P2
$$ -138 -249 230 -53 6 254 -135 -304 122 117 -5 129 -169 -454 -332 66 -117 -178 8 -371 -384 -27 45
1161D5m64K85Jk00K19K10k90j16R2K2j95N85k95l50K80O1J6J86P7o24J24O20n42
$$ 45 -419 -134 -133 -333 -114 96 -194 -310 -218 -196 -391 194 -101 -451 -171 -110 -94 92 169 -455 -331 289 -253
1184b53L04J44l74r7N11p0k43K34k02k40L14L77l24J23L1k59J93K69j35l30K08
$$ -253 51 195 -179 -276 235 165 -78 156 -46 -286 28 405 81 204 235 -24 169 438 303 -27 181
1205A81k66L13K32k45j69M0Q1j54J22K68l39l22N44k1n8j7k02j24K34J84j82P2
$$ 181 -85 228 460 215 46 86 167 13 135 403 64 -258 286 265 207 190 -12 -136 98 282 100 172
1227A72j19l73R9O01k52j13N5j81l23O06j08l07L36j69j65K09K79m42p0J86q4
$$ 172 53 -320 -221 380 128 15 70 -111 -434 172 64 -243 93 -76 -241 -32 247 -195 -265 -79 -163
1248a63k25M69j79k88R2J72j04J59J24m13P5K41j28J07J02k84m6K10J43o0K2r6
$$ -163 -388 81 -98 -386 -294 -122 -226 -67 57 -356 -281 -40 -168 -61 41 -243 -289 -79 64 4 26 -70
1270g0j64P1M54k40r3N3j25J9M54k40r0N4M4q9K04j67J03n5l4j31K6L18l13%J18
$$ -70 -234 -163 291 51 -42 11 -114 -95 359 119 29 83 127 38 242 75 178 123 89 -42 -16 302 -11 -11 107
1295A07J82l0p5K0k33K27LQ4Qk51M9KJ93j34nM6j14j81L07j17k3j15q5m2J13J88
$$ 107 289 259 184 204 -29 198 201 285 293 42 91 93 286 152 147 193 79 -102 205 88 65 -50 -135 -177 -64 124
1321A24l14P1k6J1J18K33l37QN9p4j60M04q9j92J51k2o6N6j57J06n4J44P8k88
$$ 124 -190 -119 -145 -134 -16 217 -120 -112 -53 -127 -287 117 28 -164 -13 -35 -101 -45 -202 -96 -150 -6 72 -216
1345b16J22j2j09J56Ok04J31n0Q9L3J52j89M4L2M8k07J60Q5k12K25k85J70l0J05
$$ -216 -94 -106 -215 -59 -53 -257 -126 -176 -87 -54 98 -91 -47 -15 33 -174 -14 71 -141 84 -201 -31 -61 44
1369D4QN2k07J06k05L06J07j34L1J7R2r5N1k81R7J77m0M8mj03N3K33l04J06J06
$$ 44 52 104 -103 3 -202 104 211 77 108 125 217 122 173 -108 -11 166 126 174 170 67 120 353 49 155 261
1394B61j17o2P0J08j27p8kj2P5m7q0J34j49p5J58J86j27j64j9K9j67K06j56J80
$$ 261 144 82 152 260 133 55 53 41 116 69 -11 123 -26 -101 57 243 116 -48 -67 -38 -205 1 -155 25
1418B5j57J62k72J31K76l48J32rNM0k41K6J17m6J36L5mJ59m39Q2m2R1k5J42J31
$$ 25 -132 30 -242 -111 165 -183 -51 -60 -55 -15 -256 -230 -113 -159 -23 12 8 167 -272 -190 -232 -141 -166 -24 107
1443A07k17nJ51j97N6J02j80K30j03P6o4N2L7j98M08j26j78J27n2jO4n0j12M4
$$ 107 -110 -115 36 -161 -105 -3 -183 47 -56 20 -44 8 45 -153 255 129 -49 78 26 25 89 39 -73 -29
1467b9K92m9l4O6j02k9k8R5k04K84l48Q7J79J9j71R3q5L2M2K7j38m4O7n8m0J57
$$ -29 263 214 180 246 144 115 87 182 -22 262 -86 1 180 199 28 121 36 68 110 137 -1 -45 22 -36 -76 81
1493H1p7k05M08j15k01L6J91k57J55Nq1j44K56p8PO7j74Q7oj15m0o9L07j38J47
$$ 81 4 -201 207 92 -109 -73 118 -139 16 21 -60 -204 52 -26 -19 48 -126 -39 -45 -160 -200 -269 38 -100 47
1518D7k62L34j39k8j28O9k7J25k44K30M1l4r3J62j00k01J55q5J78k3j67J16M7
$$ 47 -215 119 -20 -48 -176 -107 -134 -9 -253 -23 18 -16 -109 53 -47 -248 -93 -178 0 -23 -190 -74 -27
1541b7J2j7l6J92j51J03%K5k44J71p7P3j0J01p1J51m1J56k07J9k1K18j17k0p0
$$ -27 -15 -32 -68 124 -27 76 76 101 -143 28 -49 24 14 115 44 195 154 310 103 122 101 319 202 182 112
1566A12O1N1k01J65j84J67p2J25k33N4p9J03r8R6K4n4J79j00j50O9P4l87K57J42
$$ 112 173 224 23 188 4 171 99 224 -9 45 -34 69 -29 67 91 37 216 116 -34 35 109 -278 -21 121
1590A21j66j6OL6M3p2j04K8J05j50PR0K7pn5J02J0j19N9%p7K9J68k05L1O9O2j70
$$ 121 -45 -61 -55 -19 24 -48 -152 -124 -19 -169 -162 -72 -45 -52 -107 -5 5 -114 -55 -55 -132 -103 65 -140 -109 -40 22 -148
1618a48j09J99o5n5L9k41L60r3J71j29O9r8J20J24j37n2j11J78j9J37J20m59J39
$$ -148 -257 -58 -123 -178 -139 -380 -20 -113 58 -71 -2 -100 20 144 7 -45 -156 22 3 140 260 -199 -60
1641f0M3O2o0J03O7k16J07J31N3j9r6j35J59L0l7n7nM1K5j69K36j32o5J12j05
$$ -60 -17 45 -15 88 155 -61 46 177 230 211 115 -20 139 169 132 75 70 111 136 -33 203 71 6 118 13
1666A3n3P9J62j50j51kK79j53N1l4k2K9r2J51o0Lj46J04K9j73J02l0q0J66r6j2
$$ 13 -40 39 201 51 -100 -102 177 24 75 41 19 48 -44 107 47 50 -96 8 37 -136 -34 -64 -144 22 -74 -86
1692h6R0L0k52K5J84JQK2%j90R8l7j35K67j34O0J6J84l47J95Q6j15n2P0r6j2M
$$ -86 4 34 -218 -193 -9 -8 0 22 22 -168 -70 -107 -242 25 -109 -49 -33 151 -196 -1 85 -30 -82 -12 -108 -120 -116
1719a16J28k67K75J29l47K76J7l9k9l4k0j2J79j36kK41r1j63K53r9k32J27K15
$$ -116 12 -255 20 149 -198 78 95 56 27 -7 -27 -39 140 4 2 243 152 -11 242 143 -89 38 253
1742B53k69J94J25k07L7k7M2n6K8M8l51M0J70N1k5J24j66k28K47J37j05J90r5
$$ 253 -16 178 303 96 133 106 148 92 120 168 -183 -143 27 78 53 177 11 -217 30 167 62 252 157
1765A57j46q4j0K03j99K71l57J96J34j88n9J7k11K2L41l98j5L77o5j15j5J64q5
$$ 157 11 -73 -83 120 -79 192 -165 31 165 -23 -82 -65 -276 -254 87 -311 -326 51 -14 -129 -144 20 -65
1788f5J8j4o8k1J63j15O2q0o4J99O0L7k30R4k9r8n6J54j73L7M9J0p2J57R1k88
$$ -65 -47 -61 -129 -150 13 -102 -40 -120 -184 15 75 112 -118 -24 -53 -151 -207 -53 -226 -189 -140 -130 -202 -45 46 -242
1814b42K41M4j32J84n4P6j06J39j7j53J35m3k12K66nk7j43K02k3j48J01j85K05
$$ -242 -1 43 -89 95 41 117 11 150 133 -20 115 72 -140 126 121 94 -49 153 130 -18 83 -102 103
1837A03N7j49k2J68r1P0mJ09j19J86k81M8J8Ll2j68J80j3r9n4J58O8j05j06O2
$$ 103 160 11 -11 157 66 136 132 241 122 308 27 75 93 96 64 -104 76 63 -36 -90 68 136 31 -75 -13
1862a3M1o0R2j52O2nj4j3J29j26n0n2O1J07K12k25j86J62k24R2J69Pk08J91j03
$$ -13 28 -32 60 -92 -30 -35 -49 -62 67 -59 -109 -161 -100 7 219 -6 -192 -30 -254 -162 7 14 -194 -3 -106
1887a06O3j8Q0k11R0OJ12k72J97J3J17q7j13J2N6P1R9p0M9p0k1J26r9o9K1J05
$$ -106 -43 -61 19 -192 -102 -96 16 -256 -59 -46 71 -16 -129 -117 -61 10 109 39 88 18 -3 123 24 -45 -24 81
1913H1l1J22j48M9p7q4Q2Q9n3J41j51J25jo2q2L0k3R4K29l16p2K15n6J88k07j25
$$ 81 50 172 24 73 -4 -88 -6 83 30 171 20 145 144 82 0 30 7 101 330 14 -58 157 101 289 82 -43
1939d3P9J0pn9N4j4j50J16J27j31oLL6n4l0J94j66kj12L5O8j05K53l86J11k8J01
$$ -43 36 46 39 -20 34 20 -130 -14 113 -18 -24 -21 15 -39 -69 125 -41 -43 -155 -120 -52 -157 96 -290 -179 -207 -106
1966a06O8p6J13j78R3R0r8k4J53n2mm0n9K5N2J23j07j3J0O3p3j47J31N7j60K75
$$ -106 -38 -114 -1 -179 -86 4 -94 -118 35 -17 -21 -61 -120 -95 -43 80 -27 -40 -30 33 -40 -187 -56 1 -159 116
1992A16Rk14K1j02J04J31o6j83J90K3Q1j09j09O2Rm7k2M6J53Mlm3J96j53m0P3
$$ 116 125 -89 -68 -170 -66 65 -1 -184 6 29 110 1 -108 -46 -37 -84 -106 -60 93 97 94 51 247 94 54 127
2018A27j04%n4J87j91j6K07l7j2j63J15Q0j50K12j6j13M7j59P3p7M6j67J60r4
$$ 127 23 23 -31 156 -35 -51 156 119 107 -56 59 139 -11 201 185 72 119 -40 33 -44 2 -165 -5 -99
2042i9K69j54%J5m1K09k24J57k36n5J39n1k04J62K9j05J86q8M8n6%o7R3J14k6
$$ -99 170 16 16 31 -10 199 -25 132 -104 -159 -20 -71 -275 -113 -84 -189 -3 -91 -43 -99 -99 -166 -73 41 15
2067A5K7p7m2P3n6J26r2p9K13n8J4j81kJ8J42p2l2j8J27j31j31J75K1L6R0k00
$$ 15 42 -35 -77 -4 -60 66 -26 -105 108 50 64 -117 -119 -101 41 -31 -63 -81 46 -85 -216 -41 -20 16 106 -94
2093i4l9J65J6J11k26L8Ok47K21P4K19j08j22L6Nj2q7J68n2k36K66j15r6P8j05
$$ -94 -133 32 48 159 -67 -29 -23 -270 -49 25 244 136 14 50 55 43 -44 124 72 -164 102 -13 -109 -31 -136
2118a36K13j99L18j04j71k0P2o6n9Q5N3P7PJ12k44J65r3q7J22j33N6M5j90j32
$$ -136 77 -122 196 92 -79 -99 -27 -93 -152 -67 -14 63 70 182 -62 103 10 -77 45 -88 -32 13 -177 -309
2142c09J43J56j09Q7R7j59o9J85m2j9J3j21j3K95j04j09P5J35r0m4j3m8n6J51
$$ -309 -166 -10 -119 -32 65 -94 -163 22 -20 -39 -26 -147 -160 135 31 -78 -3 132 42 -2 -15 -63 -119 32
2166C2r4J12r3n8M2m9J93j31R4j25O8K9j3j4J9M8k9N7j8l4P4K4K9j41J54j07J18
$$ 32 -62 50 -43 -101 -59 -108 85 -46 48 -77 -9 20 7 -7 12 60 31 88 70 36 110 134 163 22 176 69 187
2193A87m05K80j48J73r4P0p5J52r3J06K6k06J61k03j7J61j1j40J19l4l7K2J5Q1
$$ 187 -218 62 -86 87 -7 63 -12 140 47 153 179 -27 134 -69 -86 75 64 -76 43 9 -28 -6 9 90
2217I0j20nOlJ98l00R5n7qJ29J41l17L8N3qJ44J30j87j69J63j14K58r5q3K79k23
$$ 90 -30 -35 -29 -32 166 -134 -39 -96 -104 25 166 -151 -113 -60 -68 76 206 19 -150 13 -101 157 62 -21 258 35
2243C5j42J23r3ML4J36j88J10k7o9m4J34M0j04J29l3j28j17K08j47O8J82r8j96
$$ 35 -107 16 -77 -73 -39 97 -91 19 -8 -77 -121 13 53 -51 78 45 -83 -200 8 -139 -71 111 13 -183
2267a83O0K01k00L21j88m4K30m8k4J6j85K3k6k0J0L9J19m5j72J45Q9m3k55L26
$$ -183 -123 78 -122 199 11 -33 197 149 125 141 -44 -21 -47 -67 -57 -18 101 56 -116 29 118 75 -180 146
2291A46j49J23R0o7j26J40K7k53K88q9j19o4K0J66n3j70m2J67p6M0k29M35l35
$$ 146 -3 120 210 143 17 157 184 -69 219 130 11 -53 -33 133 80 -90 -132 35 -41 -1 -230 205 -130
2314a30M7L7N3o4L6J11j90jQM0j13K13k27K8J19J23j38q1J92k11J52N5p1j95K07
$$ -130 -83 -46 7 -57 -21 90 -100 -101 -93 -53 -166 47 -180 -152 -33 90 -48 -129 63 -148 4 59 -12 -207 0
2339@j42J08J04k9m9j21N2M1J6r6J45r0K02l17J69K07k15o6O1m8j3J75j19N4l6
$$ 0 -142 -34 70 41 -8 -129 -77 -36 -20 -116 29 -61 141 -176 -7 200 -15 -81 -20 -68 -81 94 -25 29 -7
2364gM4n2K0l0o2J98Q2j27q9Q8ln4p6K06j21K9J12k56R6J4Pj43K4n6J66n9J84
$$ -7 37 -15 5 -25 -87 111 193 66 -23 65 62 8 -68 138 17 46 158 -98 -2 12 19 -124 -100 -156 10 -49 135
2391A35k05L2J15q8o4O8Q4k26J38l1j10K16l20L05M9j04k11J31R4r2%P5q0j7K3
$$ 135 -70 -38 77 -11 -75 -7 77 -149 -11 -42 -152 64 -256 49 98 -6 -217 -86 8 -84 -84 -9 -89 -106 -83
2416h3j50L19k09k8L6N9M3N2j67J34j45J28Q9j7l1q7J10pLp5r2J07N8j6Jk8k9
$$ -83 -233 86 -123 -151 -115 -56 -13 39 -128 6 -139 -11 78 61 30 -57 53 46 49 -26 -118 -11 47 31 32 4 -25
2443b5k5J29j81J16m5O2p6N1K09k21P4M5o1J01j49K21j17N4k42K24j61l0m3K56
$$ -25 -50 79 -102 14 -31 31 -45 6 215 -6 68 113 52 153 4 225 108 162 -80 144 -17 -47 -90 166
2467A66j99n3K60o0j23N7R7j79jK0n0O3o2J25j17j1P1q9P2L5j34K8J24L6l2K2
$$ 166 -33 -86 174 114 -9 48 145 -34 -35 -15 -65 -2 -64 61 -56 -67 4 -85 -13 22 -112 -84 40 76 44 66
2493F6Q7j11j21J35j04M9r2ml2K24m3j19J07K3r9p3M2KN0R5j06j29J3L3m3Q5L8
$$ 66 153 42 -79 56 -48 1 -91 -95 -127 97 54 -65 42 65 -34 -107 -65 -63 -13 82 -24 -153 -140 -107 -150 -65 -27
2520b7o1J03j57J41j30J17N6P1Jj76L5K43k78J4J2R6NM5q5N7l3j65J99R1l3j60
$$ -27 -88 15 -142 -1 -131 -14 42 113 114 -62 -27 216 -62 -48 -36 60 65 110 25 82 49 -116 83 174 141 -19
2546a9m4k6L2N4NO7Q4j51M1l3j19oJ19Rj03K72j82k19K73j16j11K99q9n2N7k27
$$ -19 -63 -89 -57 -3 2 69 153 2 43 10 -109 -115 4 13 -90 182 0 -219 54 -62 -173 126 37 -15 42 -185
2572a85L4J47k2k5rl2K4N9K6N3j59K6N5J3p4N6qp1R7Q5j57M8q3K05j23j07O0L3
$$ -185 -151 -4 -26 -51 -60 -92 -68 -9 17 70 -89 -63 -8 5 -69 -13 -21 -92 5 90 -67 -19 -102 103 -20 -127 -67 -34
2600c4n4K1p5J23K0J69k73J40o2R0j93J24Q7j13Nj8j17K01r3J96j47J0O9r4l8
$$ -34 -88 -67 -142 -19 1 170 -103 37 -25 65 -128 -4 83 -30 -25 -43 -160 41 -52 144 -3 7 76 -18 -56
2625e6k8L10k38K7J24Lj12j13Q9J02n9j85J81M6k19K06j36lK1K9M4M6l2j80K49
$$ -56 -84 226 -12 15 139 142 30 -83 6 108 49 -136 45 91 -128 78 -58 -61 -40 -11 33 79 47 -133 116
2650A16j52J3J10n0L0m0R4J3k47K8Q5L2j6J58k01R5J7r9j34K14r7J13j56J44r3
$$ 116 -36 -23 87 37 67 27 121 134 -113 -85 0 32 16 174 -27 68 85 -14 -148 66 -31 82 -74 70 -23
2675b3m1L3J34l0k28J08m9J39j00J04r0J56k14L7j5L1j4J59k19R1J29j33M5r2
$$ -23 -64 -31 103 73 -155 -47 -96 43 -57 47 -43 113 -101 -64 -79 -48 -62 97 -122 -31 98 -35 10 -82
2699h2n2K94j86Q3r1K5p9k7J18O6n4J9j26J49k5j29P2j4Ll7p9K30j24J60j80j7
$$ -82 -134 160 -26 57 -34 -9 -88 -115 3 69 15 34 -92 57 32 -97 -25 -39 -36 -73 -152 78 -46 114 -66 -83
2725h3L7J81k08j27K43m2p4qL2K0J23n5pM2K8j70O2J33j56R3r1J24j89m7P4Q2
$$ -83 -46 135 -73 -200 43 1 -73 -81 -49 -29 94 39 32 74 102 -68 -6 127 -29 64 -27 97 -92 -139 -65 17
2751A7j09M1o0K08r3r8J77o3j07J05q4O0qN4j58L5R9Mj72K04r0mj9O2p5r2j7L38
$$ 17 -92 -51 -111 97 4 -94 83 20 -87 18 -66 -6 -14 40 -118 -83 16 20 -152 52 -38 -42 -61 1 -74 -166 -183 155
2779A55j71LP1j7mj02r3J24K67k76NJ13On2J16k45K54j31M1p6j01K9J52j3p0l5
$$ 155 -16 -13 58 41 37 -65 -158 -34 233 -43 -38 75 81 29 145 -100 154 23 64 -12 -113 -84 68 55 -15 -50
2805e0j31L05j32R8j01K22k05Np0O5K9k67L33j1N6p9j80K2K76k01Q3n9J51j98
$$ -50 -181 124 -8 90 -11 211 6 11 -59 6 35 -232 101 90 146 67 -113 -91 185 -16 67 8 159 -39
2829c9O5L4k0j10O4l1q0K2K19M9j99mk6N2l4O2P4m3k03J49kk4O2p1j00J3J84j49
$$ -39 26 60 40 -70 -6 -37 -117 -95 124 173 -26 -30 -56 -4 -38 24 98 55 -148 1 -1 -25 37 -34 -134 -121 63 -86
2857h6M7Q7j8k33J40M9q8L47l76K49j56n2lMK9K4p5J68k10J00J2nJ02k4r5J92
$$ -86 -39 48 30 -203 -63 -14 -102 245 -131 118 -38 -90 -93 -89 -60 -36 -111 57 -153 -53 -41 -46 56 32 -63 129
2883A29j75j12J85n5MJ00l8Nj1k9J37j74N9k3R0j26Q6l9Q3N1k84K18j9j74P4k0
$$ 129 -46 -158 27 -28 -24 76 38 43 32 3 140 -34 25 2 92 -34 52 13 96 147 -137 81 62 -112 -38 -58
2909e8j3J25K6j27n2J00j19N9l5O6j4L6j17J67o9J5l7p0J38m8J36j06L3j47P5
$$ -58 -71 54 80 -47 -99 1 -118 -59 -94 -28 -42 -6 -123 44 -25 -10 -47 -117 21 -27 109 3 36 -111 -36
2934c6r9K96k12J82k79P3l4J8P4n9N8J23o9lj7o4Q8K8k0k45K76j19L8k1J73k32
$$ -36 -135 161 -51 131 -148 -75 -109 -91 -17 -76 -18 105 36 33 16 -48 40 68 48 -197 79 -40 -2 -23 150 -82
2960h2q3J14Lj18K15k43J07J37j20POQ4p1R7K7j57J4Q0j25J70k23J27J35j02j15
$$ -82 -165 -51 -48 -166 49 -194 -87 50 -70 -63 -57 27 -44 53 80 -77 -63 17 -108 62 -161 -34 101 -1 -116
2985a16K49k19J66N7lj29NL7n7j9J99K2j58L8r6q6J67O0j33J75j55o2N3J2N8l8
$$ -116 133 -86 80 137 134 5 10 47 -10 -29 170 192 34 72 -24 -110 57 117 -16 159 4 -58 -5 7 65 27
3011B7r3Q5J6j30J20r8J51j60J36L3j28m7J11RR7p9j32R3J70k31n8L4P0m9o4J15
$$ 27 -66 19 35 -95 25 -73 78 -82 54 87 -41 -88 23 32 129 50 -82 11 181 -50 -108 -74 -4 -53 -117 -2
3037bj36L0P8m0J71n7r2R5k8r5nK05k20Q7j27P4Q5j01o6K18%K2k37P6K22k1j16
$$ -2 -138 -108 -30 -70 101 44 -48 47 19 -76 -81 124 -96 -9 -136 -62 23 -78 -144 74 74 96 -141 -65 157 136 20
3064B0lP6j38K02j83O1Q5k0p4M6m1Q4j23PJ6j19N7MN4M9p8R1o2j06J27M1J6k03
$$ 20 17 93 -45 157 -26 35 120 100 26 72 31 115 -8 -1 15 -104 -47 -43 11 60 -18 73 11 -95 32 73 89 -114
3092a14m5K55n1K0K8j18L20k35j2O6j62J03j95J67r5N3J02R9m63K71L9j07K7q9
$$ -114 -159 96 45 65 93 -25 295 60 48 114 -48 55 -140 27 -68 -15 87 186 -277 -6 33 -74 -47 -136
3116a36J97K4m0q9K5M5JL6j48J42j32M4K7L0K3k0j55J13p8j4J71n0R1j77M7j7
$$ -136 61 85 45 -44 -19 26 27 63 -85 57 -75 -31 -4 26 49 29 -126 -13 -91 -105 66 16 107 -70 -23 -40
3142d0O0j47J22q2J07k9k04O5L11j10j17M2l2p8M8kK27o9l6o3L6Mq2K21k45M3
$$ -40 20 -127 -5 -87 20 -9 -213 -148 163 53 -64 -22 -54 -132 -84 -86 141 72 36 -27 9 13 -69 152 -93 -50
3168e0qK20j30o2LP0j07J77j09r4J59j16K97l12J08q6o3J15o7P3p7J34q2q9l8
$$ -50 -58 162 32 -30 -27 43 -64 113 4 -90 69 -47 250 -62 46 -40 -103 12 -55 18 -59 75 -7 -96 -134
3193a34K37k16K6J54j19J05p0O8p6L4l8R1j01J05j35l5R6k31J07L89l56J69r0
$$ -134 103 -113 -87 67 -52 53 -17 51 -25 9 -29 62 -39 66 -69 -104 -8 -239 -132 257 -99 70 -20
3216b0j15K02j42R0P4j04r5J54j3j01K5K04j74o8j12K37k0R5m1J4j19R4n7K2j05
$$ -20 -135 67 -75 15 89 -15 -110 44 31 -70 -45 159 -15 -83 -195 42 22 117 76 90 -29 65 8 30 -75
3241g5K7J82k03Q0n0J1m7J96k16J33n4J24p3n3J42k6K0j61M5p8J48l7j07k6J34
$$ -75 -48 134 -69 11 -39 -28 -75 121 -95 38 -16 108 35 -18 124 98 118 -43 2 -76 72 35 -72 -98 36
3266C6J11k00M7j8J53j63NJ11K4k31K24j01j13M0l3J23Q4J06k83m7n9K71o8J9
$$ 36 147 -53 -6 -24 129 -34 -29 82 106 -125 99 -2 -115 -75 -108 15 99 205 -78 -125 -184 87 19 38
3290C8j53J15L0Nr4J48j63Q8p4K5j33J70q7l8K49k67J96mn9k2J20j24J91l06J48
$$ 38 -115 0 30 35 -59 89 -74 14 -60 -35 -168 2 -85 -123 126 -141 55 51 -8 -30 90 -34 157 -149 -1
3315aj16J10j24J45q5J06k5j5m9O5L7p5q7K32J06k16o4N6n7M1m0J70r2J3q3N1
$$ -1 -117 -7 -131 14 -71 35 10 -5 -54 11 48 -27 -114 118 224 8 -56 0 -57 -16 -56 114 22 35 -48 3
3341CJ31m8p5PJ9j03k4P1K2M7q2K4q4J36O1L2k44J08l6k50L99j20PK8JL3o6J09
$$ 3 134 86 11 18 37 -66 -90 -19 3 50 -32 -8 -92 44 105 137 -107 1 -35 -285 114 -6 1 29 30 63 -3 106
3369A06k08J26r4LJ94j03P6j79o4J54j47l1M62k39j59J51l6m1J05l7k32K41j03
$$ 106 -102 24 -70 -67 127 24 100 -79 -143 11 -136 -167 295 56 -103 48 12 -29 76 39 -193 48 -55
3392e5L1M7j54J54l7N5oo4m1J35l9p7j3L1n8m0J44Q4j50Q1j03K2J9O2o0P8q9R5
$$ -55 -24 23 -131 23 -14 41 35 -29 -70 65 26 -51 -64 -33 -91 -131 13 97 -53 28 -75 -53 -34 28 -32 46 -43 52
3420E2L3k3l0l8j6m7J10q0k6J56J6K2j31n0l8J67j74J23R8j97M6P8j54Q2m0J21
$$ 52 85 62 32 -6 -22 -69 41 -39 -65 91 107 129 -2 -52 -90 77 -97 26 124 -73 -27 51 -103 -21 -61 60
3446F0j16L7J37j59P6k8N6q9k1j9P5R4j61K47j75%lo9K40j59J25j07j7p4M6j14
$$ 60 -56 -19 118 -41 35 7 63 -26 -47 -66 9 103 -58 189 14 14 11 -58 182 23 148 41 24 -50 -4 -118
3472a18O6j4K17j57j36Q9K3n2J06j37M2Q2l9R6j38J43j06J7J30r4Q4j16MnM8K9
$$ -118 -52 -66 151 -6 -142 -53 -30 -82 24 -113 -71 11 -28 68 -70 73 -33 -16 114 20 104 -12 -8 -13 35 64
3498F4k70P5Q1K07l22J90N6p3j61J84M2N7j38K6J9pn7R8l9J59l76j8J76J12n5
$$ 64 -206 -131 -50 157 -165 25 81 8 -153 31 73 130 -8 18 37 30 -27 71 32 191 -185 -203 -27 85 30
3523C0j30P8R1j11q2M8p9J94r5J36N9r7k65L38k25J77o1l2m3J01j11L6J50k12
$$ 30 -100 -22 69 -42 -124 -76 -155 39 -56 80 139 42 -223 115 -110 67 6 -26 -69 32 -79 -43 107 -105
3547a05J17L2M2J9l2m3j75O2l8R4rN5J39q6N4o5j34J37M9j39j28J74J94k61R1
$$ -105 12 44 86 105 73 30 -145 -83 -121 -27 -36 19 158 72 126 61 -73 64 113 -26 -154 20 214 -47 44
3572D4j01Oj18J70j85K11m7l3jQ8k0N5Jj06Lr8L27j29R9k74J49j52J69j1j60j4
$$ 44 -57 -51 -169 1 -184 27 -20 -53 -54 34 14 69 70 -36 -33 -131 196 67 166 -108 41 -111 58 47 -113 -127
3598a27L0J45o0o8NJ43R4j97M7n3l0lj4j38K98l3OK1j24N1K3m6j78J68m4O4k3
$$ -127 -97 48 -12 -80 -75 68 162 -35 12 -41 -71 -74 -88 -226 72 39 45 66 -58 -7 16 -30 -208 -40 -84 -20 -43
3625d3l3J49n4m5m3R5p8J68k15M3J12q8j8K6j06Q6J13j13J4k7J14n8N9j17J8o7
$$ -43 -76 73 19 -26 -69 26 -52 116 -99 -56 56 -32 -50 -24 -130 -44 69 -44 -30 -57 57 -1 58 -59 -41 -108
3651a08O3J20k03NJ1K10m7O5j76k8M6P7r6J49j86Q2r4K78j54Q8j23N3m3j54J58
$$ -108 -45 75 -128 -123 -112 98 51 116 -60 -88 -42 35 -61 88 -98 -16 -110 168 14 102 -21 32 -11 -165 -7
3676gm9L2R1j40M3J47j46M3j1j41o7L43r5J20p1j16K4M1n2QL5N4j96O1R2OO0k01
$$ -7 -56 -24 67 -73 -30 117 -29 14 3 -138 -205 138 43 163 92 -24 0 41 -11 -3 32 86 -110 -49 43 49 109 -92
3704i2K59n0p5j0j41J46k0J66j84O9Q1j42p3q3J26k5K5j79K4Q8Q3k9k4J61q0P2
$$ -92 167 117 42 32 -109 37 17 183 -1 68 149 7 -66 -149 -23 -48 -23 -202 -178 -90 -7 -36 -60 101 21 93
3730I3j0m4oj39L3Q9m9mJ35p4j2L0J5k14J21o8p9N9K37k00J44r3j45J81p4J9Q7
$$ 93 83 39 33 -106 -73 16 -33 -37 98 24 12 42 57 -157 -36 -104 -183 -124 113 -87 57 -36 -181 0 -74 -55 32
3757C2j00j0Q2O2m5n6j57J50M1J32j03r1mj6L12l15J97J5j72J22j04M3o1J67l82
$$ 32 -68 -78 4 66 21 -35 -192 -42 -1 131 28 -63 -67 -83 229 -86 111 126 -46 76 -28 15 -46 121 -261
3782b61K97l5pJ11k51N0Q7L5j38J05j04K13l4r4M1P1n6J95k01L3J42n6Lp4o6R
$$ -261 36 1 -6 105 -146 -96 -9 26 -112 -7 -111 102 68 -26 15 86 30 225 24 57 199 143 146 72 6 15
3808A5J01m0l8K9O5k18K00r4k2J36j81L2k41L03L8q8p1N9K6J17p4o4n1J76k22
$$ 15 116 76 38 67 132 -86 114 20 -2 134 -47 -15 -256 47 85 -3 -74 -15 11 128 54 -10 -61 115 -107
3833a07R3K0ll7J24k01J75q6l8J75q7q2J2K9O5j60Q9Nj2J94j21j01J5j21J46J17
$$ -107 -14 6 3 -34 90 -111 64 -22 -60 115 28 -54 -42 -13 52 -108 -19 -14 -26 168 47 -54 -39 -160 -14 103
3859A03k1j63R2o3p5K0RQ4Q5o4J1Q9j70M3r3K03k19KJ0m2J56J67j55J0P8j44K19
$$ 103 82 -81 11 -52 -127 -107 -98 -14 71 7 18 107 -63 -20 -113 90 -129 -127 -117 -159 -3 164 9 19 97 -47 172
3886A72k24j37L1J61m1M4K4r2J21k6j28J37kJ01m1j90j1P6o1R1O1J61k05J01k93
$$ 172 -52 -189 -158 3 -38 6 30 -62 59 33 -95 42 40 141 100 -90 -101 -25 -86 5 66 227 22 123 -170
3911a70O6L5J63k78J56j9N9J09l42Q4k7K24j36J32j14J37n8L3j35K4r5J33Kj00
$$ -170 -104 -69 94 -184 -28 -47 12 121 -221 -137 -164 60 -76 56 -58 79 21 54 -81 -57 -152 -19 -17 -117
3935a17J53r8M2l6L5oj60K36k9MO7k0K5n8k62K31j30N5K08j20K2j92j8K14l4K7
$$ -117 36 -62 -20 -56 -21 -27 -187 49 20 24 91 71 96 38 -224 7 -123 -68 140 20 42 -150 -168 46 12 39
3961C9l9o9M3Q3L5j6l21J81J26j80J46Q1j51N5j18O1L5m7O5j29j9L6J87k20J37
$$ 39 0 -69 -26 57 92 76 -245 -64 62 -118 28 109 -42 13 -105 -44 -9 -56 9 -120 -139 -103 84 -136 1
3986AQ7j8o0k4L8q3J19j53M4m2N7q4K13q5M9l3j4n6M0M7k1l8j58K19j91J38r6
$$ 1 88 70 10 -14 24 -59 60 -93 -49 -91 -34 -118 95 10 59 26 12 -44 -4 43 22 -16 -174 45 -146 -8 -104
4013a04J51O5q9q3J16Pr3k6kkk8K9J6Pl7r5K52j63O4r1R9qj6J33n1J00l00P8J88
$$ -104 47 112 23 -60 56 63 -30 -56 -58 -60 -88 -59 -43 -36 -73 -168 84 -79 -15 -106 -7 -15 -31 102 51 151 -149 -71 117
4042A17j42k3J6kN7n6j72M7J36J4M9J21J0j83J2PM1q0J18J08j40K1j69K42j91
$$ 117 -25 -48 -32 -34 23 -33 -205 -158 -22 -8 41 162 172 -11 1 8 49 -31 87 195 55 76 -93 149 -42
4067d2K67l05K42n2Po9o0o8J08j96MJ64K4j27J79j61k3P2J68j40j18J47p5j13
$$ -42 225 -80 162 110 117 48 -12 -80 28 -168 -164 0 24 -103 76 -85 -108 -36 132 -8 -126 21 -54 -167
4091a67L71m07Q7J32j16J58j04J80q2L5N3j95M9q0kK26k03J88n8l9k4J9k7o1J27
$$ -167 204 -203 -116 16 -100 58 -46 134 52 87 140 -55 -6 -86 -88 138 -65 123 65 26 2 21 -6 -67 60
4116F0o9l1J84jr6q9MP8J0J5j07k3k1oJ02MJ02k26N4L4K9oj46J86R4r2n0M6j28
$$ 60 -9 -40 144 143 47 -42 -38 40 50 65 -42 -65 -86 -92 10 14 116 -110 -56 -22 7 1 -145 41 135 43 -7 39 -89
4145h9N1K52k27J31m5j42J07q2J32j6k01Q7L17l93J2O3J55j9P9j34K4j04R5o1
$$ -89 -38 214 -13 118 73 -69 38 -44 88 72 -129 -42 275 -118 -106 -43 112 93 172 38 62 -42 53 -8
4169hj5J10j39k7K3P0r2J00J28q7q9j29J01p8o6J17O9k2k5mJ21o9M5N6o1L8j77
$$ -8 -23 87 -52 -79 -56 14 -78 22 150 63 -26 -155 -54 -132 -198 -81 -12 -34 -59 -63 58 -11 34 90 29 67 -110
4196a10J91o3k67J35J55o6J2J74j14j19J00Q1l9p9o8L1J91l30O2K80j31j11J4
$$ -110 81 18 -249 -114 41 -25 -13 161 47 -72 28 109 70 -9 -77 -46 145 -185 -123 157 26 -85 -71
4219g1L06k35M2k1M8q2K7M6jr0o9P1Q0n1Nk7R0Jj74K48j52m9P6j88K78l2o4J33
$$ -71 235 0 42 21 69 -13 14 60 59 -31 -100 -29 51 0 5 -22 68 69 -105 143 -9 -58 18 -170 108 76 12 145
4247A45j30l6J7R8n8n4j0qN6%J2j66M1nJ21j31J86O3K5j49j1o2N8p5M7j92J75
$$ 145 15 -21 -4 94 36 -18 -28 -36 20 20 32 -134 -93 -98 23 -108 78 141 166 17 6 -56 2 -73 -26 -218 -43
4274d3K29k60J12J20m60K34J90n7m4Q9P7j38j25L1K34l40JJ16J58j72m5Q0PJ70
$$ -43 186 -74 38 158 -302 -68 122 65 21 110 187 49 -76 -45 189 -151 -150 -34 124 -48 -93 -13 -6 164
4298A64m4K7k34Q9M9P2l54K80p5J41p7k66J57q2Q9L0o0J72j18oQ3j3n0%q4J25
$$ 164 120 147 -87 2 51 123 -231 49 -26 115 38 -228 -71 -153 -64 -34 -94 78 -40 -46 37 24 -26 -26 -110 15
4324A5j59M1J54R6m7j45N6p2Q3j71J29J7N1p2p0j0J86o1J81o5n5j16N5K79j10
$$ 15 -144 -103 51 147 100 -45 11 -61 22 -149 -20 -3 48 -24 -94 -104 82 21 202 137 82 -34 21 300 190
4349A90j77j5n8L5mk0J93m7k9JJ9n4k06K20OJ45j92o0Q3J35r9q0R8j74J67n9j16
$$ 190 13 -2 -60 -25 -29 -49 144 97 68 69 88 34 -172 48 54 199 7 -53 30 165 66 -14 84 -90 77 18 -98
4376i8k4P5J36k5j77K28j23K8M3l8k7j43P6j2M4o1r3K51k2p3j25J89j22O7N1o0
$$ -98 -122 -47 89 64 -113 115 -8 20 63 25 -2 -145 -69 -81 -37 -98 -191 60 38 -35 -160 29 -93 -26 25 -35
4402c5J57K1p4k2l5p1o5Q1%J19p0m2J07n4J65j15j13O5j3n5O8j4N1j07R0q9J14
$$ -35 122 143 69 47 12 -59 -124 -43 -43 76 6 -36 71 17 182 67 -46 19 6 -49 19 5 56 -51 39 -50 64
4429F4p4oO9M7op5j18J14J27j93J47p0j0O6o6J2j46M6J0L2j06K30o6l5o4j25J38
$$ 64 -10 -16 53 100 94 19 -99 15 142 -51 96 26 16 82 16 28 -118 -72 -62 -30 -136 94 28 -7 -71 -196 -58
4456e8J32o1P5k39Q0J6m6J57j78P4P1j36j9P1Nk7j0J74j06J30k69m7K67L6m9j04
$$ -58 74 13 88 -151 -71 -55 -101 56 -122 -48 23 -113 -132 -61 -56 -83 -93 81 -25 105 -164 -211 56 92 43 -61
4482f1J46j51n6J98j4r2J7J3j85J75p3j41L71j32L9j20N7O1P7j02J3L3j60J02
$$ -61 85 -66 -122 76 62 -30 -13 0 -185 -10 -83 -224 147 15 54 -66 -9 52 129 27 40 73 -87 15
4506A5R8J4r8j3P0j87L5L3K21j99J12j69R9m0r6L9P9p8N1J23j09J05q6qj01J45
$$ 15 113 127 29 16 86 -101 -66 -33 188 -11 101 -68 31 -9 -105 -66 13 -65 -14 109 0 105 19 11 -90 55
4532E5k4nN6K8j32L2j63J21Oj45J49J9K9n3JR7k35L37k09P0P8p3k8j52k2K35j23
$$ 55 31 26 82 110 -22 10 -153 -32 -26 -171 -22 -3 26 -27 -26 71 -164 173 -36 34 112 39 11 -141 -163 72 -51
4559e1Q2km9j8K6p7J23J20j53J44k02J20P1k12J35j23j11K44j15k8K51o0k28R8
$$ -51 31 29 -20 -38 -12 -89 34 154 1 145 -57 63 134 -78 57 -66 -177 67 -48 -76 175 115 -113 -15
4583a5O4o2J02j44J78k4j47N0J1j4J11j83k4J91j75J40M5j86N6J62j88j15K42
$$ -15 49 -13 89 -55 123 99 -48 2 13 -1 110 -73 -97 94 -81 59 104 -82 -26 136 -52 -167 75
4606G5j22J10j91L03k0j5j36l9p8K2O3j51P3L18l37J49j2j3Q9j83K16k86R3J7
$$ 75 -47 63 -128 175 155 140 4 -35 -113 -91 -28 -179 -106 212 -125 24 12 -1 88 -95 121 -165 -72 -55
4630e5M5k3R8o6J06k62J98j93J99l5n5Q1M0J6Rn6j43J50j55J76nj5j19K06j37
$$ -55 -10 -33 65 -1 105 -157 41 -152 47 12 -43 38 78 94 103 47 -96 54 -101 75 70 55 -64 142 5
4655EN1k9K04j14n0P3pj94N4jn4k6n3R5k5K52l8L0r1k31K05o3J02j75M3j7J89
$$ 5 56 27 231 117 67 140 133 -61 -7 -8 -62 -88 -141 -46 -71 181 143 173 82 -149 56 -7 95 -80 -37 -54 135
4682A35r2k5j19M7J40j88J13m8J08lj11J01Kj5L8K5l33K68o3J58noN3j81M0j99
$$ 135 43 18 -101 -54 86 -102 11 -37 71 68 -43 58 60 45 83 108 -225 43 -20 138 133 127 180 -1 39 -160
4708a60J99J37m5j29N3j9k04j2K38rj23J16j5m1J11j82J02p4M6QN2K0m2J9j24
$$ -160 39 176 131 2 55 36 -168 -180 58 49 -74 42 27 -14 97 -85 17 -57 -11 -3 49 69 27 46 -78
4733g8J23q4J93l8j00m5N0R2N4k97J31j09K55k23O5M9l1P8r4N3j51J98k05l2J68
$$ -78 45 -39 154 116 16 -29 21 113 167 -130 1 -108 147 -76 -11 38 7 85 -9 44 -107 91 -114 -146 22
4758B2n0k4O7r0J23J73j52o5J24m2l5Q1l90J18L8J34K19k56J02j34O2j3J62q6
$$ 22 -28 -52 15 -75 48 221 69 4 128 86 51 132 -258 -140 -102 32 251 -5 97 -37 25 12 174 88
4782H8p8j31L4j7J65L7j12m3J18l4j08m7J64l6r5J39j17J29k79J12K18j07q2R
$$ 88 10 -121 -87 -104 61 98 -14 -57 61 27 -81 -128 36 0 -95 44 -73 56 -223 -111 107 0 -82 -73
4806g3Q8q8K6Q2q4J39j9j07k0O4q7O9L2j18R7R0j24p2J4J94J6m2p6j1K7o4j11
$$ -73 15 -73 -47 35 -49 90 71 -36 -56 8 -79 -10 22 -96 1 91 -33 -105 -91 103 119 77 1 -10 17 -47 -158
4833a58Q4K30j09p8K2P0O3j88M2r3N9J96o8j04O5p1O7M3j96P1J53l8L8k65K58
$$ -158 -74 156 47 -31 -9 61 124 -64 -22 -115 -56 140 72 -32 33 -38 29 72 -124 -53 100 62 100 -165 93
$$ [...]
8191f
##END NTUPLES=NMR FID
##END=
