##TITLE=1H_SR69_k2
 CDCl3, 32 sc, 
 9.07.2021
##JCAMPDX= 6.0         $$ Bruker NMR JCAMP-DX V2.0
##DATA TYPE= NMR FID
##DATA CLASS= NTUPLES
##ORIGIN= UXNMR, Bruker Analytische Messtechnik GmbH
##OWNER= root
$$ XWIN-NMR		Version 3.5
$$ Fri Jul  9 12:53:24 2021 Russian Standard Time (UT+4h)  she@DPX200
##.OBSERVE FREQUENCY= 200.131506
##.OBSERVE NUCLEUS= ^1H
##.DELAY= (6, 6)
##.ACQUISITION MODE= SIMULTANEOUS
##.ACQUISITION SCHEME= undefined
##.AVERAGES= 32
##.DIGITISER RES= 18
##SPECTROMETER/DATA SYSTEM= spect
##.PULSE SEQUENCE= zg30
##.SOLVENT NAME= CDCl3
##.SHIFT REFERENCE= (INTERNAL, CDCl3, 0, 15.7039)
##AUDIT TRAIL= $$ (NUMBER, WHEN, WHO, WHERE, WHAT)
$$ ##TITLE= Audit trail, XWIN-NMR		Version 3.5
$$ ##JCAMPDX= 5.01
$$ ##ORIGIN= Bruker BioSpin GmbH
$$ ##OWNER= she
$$ F:/spectra/data/she/nmr/H-F/1/audita.txt
$$ ##AUDIT TRAIL=  $$ (NUMBER, WHEN, WHO, WHERE, WHAT)
(   1,<2021-07-09 12:51:44.62 +0400>,<she>,<DPX200>,
      <continue with go, POWCHK disabled, PULCHK disabled
       configuration hash MD5:
       00 E9 B6 7A A2 85 ED C7 34 08 36 98 17 FE 4E 26
       data hash MD5: 16K
       42 4C D8 D1 8C 4D B5 79 C9 FE 1C 4E 1B 15 F1 46>)
$$ ##END=
$$ 
$$ hash MD5
$$ 2D 38 DC A1 98 E8 47 86 D6 06 82 FE E4 C3 7B 7D
##$RELAX= 
##$RELAX= 
##$RELAX= 
##$RELAX= 
##$RELAX= 
##$RELAX= 
$$ Bruker specific parameters
$$ --------------------------
##$DU= <F:/spectra>
##$EXPNO= 1
##$NAME= <H-F>
##$PROCNO= 1
##$TYPE= <nmr>
##$USER= <she>
##$AMP= (0..31)
100 100 100 100 100 100 100 100 100 100 100 100 100 100 100 100 100 100 
100 100 100 100 100 100 100 100 100 100 100 100 100 100 
##$AQSEQ= 0
##$AQ_mod= 1
##$AUNM= <au_zg>
##$AUTOPOS= <>
##$BF1= 200.13
##$BF2= 200.13
##$BF3= 200.13
##$BF4= 200.13
##$BF5= 200.13
##$BF6= 200.13
##$BF7= 200.13
##$BF8= 200.13
##$BYTORDA= 1
##$CFDGTYP= 0
##$CFRGTYP= 5
##$CHEMSTR= <none>
##$CNST= (0..31)
1 1 145 1 1 1 1 1 1 1 1 1 1 1 1 1 1 1 1 1 1 1 1 1 1 1 1 1 1 1 1 1 
##$CPDPRG= <>
##$CPDPRG1= <>
##$CPDPRG2= <>
##$CPDPRG3= <>
##$CPDPRG4= <mlev>
##$CPDPRG5= <mlev>
##$CPDPRG6= <mlev>
##$CPDPRG7= <mlev>
##$CPDPRG8= <mlev>
##$CPDPRGB= <>
##$CPDPRGT= <>
##$D= (0..31)
0 1.2 0 0 0 0 0 0 0 0.06 0 0.03 0 0 0 0 0.0002 0 0 0 0 0 0 0 0 0 0 0 0 
0 0 0 
##$DATE= 1625820591
##$DBL= (0..7)
120 120 120 120 120 120 120 120 
##$DBP= (0..7)
150 150 150 150 150 150 150 150 
##$DBP07= 0
##$DBPNAM0= <>
##$DBPNAM1= <>
##$DBPNAM2= <>
##$DBPNAM3= <>
##$DBPNAM4= <>
##$DBPNAM5= <>
##$DBPNAM6= <>
##$DBPNAM7= <>
##$DBPOAL= (0..7)
0.5 0.5 0.5 0.5 0.5 0.5 0.5 0.5 
##$DBPOFFS= (0..7)
0 0 0 0 0 0 0 0 
##$DE= 6
##$DECBNUC= <off>
##$DECIM= 32
##$DECNUC= <off>
##$DECSTAT= 4
##$DIGMOD= 1
##$DIGTYP= 9
##$DL= (0..7)
0 120 120 120 120 120 120 120 
##$DP= (0..7)
150 150 150 150 150 150 150 150 
##$DP07= 0
##$DPNAME0= <>
##$DPNAME1= <>
##$DPNAME2= <>
##$DPNAME3= <>
##$DPNAME4= <>
##$DPNAME5= <>
##$DPNAME6= <>
##$DPNAME7= <>
##$DPOAL= (0..7)
0.5 0.5 0.5 0.5 0.5 0.5 0.5 0.5 
##$DPOFFS= (0..7)
0 0 0 0 0 0 0 0 
##$DQDMODE= 0
##$DR= 18
##$DS= 0
##$DSLIST= <SSSSSSSSSSSSSSS>
$$ [...]
##$SUBNAM2= <"">
##$SUBNAM3= <"">
##$SUBNAM4= <"">
##$SUBNAM5= <"">
##$SUBNAM6= <"">
##$SUBNAM7= <"">
##$SUBNAM8= <"">
##$SUBNAM9= <"">
##$SW= 20.0188882624521
##$SWIBOX= (0..15)
0 0 2 0 0 0 0 0 0 0 0 0 0 0 0 0 
##$SW_h= 4006.41025641026
##$TD= 16384
##$TD0= 1
##$TE= 0
##$TE2= 300
##$TE3= 300
##$TEG= 300
##$TL= (0..7)
0 120 120 120 120 120 120 120 
##$TP= (0..7)
150 150 150 150 150 150 150 150 
##$TP07= 0
##$TPNAME0= <>
##$TPNAME1= <>
##$TPNAME2= <>
##$TPNAME3= <>
##$TPNAME4= <>
##$TPNAME5= <>
##$TPNAME6= <>
##$TPNAME7= <>
##$TPOAL= (0..7)
0.5 0.5 0.5 0.5 0.5 0.5 0.5 0.5 
##$TPOFFS= (0..7)
0 0 0 0 0 0 0 0 
##$TUNHIN= 0
##$TUNHOUT= 0
##$TUNXOUT= 0
##$USERA1= <user>
##$USERA2= <user>
##$USERA3= <user>
##$USERA4= <user>
##$USERA5= <user>
##$V9= 5
##$VALIST= <valist>
##$VCLIST= <CCCCCCCCCCCCCCC>
##$VD= 0
##$VDLIST= <DDDDDDDDDDDDDDD>
##$VPLIST= <PPPPPPPPPPPPPPP>
##$VTLIST= <TTTTTTTTTTTTTTT>
##$WBST= 1024
##$WBSW= 4
##$XGAIN= (0..3)
0 0 0 0 
##$XL= 0
##$YL= 0
##$YMAX_a= 155035
##$YMIN_a= -185336
##$ZGOPTNS= <>
##$ZL1= 120
##$ZL2= 120
##$ZL3= 120
##$ZL4= 120
##$ABSF1= 10
##$ABSF2= 0
##$ABSG= 5
##$ABSL= 3
##$ALPHA= 0
##$AQORDER= 0
##$ASSFAC= 0
##$ASSFACI= 0
##$ASSFACX= 0
##$ASSWID= 0
##$AUNMP= <proc_1d>
##$AZFE= 0.1
##$AZFW= 0.1
##$BCFW= 1
##$BC_mod= 2
##$BYTORDP= 1
##$COROFFS= 0
##$CY= 11.3945322036743
##$DATMOD= 1
##$DC= 2
##$DFILT= <>
##$DTYPP= 0
##$F1P= 17.5019972093344
##$F2P= -2.517084195857
##$FCOR= 0.5
##$FTSIZE= 0
##$FT_mod= 4
##$GAMMA= 1
##$GB= 0.15
##$INTBC= 1
##$INTSCL= 1
##$ISEN= 128
##$LB= 0.24
##$LEV0= 0
##$LPBIN= 0
##$MAXI= 10000
##$MC2= 0
##$MEAN= 0
##$ME_mod= 0
##$MI= 1.114404
##$NCOEF= 0
##$NC_proc= 0
##$NLEV= 6
##$NOISF1= 3.799351
##$NOISF2= 2.8
##$NSP= 1
##$NTH_PI= 0
##$NZP= 0
##$OFFSET= 15.70392
##$PC= 1
##$PHC0= -12281.51
##$PHC1= 18.20099
##$PH_mod= 1
##$PKNL= yes
##$PPARMOD= 0
##$PSCAL= 0
##$PSIGN= 0
##$REVERSE= no
##$SF= 200.130013532006
##$SI= 16384
##$SIGF1= 3
##$SIGF2= 2
##$SINO= 400
##$SIOLD= 16384
##$SREGLST= <1H.CDCl3>
##$SSB= 0
##$STSI= 0
##$STSR= 0
##$SW_p= 3612.71676300578
##$SYMM= 0
##$S_DEV= 0
##$TDeff= 0
##$TDoff= 0
##$TI= <>
##$TILT= no
##$TM1= 0
##$TM2= 0
##$TOPLEV= 0
##$USERP1= <user>
##$USERP2= <user>
##$USERP3= <user>
##$USERP4= <user>
##$USERP5= <user>
##$WDW= 1
##$XDIM= 8192
##$YMAX_p= 0
##$YMIN_p= 0
$$ End of Bruker specific parameters
$$ ---------------------------------
##NTUPLES= NMR FID
##VAR_NAME=  TIME,          FID/REAL,        FID/IMAG
##SYMBOL=    X,             R,               I
##VAR_TYPE=  INDEPENDENT,   DEPENDENT,       DEPENDENT
##VAR_FORM=  AFFN,          ASDF,            ASDF
##VAR_DIM=   8192,          8192,            8192
##UNITS=     SECONDS,       ARBITRARY UNITS, ARBITRARY UNITS
##FACTOR=    0.0002496,     1,               1
##FIRST=     0,             0,               0
##LAST=      2.0444736,     0,               0
##MIN=       0,             -185336,         0
##MAX=       2.0444736,     155035,          0
$$ Real data points
##PAGE= N=1
##DATA TABLE= (X++(R..R)), XYDATA
$$ [...]
$$ plain form
2298 -339 -121 120 568 34 315 437 242 593 388 170 -347 -40 -56 872 522 27 428 356 746 414 85
2319 85 205 340 51 215 782 854 390 387 -245 83 -76 333 414 251 177 -6 327 -347 281 -205 183 -163
2341 -163 -484 270 -606 -299 -63 -143 -874 66 203 -281 -410 -70 -255 -744 -205 -9 -127 -340 -575 -567 -289
2362 -289 120 -484 -117 -153 96 84 -177 -161 -830 -326 -461 -220 -323 135 3 377 85 514 256 117 -79
2383 -79 133 339 452 431 -30 160 26 108 100 357 310 399 702 399 60 -153 444 -115 -18 690 356 207 252
2406 252 831 509 699 334 549 379 302 -37 -37 8 -60 -104 44 328 826 384 519 -76 416 64 312 101
2428 101 257 -386 260 135 274 -14 162 -711 228 -40 253 16 -159 -611 -150 5 178 -281 -309 -532
2448 -532 -33 268 414 -271 -379 -143 168 303 -58 -251 -748 -204 -324 -280 -231 -498 -442 -131 4 -432 -143
$$ packed form
2298c39K18K41M48n34K81J22j95L51k05k18n17L07j6R28l50m95M01p2L90l32l29
2319H5J20J35k89J64N67P2m64lo32L28j59M09Q1j63p4j83L33o74O28m86L88l46
2341a63l21P54q76L07K36q0p31R40J37m84j29L40j85m89N39J96j18k13k35QK78
2362b89M09o04L67l6K49j2k61J6o69N04j35K41j03M58j32L74k92M29k58j39j96
2383g9K12K06J13k1m61J90j34Q2qK57m7Q9L03l03l39k13N97n59R7P08l34j49M5
2406B52N79l22J90l65K15j70p7l39%M5o8m4J48K84M98m42J35n95M92l52K48k11
2428A01J56o43O46j25J39k88J76q73R39k68K93k37j75m52M61J55J73m59k8k23
2448e32M99L01J46o85j08K36L11J35l61j93m97N44j20M4M9k67N6L11J35m36K89
$$ plain form
2469 -143 145 -148 -493 -104 -206 -96 88 94 -59 230 -34 -62 395 357 188 -130 79 -404 472 -189 10
2490 10 -528 223 162 173 0 369 50 589 962 -48 50 562 391 372 78 547 571 -340 79 14 155 -12
2512 -12 611 79 11 -69 45 107 -74 -378 -345 154 -390 -69 -123 -492 -438 412 388 -250 -681 -511 93 -490 -124
2535 -124 0 -122 -358 -785 -56 -261 -104 -384 -518 -369 -373 -327 -282 -715 -107 -97 -508 -618 187 -165 -252 -921
2557 -921 18 -425 -120 -23 -61 32 368 59 -4 -378 -66 -422 305 51 97 -102 151 269 308 93 148 322
2579 322 -197 104 -210 71 52 577 11 630 -96 528 26 -439 -22 216 177 701 107 -72 240 33 237
2600 237 -136 103 218 -291 228 -43 339 449 314 -248 603 -376 23 52 5 324 -243 -596 -381 -152 -145
2621 -145 260 -92 -85 -104 -516 -337 181 -219 -560 28 -121 -711 -274 -313 -329 -740 102 -352 -428 -73 -85 -54 -126
$$ packed form
2469a43K88k93l45L89j02J10J84Oj53K89k64k8M57l8j69l18K09m83Q76o61J99
2490A0n38P51o1J1j73L69l19N39L73j010R8N12j71j9k94M69K4r11M19o5J41j67
2512a2O23n32o8q0J14O2j81l04L3M99n44L21n4l69N4Q50k4o38m31J70O04n83L66
2535a24J24j22k36m27P29k05J57k80j34J49mM6M5m33O08J0m11j10Q05l52q7o69
2557i21R39m43L05R7l8R3L36l09o3l74L12l56P27k54M6j99K53J18L9k15N5J74
2579C22n19L01l14K81j9N25n66O19p26O24n02m65M17K38l9N24n94j79L12k07K04
2600B37l73K39J15n09N19k71L82J10j35n62Q51r79L99K9m7L19n67l53K15K29P
2621a45M05l52Pj9m12J79N18m00l41N88j49n90M37l9j6m11Q42m54p6L55j2L1p2
$$ plain form
2644 -126 -330 -183 75 56 -520 -4 -421 -449 298 -75 83 154 -277 455 -199 -433 -9 -272 494 147 467
2665 467 408 -30 -55 157 669 306 316 -113 164 120 396 387 259 84 -100 536 636 234 -252 414 182 432
2687 432 275 244 113 370 806 -236 250 166 60 74 -170 61 235 221 -224 427 -587 94 5 188 -68
2708 -68 8 138 144 -250 -143 -216 -145 -305 -81 -134 -303 -421 500 -461 -398 71 -64 92 70 -561 -468 -266 -634
2731 -634 -814 -22 -592 -382 -134 -460 -315 -522 -151 -326 -307 -214 -461 -153 -390 468 137 191 -350 -4 147
2752 147 212 103 115 392 -115 406 103 -11 -4 537 104 -120 123 331 292 678 362 225 -31 815 -4 418
2774 418 101 155 265 162 -278 -345 260 226 727 117 -334 312 185 -7 -157 208 217 85 -41 -497 -301 137
2796 137 195 -412 409 -193 -497 -341 105 234 -236 -66 -352 -46 -428 162 -501 213 -367 -78 -228 -145 -577
$$ packed form
2644a26k04J47K58j9n76N16m17k8P47l73J58P1m31P32o54k34M24k63P66l47L20
2665D67n9m38k5K12N12l63J0m29K77m4K76rj28j75j84O36J00m02m86O66k32K50
2687D32j57l1j31K57M36j042M86q4j06J4k44K31J74j4m45O51j014O81q9J83k56
2708f8P6J30Ol94J07p3P1j60K24n3j69j18R21r61O3M69j35J56k2o31R3K02l68
2731f34j80P92n70K10K48l26J45k07L71j75J9R3k47L08k37Q58l31N4n41L46J51
2752A47O5j09J2K77n07N21l03j14PN41m33k24K43K08l9L86l16j37k56Q46q19M22
2774D18l17N4J10j03m40o7O05l4N01o10m51O46j27j92j50L65Rj32j26m56J96M38
2796A37N8o07Q21o02l04J56M46J29m70J70k86L06l82N90o63P14n80K89j50Q3m32
$$ plain form
2817 -577 -818 166 -279 32 -116 -162 -42 -277 -427 -240 -411 -135 -67 -73 312 762 -143 -411 -103 -114 458 3
2839 3 98 158 -135 95 43 -351 439 260 378 147 502 282 260 98 -2 391 -160 238 -54 306 25 640
2861 640 991 428 47 175 13 146 -18 15 404 209 -409 703 137 732 507 -86 -79 -172 282 -327 99
2882 99 -262 182 -321 242 -785 -56 -4 54 112 537 225 -41 214 186 -220 -46 -177 -283 -148 45 -124
2903 -124 -328 -742 -12 -193 -336 -223 -384 -206 -455 -279 -89 281 -246 287 -297 -190 208 -543 -281 -90
2923 -90 -316 -571 -506 -367 2 224 31 -67 -184 -41 -389 516 169 -277 676 -407 502 -563 73 198
2943 198 721 -113 -228 545 344 -26 -268 303 -178 483 70 57 187 -13 227 -85 174 666 -175 139
2963 139 328 227 194 513 -102 265 -145 179 44 -430 430 -203 274 177 -332 -312 -297 -73 -553 202 -537
$$ packed form
2817e77k41R84m45L11j48m6J20k35j50J87j71K76O8oL85M50r05k68L08j1N72m55
2839CR5O0k93K30n2l94P90j79J18k31L55k20k2j62j00L93n51L98k92L60k81O15
2861F40L51n63l81J28j62J33j64L3L89j95o18J112n66N95k25n93Pr3M54o09M26
2882I9l61M44n03N63j027P29N2N8N8M25l12k66K55k8m06J74j31j06J35J93j69
2903a24k04m14P30j81j43J13j61J78k49J76J90L70n27N33n84J07L98p51K62J91
2923i0k26k55O5J39L69K22j93r8j17J43l48R05l47m46R53j083R09j065O36J25
2943A98N23q34j15P73k01l70k42N71m81O61m13j3J30k00K40l12K59M92q41L14
2963A39J89j01l3L19o15L67m10L24j35m74Q60o33M77r7n09K0J5K24m80P55p39
$$ plain form
2984 -537 -546 -427 17 -223 -241 141 -447 -353 123 -142 -57 -625 -200 143 -521 -268 183 56 -33 -340 -357 -68
3006 -68 -478 -188 262 -457 0 -141 425 -137 -54 -436 -181 -359 -345 -205 -176 261 -116 -11 389 123 36 41
3028 41 -215 177 -95 590 -21 -56 24 465 -270 48 258 -224 -3 675 463 -343 109 521 345 250 394
3049 394 -13 497 -150 487 91 563 366 374 376 -207 52 -244 -198 20 -88 11 80 -160 259 -448 229 96
3071 96 -267 76 125 -127 176 370 218 -422 538 -168 -390 241 50 34 -227 -492 -116 103 -180 64 324
3092 324 -822 -410 -83 117 -83 -30 -558 -345 -106 557 -538 -1173 -167 -282 290 -24 65 -76 -229 -109
3112 -109 284 245 -392 -201 230 -57 319 600 -234 -363 187 185 -69 173 -201 483 51 186 636 -9 384
3133 384 175 118 221 -208 200 331 200 177 -147 68 169 152 243 -120 142 366 55 76 -231 -307 114 -516
$$ packed form
2984e37rJ19M44k40j8L82n88R4M76k65Q5n68M25L43o64K53M51j27q9l07j7K89
3006f8m10K90M50p19M57j41N66n62Q3l82K55j78J4J40K9M37l77J05M00k66q7N
3028D1k56L92k72O85o11l5Q0M41p35L18K10m82K21O78k12q06M52M12j76r5J44
3049C94m07N10o47O37l96M72j97QKn83K59k96M6K18j08R9O9k40M19p07O77j33
3071I6l63L43M9k52L03J94j52o40R60p06k22O31j91j6k61k65L76K19k83K44K60
3092C24j146M12L27K00k00N3n28K13K39O63j095o35J006j15N72l14Q9j41j53J20
3112a09L93l9o37J91M31k87L76K81q34j29N50kk54K42l74O84m32J35M50o45L93
3133C84k09n7J03m29M08J31j31k3l24K15J01j7R1l63K62K24l11K1l07p6M21o30
$$ plain form
3155 -516 24 103 -179 -294 -254 -246 -289 -230 496 315 -239 -100 -81 -200 -221 17 166 43 -515 -440 -273 -329 -491
3178 -491 -40 -437 -331 -540 -7 -505 -232 -82 -92 -214 -156 -130 -588 -99 -13 -271 310 -315 312 -245 -474
3199 -474 -106 -102 -102 148 -50 61 190 -197 -30 361 -286 401 231 179 -233 297 105 508 -69 -229 -792 698
3221 698 -18 -254 201 543 -42 605 360 248 437 -267 -112 246 -227 101 206 556 -110 141 -62 115
3241 115 -39 -361 -141 33 150 110 -49 -250 134 99 28 -337 183 -29 49 -347 396 -667 11 -116 -38
3262 -38 -356 -158 -261 -476 -388 -134 -83 -326 166 9 -307 198 -772 -225 86 -77 -213 -40 -78 312 -304
3283 -304 -394 -339 67 10 -206 -196 -96 409 911 213 218 282 502 117 -331 -157 283 -6 115 -300 -82 261
3305 261 -103 -88 104 28 -557 301 -10 24 862 834 405 -1 381 -105 -561 -48 -200 -68 684 147 210 79
$$ packed form
3155e16N40P9k82j15M0Qm3N9P26j81n54J39J9j19k1K38J49j23n58P5J67n6j62
3178d91M51l97J06k09N33m98K73J50j0j22N8K6m58M89Q6k58N81o25O27n57k29
3199d74L68M%K50j98J11J29l87J67L91o47O87j70n2m12N30j92M03n77j60n63J490
3221F98p16k36M55L42n85O47k45j12J89p04J55L58m73L28J05L50o66K51k03J77
3241A15j54l22K20J74J17m0j59k01L84l5p1l65N20k12P8l96P43j063O78j27P8
3262c8l18J98j03k15Q8K54N1k43M92j57l16N05r70N47L11j63j36J73l8L90o16
3283c04r0N5M06n7k16J0J00N05N02o98NO4K20l85m48J74M40k89J21m15K18L43
3305B61l64J5J92p6n85Q58l11L4Q38k8m29m06L82m86m56N13j52J32P52n37O3j31
$$ plain form
3327 79 478 -266 -413 -415 -54 -152 -208 320 -452 -17 62 124 -353 -298 -7 -54 168 -156 60 -503 227 27 -370
3350 -370 413 -435 -765 -358 2 -197 -200 -168 -465 131 -85 -444 -201 222 -244 -63 -329 -79 -424 300 -377
3371 -377 433 289 -783 -339 139 98 206 -190 108 -177 -219 -329 -79 -138 -119 -410 -117 813 -115 180 -83
3392 -83 350 455 -68 -150 -67 247 304 155 103 490 199 -68 547 315 33 108 369 -222 -118 384 -26 -179
3414 -179 3 298 419 84 -202 -161 561 -34 526 -5 213 -327 -212 170 -231 415 -202 276 369 -99 -254
3435 -254 -135 -351 16 -245 -373 -723 -216 -273 -193 -225 322 -93 -528 120 -151 257 -196 -262 -344 -222 -358 186
3457 186 -135 1 119 -361 482 276 -131 92 -269 -75 -306 485 613 267 254 257 174 -110 139 -20 -308
3478 -308 -209 207 264 -27 -108 -270 -263 -30 208 -168 61 418 219 16 87 142 -62 116 -557 -126 222 508
$$ packed form
3327G9L99p44j47kL61r8n6N28p72M35P9O2m77N5K91m7K22l24K16n63P30k00l97
3350c70P83q48l30M07L60j99lL2k97N96k16l59K43M23m66J81k66K50l45P24o77
3371c77Q10j44j072M44M78m1J08l96K98k85m2j10K50n9J9k91K93R30r28K95k63
3392h3M33J05n23q2Q3L14N7j49n2L87k91k67O15k32k82P5K61n91J04N02m10j53
3414a79J82K95J21l35k86M1P22n95N60n31K18n40J15L82m01O46o17M78R3m68j55
3435b54J19k16L67k61j28l50N07n7Q0l2N47m15m35O48k71M08m53o6q2J22j36N44
3457A86l21J36J18m80Q43k06m07K23l61J94k31P91J28l46j3Lq3k84K49j59k88
3478c08R9M16N7k91q1j62PK33K38l76K29L57j99k03P1N5k04J78o73M31L48K86
$$ plain form
3500 508 -84 -169 73 87 31 642 90 509 -5 43 116 610 -224 -156 -279 279 381 82 323 378 213 -245
3522 -245 29 -305 -261 207 35 454 -148 9 -73 74 -183 248 -178 -110 -500 -193 -101 -583 -88 -85 -621 -425
3544 -425 -173 1 105 136 339 -266 292 -642 471 -94 -165 74 191 -46 -157 143 122 108 -271 25 -568
3565 -568 444 389 -33 178 126 -328 -245 191 -213 -124 824 231 -194 -166 290 116 208 -269 293 -113 349 308
3587 308 289 254 10 -13 368 617 630 501 -188 83 -57 -284 -276 -119 -159 311 77 113 136 -270 190 -436 -339
3610 -339 -81 -165 82 -123 66 218 0 -51 -59 49 -288 197 -30 -423 -381 -60 -85 -104 -226 -464 159 -79
3632 -79 -131 -325 370 -128 -134 -649 452 -290 345 191 -95 167 -122 -32 178 690 -36 195 -14 270 -245
3653 -245 539 -119 320 -98 -389 89 -127 -15 -229 492 -184 185 13 -93 636 927 -65 -204 644 -216
$$ packed form
3500E08n92q5K42J4n6O11n52M19n14M8P3M94q34O8j23N58J02k99K41N5j65m58
3522b45K74l34M4M68j72M19o02J57q2J47k57M31m26O8l90L07R2m82M95Ln36J96
3544d25K52J74J04L1K03o05N58r34J113n65p1K39J17k37j11L00k1j4l79K96n93
3565e68J012n5m22K11n2m54Q3M36m04Q9R48n93m25K8M56j74R2m77N62m06M62m1
3587C08j9l5k44k3L81K49J3j29o89K71j40k27QJ57m0M70k34L6K3m06M60o26R7
3610c39K58q4K47k05J89J52k18n1qJ08l37M85k27l93M2L21k5j9j22k38O23k38
3632g9n2j94O95m98on15J101p42O35j54k86K62k89R0K10N12p26K31k09K84n15
3653b45P84o58M39m18k91M78k16J12k14P21o76L69j72j06P29K91r92j39Q48q60
$$ plain form
3673 -216 174 -195 -177 -177 653 105 65 87 61 262 -36 -242 441 274 165 272 -162 185 -201 129 109 -250
3695 -250 77 240 -238 -580 36 -340 176 258 320 155 -323 -101 -219 -55 -141 -405 113 198 -720 -58 69
3716 69 -10 -682 -341 -440 -698 -142 -207 -365 -455 370 -105 -273 -666 -207 -170 187 -163 -118 -321 63 -233 -509
3738 -509 -203 -30 -265 128 442 133 -77 308 -61 -51 -391 -358 52 -129 -151 -5 322 384 625 -8 282
3759 282 -273 205 258 180 -22 -238 497 687 182 -174 -180 278 294 337 456 -68 567 -190 -258 3 131 362
3781 362 553 436 -247 -143 -269 -326 490 -41 -207 9 -144 -404 93 59 -178 -344 -246 349 -133 -230 183
3802 183 173 -479 2 -196 -543 -1032 164 -121 -53 -733 -308 -363 19 107 -129 -179 87 -128 -512 -425 157 -254
3824 -254 -136 -915 -202 -91 -231 183 -3 42 -2 99 -417 -281 -75 385 -158 170 365 62 42 77 369
$$ packed form
3673b16L90l69J8%Q30n48m0K2k6K01k98k06O83j67j09J07m34L47l86L30k0l59
3695b50L27J63m78l42O16l76N16Q2O2j65m78K22j18J64q6k64N18Q5r18O62J27
3716F9p9o72L41r9k58N56o5j58r0Q25m75j68l93M59L7L57l50M5k03L84k96k76
3738e09L06J73k35L93L14l09k10L85l69J0l40L3M10j81k2J46L27O2K41o33K90
3759B82n55M78N3p8k02k16P35J90n05l56oM58J6M3J19n24O35p57o8K61J28K31
3781C62J91j17o83J04j26n7Q16n31j66K16j53k60M97l4k37j66R8N95m82r7M13
3802A83j0o52M81j98l47m89J196k85O8o80M25n5L82Q8k36n0K66k15l84Q7N82m11
3824b54J18p79P13J11j40M14j86M5m4J01n16J36K06M60n43L28J95l03k0L5K92
$$ plain form
3845 369 573 430 439 -90 -257 248 -120 -45 376 -86 427 -39 491 -279 -96 -261 132 16 -250 5 -121
3866 -121 -24 69 -167 233 -184 -250 -120 33 315 -374 526 283 693 199 -199 186 1 -254 -551 141 193
3887 193 383 314 -562 -322 -321 -22 -379 -109 -241 349 384 20 295 -539 -366 -716 321 8 -400 -289 342
3908 342 -95 -351 -277 -715 76 -6 -598 -348 -35 -142 -118 -127 -245 92 -285 60 29 -289 81 -165 -257 -839
3930 -839 -487 -87 153 22 -180 4 -60 -335 234 -125 -29 48 -96 117 382 -321 -124 57 32 429 -221
3951 -221 -183 -166 47 -700 -19 53 504 311 -203 261 268 -335 290 -577 6 504 559 656 -599 -106 -185 248
3973 248 103 428 113 92 -92 -69 -346 -207 226 -209 -55 -121 7 182 115 -55 270 -275 300 -92 -382
3994 -382 241 -804 -279 1 278 -250 236 -680 -266 312 -208 -99 -221 -60 -374 496 -244 -667 143 208
$$ packed form
3845C69K04j43Rn29j67N05l68P5M21m62N13m66N30p70J83j65L93j16k66K55j26
3866a21R7R3k36M00m17o6J30J53K82o89R00k43M10m94l98L85j85k55k97O92N2
3887A93J90o9q76K40JK99l57K70j32N90L5l64K75q34J73l50J037l13m08J11O31
3908C42m37k56P4m38P91q2n92K50L13j07K4rj18L37l77L45l1l18L70k46r2n82
3930h39L52M00K40j31k02J84o4k75N69l59R6P7j44K13K65p03J97J81k5L97o50
3951b21L8J7K13p47O81P2M51j93n14M64Po03O25q67N83M98N5R7j255M93p9M33
3973B48j45L25l15k1j84K3k77J39M33m35J54o6J28J75o7j70L25n45N75l92k90
3994c82O23j045N25K80K77n28M86r16M14N78n20J09j22J61l14Q70p40m23Q10O5
$$ plain form
4014 208 32 -29 216 269 -238 -171 -173 -103 57 260 -67 91 220 -43 -54 392 -281 -65 -67 4 484 -39 294
4037 294 306 250 81 -75 208 -154 -434 189 406 122 69 -22 409 286 -70 -42 -443 164 435 9 133 74
4059 74 -246 -187 -334 344 -454 -433 -183 -633 265 -276 16 275 90 788 -234 -40 -22 -1033 -624 2 -837
4080 -837 237 270 -321 -201 -506 173 18 16 -757 202 -133 -213 360 13 -476 98 -81 -144 -117 -495 324 -316
4102 -316 55 -277 218 19 625 -140 -131 86 46 347 -22 0 -126 84 -187 -338 62 206 58 -151 -24
4123 -24 583 -169 348 -184 271 112 446 86 18 230 -264 154 316 -12 50 511 69 14 -357 -257 225
4144 225 202 -17 220 145 -123 -84 279 83 -530 -288 -130 482 -42 -554 230 -563 -326 -164 -122 11 122
4165 122 145 -239 -419 -95 99 119 -25 -277 -452 -197 -432 -168 -80 143 -337 -64 -84 88 -246 24 -62 -598
$$ packed form
4014B08j76o1K45N3n07O7kP0J60K03l27J58J29k63j1M46o73K16kP1M80n23L33
4037B94J2n6j69j56K83l62k80O23K17k84n3r1M31j23l56K8m01O07K71m26J24n9
4059G4l20N9j47O78p98K1K50m50Q98n41K92K59j85O98j022J94J8j011M09O26q39
4080h37J074L3n91J20l05O79j55kp73R59l35q0N73l47m89N74j79o3K7l78Q19o40
4102c16L71l32M95j99O06p65RK17m0L01l69K2j26K10k71j51M00J44j48k09J27
4123b4O07p52N17n32M55j59L34l60o8K12m94M18J62l28O2M61m42n5l71J00M82
4144B25k3k19K37p5k68L9L63j96o13K42J58O12n24n12P84p93K37J62M2J33J11
4165A22K3l84j80L24J94K0j44k52j75K55k35K64Q8K23m80K73k0J72l34K70q6n36
$$ plain form
4187 -598 -491 41 -115 68 -232 -350 411 -286 513 -23 -376 189 -465 70 117 346 304 146 111 -21 153
4208 153 189 -87 -189 558 307 110 -1 271 293 -78 -80 802 145 -327 -35 -293 575 -99 -464 97 217
4229 217 418 162 116 -141 21 -53 -365 -508 -22 391 476 -448 133 132 150 -235 -101 -348 -478 -60 8 57 -241
4252 -241 -247 -149 -522 -273 -103 -301 -66 153 -168 -628 -122 -269 -661 -595 -390 -432 -532 -348 -314 -246 43 200
4274 200 587 -141 -13 -510 75 -289 -949 -351 -124 -873 -291 64 266 -168 -585 -61 -131 -35 625 -75 102
4295 102 243 -17 -46 241 267 206 60 75 -190 121 48 -166 79 -379 307 -546 -11 846 83 -13 92 -46
4317 -46 -115 115 -22 -88 417 -173 -205 696 571 -12 37 -160 218 410 -522 -234 -441 -12 -43 -61 -257 -345 -6
4340 -6 9 -277 -292 595 -490 272 140 -243 -296 126 -323 -514 -124 28 -307 -419 -43 50 331 49 87 -318
$$ packed form
4187e98J07N32j56J83l00j18P61o97P99n36l53N65o54N35M7K29m2j58l5j32J74
4208A53L6k76j02P47k51j97j11K72K2l71kQ82o57m72K92k58Q68o74l65N61J20
4229B17K01k56m6k57J62p4l12j43M86M13Q5r24N81jJ8l85J34k47j30M18O8M9k98
4252b41oR8l73K49J70j98K35K19l21m60N06j47l92O6K05m2j00J84L4O8K89J57
4274B00L87p28J28m97N85l64o60N98K27p49N82L55K02m34m17N24p0R6O60p00J77
4295A02J41k60k9K87K6o1j46J5k65L11p3k14K45m58O86q53N35Q57p63r6J05j38
4317d6o9K30j37o6N05n90l2R01j25n83M9j97L78J92r32K88k07M29l1j8j96q8L39
4340fJ5k86j5Q87j085P62j32l83n3M22m49j91L90J52l35j12L76R3K81k82L8m05
$$ plain form
4362 -318 498 278 77 -205 94 34 -292 -70 429 141 -62 50 -8 121 -157 -316 388 60 -41 387 660
4383 660 497 -207 462 -77 45 295 220 -211 69 313 271 -266 400 714 64 -67 -330 18 -59 525 -52
4404 -52 -69 333 -11 247 316 -369 152 -56 260 201 768 589 244 -62 -85 -316 333 42 -276 139 -58 -347
4426 -347 69 296 -69 -199 -10 -187 -199 -99 -320 -200 -555 -237 -100 49 -495 -496 136 -216 206 -27 -170
4447 -170 -147 47 177 -734 -106 -469 635 -337 85 353 295 -268 227 136 135 108 -356 206 430 648 43 195
4469 195 119 3 368 -84 -388 324 -284 415 311 243 -93 269 63 212 57 -21 550 195 -73 13 8 108
4491 108 72 -100 91 492 -269 -139 628 214 -36 228 68 173 53 -25 158 124 -345 -393 -225 243 16
4512 16 -206 97 101 -325 806 225 291 37 -39 164 304 -47 -173 183 -123 198 -330 -271 746 -372 70
$$ packed form
4362c18Q16k20k01k82K99o0l26K22M99k88k03J12n8J29k78j59P04l28j01M28K73
4383F60j63p04O69n39J22K50p5m31K80K44m2n37O66L14o50j31k63L48p7N84n77
4404e2j7M02l44K58O9o85N21k08L16n9N67j79l45l06k3k31O49k91l18M15j97k89
4426c47M16K27l65j30J89j77j2J00k21J20l55L18J37J49n44jO32l52M22k33j43
4447a70K3J94J30r11O28l63J104r72M22K68n8n63M95r1jk7m64N62K24K18o05J52
4469A95p6j16L65m52l04P12o08O99j04o8l36L62k06J49j55p8N71l55k68Q6nJ00
4491A08l6j72J91M01p61J30P67m14k50K64j60J05j20p8J83l4m69m8J68M68k27
4512A6k22L03Mm26J131n81O6k54p6K03J40l51j26L56l06L21n28N9J017j118M42
$$ plain form
4533 70 127 -152 148 -381 483 -49 -149 -88 131 33 142 -325 170 180 -290 7 212 -24 174 -116 -158 -319
4555 -319 434 163 134 149 -65 35 -102 410 256 -93 152 -123 250 -103 -408 -48 -104 644 459 47 28
4576 28 -24 -339 -148 140 11 91 -83 484 315 50 249 316 -32 492 67 398 219 224 -389 -545 241 -350
4598 -350 233 39 66 327 242 -50 -448 -341 35 -483 207 -165 -8 -58 520 -152 -187 112 104 -247 -217 127
4620 127 -432 -763 13 -230 -9 118 -150 -248 175 -135 68 31 127 -656 -907 -334 49 -211 -482 -190 -612
4641 -612 -428 171 -180 -387 -146 -68 -20 124 -96 -12 -19 -130 364 53 88 -48 563 16 392 -39 -112 269
4663 269 230 110 536 -25 -111 -313 -82 381 138 72 95 439 519 207 201 780 357 372 -74 285 669 338 63
4686 63 358 500 -227 206 -463 169 66 -149 -507 69 -408 -464 -270 -369 85 32 -15 -870 -222 -687 -298 32
$$ packed form
4533G0N7k79L00n29Q64n32j00O1K19r8J09m67M95J0m70K97K05k36J98k90m2j61
4555c19P53k71k9J5k14J00j37N12j54l49K45k75L73l53l05L60n6P48j85m12j9
4576B8n2l15J91K88j29Q0j74N67j69k65J99O7l48N24m25L31j79No13j56P86n91
4598c50N83j94K7K61q5k92l98J07L76n18O90l72J57n0N78o72l5K99ql51L0L44
4620A27n59l31P76k43K21J27k68r8M23l10K03l7R6p83k51N73L83k60k71K92m22
4641f12J84N99l51k07K41P8M8J44k20Q4pj11M94l11L5j36O11n47L76m31p3L81
4663B69l9j20M26n61q6k02K31M63k43o6K3L44Q0l12oN79m23J5m46L59L84l31k75
4686F3K95J42p27M33o69O32j03k15l58N76m77n6J94r9M54n3m7q55O48m65L89L30
$$ plain form
4708 32 -45 45 209 35 -42 269 -45 -459 -266 188 -358 138 149 -402 -235 276 -41 -92 -240 -411 -204 407
4730 407 -26 -40 117 72 159 -231 -125 571 -18 172 596 -208 -43 304 -608 -360 -512 21 120 102 -352 -16
4752 -16 146 -112 169 4 224 -18 641 335 -132 219 -163 -389 87 -134 -219 70 186 70 673 136 -462
4773 -462 15 -471 492 -11 -211 -9 181 -310 141 -3 19 -5 152 381 -451 457 -173 319 -205 174 -101
4794 -101 -500 7 -218 -64 560 -274 258 -325 -292 14 -280 138 -297 192 -171 -149 -12 -92 -8 -128 60
4815 60 -263 185 117 -88 -133 571 21 -187 434 -41 456 109 -158 -12 -108 12 367 159 156 -48 158 366
4837 366 -306 -64 -156 -24 -74 -75 439 -4 207 29 91 169 139 548 443 223 297 -166 -41 791 28 128 -285
4860 -285 -199 -229 188 489 -243 353 137 47 -11 -465 545 -149 -105 239 45 -22 -56 52 -428 396 -379 31
$$ packed form
4708C2p7R0J64j74p7L11l14m14J93M54n46M96J1n51J67N11l17n1j48j71K07O11
4730D07m33j4J57m5Q7l90J06O96n89J90M24q04J65L47r12K48j52N33R9j8m54L36
4752a6J62k58K81j65K20k42O59l06m67L51l82k26M76k21q5K89J16j16O03n37n98
4773d62M77m86R63n03k00K02J90m91M51j44K2k4J57K29q32R08o30M92n24L79k75
4794a01l99N07k25J54O24q34N32n83L3L06k94M18m35M89l63K2J37q0Q4j20J88
4815F0l23M48o8k05m5P04n50k08O21m75M97l47k67J46r6J20L55k08lk04K06K08
4837C66o72K42r2J32n0jN14m43K11j78O2P8l0M09j05k20P4m63J25Q32p63J00m13
4860b85Q6l0M17L01p32N96k16r0n8m54J010o94M4L44j94o7l4J08m80Q24p75M10
$$ plain form
4882 31 68 253 69 -8 -322 -238 -90 51 -266 147 56 484 -308 -227 155 -10 -192 -105 -24 -434 145 259 69
4905 69 -456 -7 -4 101 -28 247 -197 -191 58 7 203 -882 -243 26 34 -93 -135 -96 22 -209 -66 31 183
4928 183 -308 437 -210 -209 63 -257 -171 185 330 319 575 245 -7 496 -303 53 -84 -517 298 -55 -512
4949 -512 -392 -179 -248 -144 -43 -210 291 89 -30 186 187 122 70 182 235 89 -412 -326 -185 -367 -279 53 -88
4972 -88 27 -118 -699 -375 -298 -2 -365 170 84 -187 59 144 -522 376 382 183 -87 477 347 -283 -367 50
4994 50 103 195 104 132 321 144 198 -288 60 25 305 137 583 -491 270 -135 -307 663 208 -238 -22 47
5016 47 -169 43 262 -448 -31 -220 338 -153 398 -37 464 -297 -39 206 250 306 -137 118 -404 300 141
5037 141 -43 100 24 -37 81 202 -516 148 18 410 -84 -166 56 -306 179 122 -361 46 -248 -116 -8
$$ packed form
4882C1L7J85j84p7l14Q4J48J41l17M13r1M28p92Q1L82j65j82Q7Q1m10N79J14j90
4905F9n25M49LJ05j29K75m44OK49n1J96j085O39K69Qj27m2L9J18k31J43R7J52
4928A83m91P45o47JK72l20Q6L56J45j1K56l30k52N03p99L56j37m33Q15l53m57
4949e12J20K13o9J04J01j67N01k02j19K16Jo5n2J12N3j46n01Q6J41j82Q8L32j41
4972h8J15j45n81L24P7K96l63N35q6k71K46Q5o66Q98Oj99k70N64j30o30q4M17
4994E0N3R2r1K8J89j77N4m86L48l5K80j68M46j074P61m05j72R70m55m46K16O9
5016D7k16K12K19p10M17j89N58m91N51m35N01p61K58K45M4N6m43K55n22P04j59
5037A41j84J43p6o1J18J21p18O64j30L92m94q2K22l62M85n7m83M07k94J32J08
$$ plain form
5058 -8 -163 254 -302 538 -569 221 -83 952 106 1 -440 -571 -209 -460 -69 -237 65 -213 50 650
5078 650 -318 -262 -230 68 -452 -346 -268 -152 17 -543 354 -180 -383 17 -37 470 -18 212 279 -298 423 -140
5100 -140 4 146 156 446 147 93 359 -213 198 -89 -78 121 115 -316 408 -514 302 -135 705 -67 480 142
5122 142 -308 399 5 110 287 30 -8 497 -117 153 323 60 328 257 142 303 447 -413 -341 -180 196
5143 196 -176 -65 359 119 -196 73 -482 -313 -531 -154 44 -180 -295 -142 119 -307 173 -114 -28 -584
5163 -584 -671 231 -494 170 2 -111 406 346 -257 -3 -291 82 30 -155 97 -338 -274 -100 126 263 263 129
5185 129 167 -143 152 20 165 291 177 269 -73 -29 -38 473 577 487 78 174 421 68 -399 -130 317 -156
5207 -156 -379 304 -57 -33 284 -419 -440 188 75 -103 -297 384 70 510 117 65 307 -379 -216 62 -407
$$ packed form
5058hj55M17n56Q40j107P90l04J035q46j05m41j31L62k51L91j68L02k78K63O00
5078F50r68N6L2K98n20J06P8J16J69n60Q97n34k03M00n4N07m88K30O7n77P21n63
5100a40J44J42J0K90k99n4K66n72M11k87J1J99om31P24r22Q16m37Q40p72N47l38
5122A42m50P07l94J05J77k57l8N05o14K70J70k63K68p1j15J61J44q60P2J61L76
5143A96l72J11M24k40l15K69n55J69k18L77J98k24j15J53K61m26M80k87Q6n56
5163e84q7R02p25O64j68j13N17o0o03K54k88L73n2j85K52m35O4J74K26J37%j34
5185A29L8l10K95j32J45J26j14R2l42M4rN11J04r0m09R6K47l53m67K69M47m73
5207a56k23O83l61K4L17p03k1O28j13j78j94O81l14M40l93n2K42o86J63K78m69
$$ plain form
5228 -407 -205 0 -199 437 399 740 -373 -86 421 -252 166 -145 204 129 226 -127 -133 -303 -38 831 75
5249 75 280 307 446 651 -388 236 8 408 -109 52 -549 -189 3 284 -503 244 333 -174 89 229 56
5270 56 289 335 -210 125 109 -144 -110 -67 576 -465 56 -102 -205 466 -10 -233 127 87 75 -274 -155 -10
5292 -10 -105 -65 38 -192 143 374 51 -506 384 -224 -224 414 -135 281 -242 -210 384 -220 91 -233 -261 330
5314 330 -52 270 458 -92 -216 -93 337 -10 437 26 -13 327 -152 -297 606 -335 -154 -3 37 328 -83
5335 -83 12 -44 -194 -155 -163 -241 66 97 -50 -115 -602 -280 -212 -352 100 -310 2 -175 -311 1 228 -520 -271
5358 -271 164 -445 -98 78 173 -135 502 46 -614 -230 -61 -32 -13 64 36 88 12 -93 -332 -86 -9 110 -123
5381 -123 -150 368 387 -569 -34 180 -70 78 -280 -51 -564 387 39 -148 -436 -344 2 384 -398 202 358
$$ packed form
5228d07K02K05j99O36l8L41j113K87N07o73M18l11L49p5R7l53oj70K65Q69p56
5249G5K05K7J39K05j039O24k28M00n17J61o01L60J92K81p87P47Q9n07K63J40j73
5270E6K33M6n45L35j6k53L4M3O43j041N21j58j03O71m76k23L60m0j2l49J19J45
5292a0r5M0J03k30L35K31l23n57Q90o08%O38n49M16n23L2N94o04L11l24k8N91
5314C30l82L22J88n50j24J23M30l47M47m11l9L40m79j45R03r41J81J51M0K91m11
5335h3R5n6j50L9qp8L07L1j47o5m87L22O8j40M52m10L12j77j36L12K27p48K49
5358b71M35o09L47J76R5l08O37m56o60L84J69K9J9P7k8N2p6j05k39K46P7J19k33
5381a23k7N18J9r56N35K14k50J48l58K29n13R51l48j87k88R2L46L82p82O00J56
$$ plain form
5402 358 -289 -667 -40 19 374 -537 131 223 -166 -174 556 492 62 -343 110 80 -356 -166 -276 -146 -229 -222 269
5425 269 475 2 -245 156 -230 -536 -86 -173 -149 -204 -219 -64 549 -295 -50 -195 171 -189 162 -142 375
5446 375 -430 391 364 171 9 57 -351 -152 595 -139 -395 -122 -89 226 274 -41 -147 -179 -77 -153 109 -148
5468 -148 259 94 420 175 103 -269 356 237 119 -275 -152 52 658 92 193 -650 -106 -70 -351 90 124
5489 124 525 -34 74 71 -245 -627 -439 -41 -230 -15 224 -496 76 347 453 -261 193 -86 123 -211 258
5510 258 215 -281 -191 -214 561 -296 -261 501 330 -201 219 275 70 -309 -267 -23 57 -131 -135 -359 90 692 -154
5533 -154 -153 280 -209 -109 -47 364 361 26 -66 299 -138 67 -373 216 66 85 115 -122 -169 -408 -229 -636 201
5556 201 -333 145 -569 -234 -61 198 227 164 266 -336 -16 -32 -320 191 445 -23 -165 238 94 -262 122
$$ packed form
5402C58o47l78O27N9L55r11O68R2l89qP30o4m30m05M53l0m36J90j10J30q3PM91
5425B69K06m73k47M01l86l06M50q7K4n5j5J55O13q44K45j45L66l60L51l04N17
5446C75q05Q21k7j93j62M8m08J99P47p34k56K73L3L15M8l15j06l2J02p6K62k57
5468a48M07j65L26k45p2l72O25j19j18l94J23K04O06n66J01q43N44L6k81M41L4
5489A24M01n59J08ll16l82J88L98j89K15K39p20N72K71J06p14M54k79K09l34M69
5510B58m3m96R0k3P75q57L5P62j71n31M20N6k05l79M2K44Q0j88mk24M49O02q46
5533a54JM33m89J00O2M11ll35r2L65m37K05m40N89j50J9L0k37m7k39J79m07Q37
5556B01n34M78p14L35J73K59K9o3J02o02L20j6k88N11K54m68j42M03j44l56L84
$$ plain form
5577 122 250 437 -357 -59 -405 31 104 74 100 11 167 292 418 180 -305 256 533 184 -84 -276 -122
5598 -122 247 1 93 -221 403 -36 -505 374 -99 87 339 137 -555 47 669 62 -89 -35 -620 432
5618 432 -443 -229 122 292 -37 -25 26 -344 297 99 -134 -95 272 -170 -64 -293 -85 231 -96 -489 -164
5639 -164 603 -2 190 191 -148 160 578 283 376 358 150 28 264 -166 382 249 15 -441 -214 -308 70 -650
5661 -650 21 63 -357 172 -121 395 18 4 -56 231 316 -448 82 -228 404 365 -66 50 82 -25 283 -154
5683 -154 -435 224 73 -232 -334 171 135 365 -370 651 314 -294 122 -224 -242 67 217 196 -222 189 134
5704 134 -128 -394 196 319 101 -31 379 394 -190 -233 -28 302 -232 -334 -370 600 52 -82 33 49 346
5725 346 120 -429 -476 -58 -306 86 475 235 -379 154 54 8 -293 -234 -209 515 -546 -17 -90 235 105
$$ packed form
5577A22J28J87p94K98l46M36P3l0K6q9J56J25J26k38m85N61K77l49k68j92J54
5598a22L69k46R2l14O24m39m69Q79m73J86K52k02o92O02O22o07j51N4n85J052
5618D32q75K14L51J70l29J2N1l70O41j98k33L9L67m42J06k29K08L16l27l93L25
5639a64P67o05J92Jl39L08M18k95R3j8k08j22K36m30N48j33k34m56K27r4L78p20
5661f50O71M2m20N29k93N16l77j4o0K87Q5p64N30l10O32l9m31J16L2j07L08m37
5683a54k81O59j51l05j02N05l6K30p35J021l37o08M16l46j8L09J50k1m18M11n5
5704A34k62k66N90J23k18j32M10J5n84m3K05L30n34j02l6R70n48j34J15J6K97
5725C46k26n49m7M18k48L92L89k40o14N33j00m6l01N9K5P24j061N29p3L25j30
$$ plain form
5746 105 -352 -24 -139 7 9 357 103 327 -42 -38 107 16 332 -175 -645 -102 593 -81 -79 31 -46 127 68
5769 68 13 107 239 -260 93 -247 -670 429 -539 186 -278 121 -426 -91 -382 -40 -59 -353 -64 -162 -54
5790 -54 -747 -309 -405 -190 -392 320 765 273 172 123 206 -339 149 165 -153 111 110 178 -175 59 -197 -110 -407
5813 -407 -432 -45 -68 195 299 -255 -66 42 123 -76 -387 237 198 636 294 248 -49 171 -144 71 143 643
5835 643 -299 -96 49 -1008 -40 450 35 -24 245 -139 -170 386 -3 418 -520 -52 131 120 267 -100 119
5856 119 -203 79 -427 3 -438 238 -88 158 331 113 171 174 231 -155 197 25 -9 -377 -356 -120 -182 53
5878 53 -295 520 -51 117 -480 -275 -2 -184 -94 0 226 -19 144 229 387 -70 497 -442 239 316 24 -10
5900 -10 64 83 143 -407 -173 -288 -52 47 -45 611 173 396 228 -42 175 -250 -2 277 229 -18 520 481 156
$$ packed form
5746A05m57L28j15J46KL48k54K24l69MJ45r1L16n07m70N43O95o74KJ10p7J73n9
5769F8n5R4J32m99L53l40m23J099r68P25m64L99n47L35k91L42j9k94K89r8J08
5790e4o93M38r6K15k02P12M45m92j01m9Q3n45M88J6l18K64jO8l53K34k56Q7k97
5813d07k5L87k3K63J04n54J89J08Q1j99l11O24l9M38l42m6k97K20l15K15P2N00
5835F43r42K03J45j057R68M90m15n9K69l84l1N56l89M21r38M68J83j1J47l67K19
5856A19l22K82n06M30m41O76l26K46J73k18N8LN7l86L52j72l4l68K1K36o2K35
5878E3l48Q15n71J68n97K05K73j82R0R4K26k45J63Q5J58m57N67r39O81P7k92l4
5900a0P4J9O0n50K34j15K36R9r2O56m38K23j68k70K17m25K48K79m8k47N38l9l25
$$ plain form
5923 156 -250 -206 -2 20 60 -271 -187 -98 36 53 401 -189 -49 171 -494 -529 240 -126 -258 325 -300 433
5945 433 65 -111 -174 134 213 -386 -37 121 -276 405 -212 -208 -520 8 -218 242 -363 -350 459 -450 33 8
5967 8 127 286 312 230 41 371 263 -264 110 -294 -105 -97 -266 -117 47 572 -25 -258 -436 49 -25 -35 -216
5990 -216 -415 184 142 166 573 8 430 132 -466 -344 18 -121 114 -367 35 20 308 -35 144 56 -402
6011 -402 217 472 154 -156 283 -410 -176 10 -67 345 -10 209 -267 140 -2 420 -28 -101 -127 134 154
6032 154 -22 103 -171 -2 -548 100 -240 -635 -390 -512 -184 -458 111 663 -194 -326 496 -286 313 -130
6052 -130 166 -651 -520 -178 -106 -160 35 252 175 170 -142 -52 -336 -98 -62 86 447 -327 113 18 303 31 371
6075 371 169 -91 157 -82 -79 127 88 97 -45 131 290 35 -53 -245 302 391 213 -52 -28 31 -100 -41 -556
$$ packed form
5923A56m06M4K04K2M0l31Q4Q9J34J7L48n90J40K20o65l5P69l66j32N83o25P33
5945D33l68j76o3L08P9n99L49J58l97O81o17Ml12N28k26M60o05J3Q09r09M83k5
5967HJ19J59K6q2j89L30j08n27L74m04J89Qj69J49J64N25n97k33j78M85p4j0j81
5990b16j99N99m2K4M07n65M22k98n98J22L62j39K35m81M02j5K88l43J79q8m58
6011d02O19K55l18l10M39o93K34J86p7M12l55K19m76M07j42M22m48p3k6K61K0
6032A54j76J25k74J69n46O48l40l95K45j22L28k74N69N52q57j32Q22p82N99m43
6052a30K96q17J31L42P2n4J95K17p7nl12R0k84K38L6J48L61p74M40r5K85k72L40
6075C71k02k60K48k39LK06l9Rj42J76J59k55q8j92N47Q9j78k65K4N9j31N9n15
$$ plain form
6098 -556 21 -455 43 -102 15 5 -316 92 85 505 -394 -312 -129 -206 74 102 -112 151 -568 -513 -369 -224
6120 -224 -248 44 -103 -277 -187 -212 -527 -37 245 504 154 -571 159 595 115 -403 13 91 -363 384 30
6141 30 -336 -38 332 -30 279 -262 77 108 -9 -15 174 -76 -143 -178 42 103 -710 272 181 -135 267 479 109
6164 109 -82 385 40 -26 42 -88 319 115 181 -179 -377 -177 -191 90 238 -317 -82 244 -109 490 58
6185 58 417 -390 357 -44 -249 140 59 95 -147 -485 64 -478 -132 221 -811 165 -310 559 -165 113 -156
6206 -156 -561 -325 -50 -217 521 35 -147 43 -193 600 -141 -300 6 240 548 -350 -98 -30 -146 -10
6226 -10 305 158 -333 587 -24 192 -553 -304 -609 17 118 -110 -545 -53 231 -306 195 -487 70 -874
6246 -874 356 141 165 -418 40 -145 -468 181 2 118 -265 271 166 154 -337 -442 230 -133 56 424
$$ packed form
6098e56N77m76M98j45J17j0l21M08pM20q99Q2J83p7K80K8k14K63p19N5J44J45
6120b24k4K92j47j74R0k5l15M90K82K59l50p25P30M36m80n18M16P8m54P47l54
6141C0l66K98L70l62L09n41L39L1j17oJ89k50o7l5K20O1q13R82r1l16M02K12l70
6164A09j91M67l45o6O8j30M07k04O6l60j98K00j4K81J48n55K35L26l53N99m32
6185E8L59q07P47m01k05L89q1L6k42l38N49n42L46L53j032R76m75Q69p24K78k69
6206a56m05K36K75j67P38m86j82J90k36P93p41j59L06K34L08q98K52O8j16J36
6226a0L15j47m91R20o11K16p45K49l05O26J01k28m35M92K84n37N01o82N57r44
6246h74J230k15K4n83M58j85l23O49j79J16l83N36j05j2m91j05O72l63J89L68
$$ plain form
6266 424 -572 -72 -98 -227 -182 -387 -133 -544 -18 403 4 125 -64 6 523 108 -180 -229 17 -42 363 -415
6288 -415 34 118 -342 -297 62 -39 -172 -482 245 -57 118 427 212 323 135 -195 -289 407 -345 -612 178
6309 178 -132 188 286 134 -240 78 -112 -365 -260 -322 249 -62 567 -306 476 159 24 -216 306 -240 37
6330 37 244 -109 187 -182 506 44 34 -176 -180 40 -371 344 399 784 165 150 210 -10 36 -226 162 -106 -99
6353 -99 -236 -443 -48 199 -34 -125 154 119 -73 97 325 -109 1 599 -324 177 -560 448 -127 -45 -367
6374 -367 -53 218 -11 -101 -764 316 -286 5 466 -293 -154 372 307 14 145 -297 -308 32 260 6 694
6395 694 79 327 -9 -50 -1 3 -84 -508 -324 -194 -125 275 121 -123 22 468 -37 -254 338 -213 -486 -196
6417 -196 412 -388 -24 228 382 41 -130 -89 422 15 -21 -227 10 6 -92 169 199 -566 -354 -53 -308 -402
$$ packed form
6266D24r96N00k6j29M5k05K54m11N26M21l99J21j89P0N17m15k88m9K46n9M05p78
6288d15M49Q4m60M5L59j01j33l10P27l02J75L09k15J11j88l30r4O96p52k67P90
6309A78l10L20R8j52l74L18j90k53J05o2N71l11O29q73P82l17j35k40N22n46K77
6330C7K07l53K96l69O88m62j0k10mK20m11P15N5L85o19j5O0k20M6k62L88k68P
6353i9j37k07L95K47k33r1K79l5j92J70K28m34J10N98r23N01p37J008n75Q2l22
6374c67L14K71k29r0o63J080o02K91M61p59J39N26o5k93J31m42j1L40K28k54O88
6395F94o15K48l36m1M9Mq7m24J84J30O9M00j54k44J45M46n05k17N92n51k73K90
6417a96O08q00L64K52J54l41j71M1N11m07l6k06K37mr8K61L0p65K12L01k55r4
$$ plain form
6439 -402 -238 82 -348 -322 329 48 -252 -299 435 131 156 -206 -277 196 -380 -1 567 -98 44 100 36 3
6461 3 42 352 -85 -566 317 -80 206 -431 -366 346 60 -216 276 -35 517 628 111 -225 254 51 284
6482 284 -118 -434 44 -199 -22 139 -128 127 158 251 546 244 197 433 -166 -244 184 196 -227 -48 -199 -421
6504 -421 149 396 -66 -344 229 -183 -242 53 406 -472 -276 219 55 130 418 -597 40 -196 -469 491
6524 491 -246 -317 -324 -309 -104 -148 -212 -81 -364 -26 177 -134 520 3 164 -646 -280 31 23 2 173 -312 -295
6547 -295 38 -12 -134 -240 -133 270 97 312 79 -214 336 117 -305 283 8 -98 411 253 -218 -654
6567 -654 458 -82 121 206 -161 179 270 -71 -122 -343 -405 -266 702 105 -269 177 -41 -177 144 33 77
6588 77 -220 -62 63 372 -121 -213 -372 192 394 57 358 147 217 -207 -299 -164 -240 372 159 56 276 662
$$ packed form
6439d02J64L20m30K6O51k81l00m7P34l04K5l62p1M73n76L79N68o65J42N6o4l3
6461CL9L10m37m81Q83l97K86o37O5P12k86k76M92l11N52J11n17l36M79k03K33
6482B84m02l16M78k43J77J61k67K55L1R3K95l02m7K36n99p8M28J2m23J79j51k22
6504d21N70K47m62k78N73m12n9K95L53q78J96M95j64P5K88j015O37k36k73R60
6524D91p37p1pJ5K05m4o4J31k83L38K03l11O54n17J61q10L66L11qk1J71m85J7
6547b95L33n0j22j06J07M03j73K15k33k93N50k19m22N88k75j06N09j58m71m36
6567f54J112n40K03Q5l67L40R1l41n1k21o2J39R68n97l74M46k18j36L21j11M4
6588G7k97J58J25L09m93r2j59N64K02l37L01k11P0m24r2J35p6O12k13j03K20L86
$$ plain form
6610 662 112 117 -288 -137 -267 -224 -92 -61 399 -19 444 5 -80 -60 225 -259 -6 180 12 222 -153 131
6632 131 -470 104 -40 292 -13 196 -135 420 182 48 -9 -370 -188 -420 99 -156 -349 -238 175 123 -64
6653 -64 256 386 54 289 -337 242 -112 342 -316 -380 -73 -412 58 -244 291 48 384 -95 173 -222 15
6674 15 573 104 137 -42 250 231 708 32 -271 289 -220 -217 -140 -223 214 -559 219 318 -51 -50 176 -26 310
6697 310 -252 96 31 -221 682 293 248 358 -95 -268 -230 190 411 233 85 331 -393 134 -228 361 893
6718 893 -250 -651 285 -401 -772 43 -122 302 208 531 236 23 -597 340 -331 183 202 -51 283 -407
6738 -407 -63 -574 164 -17 10 155 -149 7 -89 -620 -171 129 44 -468 169 -262 -35 288 85 271 -62
6759 -62 9 349 402 -49 -44 437 -688 171 -231 -346 112 93 86 -192 362 -101 142 223 -56 355 134 323 391
$$ packed form
6610F62n50Nm05J51j30M3J32L1M60m18M63m39q5K0K85m84K53J86j68K10l75K84
6632A31o01N74j44L32l05K09l31N55k38j34n7l61J82k32N19k55j93J11M13n2j87
6653f4L20J30l32K35o26N79l54M54o58o4L07l39M70l02N35k43L36m79K68l95K37
6674A5N58m69L3j79K92j9M77o76l03N60n09LP7q3M37p73P78R9l69JK26k02L36
6697C10n62L48o5k52R03l89m5J10m53j73L8M20K21j78j48K46p24N27l62N89N32
6718H93j143m01R36o86l71Q15j65M24r4L23k95k13o20R37o71N14J9k53L34o90
6738d07L44n11P38j81K7J45l04J56r6n31M49L00q5n12O37m31K27L23k03J86l33
6759f2P1L40N3m51NM81j125Q59m02j15M58j9pk78N54m63K43Q1k79M11k21J89O8
$$ plain form
6782 391 234 -4 -283 258 -471 -118 -239 -103 136 708 -214 -102 529 195 169 -141 -324 -259 -19 -75 355
6803 355 694 -34 -491 -208 137 156 -34 -210 475 16 188 -144 140 137 -378 555 -306 -390 -365 -501 -131 -35
6825 -35 334 -381 -698 -53 403 568 243 16 54 123 -244 78 286 7 255 -161 -298 -331 408 120 -225
6846 -225 -387 -97 -14 100 319 -218 -213 369 -172 -236 215 62 -169 216 -351 401 76 -293 -161 125 -152
6867 -152 44 31 -112 121 188 -334 114 422 324 32 702 178 -257 520 154 -385 -31 -289 -74 13 100 759
6889 759 -64 -234 423 -103 457 177 32 501 201 179 -306 55 351 205 -357 -515 -153 57 49 -197 -262
6910 -262 -156 -328 319 167 103 -34 -38 -18 203 332 -319 -175 -12 -91 224 -115 82 105 137 180 63 -2 386
6933 386 -73 18 424 -5 -40 -186 -169 102 -363 -573 -17 -530 -175 230 -145 420 173 -251 -143 -295 -329
$$ packed form
6782C91j57k38k79N41p29L53j21J36K39N72r22J12O31l34k6l10j83O5K40n6M30
6803C55L39p28m57K83L45J9j90j76O85m59J72l32K84ln15R33q61q4K5j36L70R6
6825c5L69p15l17O45M56J65l25k27L8O9l67L22K08k79K48m16j37l3P39k88l45
6846b25j62K90Q3J14K19n37NN82n41o4M51j53k31L85n67P52l25l69J32K86k77
6867a52J96j3j43K33O7n22M48L08r8k92O70n24m35P77l66n39L54k58K15Q7Q7O59
6889G59q23j70O57n26N60k80j45M69l00k2m85L61K96j46n62j58L62K10qk46o5
6910b62J06j72O47j52o4j37mK0K21J29o51J44J63p9L15l39J97K3L2M3j17o5L88
6933C86m59R1M06m29l5j46J7K71m65k10N56n13L55M05l75N65k47m24J08j52l4
$$ plain form
6954 -329 -80 12 251 3 60 -13 -219 -67 325 -252 450 -189 3 460 -75 211 28 185 -74 -398 157
6975 157 345 430 234 80 -181 81 -287 228 409 -170 233 -279 369 -162 -160 342 -54 -318 -143 186 490
6996 490 -75 173 -80 -220 -182 63 188 16 -321 117 -236 -430 -347 39 660 -323 -146 -61 49 -8 -151
7017 -151 -911 267 -44 -112 -357 385 -235 53 85 -117 -370 -333 -373 -333 237 197 44 -407 97 664 124 242
7039 242 -105 -38 -103 55 64 502 5 -175 400 -89 -217 39 220 88 -416 36 434 145 -109 -128 764 -142
7061 -142 296 290 -158 -355 343 98 -305 296 -167 467 -43 -75 -60 47 -273 -217 23 -235 92 -604 108 -141
7083 -141 -626 -261 -92 252 -351 141 32 166 481 -141 -224 -475 264 -465 182 28 -238 220 101 -370
7103 -370 332 -65 661 121 321 -53 9 229 38 -46 289 313 43 -216 49 208 476 274 36 111 -254
$$ packed form
6954c29K49R2K39k48N7p3k06J52L92n77P02o39J92M57n35K86j83J57k59l24N55
6975A57J88Q5j96j54k61K62l68N15J81n79M03n12O48n31KN02l96k64J75L29L04
6996D90n65K48k53j40L8K45J25j72l37M38l53j94Q3L86O21r83J77Q5J10n7j43
7017a51p60J178l11o8k45P42o20K88L2k02k53L7m0M0N70m0j53m51N04N67n40J18
7039B42l47O7o5J58RM38m97j80N75m89j28K56J81j32n04M52L98k89k54j9Q92r06
7061a42M38om48j97O98k45m03O01m63O34n10l2J5J07l20N6K40k58L27o96P12k49
7083a41m85L65J69L44o03M92j09J34L15o22q3k51P39p29O47j54k66M58j19m71
7103c70P02l97P26n40K00l74O2K20j91q4L35K4k70k59K65J59K68k02k38P5l65
$$ plain form
7124 -254 136 217 -97 225 372 -76 -10 377 223 -51 -531 -152 473 464 31 404 -213 -23 -230 -260 324 99
7146 99 226 -48 -436 -356 115 282 62 -218 144 382 204 17 -227 -43 179 -275 369 41 -117 25 214
7167 214 -220 160 176 149 -216 181 288 265 -386 -436 373 -300 -38 6 50 -67 286 -361 -541 280 288 169 -78
7190 -78 143 15 -163 200 -533 -480 -101 399 117 -93 129 301 -52 139 -93 203 -128 -105 374 683 675 -268
7212 -268 287 14 -9 160 156 -178 186 93 -10 -391 -58 139 144 584 -86 379 -241 -462 -160 196 37 -449
7234 -449 564 31 -163 60 10 -71 517 -35 -196 38 169 -456 -159 412 31 338 -261 -201 228 -250 8
7255 8 -185 695 186 30 34 -12 -202 -744 330 -477 23 542 -196 -135 -106 199 36 160 138 -167 171 7
7277 7 33 15 340 92 -218 359 183 168 -86 -424 -478 -169 -357 208 -8 -228 193 558 -218 -33 279 363
$$ packed form
7124b54L90Q1l14L22J47m48O6L87j54k74m80L79O25rm33L73o17J90k07l0N84k25
7146I9J27k74l88Q0M71J67k20k80L62K38j78j87k44J84K22m54O44l28j58J42J89
7167B14m34L80J6k7l65L97J07k3o51n0Q09o73K62M4M4j17L53o47j80Q21Qj19k47
7190g8K21j28j78L63p33N3L79N00k82k10K22J72l53J91k32K96l31K3M79L09qr43
7212b68N55k73k3J69ml34L64r3j03l81L33J97NM40o70M65o20k21L02L56j59m86
7234d49J013n33j94K23n0q1N88n52j61K34J31o25K97N71l81L07n99O0M29m78K58
7255Hj93Q80n09j56Mm6j90n42J074q07N00N19p38O1K9L05j63J24k2l05L38j64
7277GK6j8L25k48l10N77j76j5k54l38n4L09j88N65k16k20M21L65p76J85L12Q4
$$ plain form
7299 363 180 -32 -89 -181 -105 164 696 337 31 -83 -51 -426 322 38 -110 167 -8 -184 53 -186 329
7320 329 207 -30 -196 51 153 3 13 51 -132 -121 -231 -91 -98 -143 -359 320 208 167 -397 -68 -153 -554 -512
7343 -512 134 444 127 342 4 -76 222 -472 29 -9 374 370 108 120 -56 -140 245 -58 77 192 -105 -391
7365 -391 296 515 -159 166 -93 -283 -55 489 -311 10 -638 117 -641 -606 25 -221 393 63 -97 -188 60
7386 60 356 689 369 485 -300 -109 -447 -79 -664 -101 253 107 -263 -121 -396 206 -70 -212 -55 111
7406 111 443 102 184 -132 726 -29 552 -54 -511 -96 -628 -577 152 32 163 -83 -593 178 460 97 -96
7427 -96 163 -202 514 -163 -297 71 -106 -42 74 109 -343 61 -590 -296 482 -95 -48 -64 -544 -203 -383 -349
7449 -349 -368 560 -142 -414 -285 268 -104 -221 -315 313 186 -358 -112 84 93 32 131 -241 51 -657 458 -13
$$ packed form
7299C63j83k12n7r2P6K69N32l59l06j14L2l75P48k84j48K77j75j76K37k39N15
7320C29j22k37j66K47J02j50J0L8j83J1j10J40pm5k16O79j12m1n64L29q5m01M2
7343e12O46L10l17K15l38q0K98o94N01l8L83mk62J2j76q4L85l03J35J15k97k86
7365c91O87K19o74L25k59j90K28N44q00L21o48P55p58L5O31k46O14l30j60r1K48
7386F0K96L33l20J16p85J91l38L68n85N63L54j46l70J42k75O02k76j42J57J66
7406A11L32l41Q2l16Q58p55N81o06m57M15n32N1P29j20J31k46n10P71K82l63j93
7427i6K59l65P16o77j34L68j77O4J16L5m52M04o51K94P78n77M7j6m80L41j80L4
7449c49j9R28p02k72J29N53l72j17r4O28j27n44K46J96Ro1R9l72K92p08J115m71
$$ plain form
7471 -13 230 345 -407 382 -215 -95 268 236 149 208 -34 -352 392 -481 -418 31 -147 -464 263 -128 -559 147
7493 147 -621 60 -37 131 435 -328 -46 143 344 194 298 23 -34 -138 148 120 312 87 -276 -9 -239
7514 -239 86 5 -239 -4 138 -181 72 -93 -673 248 -206 -516 81 213 -29 288 4 193 64 105 -219
7535 -219 -26 545 -27 -42 -36 305 151 124 212 -312 -428 -412 -206 341 -9 -181 221 102 -164 299 -23 404
7557 404 -31 -163 15 -131 -121 -110 462 81 327 10 275 -310 -323 -109 60 18 95 -148 273 -88 351 -299
7579 -299 -108 -47 -425 -172 755 66 85 285 -196 365 -56 -61 257 -172 31 600 -199 -339 -282 297 43 307
7601 307 168 55 -74 -196 175 28 -22 -170 -41 177 65 -77 26 -18 -431 73 124 59 -84 -195 -182 -192
7623 -192 -17 -290 286 243 -193 -1 -89 -59 -97 -417 316 -387 -136 328 -162 -161 245 -143 454 -134 511 282
$$ packed form
7471a3K43J15p52P89n97J20L63l2q7N9k42l18P44q73O3M49j78l17P27l91m31P06
7493A47p68O81r7J68L04p63K82J89K01j50J04k75n7j04K86k8J92k25l63K67k30
7514b39L25q1k44K35J42l19K53j65n80R21m54l10N97J32k42L17k84J89j29M1l24
7535b19J93N71n72j5OL41j54k7Q8n24j16J6K06N47l50j72M02j19k66M63l22M27
7557D04m35j32J78j46J0J1N72l81K46l17K65n85j3K14J69m2P7k43M21l61M39o50
7579b99J91O1l78K53R27o89J9K00m81N61m21nL18m29K03N69p99j40N7N79k54K64
7601C07j39j13j29j22L71j47n0j48J29K18j12j42J03m4m13N04N1o5j43j11J3j0
7623a92J75k73N76m3m36J92q8L0l8l20P33p03K51M64m90JM06l88N97n88O45k29
$$ plain form
7645 282 67 543 -157 -233 17 311 -754 108 -206 -242 -365 -179 -259 -220 -183 225 79 75 92 82 177 -58 -387
7668 -387 -380 -196 -361 467 722 46 -447 29 35 -8 -383 228 229 267 -15 386 363 -208 132 20 -131 229 55
7691 55 22 -500 -35 179 -249 502 226 0 -325 50 -184 193 -142 -15 38 222 -98 120 -172 -452 170
7712 170 -322 -132 57 -164 -109 -209 19 323 -95 -285 -190 23 240 419 34 -182 5 299 -342 -19 219
7733 219 4 -154 -384 -180 -252 455 -153 159 92 249 55 -123 -3 241 -258 608 -43 -33 68 50 430
7754 430 -126 14 120 9 -397 238 263 504 245 -263 447 91 194 -211 210 7 -224 -54 -830 246
7774 246 14 -30 -295 226 253 -570 -349 -513 -130 96 142 29 -490 -547 -54 85 26 -170 393 -106 -411 177
7796 177 836 180 -117 232 -180 -149 138 113 51 -316 237 196 -24 -2 -13 -210 206 21 -17 -434 340 78
$$ packed form
7645B82k15M76p00p6K50K94j065Q62l14l6j23J86q0L9L7M08j46mJ7j0R5k35l29
7668c87PJ84j65Q28K55o76m93M76Om3l75O11JL8k82M01k3n71L40j12j51L60j74
7691E5l3n22M65K14m28P51k76k26l25L75k34L77l35J27N3J84l20K18k92k80O22
7712A70m92J90J89k21N5j00K28L04m18j90R5K13K17J79l85k16J87K94o41L23K38
7733B19k15j58k30K04p2P07o08L12o7J57j94j78J20K44m99Q66o51J0J01j8L80
7754D30n56J40J06j11m06O35K5K41k59n08P10l56J03m05M21k03k31J70p76J076
7774B46k32m4k65N21K7q23K21j64L83K26M6j13n19n7M93J39n9j96N63m99l05N88
7796A77O59o56k97L49m12L1K87k5o2l67N53m1k20K2j1j97M16j85l8m17P74k62
$$ plain form
7818 78 -97 127 209 -99 49 467 -378 248 163 150 415 141 250 -454 -279 -156 -3 185 -2 243 559
7839 559 82 367 506 26 74 -153 -310 67 343 -92 -349 -157 66 -2 87 45 118 280 134 129 12 284
7861 284 85 -265 -69 -100 -238 67 -6 117 407 324 51 163 172 56 -185 -461 -336 -127 -494 -455 -222 82
7883 82 -296 -175 171 -456 -292 -256 60 -629 132 -241 -485 -581 -368 -202 129 -162 -297 -28 -111 250 299 -111
7905 -111 -267 -648 -310 -387 500 -448 38 152 83 43 -305 8 244 245 -266 286 224 374 -424 -150 28 146
7927 146 -56 -196 -42 399 112 -105 -314 493 -205 21 105 -291 -184 289 390 -327 -476 367 333 -531 -9
7948 -9 -206 -19 -235 -61 543 -47 -310 3 -271 105 -66 -272 -59 -153 -238 346 26 172 89 298 226 -107
7970 -107 -128 25 244 -81 13 -234 91 -296 211 74 -412 -264 -1007 163 17 83 86 62 43 -450 -297 -262
$$ packed form
7818G8j75K24Q2l08J48M18q45O26q5j3K65k74J09p04J75J23J53J88j87K45L16
7839E59m77K85J39m80M8k27j57L77K76m35k57J92K23o8Q9m2P3J62j46nj17K72
7861B84j99l50J96l1j38L05p3J23K90q3k73J12Rj16k41k76J25K09l67L9K33L04
7883H2l78J21L46o27J64L6L16o89P61l73k44r6K13J66L31k91j35K69q3L61M9m10
7905a11j56l81L38p7Q87r48M86J14o9m0l48L13K36Jn11N52o2J50p98K74J78J18
7927A46k02j40J54M41k87k17k09Q07o98K26Q4l96J07M73J01p17j49Q43l4q64N22
7948ij97J87k16J74O04n90k63L13k74L76j71k06K13r4q5N84l20J46q3K09p2l33
7970a07k1J53K19l25R4k47L25l87N07j37m86J48p43J170j46O6Lk4j9m93J53L5
$$ plain form
7992 -262 -35 -63 408 300 207 -277 486 499 -174 390 -91 530 283 214 504 -141 -259 118 -132 373 -530
8013 -530 86 -360 329 -362 -472 447 219 -306 161 11 -56 188 96 370 528 449 -3 191 217 127 -266 -110
8035 -110 -69 -46 50 -5 66 -86 307 197 567 128 -287 -203 -87 277 -186 361 -332 9 -132 38 -17 384
8057 384 741 360 125 764 3 285 569 -295 -19 60 172 -41 -67 -80 391 197 273 55 417 -169 261
8078 261 76 435 538 462 81 -788 -231 -169 -52 418 -140 -75 336 202 113 162 -27 -343 -45 20 -201 -173
8100 -173 365 45 -120 -219 313 567 429 86 -562 336 -150 301 -88 -230 -248 314 -236 -94 113 179 144
8121 144 566 134 334 -367 597 26 -320 -153 -383 112 -574 55 -255 277 560 132 -255 56 -292 -293 -416
8142 -416 -162 -190 236 150 -476 -137 -117 76 93 203 63 190 121 -235 -399 -63 15 -276 47 -228 -604 -126
$$ packed form
7992b62K27k8M71j08r3m84P63J3o73N64m81O21k47o9K90o45j18L77k50N05r03
8013e30O16m46O89o91j10R19k28n25M67j50o7K44r2K74J58p9m52J94K6r0l93J56
8035a10M1K3R6n5P1j52L93j10L70m39m15Q4J16L64m63N47o93L41j41J70n5M01
8057C84L57l81k35O39p61K82K84q64K76P9J12k13k6j3M71j94P6k18L62n86M30
8078B61j85L59J03p6l81q69N57O2J17M70n58O5M11j34q9M9j89l16K98O5k21K8
8100a73N38l20j65r9N32K54j38l43o48Q98m86M51l89j42j8N62n50J42K07O6l5
8121A44M22m32K00p01R64n71l46J67k30M95o86O29l10N32K83m28l87L11l48jj23
8142d16K54k8M26q6o26L39K0J93J7J10j40J27o9l56j64L36P8k91L23k75l76M78
$$ plain form
8164 -126 -36 -675 427 -204 88 -2 -423 -27 -19 487 -164 -198 -260 -425 -127 198 123 -408 123 203 -133 -171 269
8187 269 15 -188 -105 326
$$ packed form
8164a26R0o39J102o31K92r0m21L96QN06o51l4o2j65K98L25p5n31N31Q0l36l8M40
8187B69k54k03Q3M31
8191C26
$$ Imaginary data points
##PAGE= N=2
##DATA TABLE= (X++(I..I)), XYDATA
$$ plain form
0 0 0 0 0 0 0 0 0 0 0 0 0 0 0 0 0 0 0 0 0 -9 32 -32 32 -32 32 -32 53 -64 64 -66 92 -96 106 -127 137 -159 175
37 175 -197 221 -245 272 -302 334 -368 409 -450 498 -546 605 -666 734 -806 891 -981 1085
55 1085 -1206 1339 -1495 1680 -1897 2160 -2489 2904 -3466 4247 -5414 7339 -11073 20876 -97037
70 -97037 -185336 118145 42166 -104957 10394 -23120 -127303 43768 77585 -40821 1950
81 1950 6239 -72073 14166 43739 -35906 -8140 5972 -43986 9678 22654 -35965 -7576 8334
94 8334 -24753 3959 -14946 -46605 29777 33935 -44408 -10844 10802 -20061 26766 21725 -44462
107 -44462 -2494 13661 -26530 35265 37664 -52274 -3356 36793 -25114 26638 47916 -63332
119 -63332 -15870 69410 -23079 -13607 64416 -25894 -33596 70345 2897 -39983 56259 16630
$$ packed form
0@%%%%%%%%%%%%%%%%%%%rM1o4O4o4O4o4Q5j17J28j30J58j88K02k33K64k96L34
37A75l72M18m66N17n74O36p02P77q59R48j044J151j271J400j540J697j872K066
55A085k291K545k834L175l577M057m649N393o370P713r661J2753j8412L1949j17913
70i7037q8299L03481p5979j47123J15351l3514j04183J71071L3817j18406M2771
81A950M289p8312Q6239K9573p9645K7766J4112m9958N3664J2976n8619K8389J5910
94H334l3087K8712j8905l1659P6382M158p8343L3564K1646l0863M6827n041o6187
107d4462M1968J6155m0191O1795K399q9938M8918M0149o1907N1752K1278j11248
119f3332M7462Q5280r2489R472P8023r0310p702J03941o7448m2880R6242l9629
$$ plain form
131 16630 -45577 31702 26674 -24868 26902 21110 -25590 17793 16560 -17448 24769 18188 -28032
144 -28032 6899 16440 -10766 18574 12779 -27908 3472 19302 -10388 5957 6230 -23974 1487
157 1487 12299 -13242 2326 3694 -22306 -33 7733 -16201 1797 1099 -26568 1585 8574
170 8574 -26847 -88 12320 -29578 -6529 16765 -25772 -10317 19998 -25721 -19903 20787
182 20787 -14100 -20229 17977 -12242 -24142 17629 -1786 -20768 12129 -1872 -20299 12034
194 12034 6388 -15883 7392 4524 -14122 8584 8558 -10373 6240 7976 -8120 6597 9772
207 9772 -5184 7334 9723 -4081 6630 10492 -931 7588 8860 -1514 8194 10502 -35
220 -35 8887 8055 -2740 9402 11335 -2963 6390 8839 -5082 6582 12589 -4491 2495 10852
$$ packed form
131A6630o2207P7279n028n1542N1770n792m6700M3383j233l4008M2217o581m6220
144b8032L4931R541k7206K9340n795m0687L1380J5830k9690J6345K73l0204K5461
157A487J0812k5541J5568J368k6000K2273P766k3934J7998o98k7667K8153O989
170H574l5421K6759J2408m1898K3049K3294m2537J5455L0315m5719N818M0690
182B0787l4887o129L8206l0219j1900M1771j9415j8982L2897j4001j8427L2333
194A2034n646k2271K3275k868j8646K2706k6j8931J6613J736j6096J4717L175
207I772j4956J2518K389j3804J0711L862j1423Q519J272j0374R708K308j0537
220c5Q922q32j0795J2142J933j4298R353K449j3921J1664O007j7080O986Q357
$$ plain form
234 10852 -4928 1352 12588 -4810 -2936 9795 -3172 -4003 8656 -3188 -6658 6304 -1950
247 -1950 -7574 4245 -1498 -8813 1639 -2009 -9152 87 -2322 -8910 -1761 -2850 -9094 -2045 -2488
262 -2488 -8958 -4272 -3156 -7855 -4036 -2657 -7992 -4602 -2761 -6310 -3812 -2908 -6105 -3264 -1928
277 -1928 -4662 -2129 -1868 -4109 -1071 -487 -3380 -120 368 -3085 829 2337 -1686 832 3328 -225
293 -225 1584 3582 1156 2567 4892 2003 2555 4923 3401 2878 5680 3830 2683 5350 5071 2995
309 2995 4906 4406 3305 5193 4216 3546 4806 3763 2945 4693 4324 1555 3495 4524 1834 2038 3116
326 3116 1866 631 1414 1402 461 433 197 484 -1035 -1091 -1188 -891 -1242 -2014 -2777 -1947 -2556 -3646 -2407 -3178
346 -3178 -3687 -3246 -3872 -4058 -3906 -3604 -4221 -3067 -3669 -4790 -3943 -3364 -4064 -4060 -3277 -3837 -3720 -3655 -2855 -3001
$$ packed form
234A0852j5780O280J1236j7398J874J2731j2967q31J2659j1844l470J2962q254
247a950n624J1819n743p315J0452l648p143R239k409o588P149j089o244P049m43
262b488o470M686J116m699L819J379n335L390J841l549K498R04l197K841J336
277a928k734K533K61k241L038N84k893L260M88l453L914J508m023K518K496l553
293b25J809J998k426J411K325k889N52K368j522n23K802j850j147K667k79k076
309B995J911n00j101J888r77o70J260j043q18J748l69k769J940J029k690K04J078
326C116j250j235P83j2r41k8k36K87j519n6r7K97l51p72p63Q30o09j090J239p71
346c178n09M41o26j86J52L02o17J154o02j121Q47N79p00MP83n60J17O5Q00j46
$$ plain form
366 -3001 -2759 -3428 -1851 -1788 -2461 -1939 -639 -1349 -1697 430 -558 -636 358 319 1111 1058 537 1727 2125 511
386 511 2034 3186 1689 1695 4075 3719 2725 3045 3244 4324 4272 3201 2886 4325 3830 3298 4578 4646 2339
405 2339 3699 4195 2835 2723 4065 2873 2192 2409 2417 1965 2432 1870 1002 1572 772 76 663 853 -454
424 -454 -458 237 -291 -2056 -1360 -1374 -2866 -1765 -1756 -2354 -2071 -2489 -3337 -2688 -2837 -3573 -3319 -3163 -3609 -3187 -2477
445 -2477 -3115 -3568 -3342 -3199 -2824 -3084 -2965 -2525 -2668 -3857 -1794 -1973 -2921 -1446 -2124 -2242 -1112 -712 -1552
464 -1552 -145 -260 -2298 824 1224 -1114 490 1863 -1263 1246 3256 -137 942 3970 1371 1288
480 1288 4071 2182 1493 4518 2512 937 5086 3268 2085 4586 3357 1759 4308 3834 1999 4227
496 4227 3664 981 4144 3387 1161 2494 1996 905 2214 2408 424 1357 1602 -103 1489 1155 -1356
$$ packed form
366c001K42o69J577O3o73N22J300p10l48K127r88p8R94l9P92n3n21J190L98j614
386E11J523J152j497OK380l56r94L20J99J080n2j071l15J439m95n32J280O8k307
405B339J360M96j360j12J342j192o81K17Qm52M67n62q68N70q00o96N87J90j307
424d54mO95n28j765O96j4j492J101Rn98K83m18q48O49j49p36K54J56m46M22P10
445b477o38m53K26J43L75k60J19M40j43j189K063j79r48J475o78j18J130M00q40
464a552J407j15k038L122M00k338J604J373l126K509K010l393J079L028k599q3
480A288K783j889o89L025k006j575M149j818j183K501j229j598K549m74j835K228
496D227n63k683L163p57k226J333m98j091J309J94j984R33K45j705J592l34k511
$$ plain form
513 -1356 580 -368 -2082 717 455 -2956 199 -723 -4065 -695 252 -5011 -1940 -211 -4846 -2171
529 -2171 715 -5162 -3889 -288 -5251 -3653 262 -4970 -4714 -269 -4733 -4247 345 -3105 -5197 1063
545 1063 -2742 -4763 1005 -1655 -4975 703 -374 -3551 948 -227 -3363 982 857 -1628 1499
560 1499 1978 -1892 1426 1736 -382 2608 1791 -111 2615 2800 191 4046 3478 -266 4239 3651 -437
577 -437 4139 4603 -670 3284 5525 -366 3317 5904 -1559 2508 5934 -540 1899 5643 -1162 787
593 787 5256 -550 195 5048 -1117 -1562 4126 -403 -2158 3894 -203 -3680 2744 142 -3592 1178
609 1178 -713 -4530 575 -233 -4336 -309 -906 -5319 -798 -794 -4345 -1729 -1876 -4677 -1811 -1337 -4923
626 -4923 -948 -1225 -5087 -1447 -1220 -4641 -570 -767 -5805 -35 336 -4555 -683 1118 -4761 -948
$$ packed form
513a356J936r48j714K799k62l411L155r22l342L370R47n263L071J729m635K675
529b171K886n877J273L601m963J598L915n232K56M445m464M86M592l450k092O260
545A063l805k021N768k660l320N678j077l177M499j175l136M345j25k485L127
560A499M79l870L318L10k118K990q17j902K726J85k609L855n68l744M505n88m088
577d37M576M64n273L954K241n891L683K587p463M067L426o474K439L744o805J949
593G87M469n806P45M853o165m45N688m529j755O052m097l477O424k602l734M770
609A178j891l817N105q08m103M027n97m413M521Ml551K616j47k801K866M74l586
626d923L975k77l862L640K27l421M071j97n038N770L71m891L872J801n879L813
$$ plain form
642 -948 2115 -3499 -1178 2205 -3299 -826 3940 -2427 -130 3388 -1404 -848 4698 -432 -999 4617
658 4617 453 -630 5348 1985 -1172 4915 1821 -656 4653 3072 -707 4225 3075 -262 4153
673 4153 3336 211 3381 3026 227 3221 3523 -240 2690 1917 -488 2341 2176 -985 1934 1677 -1516
690 -1516 1671 2022 -1630 685 1267 -2489 -24 1165 -2991 -1251 1363 -3614 -1672 851 -3421 -2611
706 -2611 287 -3387 -3191 161 -3476 -3540 121 -3232 -3701 272 -2582 -3512 441 -2516 -4105 -76
722 -76 -1926 -4008 -21 -1270 -3502 77 -365 -3235 -228 -372 -2332 223 112 -2422 -135 579 -1145
739 -1145 648 1100 -926 1439 1182 -199 2025 1826 71 1771 2359 379 1992 2724 80 1925
755 1925 2940 434 1863 3705 599 1281 3773 1012 1567 3307 1141 980 3171 678 579 2403
$$ packed form
642i48L063n614K321L383n504K473M766o367K297L518m792N56N546n130n67N616
658D617m164j083N978l363l157O087l094k477N309j581l779M932j150l337M415
673D153q17l125L170l55k799K994L02l763K930p73k405K829j65l161K919k57l193
690a516L187L51l652K315N82l756K465J189m156J740K614m977J942K523m272Q10
706b611K898l674J96L352l637o4L661l353m69L973k854r30L953k957j589M029
722g6j850k082L987j249k232L579m42k870L007j44j960K555j11k534K287P14j724
739a145J793M52k026K365k57j381K224j99j755J700N88j980J613P32k644J845
755A925J015k506J429J842l106O82K492k761N55J740k166j61K191k493r9J824
$$ plain form
771 2403 844 814 2264 617 107 1918 572 -566 1509 260 -686 737 308 -1261 796 -12 -1725
788 -1725 165 -392 -2304 -801 -829 -1255 -1254 -1074 -1805 -1531 -1732 -2121 -1416 -1758 -2691 -1372 -1218 -2690 -1858
807 -1858 -1029 -2494 -1855 -1101 -2292 -1820 -967 -2215 -1485 -454 -1598 -1435 -484 -1489 -1835 -259 -816 -583
825 -583 124 50 -1143 173 -302 -292 1190 389 230 437 1289 262 1198 1192 1370 881 1267 1210 1546 1956 1229
846 1229 1412 2255 1520 1846 1531 1892 1482 1852 1505 1487 1866 1502 1430 1968 1532 1158 1734 1539 941 1459 1407
867 1407 56 847 633 -263 262 611 -435 128 -508 -367 -412 -246 -681 -944 -410 -946 -1103 -1271 -1200 -1441
887 -1441 -387 -1578 -1234 -1320 -1496 -2238 -1490 -1748 -2071 -1745 -1509 -1794 -1042 -1374 -1470 -1378 -1434 -1390 -1094 -1199 -1701
908 -1701 -778 -668 -679 -1244 -875 -640 -621 -267 -211 -267 230 298 573 460 383 80 1127 255 853 1508 1055 806
$$ packed form
771B403j559l0J450j647n10J811j346j138K075j249r46J423m29j569K057q08j713
788a725J890n57j912J503k8m26JJ80p31K74k01l89P05l42r33J319J54j472Q32
807a858Q29j465O39P54j191M72Q53j248P30J031j144J63R51j005l46J576n57K33
825e83P07p4j193J316m75J0J482q01j59K07Q52j027R36oJ78m89L86n7L36M10p27
846A229J83Q43p35L26l15L61m10L70l47j8L79l64p2N38m36l74N76j95n98N18n2
867A407j351P91k14q96N25L49j046N63o36J41m5J66m35k63N34n36j57j68P1k41
887a441J054j191L44q6j76p42P48k58l23L26K36k85P52l32r6R2n6M4K96j05n02
908a701R23J10j1n65L69K35J9L54N6n6M97O8K75j13p7l03J047q72N98O55m53k49
$$ plain form
930 806 1273 1268 611 1763 1801 1809 1625 644 1035 2185 1464 1109 1986 1462 986 1318 2094 1006 1409 1254 710
951 710 1372 783 817 989 942 347 706 833 -196 474 570 50 54 -151 -218 -42 -43 -944 -815 -325 -1088 -1425 -546
974 -546 -1324 -1167 -813 -1308 -1647 -720 -1501 -1379 -981 -1827 -1501 -1057 -1629 -1490 -1391 -1584 -1505 -781 -1150 -1422 -436
995 -436 -1140 -1114 -857 -1061 -870 -53 -752 -734 -476 -219 -525 129 484 -359 169 142 616 533 -23 484 226 641
1017 641 1018 930 1237 1046 955 1082 1392 724 1380 1046 1478 1459 1366 1545 1444 1127 1298 1139 1257 908 1229
1038 1229 1309 1348 825 442 999 1119 1111 624 511 96 408 350 230 212 -115 87 -292 -575 -247 330 -316 -610
1060 -610 -406 -676 -982 -629 -342 -1031 -788 -1067 -1111 -896 -1421 -1149 -964 -1241 -1168 -955 -785 -1389 -768 -578 -1412
1081 -1412 -739 -1144 -1772 -677 -1264 -1360 -854 -1154 -1070 -714 -363 -597 -373 -536 -361 444 -341 259 839 144
$$ packed form
930H06M67no57J152L8Qj84r81L91J150p21l55Q77n24m76L32P76j088M03j55n44
951G10O62n89L4J72m7n95L59J27j029O70R6n20Mk05o7J76jr01J29M90p63l37Q79
974e46p78J57L54m95l39R27p81J22L98q46L26M44n72J39R9j93P9P24l69k72R86
995d36p04K6K57k04J91Q17o99J8K58K57l06O54L55q43N28k7M74q3n56N07k58M15
1017F41L77q8L07j91r1J27L10o68O56l34M32j9r3J79j01l17J71j59J18l49L21
1038A229Q0L9n23l83N57J20qm87j13m15L12n8j20j8l27K02l79k83L28N77o46k94
1060f10K04k70l06L53K87o89K43k79m4K15n25K72J85k77P3K13J70o04O21J90q34
1081a412O73m05o28J095n87r6N06l00Q4L56L51k34K24j63J75Q05p85O00N80o95
$$ plain form
1101 144 -502 417 -78 597 1237 883 509 286 1063 447 1501 1269 389 1299 1565 896 1065 1131 1089 1350
1121 1350 1713 1309 1124 1343 1190 1573 1598 1144 838 1340 1074 1206 1141 503 105 354 406 309 914 251 -499
1142 -499 90 -190 -724 -164 -255 -725 -592 167 -695 -344 -789 -898 -678 -692 -998 -955 -682 -1252 -671 -1070 -1495
1163 -1495 -1096 -801 -1429 -575 -578 -1654 -935 -754 -868 -634 -513 -1033 -1006 -149 -935 -722 -296 -921 -222 171
1183 171 -459 -384 75 -413 -330 256 69 -71 284 420 -250 396 399 -20 943 777 792 809 973 572 822 1184
1205 1184 917 960 1183 508 1139 1453 356 950 1087 557 1124 768 459 626 984 850 669 1082 725 525
1225 525 528 -456 303 507 -76 87 614 -286 -368 131 -639 -679 -3 -770 -1170 -12 -282 -971 136 -284 -876
1246 -876 -64 -689 -697 -728 -946 -833 -1123 -1046 -1395 -668 -220 -1520 -530 -648 -905 -917 68 -793 -417 -197 -1442
$$ packed form
1101A44o46R19m95O75O40l54l74k23P77o16J054k32q80R10K66o69J69O6m2K61
1121A350L63m04j85K19j53L83K5m54l06N02k66J32o5o38l98K49N2r7O05o63p50
1142d99N89k80n34N60r1m70J33P59q62L51m45j09K20j4l06M3K73n70N81l99m25
1163a495L99K95o28Q54lj076P19J81j14K34J21n20K7Q57p86K13M26o25O99L93
1183A71o30P5M59m88Q3N86j87j40L55J36o70O46Lm19R63j66J5J7J64m01K50L62
1205A184k67M3K23o75O31L14j097N94J37n30N67l56l09J67L58j34j81M13l57k00
1225E25Lr84P59K04n83J63N27r00q2M99p70m0O76p67m00J158k70o89J107m20n92
1246h76Q12o25ql1k18J13k90P7l49P27M48j300R90j18k57j2R85q61L76K20j245
$$ plain form
1267 -1442 -1012 -221 -996 -287 675 -11 -155 -501 -436 -229 363 396 146 498 552 598 729 522 317 908 398
1288 398 996 1027 800 839 1029 610 606 1095 673 263 909 1436 1189 568 1161 452 1112 998 859 492 621
1309 621 894 985 770 720 292 345 312 545 513 189 182 216 -348 -299 728 -774 -559 409 -305 -350 70 -713 -884
1332 -884 -1048 -1153 -840 -206 -1142 -1010 -746 -380 -1416 -496 -783 -1152 -684 -652 -1051 -472 -717 -877 -514 -523 -1047
1353 -1047 -919 -727 -849 -146 -377 -804 -105 -521 -909 103 -210 -326 -188 272 -113 364 45 236 851
1372 851 1170 552 940 819 460 -210 1008 733 178 1017 539 285 888 1673 433 868 1369 402 1193
1391 1193 794 816 721 510 545 803 864 822 984 848 347 353 431 -308 683 642 -292 317 481 -123 -21 441 -364
1414 -364 121 -432 -626 -895 -122 -415 -534 -410 -988 -400 -380 -1376 -997 -406 -378 -1236 -890 -849 -683 -352 -1029
$$ packed form
1267a442M30P91p75P09R62o86j44l46O5K07N92L3k50L52N4M6J31k07k05N91n10
1288C98N98L1k27L9J90m19mM89m22m10O46N27k47o21N93p09O60j14j39l67J29
1309F21K73R1k15n0m28N3l3K33l2l24pL4n64M9J027j502K15R68p14m5M20p83j71
1332h84j64j05L13O34r36J32K64L66j036R20k87l69M68L2l99N79k45j60L63rn24
1353a047J28J92j22P03k31m27O99m16l88J012l13j16J38M60l85M77l19J91O15
1372H51L19o18L88j21l59o70J218k75n55Q39m78k54O03P85j240M35N01r67P91
1391A193l99K2r5k11L5K58O1m2J62j36n01OP8p39R91m1r34O09J64o04J02M62q05
1414c64M85n53j94k69P73k93j19J24n78N88K0r96L79N91K8q58L46M1J66L31o77
$$ plain form
1435 -1029 -1217 -584 -585 -662 -519 -828 -755 -457 -942 -795 -428 -64 -703 -121 -1025 -384 -125 -233 -99 33 -149
1456 -149 -431 83 308 22 -119 233 119 180 892 -205 239 178 62 268 809 1037 574 769 662 801
1476 801 994 840 520 632 778 797 1051 930 967 977 535 503 1253 921 1 465 437 175 278 242 -268 -54
1498 -54 450 351 268 -369 -447 -145 -124 301 -255 -160 -199 -516 -795 -257 -728 -155 -734 -861 -51 -847 -544 -420
1520 -420 -421 -851 -808 -582 -825 -978 -447 -621 -229 -600 -872 -748 -719 -574 -247 -546 -646 -465 -321 -200 -34
1541 -34 86 8 -37 -249 -410 415 14 -533 523 538 72 196 80 215 408 538 108 435 765 178 491
1562 491 729 753 323 262 411 417 725 416 925 611 617 350 308 396 -257 123 392 440 510 -157 314 721 410
1585 410 93 251 49 -116 436 -99 -302 -133 322 -74 -394 -42 -773 78 -104 -318 -646 -756 -511 -617
$$ packed form
1435a029j88O33jp7J43l09P3K98m85J47L67L64o39N82r04O41K59j08J34J32j82
1456a49k82N14K25k86j41L52j14O1P12j097M44o1j16K06N41K28m63J95j07J39
1476H01J93j54l20J12J46J9K54j21L7J0m42l2P50l32r20M64k8k62J03l6n10K14
1498e4N04r9q3o37p8L02K1M25n56R5l9l17k79N38m71N73n79j27Q10p96L03J24
1520d20jm30M3K26k43j53N31j74L92l71k72J24K9J45L27k99j00J81J44J21J66
1541c4J20p8m5k12j61Q25m01n47J056J5m66J24j16J35J93J30m30L27L30n87L13
1562D91K38K4m30o1J49OL08l09N09l14Ok67m2Q8o53L80K69M8P0o67M71M07l11
1585D10l17J58k02j65N52n35k03J69M55l96l20L52p31Q51j82k14l28j10K45j06
$$ plain form
1605 -617 -729 -721 -256 -1019 -455 -655 -487 -736 -709 -1038 -389 -193 -794 -1230 -507 -762 -790 -523 -764 -912 -389
1626 -389 -405 -209 -413 -201 353 -228 -36 -172 -85 -220 90 -1 -293 94 149 159 157 323 471 414 1008 -138
1648 -138 645 662 209 660 550 783 820 476 823 120 971 591 562 604 28 605 910 734 953 562 381
1669 381 581 514 253 678 635 283 506 25 118 93 182 217 333 81 -120 -240 -216 -90 -621 -509 295 -522
1691 -522 -48 -750 -568 -803 -258 -204 -646 -356 -525 -691 -321 -575 -1063 -407 -630 -789 -974 -305 -493 -663
1711 -663 -133 -67 -392 -490 -228 -64 -63 -287 117 -88 83 -9 338 -504 -255 -200 84 409 455 -140 1 -106
1733 -106 458 800 169 602 149 657 234 -92 717 78 75 842 711 74 541 224 411 485 637 684 176
1754 176 425 456 673 321 291 507 509 526 474 26 176 185 -60 107 -111 43 -591 696 -238 -133 9 100 229
$$ packed form
1605f17j12QM65p63N64k00J68k49K7l29O49J96o01m36P23k55k8K67k41j48N23
1626c89j6J96k04K12N54n81J92j36Q7j35L10r1k92L87N5J0kJ66J48n7N94j146
1648a38P83J7m53M51j10K33L7l44L47p03Q51l80k9M2n76N77L05j76K19l91j81
1669C81K00o7k61M25m3l52K23m81R3k5Q9L5J16k52k01j20K4J26n31J12Q04q17
1691e22M74p02J82k35N45N4m42K90j69j66L70k54m88O56k23j59j85O69j88j70
1711f63N30O6l25r8K62J64Jk24M04k05J71r2L47q42K49N5K84L25M6n95J41j07
1733a06N64L42o31M33m53N08m23l26Q09o39lP67j31o37M67l17J87P4J52M7n08
1754A76K49L1K17l52l0K16KJ7n2m48J50Rk45J67k18J54o34J287r34J05J42R1J29
$$ plain form
1777 229 -10 -210 -687 78 -19 -586 -795 -331 -247 -478 -80 -497 -461 -498 -501 -44 -259 -538 -893 -605 -302 -31
1799 -31 -911 -1126 -247 -21 -661 33 -511 -450 -125 -19 -380 -499 -811 -180 -510 312 -26 36 635 1124 -379
1820 -379 303 -150 79 152 132 274 -11 571 31 480 510 387 372 377 780 -89 429 467 210 989 247 123
1842 123 271 237 808 800 459 462 579 93 658 495 -446 870 784 116 -35 168 689 552 54 90 -345 -162
1864 -162 72 -575 -211 327 -104 1 -179 -638 157 -508 -149 -146 -156 -173 -32 -937 -415 -297 -704 -1102 -532
1885 -532 -154 -426 -187 -378 -928 -784 -615 -164 -76 28 -368 -92 -732 -523 -460 -705 136 -402 -92 210 -514
1906 -514 78 -39 322 393 113 373 -31 -315 -500 98 382 762 845 417 -159 224 477 645 1114 451 160
1927 160 363 787 392 692 438 591 203 615 241 489 569 -6 289 158 352 -146 -15 717 -411 352
$$ packed form
1777B29k39k00m77P65r7n67k09M64Q4k31L98m17L6l7lM57k15k79l55K88L03K71
1799c1q80k15Q79K26o40O94n44O1L25J06l61j19l12O31l30Q22l38O2N99M89j503
1820c79O82m53K29P3k0J42k85N82n40M49L0j23j5NM03q69N18L8k57P79p42j24
1842A23J48l4N71ql41LJ17m86N65j63r41J316q6o68j51K03N21j37m98L6m35J83
1864a62K34o47L64N38m31J05j80m59P95o65L59Lj0j7J41r05N22J18m07l98N70
1885e32L78k72K39j91n50J44J69M51Q8J04l96K76o40K09O3k45Q41n38L10L02p24
1906e14N92j17L61P1k80K60m04k84j85N98K84L80Q3m28n76L83K53J68M69o63k91
1927A60K03M24l95L00k54J53l88M12l74K48Q0n75K95j31J94m98J31P32j128P63
$$ plain form
1947 352 569 628 834 177 244 -453 87 -136 375 443 -209 331 213 -609 -301 -593 -556 -35 -183 -184 -73 -118
1969 -118 -328 -525 -607 -379 -102 -712 -496 -391 -883 -254 -430 -147 -624 -635 -392 -137 306 -525 -375 46 -157
1990 -157 -598 -523 -237 -214 128 -130 -15 28 -8 -8 -322 135 57 -499 155 503 -221 375 -202 -233 68 57 228
2013 228 321 130 610 192 134 305 152 73 357 610 426 300 171 282 360 396 136 322 -138 18 356 389
2035 389 -108 -250 -203 116 130 50 682 -53 -98 76 -274 503 20 -19 98 -209 -349 -75 59 -82 -478 -435
2057 -435 -603 -715 -255 -576 42 -464 -346 -34 -46 -264 -285 -7 -671 -219 -207 -854 -630 -189 -533 -497 364
2078 364 -132 -86 -18 -271 -223 132 395 -269 92 142 -135 -451 -469 -20 83 582 -180 829 554 318 -271
2099 -271 526 147 -75 212 920 -8 215 109 683 171 338 702 92 678 86 901 -235 131 15 301
$$ packed form
1947C52K17N9K06o57O7o97N40k23N11O8o52N40j18q22L08k92L7N21j48jJ11m5
1969a18k10j97q2K28K77o10K16J05m92O29j76K83m77j1K43K55M43q31J50M21k03
1990a57m41P5K86K3L42k58J15M3l6%l14M57p8n56O54L48p24N96n77l1L01j1J71
2013B28R3j91M80m18n8J71j53p9K84K53j84j26j29J11P8L6k60J86m60J56L38L3
2035C89m97j42M7L19J4q0O32p35m5J74l50P77m83l9J17l07j40K74J34j41l96M3
2057d35j68j12M60l21O18n06J18L12j2k18k1K78o64M52J2o47K24M41l44L6Q61
2078C64m96M6O8k53M8L55K63o64L61N0k77l16j8M49J03M99p62J009k75k36n89
2099b71P97l79k22K87P08r28K23j06N74n12J67L64o10N86n92Q15j136L66j16K86
$$ plain form
2119 301 -246 640 323 158 701 -159 74 277 422 455 334 231 253 28 -91 118 280 -382 -142 -249 -256
2140 -256 -205 -1 -72 -250 -150 -18 -236 97 -913 -941 -80 -522 -663 -577 -274 -462 -549 -318 -300 -15 243 -319
2162 -319 -319 -617 -427 -629 299 -669 -600 -203 -219 -307 -328 -393 -253 -496 52 -319 -405 -376 -484 152 -262 22 -479
2185 -479 664 159 184 518 373 473 240 140 164 -188 142 239 155 339 548 513 -36 341 569 258 -436
2206 -436 326 254 700 -20 507 412 879 -9 203 196 77 387 -45 159 -35 378 221 321 204 213 -176 -467
2228 -467 13 -271 -5 -465 -534 -26 17 -436 -185 -133 -60 -123 -236 -107 182 -7 -630 -418 -351 -527 -434 -576
2250 -576 -124 74 89 -322 -476 -759 -667 -322 77 -68 22 178 -161 -138 -240 0 -641 -288 101 -330 312
2271 312 -230 447 -89 9 -111 235 21 262 -224 -55 -121 569 310 -26 428 310 320 -13 160 630 -66
$$ packed form
2119C01n47Q86l17j65N43q60K33K03J45L3j21j03K2k25j19K09J62o62K40j07p
2140b56N1K04p1j78J00J32k18L33j010k8Q61m42j41Q6L03j88q7K31J8K85K58n62
2162c19%k98J90k02R28r68O9L97j6q8k1o5J40k43N48l71q6K9j08O36m14K84n01
2185d79J143n05K5L34j45J00k33j00K4l52L30R7q4J84K09l5n49L77K28l11o94
2206d36P62p2M46p20N27r5M67q88K12pj19L10m32K04j94M13j57J00j17Rl89k91
2228d67M80k84K66m60o9N08M3m53K51N2P3o3j13J29K89j89o23K12O7j76R3j42
2250e76M52J98J5m11j54k83R2L45L99j45R0J56l39K3j02K40o41L53L89m31O42
2271C12n42O77n36R8j20L46k14K41m86J69o6O90k59l36M54j18J0l33J73M70o96
$$ plain form
2292 -66 495 587 369 258 341 368 47 332 -405 386 525 -47 -109 48 -121 200 -86 -380 209 442 -93 -83
2314 -83 -226 722 -90 -258 -320 -691 -35 -72 107 284 -345 -187 -322 -112 23 -95 437 47 211 100 45
2335 45 -636 49 -137 -753 -611 -657 -91 -468 -540 -51 -194 -198 62 -743 -984 -481 -452 -588 -110 -331 154 -302
2357 -302 -70 57 319 -220 -446 267 -303 248 296 35 322 -268 486 57 -151 -145 679 -155 309 62 -177
2378 -177 577 136 675 40 -97 -70 -9 451 318 -154 -67 -398 257 430 -124 -84 298 -135 111 -385 256
2399 256 -307 272 222 70 -403 294 -139 -51 289 -558 -802 -311 -71 -86 -582 -452 332 -169 -319 -648 -84
2420 -84 85 -17 61 -519 -441 72 -392 121 224 -195 -237 -187 -536 -431 -72 -466 -119 -627 -211 -565 -90 -40
2442 -40 -161 -320 -441 -128 -249 -309 -106 60 171 -128 -835 20 -49 -73 26 -108 -91 -95 251 190 421 463 -74
$$ packed form
2292f6N61R2k18j11Q3K7l21K85p37P91J39n72o2J57j69L21k86k94N89K33n35J0
2314h3j43R48q12j68o2l71O56l7J79J77o29J58j35K10J35j18N32l90J64j11n5
2335D5o81O85j86o16J42m6N66l77p2M89j43mK60q05k41N03K9j36M78k21M85m56
2357c02K32J27K62n39k26P13n70N51M8k61K87n90P54m29k08OQ24q34M64k47k39
2378a77P54m41N39o35j37K7O1M60j33m72Q7l31O55J73n54M0L82m33K46m96O41
2399B56n63N79n0j52m73O97m33Q8L40q47k44M91K40j5m96J30P84n01j50l29N64
2420h4J69j02P8n80P8N13m64N13J03m19m2N0l49J05L59l94L47n08M16l54M75N0
2442d0j21j59j21L13j21o0K03J66J11k99p07Q55o9k4R9j34J7mL46o1K31M2n37
$$ plain form
2465 -74 122 226 -269 192 -506 -9 -107 17 -218 73 445 378 469 375 267 265 285 457 715 392 231 298 224
2488 224 -28 376 -65 72 225 15 -152 -190 -209 -24 -198 200 -158 -307 -667 -288 -437 204 178 -132 131
2509 131 -556 -28 138 -69 -187 -359 -444 -367 -71 -182 -488 78 -360 -502 441 -486 -357 -195 -4 -225 20
2530 20 184 -104 -337 -231 -549 221 132 -526 -255 -25 -542 -236 -64 -479 -150 116 104 129 119 -350 535 495
2552 495 -38 -100 228 311 906 51 85 500 410 -129 -10 690 -165 281 124 316 141 323 40 432 401 125
2574 125 39 152 -165 525 599 384 -636 -39 -17 155 248 -447 -31 5 -204 137 227 -176 35 68 -214 11
2596 11 -332 -72 112 -357 56 -63 -616 -213 -76 -321 -407 232 -434 -361 -272 175 -176 -218 177 -149 -51 -265
2618 -265 -285 7 -192 -206 90 -528 5 221 86 32 -445 -39 -364 -97 399 47 -472 464 -72 162 140
$$ packed form
2465g4J96J04m95M61o98M97r8J24k35K91L72o7R1r4j08kK0J72K58l23j61O7p4
2488B24k52M04m41J37J53k10j67l8j9J85j74L98l58j49l60L79j49O41k6l10K63
2509A31o87N28J66k07j18j72q5P7K96j11l06N66m38j42R43r27J29J62J91k21K45
2530B0J64k88k33J06l18P70q9o58K71K30n17L06J72m15L29K66j2K5j0m69Q85m0
2552D95n33o2L28Q3N95q55L4M15r0n39J19P00q55M46j57J92j75J82k83L92l1k76
2574A25q6J13l17O90P4k15j020N97K2J72R3o95M16L6k09L41R0m03K11L3k82K25
2596A1l43K60J84m69M13j19n53M03J37k45q6O39o66P3Q9M47l51m2L95l26R8k14
2618b65k0K92j99j4K96o18N33K16j35n4m77M06l25K67M96l52n19R36n36K34k2
$$ plain form
2639 140 65 470 115 -179 69 543 191 387 193 228 -340 243 182 166 152 183 529 238 402 -75 273 176
2661 176 445 201 257 322 378 853 89 340 -125 243 -29 -337 659 -247 -24 536 454 250 -38 -176 198
2682 198 -11 -193 -463 -268 -144 -302 416 -108 -297 -27 -432 -437 -57 152 -87 226 -196 150 193 -436 -220
2703 -220 150 -275 -249 -304 -9 -370 -185 -606 -789 -409 -127 140 -314 -191 -249 -365 -239 -634 -547 163 -128
2724 -128 58 -155 4 513 -69 81 20 471 153 -190 -196 -241 385 161 512 410 24 -99 363 83 338
2745 338 560 23 521 65 -136 285 449 506 356 -205 43 277 550 74 307 159 402 285 5 420
2765 420 159 258 107 135 90 -343 -257 -49 54 204 119 315 890 -362 -93 1 -74 -118 -181 -165 -167 195 45 -944
2789 -944 27 -161 -131 -519 -175 207 -244 -384 148 -428 -205 -207 -173 -642 -218 217 -302 -193 28 123 -146 -264
$$ packed form
2639A40p5M05l55k94K48M74l52J96j94L5n68N83o1j6j4L1L46k91J64m77L48r7
2661A76K69k44N6O5N6M75p64K51m65L68k72l08R96r06K23N60q2k04k88j38L74
2682A98k09j82k70J95J24j58P18n24j89K70m05nL80K09k39L13m22L46M3o29K16
2703b20L70m25K6n5K95l61J85m21j83L80K82K67m54J23n8j16J26l95Q7P10k91
2724a28J86k13J59N09n82J50o1M51l18l43om5O26k24L51j02l86j23M62k80K55
2745C38K22n37M98m56k01M21J64N7j50n61K48K34K73m76K33j48K43j17k80M15
2765D20k61R9j51K8m5m33Q6K08J03J50q5J96N75j252K69R4p5m4o3J6kL62j50r89
2789i44R71j88L0l88L44L82m51j40N32n76K23kL4m69M24M35n19J09K21R5k69j18
$$ plain form
2811 -264 379 -53 -304 233 -113 201 -62 70 244 -120 264 -43 -128 103 -129 536 -118 -69 -429 -249 -48
2832 -48 107 -127 -40 401 95 -51 321 441 373 -106 313 130 331 276 683 731 -23 -198 205 204 179 -16 273
2855 273 170 576 215 -620 -138 161 293 201 536 120 26 126 -512 -4 -383 -50 -336 -60 -276 -383 -227
2876 -227 -105 117 -62 102 -637 -310 -378 133 200 -244 -415 -79 -494 -430 -31 -855 -302 54 569 -426 -322
2897 -322 38 149 -242 -438 -364 220 112 278 187 -195 -295 65 472 280 378 279 -9 -28 -147 168 139 217
2919 217 16 431 318 -424 457 309 195 234 332 -287 36 -78 -91 291 -349 258 342 392 364 98 -252 196
2941 196 -49 -36 284 264 -191 340 221 -398 -259 -128 506 268 515 -41 -194 80 10 -65 118 -294 95
2962 95 -188 -314 64 269 -61 -10 201 -349 -118 -137 -202 76 -827 1 -809 -559 177 -246 -251 -77 -761 134
$$ packed form
2811b64O43m32k51N37l46L14k63J32J74l64L84l07q5K31k32O65o54M9l60J80K01
2832d8J55k34Q7M41l06j46L72J20o8m79M19j83K01n5M07M8p54j75M03jk5j95K89
2855B73j03M06l61q35M82K99J32r2L35m16r4J00o38N08l79L33k86K76k16j07J56
2876b27J22K22j79J64p39L27o8N11O7m44j71L36m15O4L99q24N53L56N15r95J04
2897c22L60J11l91j96P4N84j08J66r1l82j00L60M07j92R8r9k88j9j19L15k9P8
2919B17k01M15j13p42Q81j48j14L9R8o19L23j14j3L82o40O07Q4N0k8k66l50M48
2941A96k45J3L20k0m55N31j19o19J39J31O34k38K47n56j53K74p0p5J83m12L89
2962I5k83j26L78K05l30N1K11n50K31j9o5K78r03Q28q10K50P36m23nJ74o84Q95
$$ plain form
2984 134 -81 157 109 70 -566 112 -660 -378 -533 90 7 -120 59 174 194 302 -284 635 -84 342 199
3005 199 -415 68 243 291 467 157 259 -26 -440 522 -31 91 366 202 149 42 62 317 -102 262 227
3026 227 63 355 191 290 451 -160 195 198 -361 505 388 -57 37 121 539 -175 170 172 245 41 -452 -247 -330
3049 -330 56 -680 -300 216 -21 -399 -373 81 -214 434 -96 -183 -178 65 36 -678 -184 -550 -236 765 -234
3070 -234 -427 -70 -303 564 524 -72 -245 -168 -804 89 127 -230 365 485 -494 -306 173 -80 231 422 -137
3091 -137 209 -70 268 191 78 303 160 -141 317 440 116 197 443 563 382 466 154 150 103 432 95 -240
3113 -240 100 289 642 166 278 23 470 162 -326 472 50 441 5 63 364 -314 -648 362 -60 66
3133 66 -173 -373 -209 -89 -342 151 -234 -303 -619 -47 -292 -112 -258 88 72 209 -317 -319 113 -585 32 -278
$$ packed form
2984A34k15K38m8l9o36O78p72K82j55O23q3j27J79J15K0J08n86R19p19M26j43
3005A99o14M83J75M8J76l10J02k85m14R62n53J22K75j64n3j07K0K55m19L64l5
3026B27j64K92j64R9J61o11L55Ln59Q66j17m45R4Q4M18p14L45KP3k04m93K05q3
3049c30L86p36L80N16k37l78K6M54k95O48n30q7NK43k9p14M94l66L14J001r99
3070b34j93L57k33Q67m0n96j73P7o36Q93L8l57N95J20r79J88M79k53L11J91n59
3091a37L46k79L38p7j13K25j43l01M58J23l24Q1K46J20j81Q4l12mm7L29l37l35
3113b40L40J89L53m76J12k55M47l08m88P98m22L91m36N8L01o78l34J010m22J26
3133F6k39k00J64J20k53M93l85o9l16N72k45J80j46L46j6J37n26kM32o98O17l10
$$ plain form
3155 -278 249 -808 -702 -244 -580 -344 -38 -509 42 35 -244 -576 -498 35 -714 -25 -261 -250 291 -118 -98
3176 -98 -208 288 -388 -353 473 -148 94 65 315 -85 -220 49 117 173 47 -234 220 -165 84 -187 308 52
3198 52 155 93 230 -321 357 10 104 -217 -35 -84 478 264 -258 319 -132 312 12 383 -64 -271 405
3219 405 -26 -224 174 96 154 269 -263 -333 262 -161 45 225 -266 -8 -251 -97 24 -552 106 75 281
3240 281 -485 -127 197 -607 -103 -129 104 -280 -223 -11 -164 479 -475 -179 -316 -628 -393 -201 -219 -185 -383
3261 -383 -120 -61 -360 155 -30 -539 299 -56 -330 -123 -80 -82 42 240 317 372 -166 126 91 -290 -17 557
3283 557 117 106 -160 119 568 -257 441 -70 -13 361 -203 806 430 23 508 519 331 -221 495 327 -373
3304 -373 344 236 -394 256 -131 289 132 -251 123 -246 -239 269 -313 13 -360 -104 -30 236 215 -163 208
$$ packed form
3155b78N27j057J06M58l36K36L06m71N51pk79l32P8N33p49O89k36J1N41m09K0
3176i8j10M96o76L5Q26o21K42k9K50m00j35K69O8N6j26k81M54l85K49k71M95k56
3198E2J03o2J37n51O78l47R4l21J82m9N62k14n22N77m51M44l00L71m47k07O76
3219D05m31j98L98p8N8J15n32p0N95m23K06J80m91K58k43J54J21n76O58l1K06
3240B81p66L58L24q04N04k6K33l84N7K12j53O43r54K96j37l12K35J92j8L4j98
3261c83K63N9k99N15j85n09Q38l55k74K07M3kJ24J98P7N5n38K92l5l81K73N74
3283E57m40j1k66K79M49q25O98n11N7L74n64J009l76m07M85J1j88n52P16j68p00
3304c73P17j08o30O50l87M20j57l83L74l69PN08n82L26l73K56P4K66k1l78L71
$$ plain form
3325 208 109 45 -623 -371 -244 -706 -122 102 -620 -555 228 -322 396 93 -202 32 -141 -304 -105 -125 127
3346 127 -319 259 100 -254 -293 -103 675 59 -360 -178 258 -37 -307 37 -73 58 289 240 69 311 339
3367 339 530 -205 280 170 145 254 -42 -161 -173 540 33 20 214 509 479 553 328 146 255 -489 91 655
3389 655 185 189 -268 370 -418 -319 347 -468 56 176 46 36 199 -22 -498 -156 -208 328 -189 -421 -35 36
3411 36 -518 -372 101 -98 313 -219 36 -46 223 -85 -25 115 85 -182 -332 -219 -390 71 307 -293 -315 56
3433 56 -235 -524 234 -173 -99 27 -365 26 -326 -259 -81 288 -414 -201 262 -440 282 63 97 200 12
3454 12 95 -172 149 -508 -4 -268 253 706 -119 62 11 226 150 312 798 233 10 -44 539 124 196 -137
3476 -137 130 -39 374 -161 153 259 457 202 -183 193 220 529 210 -177 -60 -280 -133 378 76 663
$$ packed form
3325B08r9o4o68K52J27m62N84K24p22O5P83n50P18l03k95K34j73j63J99k0K52
3346A27m46N78j59l54l9J90P78o16m19J82M36k95k70L44j10J31K31m9j71K42K8
3367C39J91p35M85j10k5J09k96j19j2P13n07j3J94K95l0P4k25j82J09p44N80N64
3389F55m70Mm57O38p88R9O66q15N24J20j30j0J63k21m76L42n2N36n17k32L86P1
3411C6n54J46M73j99M11n32K55q2K69l08O0J40l0k67j50J13j71M61K36o00k2L71
3433E6k91k89P58m07P4J26l92L91l52O7J78L69p02K13M63p02P22k19L4J03j88
3454A2Q3k67L21o57N04k64N21M53q25J81n1K15p6J62M86n65k23n4N83m15P2l33
3476a37K67j69M13n35L14J06J98k55l85L76K7L09l19l87J17k20J47N11l02N87
$$ plain form
3496 663 -97 -243 -228 -156 359 -174 -761 7 47 -271 -93 456 -386 25 -170 -167 21 -111 -492 -197 -186 -372
3518 -372 -337 -422 -357 -496 -51 -197 332 -369 -408 107 -1 -385 -421 -308 -152 23 98 125 -136 -139 214 431 -363
3541 -363 450 123 79 -458 -175 389 -374 253 -35 47 193 629 -50 207 443 -660 131 356 276 -99 -98
3562 -98 -111 530 249 670 -115 36 848 115 106 -50 -247 264 373 97 524 27 -446 -195 -214 -48 135 97
3584 97 -119 -150 76 -148 -166 79 -245 376 268 178 -103 -229 -49 -686 170 151 255 -223 -244 -289 -357 -383 137
3607 137 169 -367 -379 -65 -385 145 51 79 -415 25 -164 26 -101 -480 -74 -383 -290 -663 251 -483 -50 380
3629 380 -65 -486 -96 -284 -90 208 -128 265 -46 237 -172 -24 -15 233 255 419 52 -249 79 -127 53
3650 53 -259 543 409 -7 261 98 55 -89 -285 419 545 -306 -127 -220 -65 -50 16 343 -117 72 100 327
$$ packed form
3496F63p60j46J5P2N15n33n87P68M0l18J78N49q42M11j95LJ88j32l81K95J1j86
3518c72L5q5O5j39M45j46N29p01l9N15j08l84l6J13J56J75P5K7k61lL53K17p94
3541c63Q13l27m4n37K83N64p63O27k88Q2J46M36o79K57K36j103P91K25q0l75J
3562i8j3O41k81M21p85J51Q12p33rj56j97N11J09k76M27m97m73K51j9J66J83l8
3584I7k16l1K26k24j8K45l24O21j08r0k81j26J80o37Q56j9J04m78k1m5o8k6N20
3607A37L2n36j2L14l20N30r4K8m94M40j89J90j27l79M06l09R3l73R14p34M33M30
3629C80m45m21L90j88J94K98l36L93l11K83m09J48RK48K2J64l67l01L28k06J80
3650E3l12Q02j34m16K68j63m3j44j96P04J26q51J79r3J55J5O6L27m60J89K8K27
$$ plain form
3672 327 -157 -17 82 -138 -3 -115 210 335 -31 -157 130 -364 -345 -124 -76 -62 -274 -183 440 192 16 -44
3694 -44 -326 -304 95 4 90 -132 14 -529 384 -552 64 49 -101 -43 421 -56 -226 8 -395 -332 -174 -109 463
3717 463 -69 -350 -325 -47 107 383 228 325 33 -261 200 -113 275 175 -22 81 341 -91 269 -87 -169
3738 -169 67 567 692 -239 -34 -127 136 -57 431 -35 229 571 362 301 -21 37 -59 -271 130 274 -449
3759 -449 129 -235 -483 -435 -545 41 -423 -216 -226 -206 -86 56 -103 36 272 65 82 356 -589 -104 44
3780 44 58 -659 390 19 82 146 -533 -70 -404 -246 214 -152 -286 368 68 -668 -166 141 74 -343 -286 -41
3802 -41 -96 65 89 74 -433 -111 -235 753 421 404 176 -99 331 -183 -33 -281 223 97 203 -205 -420 423
3824 423 -220 -584 558 -211 251 74 -767 -660 464 432 51 202 178 -285 274 411 347 92 -373 -238
$$ packed form
3672C27m84J40R9k20J35j12L25J25l66j26K87m94J9K21M8J4k12R1O23k48j76o0
3694d4k82K2L99r1Q6k22J46n43R13r36O16j5j50N8M64m77j70K34m03O3J58O5N72
3717D63n32k81K5K78J54K76j55R7k92k94M61l13L88j00j97J03K60m32L60l56q2
3738a69K36N00J25r31K05r3K63j93M88m66K64L42k09o1l22N8r6k12M01J44p23
3759d49N78l64k48M8j10N86m64K07j0K0J20J42j59J39K36k07J7K74r45M85J48
3780D4J4p17J049l71O3O4o79M63l34J58M60l66j34O54l00p36N02L07o7m17N7K45
3802d1n5J61K4j5n07L22j24R88l32j7k28k75M30n14J50k48N04j26J06m08k15Q43
3824D23o43l64J142p69M62j77q41J07J124l2l81J51k4m63N59J37o4k55m65J35
$$ plain form
3844 -238 107 446 30 174 197 -93 -125 -342 -16 137 -123 222 -183 -7 -376 -83 256 -283 159 -62 -205
3865 -205 -116 337 -14 -277 278 123 -587 -268 -314 -361 -123 -59 329 -66 -418 -270 -109 -68 -186 -286 -139 -287
3887 -287 -382 -309 -309 -483 211 -394 -386 510 -32 466 188 196 595 134 30 570 651 -482 228 -14 257 -415 96
3910 96 626 -379 46 56 -90 -136 330 143 -8 -21 -169 487 104 57 -77 170 450 433 265 101 -33 345
3932 345 774 86 31 -544 199 387 -254 497 447 -280 269 202 248 46 211 233 -123 -371 202 -166 110 41
3954 41 -95 182 40 294 178 63 -339 -506 113 -17 -77 -141 34 455 -432 255 -319 -239 48 -161 -235 -176
3976 -176 -403 157 237 -654 -57 -232 -457 -231 -122 166 282 -297 313 453 -416 153 190 -342 127 392 -44
3997 -44 418 192 236 222 -135 -57 105 227 195 -417 -34 -266 -51 467 232 315 110 19 125 -81 193 478
$$ packed form
3844b38L45L39m16J44K3k90l2k17L26J53k60L45m05J76l69K93L39n39M42k21j43
3865b05Q9M53l51k63N55j55p10L19m6m7K38O4L88l95l52J48J61M1j18j00J47j48
3887b87r5P3%j74O94o05QQ96n42M98k78QL99m61j04N40Q1j133P10k42K71o72N11
3910I6N30j005M25J0j46m6M66j87j51j3j48O56l83m7j34K47K80j7j68j64j34L78
3932C45M29o88n5n75P43J88o41P51n0p27N49o7M6k02J65K2l56k48N73l68K76o9
3954D1j36K77j42K54j16j15m02j67O19j30o0o4J75M21q87O87n74Q0K87k09p4N9
3976a76k27N60Q0q91N97j75k25K26J09K88J16n79O10J40q69N69L7n32M69K65m36
3997d4M62k26M4j4l57P8J62J22l2o12L83k32K15N18k35Q3k05r1J06k06K74K85
$$ plain form
4019 478 -34 231 -553 -175 115 123 -18 158 223 507 -456 382 167 591 251 128 -386 -189 -68 -475 -205
4040 -205 -73 105 239 4 96 367 318 -259 76 -211 4 -224 -81 -310 -523 -272 -300 -14 -132 -72 68
4061 68 -337 -55 110 -473 -359 185 396 -399 144 -68 82 19 -254 -36 -117 -137 70 -59 -518 390 -114
4082 -114 -200 515 -18 199 247 48 407 79 140 584 -20 303 403 488 197 119 642 -541 391 194 11
4103 11 -22 379 -128 217 -293 323 -148 19 -292 779 510 208 521 148 187 -240 136 -531 -415 -144 -220
4124 -220 171 46 -485 -258 17 -716 -272 60 -6 88 -41 -113 401 -254 -181 -18 -67 -32 -219 26 389 123
4146 123 -376 -74 -97 -163 -150 173 -254 5 66 -446 142 -397 -114 -455 -44 -102 144 -113 -74 -183 -40 100
4168 100 206 341 -128 -53 149 -314 -279 -292 165 752 36 244 -28 -550 -385 18 -171 142 159 -20 -112 -32
$$ packed form
4019D78n12K65p84L78K90Qj41J76O5K84r63Q38k15M24l40j23n14J97J21m07K70
4040b05J32J78J34k35R2K71m9n77L35k87K15k28J43k29k13K51k8K86j18O0J40
4061F8m05K82J65n83J14N44K11p95N43k12J50o3k73K18q1k0K07j29m59R08n04
4082a14q6P15n33K17M8j99L59l28O1M44o04L23J00Q5k91p8N23j183R32j97j83
4103A1l3M01n07L45n10O16m71J67l11J071k69l02L13l73L9m27L76o67J16K71p6
4124b20L91j25n31K27K75p33M44L32o6R4j29p2N14o55P3J63m9L5j87K45L63k66
4146A23m99L02k3o6J3L23m27K59O1n12N88n39K83l41M11n8K46k57L9j09J43J40
4168A00J06J35m69P5K02m63L5j3M57N87p16K08k72n22J65M03j89L13J7j79r2Q0
$$ plain form
4190 -32 -234 144 -321 -301 -254 79 212 183 408 -90 164 219 184 713 -1 -336 516 321 161 458 -392 -337
4212 -337 -224 -550 469 -115 127 -48 78 255 -225 11 102 -53 -79 -26 -70 -361 -390 335 -241 -258 -317 46
4234 46 -99 142 -70 -438 -35 -664 90 -437 -220 21 247 554 -458 -196 -277 -760 -565 63 -93 124
4254 124 230 493 390 149 347 -327 -42 -278 579 -46 114 201 281 284 -6 -314 -123 248 -92 99 35 482
4276 482 472 -349 63 766 410 -117 157 399 192 229 85 -309 -179 -18 43 326 90 -127 173 792 -146
4297 -146 -9 -291 -301 -88 -170 -24 273 954 466 67 -141 -164 41 -319 237 76 325 216 97 -187 -233
4318 -233 34 -400 261 414 -116 -220 239 -79 55 -502 -171 -87 -48 360 144 137 -459 -142 -799 -471 125
4339 125 221 -194 126 -178 -730 469 -212 -282 273 -179 371 206 175 -114 -14 408 277 -184 -23 -31 155
$$ packed form
4190c2k02L78m65K0M7L33J33k9K25m98K54N5l5N29p14l35Q52j95j60K97q50N5
4212c37J13l26J019n84K42j75J26J77m80K36R1j55k6N3m4k91k9P25n76j7n9L63
4234D6j45K41k12l68M03o29P54n27K17K41K26L07j012K62q1m83J95O28j56K17
4254A24J06K63j03k41J98o74K85k36Q57o25J60Q7Q0Lk90l08J91L71l40J91o4M47
4276D82j0q21M12P03l56n27K74K42k07L7j44l94J30J61O1K83k36k17L00O19r38
4297a46J37k82j0K13q2J46K97O81m88l99k08k3K05l60N56j61K49j09j19k84m6
4318b33K67m34O61J53n30j04M59l18J34n57L31Q4L9M08k16pn96L17o57L28N96
4339A25R6m15L20l04n52J199o81p0N55m52N50j65l1k89J00M22j31m61J61qJ86
$$ plain form
4360 155 292 -48 -101 175 105 127 133 -3 204 46 157 -383 117 162 66 -682 103 448 14 574 8 -321
4382 -321 -4 -213 -85 495 172 -53 345 972 -52 205 -417 432 350 -405 37 93 605 -307 -211 537 41
4403 41 -514 -547 -236 65 -262 -505 -688 -493 162 -141 -305 318 -496 -460 -74 44 -493 -370 181 390 -187
4424 -187 -258 -330 314 -454 39 102 -25 -255 -211 -320 -52 -271 -551 73 -43 -42 -196 -253 31 235 557 476 223
4447 223 -320 761 167 95 305 359 241 241 116 606 581 -300 -41 -283 825 -383 126 276 75 280 39
4468 39 -239 85 335 -268 -114 -159 -192 261 -71 -138 -10 354 160 1 6 -101 -93 -226 11 615 -168 376 327
4491 327 -267 -16 318 -173 -448 290 -182 -566 44 356 221 -44 151 -230 161 0 -102 -399 40 -264
4511 -264 -493 -36 -214 -264 156 336 469 -171 -489 594 233 -192 -127 -481 -95 -103 -188 366 162 40 -412
$$ packed form
4360A55J37l40n3K76p0K2Oj36K07j58J11n40N00M5r6p48P85L45m34N60n66l29
4382c21L17k09J28N80l23k25L98O27j024K57o22Q49q2p55M42N6N12r12R6P48m96
4403D1n55l3L11L01l27k43j83J95O55l03j64O23q14L6L86J18n37J23N51K09n77
4424a87p1p2O44p68M93O3j27k30M4j09K68k19k80O24j16Jj54n7K84K04L22q1k53
4447B23n43J081n94p2K10N4j18%j25M90k5q81K59k42J108j208N09J50k01K05k41
4468C9k78L24K50o03J54m5l3M53l32o7J28L64j94j59Nj07Qj33K37O04p83N44m9
4491C27n94K51L34m91k75P38m72l84O10L12j35k65J95l81L91j61j02k97M39l04
4511b64k29M57j78n0M20J80J33o40l18J083l61m25O5l54L86qq5N54k04j22m52
$$ plain form
4532 -412 -301 257 46 353 -120 -213 161 238 327 455 209 200 -134 140 -634 -489 -209 30 404 -148 194 -113
4554 -113 -547 -618 176 554 159 -163 202 533 90 -204 69 20 -95 420 -58 100 -272 -276 10 -80 -427 555
4576 555 -113 -532 120 163 -949 609 219 164 -174 301 570 139 419 -199 -233 84 -524 166 239 -465 -342
4597 -342 244 27 -188 21 10 -235 177 -301 32 67 53 -184 -80 -36 -110 -44 -796 1 19 -511 7 40 28
4620 28 389 -227 -84 241 447 431 55 -390 181 -19 -206 82 257 52 207 655 657 219 144 -282 40 391
4642 391 -81 527 124 -111 101 -244 -170 263 317 -142 -517 -108 -338 39 248 -247 98 198 491 -26 120
4663 120 150 206 281 230 -90 -189 -186 104 -44 -138 -129 -548 78 -172 -361 -131 -448 207 123 -430 -302 567 -397 86
4687 86 122 2 -123 263 -196 -368 -158 -147 -150 -58 123 -597 247 -366 279 -379 472 125 -220 213 -195 -324
$$ packed form
4532d12J11N58k11L07m73r3L74P7Q9J28k46rl34K74p74J45K80K39L74n52L42l07
4554a13m34p1P94L78l95l22L65L31m43k94K73m9j15N15m78J58l72mK86r0l47R82
4576E55o68m19O52M3j112J558l90n5l38M75K69m31K80o18l4L17o08O90P3p04J23
4597c42N86k17k15K09j1k45M12m78L33L5j4k37J04M4p4O6p52P97J8n30N18L3j2
4620B8L61o16J43L25K06j6l76m45N71k00j87K88J75k05J55M48Km38p5m26L22L51
4642C91m72O08m03k35K12l45P4M33N4m59l75M09k30L77K09m95L45J00K93n17J46
4663A20L0N6P5n1l20r9LK90j48r4Rm19O26k50j89K30l17O55q4n53J28Q69r64M83
4687H6L6j20j25L86m59j72K10J1lR2J81p20Q44o13O45o58Q51l47l45M33m08j29
$$ plain form
4709 -324 40 -112 96 -65 363 180 123 30 10 509 226 78 -156 125 113 -144 -170 -99 292 -130 595 403
4731 403 -227 -2 718 -163 445 -146 744 315 58 -44 -199 -2 -112 238 282 -501 42 40 -54 -629 -64
4752 -64 77 292 53 47 -12 -640 88 83 240 -481 204 -395 -40 -624 -150 26 -2 -638 -519 15 -408 -67
4774 -67 296 24 -255 -196 -112 -312 47 113 -243 -74 436 -248 16 -337 403 348 -160 -158 -248 249 23 -326 -350
4797 -350 -177 88 66 362 357 -231 363 -454 123 7 -33 653 116 128 -283 212 15 390 213 12 213 -31
4819 -31 -729 590 450 183 38 -266 258 -180 148 450 -98 -2 -39 586 167 274 601 129 -189 123 -255
4840 -255 208 367 -66 -78 346 185 -233 -166 -495 42 -204 -129 331 507 -448 -121 -380 -24 50 -61 -58 145
4862 145 -694 -219 268 -155 -214 -660 586 159 84 -131 -118 42 67 -238 -70 -305 112 -481 -731 -369 -334
$$ packed form
4709c24L64j52K08j61M28j83n7r3k0M99k83j48k34K81j2k57k6P1L91m22P25j92
4731D03o30K25P20q81O08n91Q90m29k57j02j55J97j10L50M4p83N43kr4n75N65
4752f4J41K15k39on9o28P28nJ57p21O85n99L55n84M74J76k8o36J19N34m23L41
4774f7L63k72k79N9Q4k00L59O6l56J69N10o84K64l53P40n5n08Kr0M97k26l49k4
4797c50J73K65k2K96nn88N94q17N77j16m0O86n37J2m11M95j97L75j77k01K01k44
4819c1o98J319j40k67j45l04N24m38L28L02n48R6l7O25m19J07L27m72l18L12l78
4840b55M63J59m33j2M24j61m18O7l29N37k46P5M60J76r55L27k59L56P4j11LK03
4862A45q39M75M87m23n9m46J246m27p5k15J3J60K5l05J68k35M17n93k50L62L5
$$ plain form
4883 -334 49 -375 217 120 116 345 0 152 496 -349 -72 -211 142 -244 399 -92 -279 -286 223 348 -14 261
4905 261 149 523 -322 -407 667 -72 108 -699 -310 568 416 440 98 -241 -186 275 268 -203 67 1 164 196
4927 196 -489 170 -347 -336 -57 233 279 -218 1 -298 186 92 48 -417 -124 40 -273 95 -546 -46 35 -332
4949 -332 -187 -337 -426 -342 0 -327 39 -128 359 -131 40 3 196 -291 -65 -194 -279 122 85 -176 35 -21
4971 -21 -475 -262 24 46 363 -208 -105 -404 317 277 319 95 -508 209 -61 -12 -72 -271 -146 -129 477 558 -161
4994 -161 -332 -239 37 -64 -301 -577 -41 -39 217 85 702 -166 86 -343 -123 -142 55 257 420 0 50 648
5016 648 -165 -343 143 133 276 17 643 -250 -384 -376 382 -20 -397 -61 222 156 197 266 -207 90 -466 133
5038 133 438 -475 116 269 475 89 -88 348 -356 -49 -208 15 -281 -477 -41 -378 -256 21 -38 604
$$ packed form
4883c34L83m24N92r7mK29l45J52L44q45K77j39L53l86O43m91j87pN09J25l62K75
4905B61j12L74q45q5J074p39J80q07L89Q78j52K4l42l39N5M61pm71K70o6J63L2
4927A96o85O59n17J1K79K90M6m97K19k99M84r4m4m65K93J64l13L68o41N00Q1l67
4949c32J45j50q9Q4L42l27L66j67M87m90J71l7J93m87K26j29q5M01l7k61K11n6
4971b1m54K13K86K2L17n71J03k99P21m0M2k24o03P17k70M9o0j99J25J7O06Q1p19
4994a61j71R3K76j01k37k76N36KK56j32O17q68K52m29K20j9J97K02J63m20N0N98
5016F48q13j78M86j0J43k59O26q93j34QP58m02l77L36K83o6M1O9m73K97n56N99
5038A33L05r13N91J53K06l86j77M36p04L07j59K23k96j96M36l37J22K77n9O42
$$ plain form
5058 604 -536 283 174 347 -193 -211 -14 -231 -260 -125 96 -554 91 486 -190 -469 40 130 -137 -358 -177
5079 -177 -90 358 -127 -508 -333 86 359 -235 -17 -195 301 81 -47 -7 433 371 84 57 88 -332 470 -12
5101 -12 -246 498 -83 -282 255 -273 -770 -261 -127 263 -191 -174 -95 156 -462 -545 -74 129 -125 -221 -364 -187
5123 -187 316 -484 -182 -413 -283 -395 -479 -158 -200 -63 -540 -167 -9 -82 137 258 272 -401 152 -15 241
5144 241 -268 -612 -560 -488 492 43 367 -177 -34 10 -503 161 82 -316 -307 43 225 3 287 427 -159 402
5166 402 -27 100 -290 -443 28 -64 -259 -85 -27 22 488 -133 219 72 -194 252 269 424 -444 129 307
5187 307 -179 -54 298 16 -592 326 145 184 -478 -207 -405 489 -194 210 -9 -777 -102 336 120 -113
5207 -113 190 -233 92 -32 138 -259 274 229 201 -152 -351 -75 -273 -400 -231 -111 -87 -93 362 219 -132 -20
$$ packed form
5058F04j140Q19j09J73n40j8J97k17k9J35K21o50O45L95o76k79N09R0k67k21J81
5079a77Q7M48m85l81J75M19K73n94K18j78M96k20j28M0M40o2k87k7L1m20Q02m82
5101a2k34P44n81j99N37n28m97N09J34L90m54J7P9K51o18q3M71K03k54r6j43J77
5123a87N03q00L02k31J30j12q4L21m2J37m77L73J58p3K19J21J4o73N53j67K56
5144B41n09l44N2P2R80m49L24n44J43M4n13O64p9l98RL50J82k22K84J40n86N61
5166D02m29J27l90j53M71r2j95J74N8M9M66o21L52j47k66M46J7J55q68N73J78
5187C07m86J25L52k82o08R18j81L9o62K71j98Q94o83M04k19p68O75M38k16k33
5207a13L03m23L25j24J70l97N33m5k8l53j99K76j98j27J69J20K4oM55j43l51J12
$$ plain form
5229 -20 448 105 11 -548 147 -15 -132 -382 -169 123 122 290 -445 -23 -407 -379 -159 593 -121 469 -183 441
5251 441 -244 -533 -197 -433 303 -62 324 -343 451 -190 88 255 132 343 104 248 81 -29 127 -138
5271 -138 42 -7 218 -420 -147 -268 200 -23 60 35 189 -167 596 -51 507 243 151 30 -237 213 -448
5292 -448 62 -97 261 -410 -196 20 413 100 -698 -55 -38 -127 457 -18 330 145 332 -15 -75 337 106
5313 106 -294 -234 -509 -515 400 104 -536 -151 374 -432 -238 -108 506 -118 -289 -368 430 -120 -604 315 -109
5334 -109 -180 3 -299 388 71 -309 35 464 -451 453 426 -373 0 -210 305 306 -38 -571 -301 347 219
5355 219 -174 98 129 -27 -290 -227 115 270 -7 -431 -302 -99 -232 166 170 -302 187 -38 387 174 220 187
5377 187 10 168 123 -17 463 225 95 -254 -25 157 419 103 149 11 -149 358 53 325 291 -159 31
$$ packed form
5229b0M68l43r4n59O95j62j17k50K13K92jJ68p35M22l84K8K20P52p14N90o52O24
5251D41o85k89L36k36P36l65L86o67P94o41K78J67j23K11k39J44j67j10J56k65
5271a38J80m9K25o38K73j21M68k23Q3k5J54l56P63o47N58k64r2j21k67M50o61
5292d48N10j59L58o71K14K16L93l13p98O43J7q9N84m75L48j85J87l47o0M12k31
5313A06m00O0k75oR15k96o40L85N25q06J94J30O14o24j71p9P98n50m84R19m24
5334a09p1J83l02O87l17l80L44M29r15R04k7p99L73k10N15Jl44n33K70O48j28
5355B19l93K72L1j56k63O3L42J55k77m24J29K03j33L98Mm72M89k25M25k13M6l3
5377A87j77J58m5j40M80k38j30l49K29J82K62l16M6j38j60N07l05K72l4m50J90
$$ plain form
5398 31 76 -141 58 -183 87 -165 124 -176 232 19 -59 -115 -289 -52 -98 -138 409 314 70 -280 237 -199
5420 -199 438 60 -39 178 2 775 14 19 72 599 -268 -698 -421 28 -266 273 -189 -99 -130 206 571 91
5442 91 239 -152 -1 -279 512 -475 -65 -522 439 71 142 41 -88 112 -165 63 125 282 -92 -272 -118
5463 -118 -55 -114 141 44 -219 -310 21 -64 249 52 -55 -234 95 147 513 -451 -171 -159 -238 -119 -322 -53 349
5486 349 33 203 256 280 106 -2 -492 107 -293 10 -413 -176 -308 -73 80 -99 69 -176 -351 278 -165
5507 -165 62 -434 -255 -426 -224 -60 -41 65 -686 -332 -169 -195 -158 -187 210 -389 -66 524 87 57 178 114
5529 114 233 -77 556 8 -512 -155 343 -18 -345 -676 -218 -45 -138 167 -256 205 858 209 503 166
5549 166 -421 -2 7 99 -392 372 -328 434 105 154 -177 261 0 172 606 -533 -234 110 -86 -24 -275
$$ packed form
5398C1M5k17J99k41K70k52K89l00M08k13p8n6j74K37m6m0N47r5k44l50N17m36
5420a99O37l78r9K17j76P73p61NN3N27q67m30K77M49k94N39m62R0l1L36L65m80
5442I1J48l91J51k78P91r87M10m57R61l68P1j01j29K00k77K28O2J57l74j80J54
5463a18O3n9K55r7k63r1L31q5L13j97j07j79L29N2L66r64K80J2p9J19k03K69M02
5486C49l16J70N3K4j74j08m90N99m00L03m23K37j32K35J53j79J68k45j75O29m43
5507a65K27m96J79j71K02J64J9J06p51L54J63k6L7k9L97n99L23N90m37l0J21o4
5529A14J19l10O33n48n20L57M98l61l27l31M58J73r3L05m23M61O53o49K94l37
5549A66n87M19RR2m91P64p00P62l29M9l31M38k61J72M34j139K99L44j96O2k51
$$ plain form
5570 -275 259 164 316 -201 -213 142 -451 -274 101 476 -99 -157 432 153 -97 -418 494 -170 -126 -56 -213 218
5592 218 325 -112 -194 557 -188 1 -513 181 -122 -51 4 -471 -239 -436 158 -213 -567 279 -412 -219 312
5613 312 -294 83 666 -46 387 36 297 -11 -47 862 216 -98 -14 251 597 17 391 -138 589 -413
5633 -413 -27 154 82 260 -233 557 102 -95 231 503 -527 598 -116 43 85 -68 -213 -650 493 67
5653 67 -310 104 189 -294 117 4 -113 -49 124 101 224 306 384 43 127 -221 -293 -86 -34 -147 45 81 371
5676 371 -187 -284 363 295 -96 -32 351 -179 34 -201 -120 -372 223 -445 -142 136 -215 58 239 -71 52
5697 52 199 115 -52 130 253 91 -638 106 -91 201 136 116 267 -159 457 253 -103 255 101 213 -414
5718 -414 109 -41 109 -401 -263 242 -239 -133 -580 3 102 120 -420 -337 -55 383 -14 -68 -334 -108 -229
$$ packed form
5570b75N34r5J52n17j2L55n93J77L75L75n75n8N89k79k50l21R12o64M4P0j57M31
5592B18J07m37q2P51p45J89n14O94l03P1N5m75K32j97N94l71l54Q46o91J93N31
5613C12o06L77N83p12M33l51K61l08l6R09o46l14Q4K65L46n80L74n29P27j002
5633d13L86J81p2J78m93P90m55j97L26K72j030J125p14J59M2j53j45m37J143m26
5653F7l77M14Q5m83M11j13j17O4J73k3J23Q2P8l41Q4l48p2K07N2j13J92L6K90
5676C71n58r7O47o8l91O4L83n30K13k35Q1k52N95o68L03K78l51K73J81l10J23
5697E2J47q4j67J82J23j62p29P44j97K92o5k0J51m26O16k04l56L58j54J12o27
5718d14N23j50J50n10J38N05m81J06m47N83R9J8n40Q3K82M38l97n4k66K26j21
$$ plain form
5739 -229 268 355 94 86 372 52 471 -362 -280 -34 379 466 394 -193 120 190 -246 -176 -84 -186 -324 352 44
5762 44 -90 18 -243 -379 39 474 -272 -125 218 -216 -58 -192 -251 -84 200 -204 172 -201 19 -391 -235
5783 -235 -35 319 150 89 -303 -84 -119 -41 -189 -48 35 -12 -327 -86 -134 181 43 -156 485 350 236 -58
5805 -58 400 -120 -41 -316 -135 -561 -320 -145 242 -129 -35 -29 238 139 20 -163 307 -395 -250 -290 37 -63
5827 -63 -22 -148 -108 206 112 -280 183 2 -66 -105 -226 -71 -410 -127 356 12 98 621 -337 -67 -216 -59
5849 -59 -113 595 447 135 -278 -415 -58 112 659 336 182 458 49 -74 -95 77 -18 -62 -224 -412 -205 304
$$ packed form
5739b29M97Q7k61qK86l20M19q33Q2K46M13Q7p2n87L13P0m36P0R2j02j38O76l08
5762D4j34J08k61j36M18M35p46J47L43m34J58j34n9J67K84m04L76l73K20m10J56
5783b35K00L54j69o1l92K19l5P8j48J41Q3m7l15K41m8L15j38j99O41j35j14k94
5805e8M58n20P9k75J81m26K41J75L87l71R4OK67r9j19j83M70p02J45m0L27j00
5827f3M1j26M0L14r4l92M63j81o8l9j21J55l39K83M83l44Q6N23r58K70j49J57
5849e9n4P08j48l12m13j37L57J70N47l23j54K76m09j23k1J72r5m4j62j88K07N09
$$ [...]
8191b70
##END NTUPLES=NMR FID
##END=
