##TITLE=1H_SR69_k(TFA)
 CDCl3, 8 sc, 
 8.07.2021
##JCAMPDX= 6.0         $$ Bruker NMR JCAMP-DX V2.0
##DATA TYPE= NMR FID
##DATA CLASS= NTUPLES
##ORIGIN= UXNMR, Bruker Analytische Messtechnik GmbH
##OWNER= root
$$ XWIN-NMR		Version 3.5
$$ Thu Jul  8 12:00:42 2021 Russian Standard Time (UT+4h)  she@DPX200
##.OBSERVE FREQUENCY= 200.131506
##.OBSERVE NUCLEUS= ^1H
##.DELAY= (6, 6)
##.ACQUISITION MODE= SIMULTANEOUS
##.ACQUISITION SCHEME= undefined
##.AVERAGES= 8
##.DIGITISER RES= 18
##SPECTROMETER/DATA SYSTEM= spect
##.PULSE SEQUENCE= zg30
##.SOLVENT NAME= CDCl3
##.SHIFT REFERENCE= (INTERNAL, CDCl3, 0, 15.7039)
##AUDIT TRAIL= $$ (NUMBER, WHEN, WHO, WHERE, WHAT)
$$ ##TITLE= Audit trail, XWIN-NMR		Version 3.5
$$ ##JCAMPDX= 5.01
$$ ##ORIGIN= Bruker BioSpin GmbH
$$ ##OWNER= she
$$ F:/spectra/data/she/nmr/H-F/1/audita.txt
$$ ##AUDIT TRAIL=  $$ (NUMBER, WHEN, WHO, WHERE, WHAT)
(   1,<2021-07-08 11:59:36.93 +0400>,<she>,<DPX200>,
      <created by zg, POWCHK disabled, PULCHK disabled
       configuration hash MD5:
       00 E9 B6 7A A2 85 ED C7 34 08 36 98 17 FE 4E 26
       data hash MD5: 16K
       4C A2 62 60 81 84 1E B3 2B 8D A5 B1 91 B5 DD 5A>)
$$ ##END=
$$ 
$$ hash MD5
$$ 3C 59 01 EB 8B 07 41 1C 35 3E 91 C4 DC D4 83 F5
##$RELAX= 
##$RELAX= 
##$RELAX= 
##$RELAX= 
##$RELAX= 
##$RELAX= 
$$ Bruker specific parameters
$$ --------------------------
##$DU= <F:/spectra>
##$EXPNO= 1
##$NAME= <H-F>
##$PROCNO= 1
##$TYPE= <nmr>
##$USER= <she>
##$AMP= (0..31)
100 100 100 100 100 100 100 100 100 100 100 100 100 100 100 100 100 100 
100 100 100 100 100 100 100 100 100 100 100 100 100 100 
##$AQSEQ= 0
##$AQ_mod= 1
##$AUNM= <au_zg>
##$AUTOPOS= <>
##$BF1= 200.13
##$BF2= 200.13
##$BF3= 200.13
##$BF4= 200.13
##$BF5= 200.13
##$BF6= 200.13
##$BF7= 200.13
##$BF8= 200.13
##$BYTORDA= 1
##$CFDGTYP= 0
##$CFRGTYP= 5
##$CHEMSTR= <none>
##$CNST= (0..31)
1 1 145 1 1 1 1 1 1 1 1 1 1 1 1 1 1 1 1 1 1 1 1 1 1 1 1 1 1 1 1 1 
##$CPDPRG= <>
##$CPDPRG1= <>
##$CPDPRG2= <>
##$CPDPRG3= <>
##$CPDPRG4= <mlev>
##$CPDPRG5= <mlev>
##$CPDPRG6= <mlev>
##$CPDPRG7= <mlev>
##$CPDPRG8= <mlev>
##$CPDPRGB= <>
##$CPDPRGT= <>
##$D= (0..31)
0 1.2 0 0 0 0 0 0 0 0.06 0 0.03 0 0 0 0 0.0002 0 0 0 0 0 0 0 0 0 0 0 0 
0 0 0 
##$DATE= 1625731176
##$DBL= (0..7)
120 120 120 120 120 120 120 120 
##$DBP= (0..7)
150 150 150 150 150 150 150 150 
##$DBP07= 0
##$DBPNAM0= <>
##$DBPNAM1= <>
##$DBPNAM2= <>
##$DBPNAM3= <>
##$DBPNAM4= <>
##$DBPNAM5= <>
##$DBPNAM6= <>
##$DBPNAM7= <>
##$DBPOAL= (0..7)
0.5 0.5 0.5 0.5 0.5 0.5 0.5 0.5 
##$DBPOFFS= (0..7)
0 0 0 0 0 0 0 0 
##$DE= 6
##$DECBNUC= <off>
##$DECIM= 32
##$DECNUC= <off>
##$DECSTAT= 4
##$DIGMOD= 1
##$DIGTYP= 9
##$DL= (0..7)
0 120 120 120 120 120 120 120 
##$DP= (0..7)
150 150 150 150 150 150 150 150 
##$DP07= 0
##$DPNAME0= <>
##$DPNAME1= <>
##$DPNAME2= <>
##$DPNAME3= <>
##$DPNAME4= <>
##$DPNAME5= <>
##$DPNAME6= <>
##$DPNAME7= <>
##$DPOAL= (0..7)
0.5 0.5 0.5 0.5 0.5 0.5 0.5 0.5 
##$DPOFFS= (0..7)
0 0 0 0 0 0 0 0 
##$DQDMODE= 0
##$DR= 18
##$DS= 0
##$DSLIST= <SSSSSSSSSSSSSSS>
$$ [...]
##$SUBNAM2= <"">
##$SUBNAM3= <"">
##$SUBNAM4= <"">
##$SUBNAM5= <"">
##$SUBNAM6= <"">
##$SUBNAM7= <"">
##$SUBNAM8= <"">
##$SUBNAM9= <"">
##$SW= 20.0188882624521
##$SWIBOX= (0..15)
0 0 2 0 0 0 0 0 0 0 0 0 0 0 0 0 
##$SW_h= 4006.41025641026
##$TD= 16384
##$TD0= 1
##$TE= 0
##$TE2= 300
##$TE3= 300
##$TEG= 300
##$TL= (0..7)
0 120 120 120 120 120 120 120 
##$TP= (0..7)
150 150 150 150 150 150 150 150 
##$TP07= 0
##$TPNAME0= <>
##$TPNAME1= <>
##$TPNAME2= <>
##$TPNAME3= <>
##$TPNAME4= <>
##$TPNAME5= <>
##$TPNAME6= <>
##$TPNAME7= <>
##$TPOAL= (0..7)
0.5 0.5 0.5 0.5 0.5 0.5 0.5 0.5 
##$TPOFFS= (0..7)
0 0 0 0 0 0 0 0 
##$TUNHIN= 0
##$TUNHOUT= 0
##$TUNXOUT= 0
##$USERA1= <user>
##$USERA2= <user>
##$USERA3= <user>
##$USERA4= <user>
##$USERA5= <user>
##$V9= 5
##$VALIST= <valist>
##$VCLIST= <CCCCCCCCCCCCCCC>
##$VD= 0
##$VDLIST= <DDDDDDDDDDDDDDD>
##$VPLIST= <PPPPPPPPPPPPPPP>
##$VTLIST= <TTTTTTTTTTTTTTT>
##$WBST= 1024
##$WBSW= 4
##$XGAIN= (0..3)
0 0 0 0 
##$XL= 0
##$YL= 0
##$YMAX_a= 113253
##$YMIN_a= -106813
##$ZGOPTNS= <>
##$ZL1= 120
##$ZL2= 120
##$ZL3= 120
##$ZL4= 120
##$ABSF1= 10
##$ABSF2= 0
##$ABSG= 5
##$ABSL= 3
##$ALPHA= 0
##$AQORDER= 0
##$ASSFAC= 0
##$ASSFACI= 0
##$ASSFACX= 0
##$ASSWID= 0
##$AUNMP= <proc_1d>
##$AZFE= 0.1
##$AZFW= 0.1
##$BCFW= 1
##$BC_mod= 2
##$BYTORDP= 1
##$COROFFS= 0
##$CY= 11.3945322036743
##$DATMOD= 1
##$DC= 2
##$DFILT= <>
##$DTYPP= 0
##$F1P= 17.5019972093344
##$F2P= -2.517084195857
##$FCOR= 0.5
##$FTSIZE= 0
##$FT_mod= 4
##$GAMMA= 1
##$GB= 0.15
##$INTBC= 1
##$INTSCL= 1
##$ISEN= 128
##$LB= 0.24
##$LEV0= 0
##$LPBIN= 0
##$MAXI= 10000
##$MC2= 0
##$MEAN= 0
##$ME_mod= 0
##$MI= 1.114404
##$NCOEF= 0
##$NC_proc= 0
##$NLEV= 6
##$NOISF1= 3.799351
##$NOISF2= 2.8
##$NSP= 1
##$NTH_PI= 0
##$NZP= 0
##$OFFSET= 15.70392
##$PC= 1
##$PHC0= -12274.12
##$PHC1= 11.20101
##$PH_mod= 1
##$PKNL= yes
##$PPARMOD= 0
##$PSCAL= 0
##$PSIGN= 0
##$REVERSE= no
##$SF= 200.130013532006
##$SI= 16384
##$SIGF1= 3
##$SIGF2= 2
##$SINO= 400
##$SIOLD= 16384
##$SREGLST= <1H.CDCl3>
##$SSB= 0
##$STSI= 0
##$STSR= 0
##$SW_p= 3612.71676300578
##$SYMM= 0
##$S_DEV= 0
##$TDeff= 0
##$TDoff= 0
##$TI= <>
##$TILT= no
##$TM1= 0
##$TM2= 0
##$TOPLEV= 0
##$USERP1= <user>
##$USERP2= <user>
##$USERP3= <user>
##$USERP4= <user>
##$USERP5= <user>
##$WDW= 1
##$XDIM= 8192
##$YMAX_p= 0
##$YMIN_p= 0
$$ End of Bruker specific parameters
$$ ---------------------------------
##NTUPLES= NMR FID
##VAR_NAME=  TIME,          FID/REAL,        FID/IMAG
##SYMBOL=    X,             R,               I
##VAR_TYPE=  INDEPENDENT,   DEPENDENT,       DEPENDENT
##VAR_FORM=  AFFN,          ASDF,            ASDF
##VAR_DIM=   8192,          8192,            8192
##UNITS=     SECONDS,       ARBITRARY UNITS, ARBITRARY UNITS
##FACTOR=    0.0002496,     1,               1
##FIRST=     0,             0,               0
##LAST=      2.0444736,     0,               0
##MIN=       0,             -106813,         0
##MAX=       2.0444736,     113253,          0
$$ Real data points
##PAGE= N=1
##DATA TABLE= (X++(R..R)), XYDATA
$$ [...]
1796f3j24K32k52K21K68n98K60J05j23j3k1l55J90J38k58M00j93p4j02M19n32
$$ -63 -187 45 -207 14 282 -316 -56 49 -74 -87 -108 -463 -273 -135 -393 7 -186 -260 -362 57 -475
1817d75M48j92l5K84j09j41J78L43m68K21r3k02M27q6m63L21J74o66L32M13l46
$$ -475 -27 -219 -254 30 -79 -220 -42 301 -167 54 -39 -241 186 100 -363 -42 132 -534 -202 211 -135
1838a35k7O16p03J47N92p48L36M11l31k01K46J80p10O97j43j11J36j25P7N0n4
$$ -135 -162 454 -249 -102 490 -258 78 489 158 -43 203 383 -327 370 227 116 252 127 204 254 200
1859B00j63M01k87j26K77k74k63M22J08l54M58k40k41K75J31k31r1o6J0M08l40
$$ 200 37 438 151 25 302 28 -235 187 295 -59 399 159 -82 193 324 93 2 -64 -54 354 14
1880A4j94L20P3o63O62l6j71PR9n40J80N41p80L34J82k46O8Q6l86K41L59l07k36
$$ 14 -180 140 213 -450 212 176 5 12 111 -429 -249 292 -488 -154 28 -218 -150 -64 -450 -209 150 -157 -393
1903c93M57j91l02J26L41m01M95k14m40M98k48q5L60p9k92N57k11p0K3r8j29M75
$$ -393 64 -127 -429 -303 38 -363 132 -82 -522 -24 -272 -357 3 -76 -368 189 -22 -92 -69 -167 -296 179
1925A79k36p9K78n8k44J76J61j18KJ28m41L03K23m66nK19N1l6L01l04N52l73l85
$$ 179 -57 -136 142 84 -160 16 177 59 61 189 -252 51 274 -192 -197 22 73 37 338 34 586 213 -172
1948a72lM76m77M24j00J89k46J23j07j26K93k50J45q9k08Q2M4J95k53K48l16k
$$ -172 -175 301 -176 248 148 337 91 214 107 -19 274 24 169 80 -128 -46 -2 193 -60 188 -128 -130
1970a30K71j80J3J94k91n5M24k96q1J71p5r9J71k9l43M56j83j56J1L09m72M56
$$ -130 141 -39 -26 168 -123 -178 246 -50 -131 40 -35 -134 37 8 -335 121 -62 -218 -207 102 -370 86
1992H6j80j03J73j22l1J45O6k39J63p5J2K42j68p0oN8n8K21j99K01m59M55j24
$$ 86 -94 -197 -24 -146 -177 -32 34 -205 -42 -117 -105 137 -31 -101 -107 -49 -107 114 -85 116 -343 112 -12
2015a2p6K52r5o7K7o4k86N88k73M11j22l44LK71l04K88J8j31j74L56k8k40N40
$$ -12 -88 164 69 2 29 -35 -321 267 -6 405 283 -61 -58 213 -91 197 215 84 -90 266 238 -2 538
2038E38l85o7j90K04J30l15J58J26j56M2K6L3K7Q0k09K55l94J77k4K3q6j9J19
$$ 538 153 86 -104 100 230 -85 73 199 43 85 111 144 171 251 42 297 -97 80 56 79 -7 -26 93
2061I3l39K40j23KJ10j83J54k29K81Lm3J99J1l3l68O3m30N58j7M2q1RK25o9m4
$$ 93 -246 -6 -129 -127 -17 -200 -46 -275 6 9 -34 165 176 143 -225 -162 -592 -34 -51 -9 -90 -81 144 75 31
2086C1oj43K87Ml00l2K96j63k07N1R0L2j10j02R8J10J14j2L4r5J8J54k0j15j62
$$ 31 25 -118 169 173 -127 -159 137 -26 -233 -182 -92 -60 -170 -272 -174 -64 50 38 72 -23 -5 149 129 14 -148
2111a48L44k13m5n5R2mR5J40K35l60l6J08j6j61lj86K75Q5J03m91M13p3J74k11
$$ -148 196 -17 -62 -117 -25 -29 66 206 441 81 45 153 137 -24 -27 -213 62 147 250 -241 172 99 273 62
2135F2m6L1O4J50j02j23r6L21m29L89K6l11K35j8J2p4LQk95r2K76q4L87k22r2
$$ 62 16 47 111 261 159 36 -60 261 -168 221 247 -64 171 153 165 91 94 102 -193 -285 -9 -93 294 72 -20
2160b0J42l47K41r2q9K37m6jr1j13K16j89kL07k31J38k89j9Q8J14K72l16k10K72
$$ -20 122 -225 16 -76 -165 72 26 25 -66 -179 37 -152 -154 153 -78 60 -229 -248 -160 -46 226 -90 -300 -28
2184b8N2M8k71K22J0M1k53J97J23k55j95M00k66K19m5k14J01K37l26L75J11l79
$$ -28 24 72 -199 23 33 74 -179 18 141 -114 -309 91 -175 44 -1 -215 -114 123 -203 172 283 -96
2206i6r8K86m8N2j85L69j17jj35j36M28j89m1J39k43J01J1K31k70n1K02j7j7K2
$$ -96 -194 92 44 96 -89 280 163 162 27 -109 319 130 89 228 -15 86 97 328 58 7 209 192 175 197
2230A97k07J56k17R1j17K72k77K77j34k27K53j04m3N3J33j98n8l0R0lJ61j44J6
$$ 197 -10 146 -71 20 -97 175 -102 175 41 -186 67 -37 -80 -27 106 -92 -150 -180 -90 -93 68 -76 -60
2253f0K2mk4N8J8L8N8k0m1l07j59J91K60k35nK72j73J20o0j81J50K41k95QK84
$$ -60 -38 -42 -66 -8 10 48 106 86 45 -262 -421 -230 30 -205 -210 62 -111 9 -51 -232 -82 159 -136 -128 156
2278A56j19oo0j04J73qlm5K87k60k11K66M2P2j83r2K6M18j23K4l47K51j36j97
$$ 156 37 31 -29 -133 40 32 29 -16 271 11 -200 66 108 180 -3 -95 -69 349 226 250 -97 154 18 -179
2302a79K90J81j36ql5k64M31l27j09L11N7j65o3r4J14J56n6o1j75L91J32r5j50
$$ -179 111 292 156 148 113 -151 280 -47 -156 155 212 47 -16 -110 4 160 104 43 -132 259 391 296 146
2325A46p4j45O3J97k44k04J53L37k15k11J82j70J96Q3l01J38K79p6l7j84J19o7
$$ 146 72 -73 -10 187 -57 -261 -108 229 14 -197 -15 -185 11 94 -207 -69 210 134 97 -87 32 -35
2347c5j5m2K59l65L85l95J8J16j6Q4o9J65j87j2Mj60K00R6k42L9J51j10p5K68
$$ -35 -50 -92 167 -198 187 -208 -190 -74 -90 -6 -75 90 -97 -109 -105 -265 -65 31 -211 -172 -21 -131 -206 62
2371F2r5nj19K0J23J21j66j48J49M70l92nR3J43k23K81m23J44J0K44m2l63P0J57
$$ 62 -33 -38 -157 -137 -14 107 -59 -207 -58 412 20 15 108 251 28 309 -114 30 40 284 242 -121 -51 106
2395A06Pj12K11l37J53q7K03N1j18J83k16L9O5N8j52j19Q4m3J8R8m8O5j22L66
$$ 106 113 1 212 -125 28 -59 144 195 77 260 44 83 148 206 54 -65 19 -24 -6 92 44 109 -13 353
2419C53k68l97L55l0l05N3L98J07k60k00J99j1J7r3l5K5p7j28K04J60l48K9J25
$$ 353 85 -312 43 13 -292 -239 159 266 6 -194 5 -6 11 -82 -117 -92 -169 -297 -93 67 -281 -252 -127
2442a27J90k78K6K47k68P3J34k33M40l30r4J83l5J02j42K99j53K3q5J20j07J56
$$ -127 63 -215 -189 58 -210 -137 -3 -236 204 -126 -220 -37 -72 30 -112 187 34 57 -28 92 -15 141
2464A41j16m8J9J14j42k71L56m9J13j52K41j9l31L12j06n0k17J95M47k03q3J55
$$ 141 25 -23 -4 110 -32 -303 53 4 117 -35 206 187 -144 168 62 12 -205 -10 437 234 151 306
2486C06j84r3j03P3PM38n90J89m5K10j75L5J59K5k20L5k4Lp9K0j06L05Q0l24J06
$$ 306 122 29 -74 -1 6 444 -146 43 -2 208 33 68 227 252 32 67 43 46 -33 -13 -119 186 266 -58 48
2511D8rj18O2P8j29lk35Q2M08k64K38k18l7K29k25j36K45r1N4k51K18J75l7l80
$$ 48 39 -79 -17 61 -68 -71 -306 -224 184 -80 158 -60 -97 132 -93 -229 16 -75 -21 -272 -54 121 84 -296
2535b96K54PJ4P3l04J01L72l00K61m03L50l33k4J79j09o4R9K06o8j50R3j83L02
$$ -296 -42 -35 -21 52 -252 -151 221 -79 182 -221 129 -204 -228 -49 -158 -222 -123 83 15 -135 -42 -225 77
2558G7q0r6L25l89K30J49k14j83J58J17J76k66m8K78l33K40j12K57j60J37k10
$$ 77 -3 -99 226 -163 67 216 2 -181 -23 94 270 4 -44 234 -99 141 29 286 126 263 53
2579E3k4J8J11K1Q8k36n6Q3N9j11O5k47K49j24J06k32J64J24k2j37N2r4j02J27
$$ 53 29 47 158 179 267 31 -25 58 117 6 71 -176 73 -51 55 -177 -13 111 89 -48 4 -90 -192 -65
2603f5J13n4j52M31m80M05p9j44J84j02J58k53k20K11q2k7P6Pj86J02j07J84l02
$$ -65 48 -6 -158 273 -207 198 119 -25 159 57 215 -38 -258 -47 -129 -156 -80 -73 -259 -157 -264 -80 -382
2626c82M40k16J30L2l29K7K35RK52l60K21m2o4k24J10J21M6m5l85N65j64L06l33
$$ -382 58 -158 -28 4 -325 -298 -63 -54 198 -162 59 17 -47 -271 -161 -40 6 -39 -424 141 -23 283 -50
2649e0l30N11j97oP1j97N88l25K24j12n7pj08j85K54J10j84R0Q4M7n82N84j34
$$ -50 -380 131 -66 -72 -1 -198 390 65 289 177 120 113 5 -180 74 184 0 90 174 221 -361 223 89
2672H9o7j57J17L1J23p5J75j21P6j34P5j4r3M6o2j27J17L10n75L14o9Pm9Q2K54
$$ 89 22 -135 -18 13 136 61 236 115 191 57 132 118 25 71 9 -118 -1 309 -266 48 -21 -14 -63 19 273
2697B73o9j14l86L13J81j36j28k62N61p3k34M4O9K3J63m73J90J35j66K05o4k15
$$ 273 204 90 -296 17 198 62 -66 -328 233 160 -74 -30 39 62 225 -248 -58 77 -89 116 52 -163
2719a63l9O6J22Qj2J08k1k48J24N9k36K40j63k1J22O7j83l7J3J22K88k48j5J08
$$ -163 -202 -136 -14 -6 -18 90 69 -179 -55 4 -232 8 -155 -176 -54 13 -170 -207 -194 -72 216 -32 -47 61
2743F1p4J60n7M7k39J85m1K19l39O4q0J80j80L14l23k4L43k12J45Q1m2k00L17
$$ 61 -13 147 90 137 -102 83 42 261 -78 -14 -94 86 -94 220 -103 -127 216 4 149 230 188 -12 305
2766C05j74j55l3K27j17k35K94j84J41n4qL83o38L06k08J22J11j02K64n18M84
$$ 305 131 -24 -57 170 53 -182 112 -72 69 15 7 390 -248 58 -150 -28 83 -19 245 -273 211
2787B11p1j1j18k13K76m2N8l9k47M3J93j75k39L52N6M3j47r9K44q1o0j04j43J39
$$ 211 140 129 11 -202 74 32 90 51 -196 -153 40 -135 -374 -22 34 77 -70 -169 75 -6 -66 -170 -313 -174
2811a74K51n5q4NJ73L3j97J17k72L14k85K49j16K6R2qr1oj1o2N6J4N0k20L36K4
$$ -174 77 22 -62 -57 116 149 -48 69 -203 111 -174 75 -41 -15 77 69 -22 -28 -39 -101 -45 -31 19 -201 135 159
2837A59pn9j51M6K99j82J47k27K20l25L23j06k53J38J53Q1k77n1L6P2L4J70Ln2
$$ 159 152 93 -58 -12 287 105 252 25 245 -80 243 137 -116 22 175 256 -21 -72 -36 36 70 240 243 191
2861A91j31K0j98L73m25J79O8n2m9P7q8J65m7j22L62m27j0J02O7J89j72j48Nk03
$$ 191 60 80 -118 255 -170 9 77 25 -24 53 -35 130 83 -39 323 -104 -114 -12 55 244 72 -76 -71 -274
2885b74L61J09k23k4L6k92L70l54M05j39n6K92m70J64J57k00J51k87K48k95M92
$$ -274 87 196 -27 -51 -15 -307 63 -291 114 -25 -81 211 -259 -95 62 -138 13 -274 -26 -321 171
2906A71L0l65J5l0n1L93k51Q1J87O3l64K6j66L23l36J93j96L72j21J38j12k82
$$ 171 201 -164 -149 -179 -230 163 -88 -7 180 243 -121 -95 -261 62 -274 -81 -277 95 -26 112 0 -282
2928b82K94j28K16M3K27n01K49j04L08m38K45p9K18l77K06l11K5L89mj81J24l88
$$ -282 12 -116 100 143 370 -131 118 14 322 -116 129 50 268 -109 97 -214 -189 200 196 15 139 -249
2950b49J00L5Q0K04k30J46k58M10m26M8j0K81k27k01Q4L94j21n3K1j21R5L7k1
$$ -249 -149 -114 -34 170 -60 86 -172 238 -188 -140 -150 131 -96 -297 -213 181 60 7 28 -93 2 39 18
2973A8q4j66L2J06k59L99K9l6k51J9J72l1k16K70o8n8N1J02n2J50q1n9j16J03
$$ 18 -66 -232 -200 -94 -353 46 75 39 -212 -193 -21 -52 -268 2 -66 -124 -73 29 -23 127 46 -13 -129 -26
2997b6K75m97N88m30n5K6J08j29J85r6J31j49m0L04k21J6M6j33M53m62J8l0J20
$$ -26 249 -248 340 -90 -145 -119 -11 -140 45 -51 80 -69 -109 195 -26 -10 36 -97 356 -106 -88 -118 2
3020Bq9j1J65K7q3N7J1k64L59k9l84M26L0l45Q1L4k6J01l5K16j92k2o0L8K25l48
$$ 2 -87 -98 67 94 11 68 79 -185 174 145 -239 187 217 -128 -47 -13 -39 62 27 243 51 29 -31 7 232 -116
3046a16n1J20n7J21j84j89L78l8J40k30J10K37j86k90K06m2k33M93m03J04L80
$$ -116 -167 -47 -104 17 -167 -356 22 -16 124 -106 4 241 55 -235 -29 -71 -304 189 -214 -110 270
3067B70l19P7J96l2P6q7l55j05J09l0L6Q1K3p5M4Q5j08K21m27K46o3J3P2Q1k11
$$ 270 -49 28 224 192 268 181 -174 -279 -170 -200 -164 -83 -60 -135 -91 -6 -114 107 -320 -74 -137 -124 -52 29 -182
3092a82l9j9K58J08r3J1o3jN3r8M2K92n14R9J18j06J44L65l4m04k2L7LJ6q3Q8
$$ -182 -221 -240 18 126 33 44 -19 -20 33 -65 -23 269 -245 -146 -28 -134 10 375 341 -63 -85 -48 -45 -29 -112 -24
3118b4m5K69j22j66L26R3j55j22l0L5Q6M7j12p3p0P4o4O2M1j00J41l05k9N13l90
$$ -24 -69 200 78 -88 238 331 176 54 24 59 145 192 80 7 -63 11 -53 9 50 -50 91 -214 -243 270 -120
3143a20M15l86j46L21j44j26k01P07m12J34K9M6k6j31j0J37m06nPL24j57K27j99
$$ -120 295 -91 -237 84 -60 -186 -387 320 -92 42 71 117 91 -40 -50 87 -319 -324 -317 7 -150 77 -122
3166a22Q0M3n3O6k61J72l6J2LM1j21J49M0q8m1QK00k30K8L29r7j33m9N7N1J08
$$ -122 -42 1 -52 14 -247 -75 -111 -99 -96 -55 -176 -27 13 -75 -116 -108 92 -138 -110 219 122 -11 -60 -3 48 156
3192A56k54J6r0K58l3J00r9j43J05j51L23%j76j39J66R0j92K25j47N0O7k67j7
$$ 156 -98 -82 -172 86 53 153 54 -89 16 -135 188 188 12 -127 39 129 -63 162 15 65 132 -135 -152
3215a52o1L71k9k50K68K2q8J0p7j97K61j37K86j86k52L9K14l6l6j82M19PK6l1
$$ -152 -213 158 129 -121 147 169 81 91 14 -183 78 -59 227 41 -211 -172 42 6 -30 -212 207 214 240 209
3239B09r2k60J5J72k27L36k71J61l23Q7J79l37Q7M29k60J43q3j52K70j75M5K91
$$ 209 117 -143 -128 44 -183 153 -118 43 -280 -193 -14 -351 -264 165 -95 48 -35 -187 83 -92 -47 244
3261B44l43L07m5k33K31J07k33o6p2j55J94P6J42j04l13M11k21J25j7p0Q9k57
$$ 244 -99 208 163 -70 161 268 35 -31 -103 -258 -64 12 154 50 -263 148 -73 52 35 -35 54 -203
3283b03K75p8j1j60L16J7p8kN8j90K59j39k96K21K36k64m2J5j70R0O0j49K59J64
$$ -203 72 -6 -17 -177 139 156 78 76 134 -56 203 64 -232 -11 225 -39 -81 -66 -236 -146 -86 -235 24 188
3307A88j65K8J05k58J92J05k43K02j54K50p7j09Kj73K90M1m24K55k34K51j01n2
$$ 188 23 51 156 -102 90 195 -48 154 0 250 173 64 66 -107 183 224 -200 55 -179 72 -29 -81
3329h1Pq4J82jJ72r6K20l95P2l8j62J70j79K29j7Q4K4j97l7L28k75P7j62M9j02
$$ -81 -74 -158 24 23 195 99 319 -76 -4 -42 -204 -34 -213 16 -1 83 107 -90 -127 201 -74 3 -159 -110 -212
3354b12m1K70k71L40k31N4lK49k84Q2J93j42J6j83J85j4L2r3k2r4M7Q7L8k33J89
$$ -212 -253 17 -254 86 -145 -91 -94 155 -129 -47 146 4 20 -163 22 8 40 -53 -75 -169 -122 -35 3 -230 -41
3379d1j8J64p3M5j26j81qN94j64N7l54J51p2L3j22l04N85J16k4j36o5L5M0j04
$$ -41 -59 105 32 77 -49 -230 -238 356 192 249 -105 46 -26 7 -115 -419 166 282 258 122 57 92 132 28
3403B8J50K0k53LL34l95QL33k68M5j17J14j73K43K35n11K58RM0j41L1o7k9O4O2
$$ 28 178 198 -55 -52 282 -113 -105 228 -40 5 -112 2 -171 72 307 -204 54 63 103 -38 -7 -74 -103 -39 23
3428B3k4l23K90M4J0L2k20P3J93j42k65K13M0L53l25P7k8k02N5K32m25L00q5K30
$$ 23 -1 -324 -34 10 20 52 -168 -95 98 -44 -309 -96 -56 297 -28 49 21 -181 -126 106 -319 -19 -104 126
3452A26r1J0j45j7O6r6L86l95L8J20m9K40l63K79l07J87J43l32O45k66l29K83
$$ 126 35 45 -100 -117 -51 -147 239 -156 -118 2 -47 193 -170 109 -198 -11 132 -200 445 179 -150 133
3474A33J5k6K5l62K78l06O55k19k77K46j71nK01k77P6J9m1j54Q5L24m12K64k5
$$ 133 148 122 147 -215 63 -243 412 193 -84 162 -9 -14 187 -90 -14 5 -36 -190 -105 219 -193 71 46
3497D6K5k8P2l43P9J51J78j95k27L12k92K51O1j56J0m2o2J76r8K71k11j83J5K99
$$ 46 71 43 115 -228 -149 2 180 -15 -242 70 -222 29 90 -66 -56 -98 -160 16 -82 189 -22 -205 -190 109
3521A09r3l30L42j88K23J17k50n8K74j88j71p1m8N4L72k44J87qM3k65J60R6k15
$$ 109 16 -314 28 -160 63 180 -70 -128 146 -42 -213 -284 -332 -278 94 -150 37 29 72 -193 -33 63 -152
3544a52K37j45p6k51L28O0K6p1J03lNJ51j02k3J62k41K3J93l15J02j7r5L12l87
$$ -152 85 -60 -136 -387 -59 1 27 -44 59 56 61 212 110 87 249 8 31 224 -91 11 -6 -101 211 -176
3568a76M08q3k16J31Rj14J51m9q6M8j61K48L2j6r2M6j06M5j84J37j28OJ85Lj75
$$ -176 232 149 -67 64 73 -41 110 61 -25 23 -138 110 142 126 34 80 -26 19 -165 -28 -156 -150 35 38 -137
3593a37L27m6k69K13j81kJ49J04k23k20J15L07j31q4J59k44J74j28J69k57r1M33
$$ -137 190 144 -125 88 -93 -95 54 158 -65 -285 -170 137 6 -78 81 -163 11 -117 52 -205 -296 137
3615A37k81M3j38K56k43M28n8l19M25j13K5j42J06m4M5O1q0l91O10m75q4L20k44
$$ 137 -144 -101 -239 17 -226 202 144 -175 250 137 162 20 126 82 127 188 108 -283 327 -148 -232 88 -156
3638a56L18Oq1k65L07l55J87j21K22J37l29L4L09j52n4J96n84M10nJ84j54O7K53
$$ -156 162 168 87 -178 129 -226 -39 -160 62 199 -130 -96 213 61 7 203 -381 29 24 208 54 121 374
3661C74l26j41N9j12j0J10L29k87m1k06K15K85j31j49j02J3L49k41lo1J23J30
$$ 374 48 -93 -34 -146 -156 -46 283 -4 -45 -251 -36 249 118 -31 -133 -120 229 -12 -15 -76 47 177
3683A77Ln17K04K37j72n6Q6k2N8L8NJ53m16J35O9K36l19JQ1K15k34k7J44j67O9
$$ 177 180 -337 -133 104 -68 -124 -38 -60 -2 36 41 194 -222 -87 -18 218 -101 -100 -19 196 -38 -65 79 -88 -19
3708a9o9K1J09j7m6l6J34k23K60p6oj07n6M4L20k73j06J25m0J61o3k47J43p0N1
$$ -19 -88 -67 42 25 -21 -57 77 -146 114 38 32 -75 -131 -87 233 -40 -146 -21 -61 100 37 -210 -67 -137 -86
3733h6L34j95k35J70J26j77k15M66l40K94l42K72k17K26j80K56J05l32J26%k89
$$ -86 248 53 -182 -12 114 -63 -278 188 -152 142 -200 72 -145 81 -99 157 262 -70 56 56 -233
3754b33L50k05J57J06p2O0k14n5R2K8M7j83J23j38R1J62q9j42N1O9L5K8o7J66
$$ -233 117 -88 69 175 103 163 -51 -106 -14 14 61 -122 1 -137 -46 116 27 -115 -64 5 40 68 1 167
3778A67l16K27k35J24M12m78J42L98n02L71j85m44K20M96m02J04O8k65QQ1K05
$$ 167 -149 78 -157 -33 379 -99 43 441 -61 310 125 -319 -99 397 -5 99 167 -98 -90 -9 196
3799A96k84J90j37J83R4k33o9lQ3m9q4J98J36j93Q4j61O5Q6l1M3k6j79L58j05
$$ 196 -88 102 -35 148 242 9 -60 -63 20 -29 -113 85 221 28 112 -49 16 102 71 114 88 -91 267 162
3823A62k96N0J10J10l44J37N2k0L19k12j50N2J14j28K4m7J98j69j78K29o1j2J56
$$ 162 -134 -84 26 136 -208 -71 -19 -39 280 68 -82 -30 84 -44 -20 -67 131 -38 -216 13 -48 -60 96
3846I6k34L60k27j61O4M7K50o5j15rm0J50j29Q6M2j47K12j29oJ63o0k04L7n6q
$$ 96 -138 222 -5 -166 -102 -55 195 130 15 6 -34 116 -13 73 115 -32 180 51 45 208 148 -56 -19 -75 -83
3871h3rk8N5J82j22J88M9k51J06k15R6R2j59K59j48k41L1K02lL9o0p8j93K07Q4
$$ -83 -92 -120 -65 117 -5 183 232 -19 87 -128 -32 60 -99 160 12 -229 -198 4 1 40 -20 -98 -291 -84 0
3896@o3N4J88k38L40k62K0rq3K2K22j04k90L63k51K05k69K77j71J16q3L7J52j12
$$ 0 -63 -9 179 -59 281 19 39 30 -53 -31 191 87 -203 160 -91 114 -155 122 -49 67 -16 21 173 61
3920F1k07M01l17L62k44N8l9OJ39n4j78QL23m79L68n0l33o7L27n0j17L4J10j59
$$ 61 -146 255 -62 300 56 114 75 81 220 166 -12 -4 319 -160 208 158 -175 -242 85 35 -82 -48 62 -97
3944i7J21L3k60M39l47p1J89j7q8J20M9n2M2K33k13k10P9J49k12J14n3J68k20
$$ -97 24 57 -203 236 -111 -182 7 -10 -98 22 71 19 61 294 81 -129 -50 99 -113 1 -52 116 -104
3967a04P8J72o5M1qq1m52M82r3J04n0l84L73J94l83J31k8J19j24r8J34j83N4O7
$$ -104 -26 146 81 122 114 33 -419 63 -30 74 24 -360 13 207 -176 -45 -73 46 -78 -176 -42 -225 -171 -104
3991a04J68o3j02O1N3J08l7k16J6J91Q7l20J64j81J03K15p6j57j08K70K0k17K0
$$ -104 64 1 -101 -40 13 121 84 -132 -116 75 162 -158 6 -175 -72 143 67 -90 -198 72 92 -125 -105
4014a05K07j31l0k22L62r6K91m28P1J89k19J54J43p3%k15K4K38j75j62P3J19P4
$$ -105 102 -29 -59 -281 81 -15 276 -152 -81 108 -111 43 186 113 113 -102 -78 160 -15 -177 -104 15 89
4037H9j79J83k54PK01j66J05m5L14j19O1j19l09L07k3J7j39O8K12m07L54k20m9
$$ 89 -90 93 -161 -154 47 -119 -14 -59 255 136 197 78 -231 76 53 70 -69 -1 211 -196 158 -62 -111
4060a11O7j13K82p1n0j89L34j97J67j25n4K52l02P0M4n1k7k7k31K82J56p8qoJ65
$$ -111 -44 -157 125 54 4 -185 149 -48 119 -6 -60 192 -110 -40 4 -47 -74 -101 -332 -50 106 28 20 14 179
4085A79m33M04k31J21j31j63K98N3j91J3r1J11K30k40J54Q6k83R3k44M13j20l1
$$ 179 -254 150 -81 40 -91 -254 44 97 -94 -81 -172 -61 169 -71 83 169 -114 -21 -265 148 28 -3
4107cMj36K03j40Q6o9j00K42j58M18k09o5j32J15r8J32l5J68j37k53R8Q3OJ7k27
$$ -3 1 -135 68 -72 14 -55 -155 87 -71 347 138 73 -59 56 -42 90 55 223 86 -167 -69 14 20 37 -190
4132a90J77J94Jj60m8N3J48l6k25J43j80J06O6J6j10j12R7k20J86O7p5K46l02
$$ -190 -13 181 182 22 -26 27 175 139 -86 57 -123 -17 49 65 -45 -157 -60 -280 -94 -27 -102 144 -158
4155a58K99j06j09P5J06m43J49K93J77j93l0J71m21K31j25J10k19P1j41L19k44
$$ -158 141 35 -74 1 107 -336 -187 106 283 90 60 231 -190 41 -84 26 -193 -122 -263 56 -188
4176a88K23j88m3l0N9jP1J27k59L13J41l77Q8m8J76K9k91K78l41J21J14k42K12
$$ -188 35 -153 -196 -226 -167 -168 -97 30 -229 84 225 -152 -64 -112 64 93 -198 80 -261 -140 -26 -268 -56
4199e6J71K8qj57J50q6j4J77k70L05j20K54n4k40o5K62l84J4L44l33qL19o4k04
$$ -56 115 143 135 -22 128 42 28 205 -65 240 120 374 320 80 15 277 -107 -93 251 -82 -90 229 165 -39
4223c9K86l09K83l27k29L68j31Q4K12j09j69R0K12j49q8K2J92p7o1J08l00l0J35
$$ -39 247 -62 221 -106 -335 33 -98 -14 198 89 -80 10 222 73 -15 7 199 122 61 169 -131 -161 -26
4246b6L63k97O2k55N4J42M2p3L0o9j29K00k12Q9k6P9L33l16O9l4m7J65P3j88p0
$$ -26 337 40 102 -153 -99 43 85 12 42 -27 -156 44 -168 -79 -105 -26 307 -9 60 26 -21 144 217 29 -41
4271d1K88k3q6k83k7%J39J18Nj69J7n5M4M8M3J78k7k09P4P1j0r4p1J89J73j72
$$ -41 247 224 138 -145 -172 -172 -33 85 90 -79 -62 -117 -73 -25 18 196 169 -40 34 105 95 1 -70 119 292 120
4297A20k61L14m83L69n8n6q0J2R1L0M09l71l1R9M1Q3l56j42M71l8o3j91M%l7l4
$$ 120 -141 173 -310 59 1 -55 -135 -123 -32 -2 407 36 5 104 145 228 -128 -270 201 163 100 -91 -87 -87 -124 -158
4323a58M0N4K91l00r2QK43p4K28M2n44M56l14J68k92J15k0N1P5mm42N05q4q2J04
$$ -158 -118 -64 227 -73 -165 -157 86 12 240 282 -262 194 -120 48 -244 -129 -149 -98 -23 -27 -469 36 -48 -130 -26
4348b6r7K22k89J48oN4k9J7K65j58l12L23k51KK89k31M42m30q4J6NP2J8J28p2
$$ -26 -123 99 -190 -42 -48 6 -23 -6 259 101 -211 112 -139 -137 152 -79 363 -67 -151 -135 -130 -58 -40 88 16
4373A6R7k50J14RR4m9o3P2L7j62o4J57k1j28K50k6J20k50J13J20n6j84J23j2j28
$$ 16 113 -137 -23 -14 80 31 -32 40 77 -85 -149 8 -13 -141 109 83 203 -47 66 186 130 -54 69 57 -71
4398g1J71j94L69l47L5J65jJ59l06o2K42R1k62Q1j93l9J44J53j19r4k0m5Q4Q1
$$ -71 100 -94 275 -72 -37 128 127 286 -20 -82 160 251 -11 70 -123 -162 -18 135 16 -78 -98 -143 -59 22
4422B2q8Jj64Q9m4K44l6j45J34j62K56l73J38K79n4l2j79j40L22J74l63K04k45
$$ 22 -66 -65 -229 -140 -184 60 24 -121 13 -149 107 -266 -128 151 97 65 -114 -254 68 242 -121 83 -162
4445a62L55k61M4K2j67K72K8L2m18O32n09m2K25j30L2j53K93j68K63j68N3O9k92
$$ -162 193 -68 -24 -2 -169 103 131 163 -255 377 -132 -174 51 -79 -47 -200 93 -75 188 20 73 142 -150
4468a50J4L21l41L66p2Q7k50J09Q1k04Q5M9j08k5J94k86k2Q2nL34j90j60J95k52
$$ -150 -136 185 -156 210 138 225 -25 84 165 -39 46 95 -13 -38 156 -130 -152 -70 -75 259 69 -91 104 -148
4492a48J56K6j1J41m52M09k27K80k72J55j83l9J70j37l2L6P9j82M65n52M09j45
$$ -148 8 34 23 164 -288 121 -106 174 -98 57 -126 -165 5 -132 -164 -128 -49 -231 234 -318 91 -54
4514e4J37K21k61LL0n7j0K18l17J45J48l5J6n39L82nK26m48m0L81o7k10J98j49
$$ -54 83 304 43 46 76 19 9 227 -90 55 203 168 184 -355 27 22 248 -200 -240 141 74 -136 62 -87
4538h7O7j99J25o0J73Q4q9k14K95Ol40M3J44K77m92M34r1r2K2O5j54J11O5j83
$$ -87 -20 -219 -94 -154 19 103 14 -200 95 101 -239 -196 -52 225 -267 167 76 -16 6 71 -83 28 93 -90
4562i0J82o3r8m7L7k5J06O0JJ87k53K18l69J49Q5j96K00O4k54L06l06N5P0N6K32
$$ -90 92 29 -69 -116 -79 -104 2 62 63 250 -3 215 -154 -5 80 -116 84 148 -106 200 -106 -51 19 75 307
4587C07n17K62j33k60L50k35K33Mk6J58l24J01L4J01k14m8L65j52j17J62M2l85
$$ 307 -210 52 -81 -341 9 -226 7 11 -15 143 -181 -80 -46 55 -159 -207 158 6 -111 51 93 -292
4609b92L33P5m22K60J08Qm07K98R1o7j16J73K30l38j60L20k03L06N0m18K53Q1
$$ -292 41 116 -306 -46 62 70 -337 -39 52 -15 -131 42 272 -66 -226 94 -109 197 247 -171 82 163
4631A63k49j2m3O8K6K78l09J72Mj50J14K33l87J08j7K06k3q6J62k68J44N6l91
$$ 163 -86 -98 -141 -73 -47 231 -78 94 98 -52 62 295 -92 16 -1 205 182 96 258 -10 134 190 -201
4654b01K68k60M22k4j88J76k08K2j2j8j58p6J87K9j33K94J32l1k73K11K5j83M5
$$ -201 67 -193 229 205 17 193 -15 7 -5 -23 -181 -257 -70 -41 -174 120 252 221 -52 159 184 1 46
4677D6j38j42R6J95R2j17k68J17J25k8M8n3Q8r2J30J59j54j26n1j52K85J02j50
$$ 46 -92 -234 -138 57 149 32 -236 -119 6 -22 26 -27 61 -31 99 258 104 -22 -73 -225 60 162 12
4700A2J70m11J16l7L65m7k56J32m3j3M38o2l03P2k42P7p3j23L01q5R8j30j1j79
$$ 12 182 -229 -113 -150 215 168 -88 44 1 -12 426 364 61 133 -109 -32 -105 -228 73 -12 86 -44 -55 -234
4724b34K47j43M44l72N4Q3k70K30j2qq2K2M1J18m7j48J04M0o9m5j61L95l04J73
$$ -234 13 -130 314 -58 -4 79 -191 39 27 19 -63 -41 0 118 71 -77 27 67 -2 -47 -208 187 -117 56
4748E6O4j88J34k36L34J32k78L9J6j95K49q8N2j30j54J05K82m03J8L08j42R1j12
$$ 56 120 -68 66 -170 164 296 18 57 73 -122 127 39 91 -39 -193 -88 194 -209 -191 117 -25 66 -46
4771d6P7r5o0K40o0J57k64J56l30L51k18M5mK11k2L6q5j57l5K64l99N82m27o9
$$ -46 31 -64 -124 116 56 213 -51 105 -225 126 -92 -47 -51 160 138 174 89 -68 -103 161 -238 344 -83 -152
4795a52J82j82J20oK1q4J05j13kJ56l27L24k3p1J23k20R0n6J57l26K68j53J22
$$ -152 30 -152 -32 -38 -17 -101 4 -109 -111 45 -282 42 19 -52 71 -149 -59 -115 42 -284 -16 -169 -47
4818d7M7n9O7j41ML40j49j09J06k7j38L9NJ08j92L12l23q5N18n20K15J66k25q8
$$ -47 0 -59 8 -133 -129 211 62 -47 59 32 -106 -67 -62 46 -146 166 -157 -242 276 -244 -29 137 -88 -176
4842a76J31j0K51k70j26M48r1Q9k76K55n11M16Q3J28m04j14L04k63K39k62L84
$$ -176 -45 -55 196 -74 -200 248 157 246 -30 225 -286 130 213 341 -63 -177 127 -136 103 -159 225
4863B25k02K80l07n7p4L07j44Q4L4j88r3j48L28J4l2L9M2ll12N19m62J38n2P6
$$ 225 23 303 -4 -61 -135 172 28 112 146 -42 -135 -283 45 59 27 66 108 105 -207 312 -150 -12 -64 12
4887A2m3k9J9j9l35K36M31l18r9O3R6J5j36j0N5L17k95j43J58k37J41j89K38R0
$$ 12 -31 -60 -41 -60 -395 -159 272 -46 -145 -82 14 29 -107 -117 -62 255 -40 -183 -25 -262 -121 -310 -72 18
4911A8j2K59k05K42m31J97R5k52J55j98k01M96l02o3K24k6L8j9q7q7K62k48j7
$$ 18 6 265 60 302 -129 68 163 -89 66 -132 -333 163 -139 -202 22 -4 34 15 -72 -159 103 -145 -162
4934a62J38l0j76J08J92l6J11j94J19M2k75m5J66R3q5j02L02l11L21j03K37l69
$$ -162 -24 -54 -230 -122 70 34 145 -49 70 112 -163 -208 -42 51 -34 -136 166 -145 176 73 310 -59
4956e9J19k2j74K94j62k2M6J45Jk22p1J52j54L99m13K21m3J61j76r2J30no9J24
$$ -59 60 38 -136 158 -4 -26 20 165 166 -56 -127 25 -129 270 -143 78 35 196 20 -72 58 53 -16 108
4980A08k54j12K06O8j61L36q0j27N3q5K27l95J46j51K34J80k45m1J92l2p7l2M8
$$ 108 -146 -258 -52 16 -145 191 111 -16 37 -48 179 -216 -70 -221 13 193 -52 -93 99 67 -10 -42 6
5003FJ0J49k45K31J6p2q3j74K01J22j98K22k26k8J29N3j38J41L88m35p7j42q1
$$ 6 16 165 -80 151 167 95 12 -162 39 161 -37 185 -41 -69 60 113 -25 116 504 69 -8 -150 -231
5026b31M10j60R4j39R8m0j2j26j6J08N9K12l62K05p6j01K31l0k1k7K70j78l12
$$ -231 179 19 113 -26 72 32 20 -106 -122 -14 45 257 -105 100 24 -77 154 124 103 76 346 168 -144
5049a44K50j75j12N4J79M8J00j00l60L69k21N5m5K09j10k01J53Q8m9J15o5j12
$$ -144 106 -69 -181 -127 52 100 200 100 -260 109 -112 -57 -102 107 -3 -204 -51 37 -12 103 38 -74
5071g4q%K2J66k93L06j42j16L32l82j08L81J28m35N47l75J27o9M3n8QJ3k5J13
$$ -74 -82 -82 -60 106 -187 119 -23 -139 193 -189 -297 84 212 -223 324 -51 76 7 50 -8 0 13 -12 101
5095A01K1l60J85J88k83P2l3J5J97n5m2j4J23l10J75n4q7J15K30j56n3J81jk21
$$ 101 122 -238 -53 135 -148 -76 -109 -94 103 48 6 -8 115 -195 -20 -74 -161 -46 184 28 -25 156 155 -66
5119f6J75n8k5j12k1J95k98L15m00J61J62j28Mr8m6L03L5j5N3p3m6k22K31r0L21
$$ -66 109 51 26 -86 -107 88 -210 105 -295 -134 28 -100 -96 -194 -240 63 98 83 136 63 17 -205 26 -64 257
5144B57k34J46l38L03jm50K63O9Q0l78Q7J64J40j8k12k78M39k29J96Q2k32o3L29
$$ 257 23 169 -169 134 133 -317 -54 15 95 -283 -196 -32 108 90 -122 -400 39 -190 6 88 -144 -207 122
5167A22k28L8rJ7K68k11j24L22l27j89M34k89K11l06M18j48k83K48k88O3L81k71
$$ 122 -106 -68 -77 -60 208 -3 -127 195 -132 -321 113 -176 35 -271 147 -1 -284 -36 -324 -261 120 -151
5189a51J69J5j1K8J19k52J21p4Q6q1j2k68L06J06l79L65j32m6j1J23l18M59P6
$$ -151 18 33 22 50 169 -83 38 -36 50 -31 -43 -311 -5 101 -278 87 -45 -91 -102 21 -297 162 238
5212B38q3j07j01N6m3K93l4l21J65k6J91k95m3K58km47J4K27L3p3R4k00L49j0
$$ 238 155 48 -53 3 -40 253 219 -102 63 37 228 -67 -110 148 146 -301 -287 -60 -27 -100 -6 -206 143 133
5236A33K10n07L05L0k04j88K90k7k92M08l68L25p5K3k50K4J55j40J85J1j73J57
$$ 133 343 -164 141 171 -33 -221 69 42 -250 158 -210 115 40 63 -187 -163 -8 -148 37 48 -125 32
5258C2J47l30J39j72P1J72J41l38kL7J98j37K91j10J21l30m2K69k31k1p7p2J85
$$ 32 179 -151 -12 -184 -113 59 200 -138 -140 -103 95 -42 249 139 260 -70 -112 157 -74 -95 -172 -244 -59
5281e9R0m0j3J40P8m19K20n1mO1o7o7q9K13l94K92P2J77j15K4J7mq5J16j41J3
$$ -59 31 -9 -22 118 196 -223 -3 -54 -58 3 -64 -131 -220 -7 -401 -109 -37 140 25 49 66 62 -23 93 -48 -35
5307c5K78k16k13K63J07k84Q9J07N5o5k6L4pj19J72l64N94j43k81r4l0J32L2P5
$$ -35 243 27 -186 77 184 -100 -11 96 151 86 60 94 87 -32 140 -224 370 227 -54 -148 -178 -46 -14 61
5331F1k80K98j30N7l5j17l4K86j97J37j95R6M1K7k18P4K10lk04P0j82L23j12J20
$$ 61 -219 79 -51 6 -29 -146 -180 106 -91 46 -149 -53 -12 15 -203 -129 81 78 -126 -56 -238 85 -27 93
5355I3j70J18j5q0L67l91J73k7K2j79J37n69M08P5k10L76o6J34j31j65R6Rj65
$$ 93 -77 41 26 -54 313 -78 95 68 90 -89 48 -521 -113 -38 -248 128 62 196 65 -100 -4 5 -160
5378a60K07L2K7m9K04k85j41M12j74q9L18k60j5J32k00j59K30J50j49l01L38o2
$$ -160 47 79 106 57 261 -24 -165 247 73 -16 302 42 27 159 -41 -200 30 180 31 -270 68 6
5400Fq5l7J90r1O2J14m25J45J09p3N4P3Q5j10m8K70m70L46o0k68K81j96K24J04
$$ 6 -79 -116 74 -17 45 159 -266 -121 -12 -85 -31 42 127 17 -31 239 -231 115 55 -213 68 -128 96 200
5424B00j47k16J13r1L77l39J43m6j98J0J87j30K23k58L56k46J4O2O2R1k11j51
$$ 200 53 -163 -50 -141 236 -103 40 -6 -204 -194 -7 -137 86 -172 184 -62 -48 14 76 167 -44 -195
5446a95K19j19K5R9O2r5J16k8J15j19l35L02K55k76M2j84P4P1j32J70P8N1j38
$$ -195 24 -95 -70 29 91 -4 112 84 199 80 -255 47 302 26 68 -116 -42 29 -103 67 145 196 58
5469E8j22L79m60K81O6m19K77j15j00R2r3K04m4n5MK0J35j53K12l1j32M6R7k11
$$ 58 -64 315 -145 136 202 -217 60 -55 -155 -63 -156 48 4 -51 -47 -27 108 -45 167 136 4 50 147 -64
5493f4J22l43K06k23K78j70K40Q2j2k58M3O8P9O2k60J72Q3l19K02J03N6r7J35
$$ -64 58 -285 -79 -302 -24 -194 46 128 116 -142 -99 -31 48 110 -150 22 105 -214 -12 91 147 50 185
5516A85j28K09k93L1m3pj0K11l90L7K15L9M2K43o5q7l83L21k33R8j65R1K01k66
$$ 185 57 266 -27 4 -39 -46 -56 155 -235 -198 17 56 98 341 276 189 -194 127 -106 -8 -173 -82 119 -147
5540a47J17k24L84J42k64M0n2lJ58M2l38n4K79p8M8j51L36l42RN7MJ07P1j94K07
$$ -147 -30 -254 130 272 8 48 -4 -7 151 193 -145 -199 80 2 50 -101 235 -107 -98 -41 -37 70 141 -53 154
5565A54j15J6p3L8n2J41J19j89n7N7j5j9J16l33L21M6l4l24J27J48j70K91k53
$$ 154 39 55 -18 20 -32 109 228 39 -18 39 24 5 121 -212 109 155 121 -203 -76 72 -98 193 -60
5588f0J3J4N5L22k14o8K4l50N15m34L40j69l6K26l25n1J57J75l7j43p5K69m79
$$ -60 -47 -33 22 344 130 62 86 -264 251 -183 157 -12 -48 178 -147 -198 -41 134 97 -46 -121 148 -331
5611c31K07q3L22r3Q5k12L29n1k44L33p8j95rL1k4P4k73J69p2O1J60J6j60J16
$$ -331 -124 -207 115 22 107 -105 224 173 -71 262 184 -11 -20 11 -13 61 -212 -43 -115 -54 106 122 -38 78
5635G8k0j60M08l94P2j18K03m0RJ10L0k88N1j85K33r9Q3Q6k09M07l54K00K0J87
$$ 78 58 -102 306 -88 -16 -134 69 29 38 148 178 -110 -59 -244 -11 -110 -27 59 -150 257 -97 103 123 310
5659C10j61j09J10n9J59l28K84k58k47M43m38K67J01j11J64o2r0Nm3j5K02q8n1
$$ 310 149 40 150 91 250 -78 206 -52 -299 144 -294 -27 74 -37 127 65 -25 -20 -63 -78 124 36 -15
5682a5k20K6K28j37o7J2R6K29k38L49k98q9OJ04m0q1LJ19l63K38p3O3l8L45R7
$$ -15 -235 -209 19 -118 -185 -173 -77 152 -86 263 -35 -124 -118 -14 -54 -135 -132 -13 -376 -138 -211 -148 -186 159 256
5707B56j43j65l5J89k33n8L06k41j29J90L4m9Rk2j35k4L21k52L77l22J91p2JP0
$$ 256 113 -52 -87 102 -131 -189 117 -124 -253 -63 -29 -78 -69 -91 -226 -250 71 -181 196 -126 65 -7 -6 64
5731F4j04L27n30M99j55J2j82J85J85L5l21J9mK04m34K44K15l54Q0p0J85O7k09
$$ 64 -40 287 -243 256 101 113 -69 116 301 336 15 34 30 234 -200 44 259 -95 -15 -85 100 167 -42
5754d2J38o3mRO0J60j26R5l3Q0k30Pqj37K94k18N3j8J98k75N7n3j22J11K85l70
$$ -42 96 33 29 38 98 258 132 227 194 274 44 51 43 -94 200 -18 35 17 215 -60 -3 -56 -178 -67 218 -152
5780a52L27k21J17m7J50nj58j38Q9M7k0K13l13R2j00mP5j09J47O1r5J96k69M03
$$ -152 175 -46 71 24 174 169 11 -127 -38 9 -11 202 -111 -19 -119 -123 -48 -157 -10 51 -44 152 -117 286
5804B86m27J23K19k36J48j20j52M03k87K01k0J4j96L48p28L10J59N6O1P4q0l52
$$ 286 -141 -18 201 -35 113 -7 -159 244 -43 158 138 152 -44 304 -424 -114 45 101 162 236 156 -196
5826a96j6K80q9P2p2j43K30L7j61J97j28K26k98J42k7l29K55J32j79K0L5k03J93
$$ -196 -212 68 -21 51 -21 -164 66 103 -58 139 11 237 -61 81 54 -275 -20 112 -67 -47 -12 -215 -22
5849b2L33k48P4j85L63j46k57M4J40j44j18ML17j14J24k15L50j01k85O1J74l43
$$ -22 311 63 137 -48 315 169 -88 -44 96 -48 -166 -162 155 41 165 -50 300 199 -86 -25 149 -194
5871a94k1R4Q6P9j6o0K54m54J87L1j10P8M2j01J11RJ7l73M74J31k7j57l91J97
$$ -194 -215 -121 -35 44 28 -32 222 -232 -45 -14 -124 -46 -4 -105 6 15 32 -341 133 264 237 80 -311 -114
5895a14n5Q3K59j14j2O9K4k16N7L96m09l1j70M51l56L57j95o1K97l70N7L21k16
$$ -114 -169 -86 173 59 47 116 140 -76 -19 377 -32 -63 -233 218 -138 219 24 -37 260 -110 -53 268 52
5918E2Q1O7k27N4P7P3j20l46L54J61l59R7m3J62n2R6r0j22J79j58J40o5j7j4Q9
$$ 52 133 200 -27 27 104 177 57 -289 65 226 -133 -36 -79 83 31 127 37 -85 94 -64 76 11 -6 -20 69
5943F9k01J74Q8n6N2R0l01J76o8J50l25J6J74J83p42K72P3P3L8oJ34M27n32j22
$$ 69 -132 42 130 74 126 216 -85 91 23 173 -152 -136 38 221 -521 -249 -176 -103 -65 -71 63 490 -42 -164
5967a64J00k29J43o1J05oK45L5o5q5j68N9M04j25m8L7j25P6l22j24J96nJ39J07
$$ -164 -64 -293 -150 -211 -106 -112 133 168 103 18 -150 -91 313 188 140 177 52 128 -194 -318 -122 -127 12 119
5991A19n5m4k1J93l99L86L3k75l2P5mJ67j15M0J6k76J94l7o8J8J48j07L16m99
$$ 119 64 20 -1 192 -207 179 212 -63 -95 -20 -24 143 28 68 84 -192 2 -35 -103 -85 63 -44 272 -227
6015b27K17k25N19k09K8k28K18R5l14J31L6J39n01L89k13L4J69j09j12J13o5J37
$$ -227 -10 -235 284 75 103 -125 93 188 -126 5 41 180 -321 68 -145 -111 58 -51 -163 -50 -115 22
6037B2j9k11L37lK58k82lJ27j27m38L91m5J87k44m9l4J19r1p4J5P1L45n14K01
$$ 22 3 -208 129 126 384 102 99 226 99 -339 52 7 194 -50 -99 -133 -14 -105 -179 -164 -93 252 -262 -61
6061f1MjK18J7l8j94l0J98j97K3o1K12j81N9J02k42M10p0j51j99n8L97j04j29
$$ -61 -57 -58 160 177 139 -55 -85 113 -84 -61 -122 90 -91 -32 70 -172 238 168 17 -182 -240 157 53 -76
6085g6P4lM0K04j50l35N08m14J09m2n7P8kj98N96j44l48J03r6K15k94K71NL17
$$ -76 -2 -5 35 239 89 -246 262 -152 -43 -85 -142 -64 -66 -264 332 188 -160 -57 -153 62 -232 39 44 361
6109C61m58R7k9L6j80J49J97j4o6M1k66L8L3K67k91Q7M0m3L13k72j75J8K94k60
$$ 361 -97 0 -29 7 -173 -24 173 159 93 134 -132 -94 -61 206 -85 2 42 -1 312 40 -135 -117 177 -83
6133h3J54Q1l27L30k50K80j24j08L00l69M8j55K71j47j2K07J60l42K85m3n65M43
$$ -83 71 152 -175 155 -95 185 61 -47 253 -116 -68 -223 48 -99 -111 96 256 -86 199 156 -409 34
6155C4L6j79P4j28K16j18L05l58J26j43Q3J35l6k45J24K02j62M9j35K43k9k31
$$ 34 70 -109 -35 -163 53 -65 240 -118 8 -135 -52 83 47 -198 -74 128 -34 15 -120 123 94 -137
6177a37KJ68o3J63k99J61nK3j63p8K19J04l77L82j5j60J69j27L6kp7K45k95pP9
$$ -137 -135 33 -30 133 -166 -5 -10 13 -150 -228 -9 95 -282 100 85 -75 94 -33 3 1 -76 169 -126 -133 -54
6202e4J3j19K50j10k34P7L87l87M4J08J7J95m52N92k63j69k7J19P3K22m35j60
$$ -54 -41 -160 90 -20 -254 -177 210 -177 -133 -25 -8 187 -265 327 64 -105 -132 -13 60 282 -153 -313
6224c13L93j44K50l47J56o1R4J59k17j47K9N82n12N8j24L42l20J07o1k01r5M35
$$ -313 80 -64 186 -161 -5 -66 28 187 -30 -177 -148 434 -78 -20 -144 198 -122 -15 -76 -277 -372 63
6246F3j04P7k3J7K64l06Jk4J14J09k09l0N4o4q9k3J65l9K79j91j09p4J72n9j50
$$ 63 -41 36 13 30 294 -12 -11 -35 79 188 -21 -51 3 -61 -150 -173 -8 -47 232 41 -68 -142 30 -29 -179
6271a79L40j36J13k09J69l6o9l0r5L0OM66l26J09k34K26k15J37j50p6RJ7N86o66
$$ -179 161 25 138 -71 98 62 -7 -37 -132 -102 -96 370 44 153 -81 145 -70 67 -83 -159 -150 -133 453 -213
6295b13K45K45n33k3O00j44k35K59n4j02J2J52j66N7n9N3k66k1K54k88nM45j62
$$ -213 32 277 -256 -279 321 177 -58 201 147 45 57 209 43 100 41 94 -172 -193 61 -227 -232 213 51
6318E1q3K23n63K40L25k29J34m63L23K41l20L56j37j00m4J78Q1j42k15O0J11N7
$$ 51 -32 191 -372 -132 193 -36 98 -365 -42 199 -121 235 98 -2 -46 132 213 71 -144 -84 27 84
6340H4J37k25R4l46J50L4K20M5k31J89j73M2j01J06L7J24K2k32P4J89l08M8m1
$$ 84 221 -4 90 -256 -106 -72 148 193 -38 151 -22 20 -81 25 62 186 208 -24 50 239 -69 -21 -62
6363f2p5K84M6J86p76K72j81R7M5P5LK38K1m0k43J67J33l06j9J50j41J36k2M01
$$ -62 -137 147 193 379 -397 -125 -306 -209 -164 -89 -86 152 173 133 -110 57 190 -116 -135 15 -126 10 -12 389
6387C89k23j57k06M91k05k1J39j07k65J68L1J59l40m0K70k72l3L18j58J7K12r7
$$ 389 166 9 -197 294 89 68 207 100 -165 3 34 193 -147 -187 83 -189 -222 96 -62 -45 167 70
6409G0o8K12j80N9m9m17M47o2N8j25oJ61k04J37M8m6M1J2j06o9J25M9l60K86k18
$$ 70 2 214 34 93 44 -373 74 12 70 -55 -61 100 -104 33 81 35 76 88 -18 -87 38 87 -273 13 -205
6434b05J89j11J73J31n2O3n10J15K15j13K73l05J0n4J8P4K23l0j32J46l49L15
$$ -205 -16 -127 46 177 125 188 -322 -207 8 -105 168 -137 -127 -181 -163 -89 134 104 -28 118 -231 84
6456H4l6j17J93j36l09J49K17k45K47J69k64J94l52J27R1N3p7K46m7k19j55K25
$$ 84 48 -69 124 -12 -321 -172 45 -200 47 216 -48 146 -206 -79 12 65 -12 234 187 -32 -187 38
6478C8K43j40n3p6m4j11J95k11L5K10l49M0K25j83P6r4J81j15K77k0k1k22K7J7
$$ 38 281 141 88 12 -32 -143 52 -159 -124 86 -263 -223 2 -181 -105 -199 -18 -133 144 124 103 -119 -92 -75
6502g5J56o4j05j25J41K64k67J6m3J86p6J60n0j48J07r3J88k31L17N5k26M7l74
$$ -75 81 17 -88 -213 -72 192 -75 -59 -102 84 8 168 118 -30 77 -16 172 -59 258 313 87 134 -240
6525b40k7L08j5j90K19j5l6N9Q3j62o1O7q0m3M68j16k23P3j54J11J8K29k60j72
$$ -240 -267 41 26 -164 55 40 4 63 146 -16 -77 -10 -90 -133 335 219 -4 69 -85 26 44 273 13 -159
6549a59J67m2n9K83J71l84L3o6LJ19p2J71j73n1K69k97J76p5K4L3r9n2J73O9l48
$$ -159 8 -34 -93 190 361 -23 10 -56 -53 66 -6 165 -8 -59 210 -87 89 14 38 71 -28 -80 93 162 -186
6574a86J73j70N7O5j05J16J21j43N8N4n3q4L4k22L56mj73K28k8k29K64j44l89
$$ -186 -13 -183 -126 -61 -166 -50 71 -72 -14 40 -13 -97 -63 -285 71 67 -106 122 94 -135 129 -15 -404
6597d04L01J40r3k13J16J12J92j11j09J47K9O4K8l28K35j44K05k92K0J0J84j65
$$ -404 -103 37 -56 -269 -153 -41 151 40 -69 78 107 171 199 -129 106 -38 167 -125 -105 -95 89 -76
6619g6P9qj10K54M4l12J98p7J1J64m1M7j2j50N8n8k10J83j29L57j37k66J82P9
$$ -76 3 -5 -115 139 183 -129 69 -8 3 167 126 173 161 11 69 11 -199 -16 -145 212 75 -191 -9 70
6643G0j59K11k4P0k44j95K69l4J29j71K24k98O0j37L76k84K3J79j9K40j70o1l09
$$ 70 -89 122 98 168 -76 -271 -2 -36 93 -78 146 -152 -92 -229 147 -137 -114 65 46 286 116 55 -254
6666b54J55K49r2j55l12L04o1L59k97L43l27K77k78q8K79k47J38l04L21K67j93
$$ -254 -99 150 58 -97 -409 -105 -166 193 -104 239 -88 189 -89 -177 102 -145 -7 -311 10 277 84
6687H4l0k1Mn8Q0k90K65N7k49j14L50J40k02J80j84k07J73NJ77N7j15j24R0P5
$$ 84 54 33 37 -21 59 -231 34 91 -158 -272 78 218 16 196 12 -195 -22 -17 160 217 102 -22 68 143
6711A43p8K19k45J5q7J4L6pJ2k85J79R3l3J43O7k49m4l0m8J11k3n4K58m52N40
$$ 143 65 284 39 54 -33 -19 17 10 22 -263 -84 9 -24 119 186 -63 -107 -137 -185 -74 -97 -151 107 -345 195
6736A95k27j15K57j84K39k08K28j96o4J03K6k75m8L38j45L0P4J91k38J04k27M80
$$ 195 -32 -147 110 -74 165 -43 185 -11 -75 28 54 -221 -269 69 -76 -46 28 219 -19 85 -142 338
6758C38m10J80k71L23n29K73J56J11l87K12Nj67J99j00K10j79O6qNk43K81k53
$$ 338 -72 108 -163 160 -369 -96 60 171 -216 -4 1 -166 33 -67 143 -36 30 22 27 -216 65 -188
6780a88O9J3L07r0j17j66r5j2K99K8j21J75k05j84K48r6n7L18k68j5J20J68j45
$$ -188 -119 -106 201 111 -6 -172 -267 -279 20 48 -73 102 -103 -287 -39 -135 -192 126 -142 -157 -37 131 -14
6803a4Q0M6k37K23Q7m68K82Q3k10Q2P8p3l2k05N8K65OP9l13M29k46R2m23M72q0
$$ -14 66 112 -125 98 185 -283 -1 82 -128 -46 32 -41 -73 -278 -220 45 51 130 -183 246 0 92 -331 141 61
6828F1p8N0j04k00N58l5n61J03R3M56k60k48j01K54j21K02o5J22k6k6Q2l65J35
$$ 61 -17 33 -71 -271 287 252 -309 -206 -113 343 83 -165 -266 -12 -133 69 4 126 100 74 156 -209 -74
6851g4o4J41J56m5k29L10j21l41L05o8J87l2k45J04N9k80J03J33r8P5J23o4J41
$$ -74 -138 3 159 114 -115 195 74 -267 38 -30 157 125 -120 -16 43 -237 -134 -1 -99 -24 99 35 176
6874A76j24m6L91l54Mj61J40J8pk6K22l34K82l5l25J35R8K3k76O4r5o4K30k3P7
$$ 176 52 6 397 43 47 -114 26 44 37 11 233 -101 181 146 -179 -44 54 77 -199 -135 -230 -294 -64 -87 -10
6899a0K32j42Q6j08J5m9j35L89l42K2k2o1Q6J23j7j20J10n1k1P7j23R5K05m15
$$ -10 222 80 166 58 73 24 -111 278 -64 -42 -64 -125 -39 84 67 -53 57 6 -15 62 -61 34 239 -176
6923a76R0J92j91K66k80K45k14k1J52R6l32J88j8m8j54pM7K62n3Pj84n0J40O5
$$ -176 -86 106 -85 181 -99 146 -68 -89 63 159 -173 15 -3 -51 -205 -212 -165 97 44 51 -133 -183 -43 22
6947B2L3j20l7L5RK97j24k92J69m3NJ94q0j26m9L07p8j96J92l8Ql40K63M8j05
$$ 22 55 -65 -102 -67 -58 239 115 -177 -8 -51 -46 148 68 -58 -107 200 122 -74 118 80 88 -252 11 59 -46
6972d6L03n50K70J13k47J58j48L04k30J64j40J74J34k71J90k66M06l01K5K1L1
$$ -46 257 -293 -23 90 -157 1 -147 157 -73 91 -49 125 259 -12 178 -88 318 17 42 63 94
6993I4m3m4Q5N3j87j46lK83j83L47j53k92K26q7M7J85k49L0k8K26k03O1j77R4
$$ 94 51 7 92 145 -42 -188 -191 92 -91 256 103 -189 37 -50 -3 182 -67 -37 -65 161 -42 19 -158 -64
7017f4J43p1J39k10M08l63m3r9L07k04J0L14k51k60K09L9l5n3K39k26O7k33J50
$$ -64 79 8 147 -63 345 -18 -61 -160 147 -57 -47 267 16 -244 -35 4 -31 -84 155 -71 -4 -237 -87
7040h7J08k11K22J33j69m2P6j32O5K50qm78J77K65k94mK00r6J89k25N0L25j14
$$ -87 21 -190 32 165 -4 -46 30 -102 -37 213 205 -273 -96 169 -125 -129 71 -25 164 -61 -11 314 200
7063B00j90j22K79k40K41%l31k7n8L10n8q2P8j16J51J0J48l69P5Q8n1K61RN8l41
$$ 200 10 -112 167 -73 168 168 -163 -190 -248 62 4 -78 0 -116 35 45 193 -176 -101 -13 -64 197 206 264 -77
7088g7RK53l52J06J21j09L4n2J8P3r9l1L9J29m3j37nk13M47j00l24L03m0k4K68
$$ -77 -68 185 -167 -61 60 -49 -15 -67 -49 24 -75 -106 -67 62 19 -118 -123 -336 111 11 -313 -10 -50 -74 194
7113A94r1j62J61jj60J95j35k72L46Qj03J9K0j85J02J66P5k30J06J7k84j6J70
$$ 194 103 -59 102 101 -59 136 1 -271 75 83 -20 -1 19 -166 -64 102 177 -53 53 70 -214 -230 -60
7136f0L12k31J28Mk26K36k12J63k77m5K23J9n6QK14ON5l36K88j10l04o3O06l75
$$ -60 252 21 149 153 -73 163 -49 114 -163 -208 15 34 -22 -14 200 206 261 -75 213 103 -201 -264 342 -33
7160c3L1m6k3K25l05J59j26NL82k07J65m69L05q2K10j27j7j07rL2J50j95J80j83
$$ -33 -2 -48 -71 154 -151 8 -118 -113 269 62 227 -242 63 -19 191 64 47 -60 -69 -37 113 -82 98 -85
7184h5O3P0K44k41q3j83J97k7r8J08Q3o1m3p5LJ91j33J00j60J86j58J74M5j93
$$ -85 -22 48 292 51 -32 -215 -18 -45 -143 -35 48 -13 -56 -131 -128 63 -70 30 -130 56 -102 72 117 -76
7208g6j23K40j65Pj19K53R5k10k82M51k24J44ok5J68j5n9P1o4R3N5k43J18k40
$$ -76 -199 41 -124 -117 -236 17 112 -98 -380 71 -153 -9 -15 -40 128 113 54 125 61 154 209 -34 84 -156
7232a56J77j0K04l20K20j97L24r9j70R5l6j27j1j2K14j79p4L59r1j66kJ62k93
$$ -156 21 11 215 -105 115 -82 242 143 -27 68 32 -95 -106 -118 96 -83 -157 202 111 -55 -57 105 -188
7255a88m5J19K41J03k14p2k00M14m24KM84n24K87o8J70m93M54J37m76M36k59K54
$$ -188 -233 -114 127 230 16 -56 -256 158 -266 -264 220 -304 -17 -85 85 -408 46 183 -293 143 -116 138
7277A38k87Q7P7n6l9J00L14l20rl0M0Q1Pj05j38nQ3o1J10J19l9j30m2J11J86k
$$ 138 -149 -62 15 -41 -80 20 334 14 5 -25 15 96 103 -2 -140 -145 -62 -123 -13 106 67 -63 -105 6 192 190
7303A90k11j75R0K3j17K88j08L4J04J49q4m7j91K06k46N0p6J23j17J3J3N2J35
$$ 190 -21 -196 -106 -83 -200 88 -20 14 118 267 183 136 -55 151 -95 -45 -121 2 -115 -102 -89 -37 98
7326I8j91l2J51N9K57N7m84P8j62J84K84l67J58j24j82K9P1L65m13K29k38N09
$$ 98 -93 -125 26 85 342 399 -85 -7 -169 15 299 -68 90 -34 -216 -187 -116 249 -164 65 -173 336
7348C36m05J60nl42J80J02j09K20j91J07j59K90k08j73K83k23j17O12l21Rr3j23
$$ 336 -69 91 86 -256 -76 26 -83 137 -54 53 -106 184 -24 -197 86 -137 -254 358 37 46 -47 -170
7370a70K22l08J83J72k41L8P4J97j26j12k40o8J97K8J45P7j41m9l9L81q1j71o3
$$ -170 52 -256 -73 99 -142 -104 -30 167 41 -71 -311 -379 -182 -154 -9 68 -73 -122 -161 220 139 -32 -95
7393i5j55J43N3j54J08Q9K16l22j1J82k30rL91j47K9m8k6K90k32k47J32J27J4
$$ -95 -250 -107 -54 -208 -100 -11 205 -117 -128 54 -176 -185 206 59 88 40 14 304 72 -175 -43 84 98
7416I8j28J90o0k5o2Oj27m5R4J5J42k04K84m36M76m80N6L84k38K17n76J81K96
$$ 98 -30 160 100 75 13 19 -108 -153 -59 -44 98 -106 178 -258 218 -262 -206 178 -60 157 -419 -238 58
7439E8O5K53k78M9j96Rn1k00M15o5mp4n1J80j10N9q9R3m12L40K06k45K75p1k06
$$ 58 123 376 98 147 -49 -40 -91 -291 124 59 55 -19 -70 110 0 59 -30 63 -349 -9 197 -48 227 156 -50
7464e0J77P9j38k7o3j03n0N8k6K85n7l73K67L0K0jM4j79Q8K5j32j12K34L43l86
$$ -50 127 206 68 41 -22 -125 -175 -117 -143 142 85 -288 -21 9 29 28 72 -107 -19 6 -126 -238 -4 339 -47
7489d7L6l5M0Q2k69K87o6J29l5J23k47k16N3J64j60J79m5j88J0J45K09J8m07J68
$$ -47 -11 -46 -6 76 -193 94 28 157 122 245 -2 -218 -165 -1 -161 18 -27 -215 -205 -60 149 167 -240 -72
7513g2M0l9P0n6Q4pk16Q7J5j7q6J51Q5R2q4j34l5L60L0l28K09j89j50M14n70N69
$$ -72 -32 -71 -1 -57 27 20 -196 -109 -94 -111 -197 -46 39 131 47 -87 -122 238 268 -60 149 -40 -190 224 -346 223
7539B23j92n2J23j95l6j33J77J07j0K47k82J46m32K66J40j00m9K15mk6j8k22J89
$$ 223 31 -21 102 -93 -129 -262 -85 22 12 259 -23 123 -309 -43 97 -3 -52 163 159 133 115 -107 82
7562H2k4o1K1N2p0k03J69j8o2P3lJ61M6k85K01j3K4l25j06L06o2K12n2n5j2j91
$$ 82 58 -3 18 70 0 -203 -34 -52 -114 -41 -44 117 163 -122 79 66 90 -235 -341 -35 -97 115 63 8 -4 -195
7588a95L58k68J36K50l19K00k45M4J73J39k32q5K29j89k34L75L1j12j11j05O6
$$ -195 163 -105 31 281 -38 162 -83 -39 134 273 41 -44 185 -4 -238 137 168 56 -55 -160 -94
7609i4J31n%j66J71L2m73N14l08R6N3K53k82K03j85n3J72l00K95k70O4J23m7M32
$$ -94 37 32 32 -134 37 69 -404 110 -198 -102 -49 204 -78 125 -60 -113 59 -241 54 -216 -152 -29 -76 356
7633C56m22j74J91M4k34J95m3k8M10l00N8j86M04m02k6J19P8K34k36j95J54q9
$$ 356 -66 -240 -49 -5 -239 -44 -87 -115 295 -5 53 -133 271 -131 -157 -38 40 274 38 -157 -3 -92
7655i2j61M99l08n4J94j64J86j53L7J85l63m0L88k70j15K14J56k3L1l09O2J99
$$ -92 -253 246 -62 -116 78 -86 100 -53 -16 169 -194 -234 154 -116 -231 -17 139 116 147 -162 -100 99
7677I9O9N9l27l8L63O8J11k60M1m35J93J0K7j9l0J08k28K80q7o7L6J89K1O2k59
$$ 99 168 227 -100 -138 225 293 404 144 185 -250 -57 -47 -20 -39 -69 39 -189 91 4 -63 -27 162 183 245 -14
7702a4K9Q3n8m4J27j01O5l47L41k24J87K0j52L28j56M4k75J31L3r1K04j31%R0
$$ -14 15 98 40 -4 123 22 87 -260 81 -143 44 64 -88 240 84 128 -147 -16 17 -74 130 -1 -1 89
7726H9r7P7m03M24j60K87j93l04L10k32pK49p3P2r1L3k42J13p1L16Mn0J7j19m0
$$ 89 -8 69 -334 90 -70 217 24 -280 30 -202 -209 40 -33 39 -52 -19 -261 -148 -219 97 101 51 68 -51 -91
7751i1L19l5J4k97K77l21j21K39l44J72J2K78k38J87P4k57J79O4j26J35o0K30
$$ -91 228 193 207 -90 187 -134 -255 -16 -360 -188 -176 102 -136 51 125 -132 47 111 -15 120 60 290
7773B90m64K60p1L00m34m4M52j28k76J94j82O0l5j17K27j0J80k95oM09k00j65
$$ 290 -174 86 15 315 -119 -163 289 161 -115 79 -103 -43 -78 -195 32 22 202 -93 -99 310 110 -55
7795e5J6K2jQP9k03K95j78J23k1K5j28m0j69O8K22k47L32j40k11K38M6j59M22
$$ -55 -39 -17 -18 -10 69 -134 161 -17 106 85 110 -18 -58 -227 -159 63 -184 148 8 -203 35 81 -78 344
7819C44m12M05m50J86j6r2Q7j01K8j00K39j38j94J01O4L02r4j93L20o26K75L96
$$ 344 -68 337 -113 73 57 -35 52 -49 -21 -121 118 -20 -214 -113 -49 253 159 -34 286 -340 -65 331
7841C31k76O1j96K71k19p7R1K01j57j63j60L95j07rP9k40K79K3j23J66N2j22j22
$$ 331 55 116 -80 191 -28 -105 -14 187 30 -133 -293 102 -5 -14 65 -175 104 127 4 170 222 100 -22
7864b2n9J12j2m1k84K28NJ73k67O6n7K91l57O8L07k12J18nj44q6J44N5J2k6j2
$$ -22 -81 31 19 -22 -306 -78 -73 100 -167 -101 -158 133 -224 -156 151 -61 57 52 -92 -178 -34 21 33 7 -5
7889ek71j7M05n1J04q2P8L3k9j27J72J89n56j21K19l2k5J30K42k43j51L3K89J12
$$ -5 -276 -293 112 61 165 83 161 194 165 38 210 399 -157 -278 -59 -91 -116 14 256 13 -138 -105 184 296
7913B96m76K86r2O3J22l73J21L83m57Q3j55J24j31J87J58j00j20K51l28J36n7
$$ 296 -180 106 14 77 199 -174 -53 330 -127 -44 -199 -75 -206 -19 139 39 -81 170 -158 -22 -79
7934g9Q7n9j47L07p0J30k20J52Q5m40L53q6Q8j46j20K88j93J94k9k88J94O6Q4
$$ -79 8 -51 -198 109 39 169 -51 101 186 -254 99 13 101 -45 -165 123 -70 124 95 -193 1 67 151
7957A51k08K63j11k10J78j76J20K18k33KR9J20l24J42R0k28L31J4j62m6k16P6
$$ 151 -57 206 95 -115 63 -113 7 225 -8 -6 93 213 -111 31 121 -107 224 238 76 30 -186 -110
7979a10l3J28J06k89K72Q1k36Q3K24k18j94J31kJQ7j28J49j18J14n0j42L09j20
$$ -110 -143 -15 91 -198 74 155 -81 2 226 8 -186 -55 -57 -56 31 -97 52 -66 48 -2 -144 165 45
8002D5R8l3R6k40J40P8m30L48k36J27j33L23k97L11j66M4j38K30k05j50J98N8
$$ 45 143 110 206 -34 106 184 -246 102 -134 -7 -140 183 -114 197 31 75 -63 167 -38 -188 10 68
8024F8k92L65j93k9J71l30M55k56R7j98K80Qk91K38j6k15K47j91K16kJ07j92p7
$$ 68 -224 141 -52 -81 90 -240 215 -41 56 -142 138 146 -145 93 77 -138 109 -82 134 132 239 47 -30
8047c0N8M5j57K90J6m14L77j63J29k19J21n4L2k36K40j31J27j4J22l14J56K27
$$ -30 28 73 -84 206 222 -192 185 22 151 -68 53 -1 31 -205 35 -96 31 17 139 -175 -19 208
8069B08j25k28M50n7n05M22j27QJ92m35J15nK62j59k5J20R9n2J70n14M40m17J54
$$ 208 83 -145 305 248 -257 165 38 46 238 -197 -82 -87 175 16 -9 111 210 158 328 -186 254 -163 -9
8092iL9M6j68j24K48j63J53n3J03k57m0J54K58j98j57J76o6K12k41L00j11l07
$$ -9 30 76 -92 -216 32 -131 22 -31 72 -185 -225 -71 187 -11 -168 8 -58 154 -87 213 102 -205
8114b05J31J37j41M4j76K24J4J02n3L6q5j44L82k61r1J03LK02Mk65l9K86M4l60
$$ -205 -74 63 -78 -34 -210 14 28 130 77 113 28 -116 266 5 -86 17 20 222 226 -39 -78 208 252 -108
8138a08J27J33k17j02L8J43k15L94j43l04J95l5J43j06O1K51k02n2OK61m72L09
$$ -108 19 152 -65 -167 -129 14 -201 193 50 -254 -59 -94 49 -57 4 255 53 1 7 268 -204 105
8160A05m18K87K04j61j10N0j23J84O0j4j13p1J80l5k8L0J1K94m44K26j60j0KO3
$$ 105 -313 -26 178 17 -93 -43 -166 18 78 64 -49 -120 60 25 -3 27 38 332 -112 114 -46 -56 -54 9
8184Iq2K7K75r9o3r9J84
$$ 9 -73 -46 229 130 67 -32 152
8191A52
$$ Imaginary data points
##PAGE= N=2
##DATA TABLE= (X++(I..I)), XYDATA
0@%%%%%%%%%%%%%%%qJ6j6J6j6J6k4L2l2M0m8N5o3P2q3R1j04J20j36J52j71J94
$$ 0 0 0 0 0 0 0 0 0 0 0 0 0 0 0 0 -8 8 -8 8 -8 8 -16 16 -16 24 -24 31 -32 40 -43 48 -56 64 -72 80 -91 103
37A03k18K43k70L00l35L72m12M55n01N53o10O71p39Q16q99R90j093J209j340J487
$$ 103 -115 128 -142 158 -177 195 -217 238 -263 290 -320 351 -388 428 -471 519 -574 635 -705 782
57G82j657J858k095K378k728L172l752M551n716P579j1010J9235p2037m7373K20066
$$ 782 -875 983 -1112 1266 -1462 1710 -2042 2509 -3207 4372 -6638 12597 -59440 -106813 113253
72A13253n4279j19517P0734l8903p2979J44433M5009q6707J0148l0576p2498Q1901
$$ 113253 58974 -60543 10191 -28712 -101691 42742 87751 1044 11192 -19384 -91882 -9981
84i981N9524l2577J5241k3606o9964L3895L4933o915L7319m717n5350m391j7851
$$ -9981 49543 16966 32207 8601 -61363 -27468 7465 550 37869 33152 -22198 -26589 -44440
97d4440M119R1481Q840p5355m48o130j9654O4460J7615m7452K1033j4278m8503
$$ -44440 -40321 51160 60000 -15355 -15803 -21933 -41587 22873 40488 -6964 14069 -209 -48712
110d8712N6478J9768n3466M6117J9033o9810K8778J4785p2553O4751P4311r1296
$$ -48712 7766 27534 -25932 20185 39218 -30592 -1814 12971 -59582 5169 79480 -11816
122a1816j2565M6985p1805K0967J06330n9919n0791O2340m1438m2219Q0323O723
$$ -11816 -24381 22604 -49201 -28234 78096 18177 -32614 29726 -11712 -53931 26392 33115
134C3115l8723L0542k4304m1424M2312N642j2282M6947k0619o1469K1690J6144
$$ 33115 -5608 24934 630 -40794 1518 7160 -5122 41825 21206 -40263 -18573 -2429
146b429l273M2922r810n3901J2629J1160r777L2290k4l2888J6098m17k5747K4381
$$ -2429 -5702 37220 27410 -26491 -13862 -2702 -12479 19811 19787 -13101 2997 2580 -23167 1214
160A214R559j9128K1809r03l3609J2946K747j0679M0795k79n1049J6823J3171
$$ 1214 10773 -8355 13454 12551 -21058 -8112 -5365 -16044 24751 24472 -26577 -9754 3417
173C417k9552L6203K3522n2639R250K7749m5304J0622M6557l2864o094L2981m0288
$$ 3417 -26135 10068 33590 -19049 -9799 17950 -27354 -16732 29825 -3039 -9133 23848 -16440
186a6440j6638M7988q417j1966L0119k8285l1676L7023P959j2945K1877j3168
$$ -16440 -33078 14910 6493 -5473 24646 -3639 -35315 1708 9667 -3278 18599 5431
198E431k8229K2015O550j3685J8046J57j8375J1522j998j5386J6497P748r178
$$ 5431 -22798 -783 5767 -7918 10128 10285 -8090 3432 1434 -13952 2545 10293 1115
211A115Q409p902j7946J4613Q386m226J1545r293j9579J4394M927r375J6324j73
$$ 1115 9524 1622 -16324 -1711 6675 2449 13994 4701 -14878 -484 4443 -4932 11392 11219
225A1219k0751J1496L348j8810J6379J3183j9498O089N420k4527Q992K3658j4260
$$ 11219 -9532 1964 5312 -13498 2881 16064 -3434 2655 8075 -16452 -7460 16198 1938
238A938k042R967k1371j438K3968p096o746J1865j2326p799J5777m576o168J3799
$$ 1938 -104 9863 -11508 -12946 11022 3926 -2820 9045 -3281 -11080 4697 121 -6047 7752
252G752m674j0021Q322m804o174J4401J959j0255L285l646o216J1292L985o329
$$ 7752 3078 -6943 1379 -3425 -9599 4802 6761 -3494 -209 -3855 -10071 1221 5206 -1123
266a123K232l122o602Q277K097m840N863k22q162K895J476l336O819K772o498
$$ -1123 1109 -2013 -8615 -338 1759 -3081 2782 2560 -5602 -2707 -1231 -4567 2252 5024 -1474
281a474L71k003l747R373L944p826J552N59p915O013P944o788o61M782n914k136
$$ -1474 -1103 -3106 -6853 2520 6464 -1362 190 749 -7166 -1153 6791 3 -658 4124 -1790 -3926
297c926O409j201j05K954k657k839Q33j371L372N391n123l402L067k146j359O438
$$ -3926 2483 1282 1177 4131 1474 -1365 -532 -1903 1469 6860 1737 -1665 1402 -744 -2103 4335
313D335M54m434k20n4m80J421K57Q77J632m108k248L552K71j963L474J096n538
$$ 4335 4789 355 135 81 -399 1022 1279 2156 3788 -320 -2568 984 1255 -708 2766 3862 -1676
330a676j194K642Q94K78Q37r44j605j653N89K314O21p70m86o83j262J64J167J361
$$ -1676 -2870 -228 666 944 1781 837 -768 -2421 -1832 482 1103 333 -153 -836 -2098 -1934 -767 594
348E94j72j194j090l35L48J462O30n30m28o11j554O58K401k6j423J049j81k696
$$ 594 422 -772 -1862 -2197 -1849 -387 243 -287 -715 -1326 -2880 -2222 179 153 -1270 -221 -402 -3098
366c098O85L481K10k507j98J348q40j149K010K386k095j951J813N03j792P68K391
$$ -3098 -2413 1068 1278 -1229 -1427 -79 -919 -2068 -58 2328 233 -1718 95 598 -1194 -426 1965
383A965M9k599r63K261L98j600J705J972l172k276L266J793j937k45J041n42p55
$$ 1965 2014 -585 -1548 713 1111 -489 1216 3188 16 -2260 1006 2799 862 617 1658 1116 361
400C61m05J289Q96p18o67O58m00j826Q21K341m91j485k95J55k89Q81J126q93j587
$$ 361 -44 1245 2141 1423 756 1414 1014 -812 9 2350 1859 374 79 234 -55 826 1952 1059 -528
419e28R2P78K97l08m38L11M3l31p70K76L79K28L41l09j026o51K05J060Q88r61
$$ -528 -436 342 639 331 -107 204 247 -84 -854 -578 -199 29 370 61 -965 -1616 -1411 -351 537 -424
439d24j184M17N67l80J97P5m13J05M62l02m81j67J315P03j512m89Q90o46J35K433
$$ -424 -1608 -1191 -624 -1004 -807 -732 -1145 -1040 -578 -880 -1361 -1528 -213 490 -1022 -1511 -621 -1267 -1132 1301
459A301q90k717J351J063j161K175j69l560K127K323k933N84K350l025O36K923
$$ 1301 411 -2306 -955 108 -1053 1122 953 -2607 -480 1843 -1090 -506 1844 -1181 -545 2378
475B378k619j391L531j125j273K544j151j781J922J28j097J960j866j309L459
$$ 2378 -241 -1632 1899 774 -499 2045 894 -887 1035 1163 66 2026 160 -1149 2310
490B310l83l013K240M80j536J503j05k208J454O75n78J263k107j599K947J30j517
$$ 2310 1927 -1086 1154 1634 98 1601 1496 -712 742 1417 839 2102 -5 -1604 1343 1473 -44
507d4K238k328k111L520M03k689K934k030l534N875J67o195L948K450o214L147
$$ -44 2194 -134 -2245 1275 1678 -1011 1923 -107 -3641 2234 2401 -3794 154 2604 -3610 -463
523d63L476o263J230M689m921L20M326n119k16N995m660k004N724l369j712N374
$$ -463 3013 -3250 -2020 2669 -2252 -1932 2394 -2725 -2941 3054 -1606 -3610 2114 -1255 -2967 2407
539B407l565l024N990j682k637L968k797k896O216l39m276L592j226l403N297
$$ 2407 -1158 -4182 1808 126 -2511 1457 -1340 -4236 1980 1641 -2635 957 -269 -3672 1625
554A625M42l897K114o62j971M565p33l996L878o95l368N702j086n353N636j11
$$ 1625 2067 -1830 284 -378 -2349 2216 1483 -2513 1365 670 -2698 3004 1918 -3435 2201 2090
570B090n375N442R53o668N792K020p890M288L823p463L923M254q701K584O423
$$ 2090 -3285 2157 3110 -3558 2234 4254 -3636 652 4475 -2988 935 5189 -3512 -928 5495
585E495p049P78N696p716O73Q303o298k219O383n814q74Q257n409l771O408l170
$$ 5495 -1554 -776 4920 -2796 -2123 6180 -118 -2337 4046 -1768 -2642 5615 206 -3565 2843 -327
601c27k682P450l648n108O668j720m120O503k347n044O101p81m710N328p98m816
$$ -327 -3009 4441 793 -4315 2353 633 -3487 3016 669 -4375 1726 945 -3765 1563 765 -4051
617d051N887r18n464N545K22m845M723l52n947O323R07n931M790J68o630O782
$$ -4051 1836 918 -4546 999 1221 -3624 1099 747 -5200 1123 2030 -3901 889 1057 -5573 1209
633A209K266q173M371K982q015N508N213j0062K579O228p869K394P123q717n10
$$ 1209 3475 -4698 -327 2655 -5360 148 5361 -4701 -2122 4106 -3763 -1369 5754 -2963 -3473
648c473Q526o667j315Q017o473k365Q302m209l587P646m100l429P051l510l889
$$ -3473 5053 -1614 -2929 5088 -1385 -3750 4552 343 -3244 4402 302 -3127 3924 414 -3475
663c475P270k067m724O773k735m305O742p91n485N109p68m403N908n39n380M797
$$ -3475 3795 1728 -2996 3777 1042 -3263 3479 2688 -2797 2312 1544 -2859 3049 2510 -2870 1927
679A927m08m414N866n28n991N256M71n522N960P2p346N730K603p971N210L192
$$ 1927 1519 -2895 2971 2443 -3548 1708 2179 -3343 2617 2689 -4657 1073 3676 -4295 915 4107
695D107q914L947N579q104J820O041p443K95O987o553p37O400m680j584N518m263
$$ 4107 -4807 -860 4719 -3385 -1565 4476 -2967 -2672 4315 -2238 -2975 3425 -1255 -2839 2679 -1584
711a584j093N618l966k232N143l090j675N816l594k646N359l008k023N478k918
$$ -1584 -2677 2941 -1025 -3257 1886 -1204 -2879 2937 -657 -3303 2056 -952 -2975 2503 -415
726d15l655O403j775m271O050j559m659N579L2m967M555J24m526M404R28n114
$$ -415 -4070 2333 558 -3713 2337 778 -3881 1698 1730 -3237 1318 1442 -3084 1320 2248 -2866
742b866L708J393m798L449J525n056L408J977m592K617J938m775K885K647n495
$$ -2866 842 2235 -2563 886 2411 -2645 763 2740 -1852 765 2703 -2072 813 3460 -2035
757b035K007L552n257J584M115n174K53M139l619m68M228m254l13M363l076j262
$$ -2035 -28 3524 -1733 -149 3966 -1208 -955 3184 -435 -903 3325 -929 -1242 3121 45 -1217
773a217M286l490j511M499k201k449L761j475j932L740j669k422L746j200k730
$$ -1217 3069 -421 -1932 2567 366 -2083 1678 203 -1729 2011 342 -2080 1666 466 -2264
788b264L974m91l749L432K11l338K521L13k512K168R9k493K502J05k904K647O64
$$ -2264 1710 1219 -2530 902 1113 -2225 296 609 -1903 265 364 -2129 373 478 -2426 221 885
805H85l520K286J523l066J714J022k931J548J792l341J332K636l778O10L191k851
$$ 885 -2635 -349 1174 -1892 -178 844 -2087 -539 1253 -2088 -756 1880 -1898 -1288 1903 -948
821i48m04K956j966r35K463j376r69K268j426k66J864j510o82K577j509o46J900
$$ -948 -1352 1604 -362 -1297 1166 -210 -1179 1089 -337 -603 1261 -249 -931 1646 137 -509 1391
838A391r86q64J827j133o17J694q46j023J796m49j334J984l91j434J378J3j306
$$ 1391 405 -459 1368 235 -382 1312 466 -557 1239 790 -544 1440 1049 -385 993 1006 -300
855c00J341k62j067J121N6j778J533M41j564O92J002j574L68R54j285J25J072
$$ -300 1041 779 -288 833 889 -889 644 1085 -479 213 1215 -359 9 963 -322 -197 875
872H75j320K87O48j093J80J056j259J07O48n61J54M10o75J25M87p10J01M28k30
$$ 875 -445 -158 490 -603 -423 633 -626 -519 129 -432 -278 132 -543 -418 69 -641 -540 -112 -342
891c42m41N69l30r3K54k29j19O12l79j09N62l76m31Q54k40k13L83k46K7J95j02
$$ -342 -783 -214 -544 -637 -383 -612 -731 -119 -498 -607 -45 -421 -852 2 -238 -451 -68 -314 -287 -92 -194
912a94k12N81j76m11N82k93O0M18m22jJ09K40p9R4J0r5K56J27j61L2l40M2M14
$$ -194 -406 175 -1 -412 170 -123 -63 355 -67 -68 41 281 202 296 306 211 467 594 433 465 125 167 581
935E81j58j37M27m02M04k32k55K46N2l45K13J56k36j4J90m15K18J08l23N1K09
$$ 581 423 286 713 311 715 483 228 474 526 181 394 550 314 300 490 75 293 401 78 129 338
956C38j80L7J10l71M0N49n24k73P30q27L51j7R1l52P67m99k55J16j27k71L33K16
$$ 338 158 195 305 -66 -26 523 -1 -274 456 -371 -20 -37 54 -298 469 -30 -285 -169 -296 -567 -234 -18
978a8m13J17J24l46M45m24j47M57P1l73K37q2k68J09K32n8J72j43j41K95k7j38
$$ -18 -431 -314 -190 -536 -91 -515 -662 -205 -134 -507 -270 -352 -620 -511 -279 -337 -165 -308 -449 -154 -181 -319
1000c19j21L89k52K31j37P2n2L39k19P3L46k29j40J87l10M80m6j30J78J75j33
$$ -319 -440 -51 -303 -72 -209 -137 -189 150 -69 4 350 121 -19 168 -142 338 292 162 340 515 382
1021C82k67M89j14q2K26k65l37M50j0j96K23j97j70O45l20l16K83J84k57k00L82
$$ 382 115 604 490 408 634 369 32 482 472 276 499 302 132 777 457 141 424 608 351 151 533
1042E33k35l36O53l53l40L55rk16p6K44j24p9N9j42l0o2l76K79L16p8n66M02l46
$$ 533 298 -38 615 262 -78 277 268 52 -24 220 96 17 76 -66 -96 -158 -534 -255 61 -17 -583 -181 -527
1065e27L95K2j70nj76Q6j16K30m4l20M42k92J74J3l29K08J73k5k08M01l71kM83
$$ -527 -132 -110 -280 -285 -461 -375 -491 -261 -305 -625 -183 -475 -301 -288 -617 -409 -236 -261 -469 -68 -439 -441 42
1088D2j75m24Q22o16k67P70Q7n94M67j24l11Q94k42p57O80K13q42N37O01r05R9
$$ 42 -133 -557 265 -351 -618 152 239 -355 112 -12 -323 571 329 -428 252 465 -377 160 761 -144 -45
1109d5M25o86O44K04o98O37K56o46L14M99p62p6P51n35l15O05l06k73J007r35
$$ -45 380 -306 338 542 -156 481 737 91 405 904 142 66 817 282 -33 572 266 -7 1000 65
1129F5q7R45q38k95P71m83k04P15k40p67O68k07m32J194q04o14J029l82p35P56
$$ 65 -22 923 85 -210 561 78 -126 589 349 -418 250 43 -389 805 1 -613 416 34 -701 55
1149E5or91J037L3r40P42P9q23J027m2j089P62N67j262P03L99j242N99Q09j312
$$ 55 49 -942 95 128 -812 -70 9 -814 213 171 -918 -156 411 -851 -148 251 -991 -392 417 -895
1169h95M11Q05j225M42J160j197j66J339j459M02J144j249l03J258q24l2J265
$$ -895 -484 321 -904 -462 698 -499 -665 674 -785 -383 761 -488 -791 467 -357 -389 876
1186H76j155l11J259q85m16J447p90q04J663q53n29J306o25m73J190n77j150J685
$$ 876 -279 -590 669 -216 -632 815 25 -779 884 31 -498 808 183 -290 900 323 -827 858
1204H58Nj303J504p00r54J221L00j464R74K93j224J145L75j641Q50P95j617Q80
$$ 858 863 -440 1064 364 -590 631 931 -533 441 734 -490 655 1030 -611 239 1034 -583 297
1222B97J006j954O88P19j455J000N02j342M04R86j239J37J328j846K12J543j739
$$ 297 1303 -651 37 756 -699 301 803 -539 -135 851 -388 -251 1077 -769 -557 986 -753
1239g53j87J879j428k77J504j375p2J383j114m78J515j242m98J620p16r30J608
$$ -753 -940 939 -489 -766 738 -637 -709 674 -440 -918 597 -645 -1143 477 -239 -1169 439
1256D39n40q06J321n97j134J705j56j399J801n38j302J569Q0j724J530J28j418
$$ 439 -101 -907 414 -183 -1317 388 232 -1167 634 96 -1206 363 443 -1281 249 377 -1041
1273a041J219N43j808J096P60j270N00O10j494R71J109j702O38P89j411O39J065
$$ -1041 178 721 -1087 9 769 -501 -1 609 -885 86 1195 -507 131 920 -491 148 1213
1290A213j541J46J099j231M17J188j675L21J227j566K41J090j256P7J424j058
$$ 1213 -328 -182 917 -314 103 1291 -384 -63 1164 -402 -161 929 -327 -250 1174 116
1306A16l41J170r39l94J314m24q07J083o44n10J114n28j189J818n40j249J493
$$ 116 -225 945 6 -388 926 502 -305 778 134 -376 738 210 -979 839 299 -950 543
1323E43j41j295J263K17j446J106J16j382J093K56j104M27O96j029N96N16j517
$$ 543 402 -893 370 587 -859 247 363 -1019 74 330 -774 -347 349 -680 -84 432 -1085
1340a085R19K71j052O10Q23j141M53N32j054M32J057j516L50Q38j123K65J079
$$ -1085 -166 105 -947 -337 486 -655 -202 330 -724 -292 765 -751 -401 437 -686 -421 658
1357F58j210j79J445j131l36J294n38p56J165l32o50J084m07n33J093l30q67R22
$$ 658 -552 -731 714 -417 -753 541 3 -753 412 80 -570 514 107 -426 667 337 -530 392
1375C92j40p06R47k69o84J016k50o78J072l63p03J214k44o78N89J04q48N65L27
$$ 392 252 -454 493 224 -460 556 306 -372 700 337 -366 848 604 -74 515 619 -229 336 663
1394F63j053P72J17o46N53K13q98K75M93p77J53O21p19K52N32m95m8K39l85k6
$$ 663 -390 382 499 -147 406 619 -279 -4 489 -288 -135 486 -233 19 551 56 8 247 -138 -164
1414a64K84l77J9O60p11j29N57m38j45N84m28l46R28o42k07N77m14m98R22J31
$$ -164 120 -257 -238 422 -289 -418 139 -299 -444 140 -288 -634 294 -348 -555 22 -392 -890 32 163
1434A63p62L80j83J61J22j12R5p6L80p23N80K91q51L65K58l19K33L7n59N74m3
$$ 163 -599 -219 -402 -241 -119 -231 -136 -212 168 -555 25 316 -535 -170 88 -231 2 39 -520 54 11
1455A1j90K51j05j29J45L68o82N15J39N2l73J8N7j6M28l51M4L11m47j28N37k39
$$ 11 -179 72 -33 -162 -17 351 -331 184 323 375 2 20 77 61 489 138 182 493 46 -82 455 216
1477B16J23Ln9l1nR4P7k7J3m41J98j64J48j46J97j87O3O1L2k1n3j2j2K49Nm98
$$ 216 339 342 283 252 247 341 418 391 404 -37 161 -3 145 -1 196 9 72 133 165 144 91 79 67 316 321 -177
1503a77J13K07Lj71K67k01k64K13j40n6j3J14m8q6o2p7J28J12j09j82L17j10L3
$$ -177 -64 143 146 -25 242 41 -223 -10 -150 -206 -219 -105 -153 -239 -301 -378 -250 -138 -247 -429 -112 -222 -189
1526a89p5j0K13K08l58J9J40k85Q4K07j65R0J57k20L17m9j21j52O7J79j50J91
$$ -189 -264 -274 -61 147 -211 -192 -52 -337 -253 -46 -211 -121 36 -184 133 84 -37 -189 -122 57 -93 98
1548I8j29J46J77m95J88K58l13J99L8p0N4K62k19J15j3L8k82J78o2n6K78p8j81
$$ 98 -31 115 292 -203 -15 243 -70 129 167 97 151 413 194 309 296 334 52 230 168 112 390 312 131
1571A31J04j04Q5k2m8j56N30l19q5m0j00K21r4J73j66J06Ln00O6L38pj12K91l76
$$ 131 235 131 216 194 146 -10 520 201 116 76 -24 197 103 276 110 216 219 -281 -215 123 116 4 295 -81
1595h1M1m0j51R1K14k29O7R7k51J3J2O7P8k9k34J08J77j27O3j40j89L03Lj08R3
$$ -81 -40 -80 -231 -140 74 -155 -88 9 -242 -229 -217 -150 -72 -101 -335 -227 -50 -177 -114 -254 -443 -140 -137 -245 -152
1620a52j16k37L34K62l08N3R8k01n7K35J9l63L34N7J01j90K14l78M01R6k09M5
$$ -152 -268 -505 -171 91 -217 -164 -66 -267 -324 -89 -70 -433 -99 -42 59 -131 83 -295 106 202 -7 38
1642C8J12k02J01P42r02K36q1J64k26M29l10J4M1L09k30j93K86k07J09j02o7j02
$$ 38 150 -52 49 791 -111 125 44 208 -18 411 101 115 156 465 235 42 328 121 230 128 61 -41
1664d1K88m1j81L05j12q4k54Q1J53j45p5O4O5N5j20k12N75l57K39j90J0j00q0
$$ -41 247 206 25 330 218 134 -120 -39 114 -31 -106 -42 23 78 -42 -254 321 -36 203 13 23 -77 -157
1687a57K48q8j26j53J66j17J84l80L09l5q8R7k33L25j89J21R6j44m26N96p6j94
$$ -157 91 3 -123 -276 -110 -227 -43 -423 -114 -149 -237 -140 -373 -48 -237 -116 -20 -164 -590 6 -70 -264
1709b64J57j51J23j96L53j33J40j7j43k25L83k97J9J90J2j92M57%l91J27K66m35
$$ -264 -107 -258 -135 -331 22 -111 29 12 -131 -356 27 -270 -251 -61 -49 -241 216 216 -175 -48 218 -217
1731b17L28M1j59L51r5k54PL34r8j42o4q0k9M15l16j45M07k37L52j44m06O71k64
$$ -217 111 152 -7 344 249 -5 2 336 238 96 32 -48 -77 338 22 -123 284 47 399 255 -151 520 256
1754B56j34K31O3k89R8k90O9L81l23k52L98k02k8j9K05m22J78L56k59K78pn77
$$ 256 122 353 416 127 225 -65 4 385 62 -190 208 6 -22 -41 164 -258 -80 276 17 295 288 -289
1776b89J3J00j22j8M08k53o2K95q2l37L57k21j57K02J03p9J38%m63K61N6l26K97
$$ -289 -276 -176 -298 -316 92 -161 -223 72 -10 -347 10 -211 -368 -166 -63 -142 -4 -4 -467 -206 -150 -476 -179
1799a79n0nl7M00l79N8j09l1L91R2m18L41j58l67M66j5k39J74L47m66L1L72k87
$$ -179 -229 -234 -271 129 -250 -192 -301 -332 59 151 -267 74 -84 -451 15 0 -239 -65 282 -184 -153 219 -68
1822f8k6L38l74K11K09j97J14K49l09j38K69k88k43Q22m21l35N88k41J37J6k10
$$ -68 -94 244 -130 81 290 93 207 456 147 9 278 -10 -253 569 148 -187 401 160 297 313 103
1843A03k07N94l32j18j2L7j27K50Q1k73N4o6p6P1N37n01J53k5l77O63k36p28K02
$$ 103 -104 490 158 40 28 65 -62 188 269 -4 50 -16 -92 -21 516 15 168 143 -234 429 193 -535 -333
1866c33N23n19J96n3N4m9M03o20M4K92k80J20M18l88j06M31m22J04J41k19k12
$$ -333 190 -329 -133 -186 -132 -181 222 -398 -354 -62 -342 -222 196 -192 -298 133 -289 -185 -44 -263 -475
1887d75N34m99KK80j76J69J79k56J2L57m4k53N66l72j22J21N3j88L84J5p26L91
$$ -475 59 -440 -438 -158 -334 -165 14 -242 -230 127 83 -170 396 24 -98 23 76 -112 272 287 -439 -48
1909d8L03n01M18J23m78N08j77j02K43K21q26O53j21j14J39L8j58j21R2m0KL43
$$ -48 255 -246 172 295 -183 325 148 46 289 510 -316 337 216 102 241 279 121 0 92 52 54 397
1931C97l89K17q1j42K20k31J00j0J23l44J13J88l43L53J89o24N11j82n49M09M49
$$ 397 8 225 144 2 222 -9 91 81 204 -140 -27 161 -182 171 360 -264 247 65 -484 -75 374
1952C74n79J19J21J31l15M64m16J60p5k54j90O31l80q0K62o4j88L41l97L30q0
$$ 374 -205 -86 35 166 -149 315 -101 59 -16 -270 -460 171 -209 -289 -27 -91 -279 62 -335 -5 -85
1973h5l3J96k33M4q5J41m55L32O0P4k95J84j05Rj25N9Q0K29R5k34oJ18J25l66
$$ -85 -118 78 -155 -111 -196 -55 -510 -178 -118 -44 -339 -155 -260 -251 -376 -317 -237 -8 87 -147 -153 -35 90 -276
1997b76L82r3l72M95k29J81J96n3k01M9J69j05l6L61k10j72J38k20J02K63k94
$$ -276 106 13 -359 136 -93 88 284 231 30 79 248 143 107 468 258 86 224 4 106 369 75
2018G5R9q1j27J61Mj15M5j77L78o1j21J94Nk22P0q4m4kJ98J7j38K5m4l11N32j88
$$ 75 174 93 -34 127 131 16 61 -116 262 201 80 274 279 57 127 43 -1 -3 195 212 74 99 55 -256 276 88
2044H8j10j7j79J93O4nj60j68J75L7j54J84r7M2p2J24klk86K1K40P4k33M37k06
$$ 88 -22 -39 -218 -25 39 34 -126 -294 -119 -82 -236 -52 -149 -107 -179 -55 -57 -60 -346 -325 -85 -11 -244 193 -13
2069a3J66m71Q4q4L50j56O7j31R9J28n1J57J93k60O4k96J42j03j0K51j7j67q2
$$ -13 153 -318 -234 -318 32 -124 -57 -188 -89 39 -12 145 338 78 142 -154 -12 -115 -125 126 109 -58 -140
2092a40L36j55J1K95j05m05M19R5n51L79j2j70L17k56k2n1J91M2k30J72k2k0p6
$$ -140 196 41 52 347 242 -163 256 351 -200 179 167 -3 314 58 36 -15 176 218 -12 160 138 118 42
2115D2K7J71j72K00k62j0k9L04k72o2P8K40p2j63K6J72k04K34j39j62Rm9J26J93
$$ 42 69 240 68 268 6 -4 -33 271 -1 -63 15 255 183 20 46 218 14 248 109 -53 -44 -93 33 226
2139B26m61K62k99L39j9l55K40j35J45K05j25l23L50k16O7L04m31R6J03j68r2
$$ 226 -235 27 -272 67 48 -307 -67 -202 -57 148 23 -300 50 -166 -99 205 -226 -130 -27 -195 -287
2160b87K72J70n3m13J25o9M63m39Q3K10q6J45k11J55k13L65k9k38R6J5Lj81K33
$$ -287 -15 155 102 -311 -186 -255 208 -231 -148 62 -24 121 -90 65 -148 217 188 -50 46 61 64 -117 116
2183A16j03J8j26L06j47K86k21k10q1L55k05L05j62J95k32K3k21J26j17K45M7
$$ 116 13 31 -95 211 64 350 129 -81 -162 193 -12 293 131 326 94 117 -104 22 -95 150 197
2204A97M1j45M2j64K89k3l92l3K03M3k44M33m21J77J41l89K99K50l77q2K73l68
$$ 197 238 93 135 -29 260 237 -155 -188 15 58 -186 247 -174 3 144 -245 54 304 -73 -155 118 -250
2226b50M9K38l17J71K3l6L1J39pj14j70L9j0o0J70j22OQ6j74J00J46K72m12o2
$$ -250 -201 37 -280 -109 -86 -122 -91 48 41 -73 -243 -204 -214 -274 -104 -226 -220 -134 -308 -208 -62 210 -202 -264
2250b64K07rLj60K98l51J02J9J25k61K71k12k4K66j45K64j15j66K06k11L8R7k9
$$ -264 -57 -66 -63 -223 75 -276 -174 -155 -30 -291 -20 -232 -256 10 -135 129 14 -152 54 -157 -119 -22 -51
2273e1K9J09L2K40l64L24j03K05l60j60R0R6J55m6k09L31k62j92K92J21j04j51
$$ -51 -22 87 119 359 -5 319 216 421 61 -99 -9 87 242 196 -13 318 56 -136 156 277 173 22
2295B2R9j49K39Jm30K09p2J34Kj02K48j96J77J9l37j2M65m41J42o4J81k99J12
$$ 22 121 -28 211 212 -218 -9 -81 53 55 -47 201 5 182 201 -136 -148 317 -124 18 -46 135 -164 -52
2318e2L97m59K86j88k60K98N7k19j19L21j41K13q6M6j74k26N21k22l44L59J19
$$ -52 345 -114 172 -16 -276 22 79 -140 -259 62 -79 134 48 94 -80 -306 215 -7 -351 8 127
2339A27l16K8J7J47Q0n0r9k8L9n8L81l49j02J10rl0r8J79J14n2k8Q0j47J63j72
$$ 127 -189 -161 -144 3 83 33 -66 -94 -55 -113 268 -81 -183 -73 -82 -112 -210 -31 83 31 3 83 -64 99 -73
2364g3R4k07N64n71K73O8j58L0J55k36o2J31N4k04O4lN7J50K7jJ1L34m20k35l2
$$ -73 21 -186 378 -193 80 148 -10 20 175 -61 -123 8 62 -142 -78 -81 -24 126 153 152 163 497 77 -158 -190
2389a90K73q8J09k36J46O5j3JJ10k10K23k14J01r6r2J5N3L56k38m2p1k9J00N7
$$ -190 83 -5 104 -132 14 79 66 67 177 -33 190 -24 77 -19 -111 -96 -43 313 75 33 -38 -67 33 90
2413I0j80j65K62j84q0J86l1j16R4J57k42L26k49J22l7Kj01Q7j10J86k14P6J32
$$ 90 -90 -255 7 -177 -257 -71 -102 -218 -124 33 -209 117 -132 -10 -47 -45 -146 -59 -169 17 -197 -121 11
2436A1KJ4j64o0k00l8M16K26n02J24P5j0L67j81j67M6K45j70pj11L59J54l60J28
$$ 11 13 27 -137 -197 -397 -435 -19 207 -295 -171 -96 -106 261 80 -87 -41 204 34 27 -84 275 429 69 197
2460A97k60K34j67J35p1J58k2q3j30M8M10m85K46k87J60J24j66K7l22N61k84J99
$$ 197 -63 171 4 139 68 226 204 121 -9 39 449 -36 210 -77 83 207 41 68 -254 307 23 222
2482B22J4k92j13L76l56J53L10k83Q8j73Q7n0P7R0j61j31J84N3J19l49j30M24
$$ 222 236 -56 -169 207 -149 4 314 31 119 -54 33 -17 60 150 -11 -142 42 95 214 -135 -265 159
2504A59l25J80l1J13K4k20j10Q5J44q6k92K90kk4o3J66k47L32J87k79j88k1K21
$$ 159 -166 14 -17 96 120 -100 -210 -125 19 -67 -359 -69 -71 -95 -158 8 -239 93 280 1 -187 -208 13
2527A3m13L52q3k28N42k81K83j42j85K01j18P0k37J97K29l13J43j08p0J89j0k69
$$ 13 -400 -48 -131 -359 183 -98 185 43 -142 59 -59 11 -226 -29 200 -113 30 -78 -148 41 31 -238
2549b38M12o9j46J09J85j48K2M5M4j2r2M1l9m7P1J60k31o1N5Q3J38j78q1R0J97
$$ -238 174 105 -41 68 253 105 127 172 216 204 112 153 114 67 138 298 67 6 61 144 282 104 23 113 310
2574C10m82K95ok01M0J6J77l03J7Q7o4K87n7J91k61j86O4Jj23K10j19J09k55J53
$$ 310 -172 123 117 -84 -44 -28 149 -154 -137 -50 -114 173 116 307 46 -140 -76 -75 -198 12 -107 2 -253 -100
2598a00j72J66K24n2k80R8K49%m5j96oJ13j72J31MJ87k44j43K29j00j00M35l24
$$ -100 -272 -106 118 66 -214 -116 133 133 88 -108 -114 -1 -173 -42 -38 149 -95 -238 -9 -109 -209 226 -98
2621i8o0j44L13M3j35L18m29L5K73q2P6k63L08l12L00p1n9K55n11N30l00N4m6
$$ -98 -158 -302 11 54 -81 237 -192 -157 116 34 110 -153 155 -157 143 72 13 268 -243 287 -13 41 -5
2644eK82j68m3O0N4L29m75J11P9O4j14k82K4O2L41j90m4l30K59J63k36P2r0J05
$$ -5 277 109 66 126 180 509 34 145 224 288 174 -108 -84 -22 319 129 85 -245 14 177 -59 13 -77 28
2668B8k6K90k72M5j22J44k48J63j31j49J27K37j8k20J23K29l01J89J28k96K4m1
$$ 28 2 292 20 65 -57 87 -161 2 -129 -278 -151 86 68 -152 -29 200 -101 88 216 -80 -56 -97
2690i7L0J93j46l4J54J44m94R3L00l37K47k24J81p2J44j93J6R5r4N6Q7n3J57l76
$$ -97 -67 126 -20 -54 100 244 -250 -157 143 -194 53 -171 10 -62 82 -111 -95 0 -94 -38 49 -4 153 -223
2714b23K78k37K95k14L88k99J75j57o2m5M59j00l07J93j31j00J94j70Q5k3K40
$$ -223 55 -182 113 -101 287 -12 163 6 -56 -101 358 258 -49 144 13 -87 107 -63 22 -1 239
2735B39n8j06n8l2J69Q3p8o4R1p0K12k90j09K47k45J42M7lrn4Q3k6j32j53R0L4
$$ 239 181 75 17 -15 154 237 159 95 186 116 328 38 -71 176 -69 73 120 117 108 54 137 111 -21 -174 -84 -50
2761e0J08j9j23K60l80L26k29k68M20p1j50J09p7J74K22l90k33L24J8k88K82K45
$$ -50 58 39 -84 176 -204 122 -107 -375 45 -26 -176 -67 -144 30 252 -138 -371 -47 -29 -317 -35 210
2783B10j27j55l12L66R0k63J14m3J64J01k71K00j42j15J34k2o1J34l9K23n7j88
$$ 210 83 -72 -384 -18 72 -191 -77 -120 44 145 -126 74 -68 -183 -49 -71 -132 2 -37 186 129 -59
2805e9m7Q5m3Q0J35l02L89k17l35K41M9J17J14j58n7j4K12l74J18M2J6L28k93
$$ -59 -106 -21 -64 16 151 -151 238 21 -314 -73 -24 93 207 49 -8 -22 190 -184 -66 -24 -8 320 27
2828B7j86K07l8l8o0lO7K30l40J05K76l68K75r7k15J98j28M7J10Lr0K33k40RM7
$$ 27 -159 48 10 -28 -88 -91 -24 206 -134 -29 247 -121 154 57 -158 40 -88 -41 69 72 -18 215 -25 -16 31
2853C1l4j61K76L1O8n10M63j5k11P6k53q3J90J96o2k7j51O5J0K60k28p4j09J68
$$ 31 -3 -164 112 143 211 -299 164 149 -62 14 -239 -322 -132 64 2 -25 -176 -111 -101 159 -69 -143 -252 -84
2877h4m4r5N1L81l40J51l5j19r3K61j76L01m36K62M2J43j83L31j34k74r9K30j67
$$ -84 -128 -223 -172 209 -131 20 -15 -134 -227 34 -142 159 -277 -15 27 170 -13 318 184 -90 -189 41 -126
2900a26J48Pm7j02L0R8k34J44J01M5O4q6j02J26k8j36J88Kl11M71mj38k02L18
$$ -126 22 29 -18 -120 -90 8 -226 -82 19 64 128 42 -60 66 38 -98 90 92 -219 252 248 110 -92 226
2924B26j61N0Ll04J50J28Nk22J66K28l18L86l39Q0l5J23k95J37k67L99j3j78k51
$$ 226 65 115 118 -186 -36 92 97 -125 41 269 -49 337 -2 78 43 166 -129 8 -259 140 127 -51 -302
2947c02L30P6j27J14k94K79J02j45l6J65m96L84L4j23o9J0r5J80J94m25L83J6
$$ -302 28 104 -23 91 -203 76 178 33 -3 162 -334 50 84 -39 -108 -98 -193 -13 181 -244 139 155
2969A55l22j5J40K12m57J65J59k71L4K72j82J83k28L13k69L86l25m2J61O6k86
$$ 155 -167 -182 -42 170 -287 -122 37 -234 -200 72 -110 73 -155 158 -111 275 -50 -92 69 135 -151
2990a51L64j37n8n9N0J97j05j94L14r0M2l76K69pp7J7j67K19m53N02L8O0k74L
$$ -151 213 76 18 -41 9 206 101 -93 221 131 173 -203 66 59 -18 -1 -168 51 -402 100 138 198 -76 -73
3014g3K45k03j70K29j65K86k13L3K09J62k59j1j14r8J98j95L09m0n5P2n9J35l55
$$ -73 172 -31 -201 28 -137 149 -64 -31 178 340 81 70 -44 -142 56 -139 170 130 75 147 88 223 -132
3037a32R8R6j46J66j2l46O2K23J65l27K86j89J68K6k55j99J57j80L58Q4j05pL2
$$ -132 -34 62 -84 82 70 -276 -214 9 174 -153 133 -56 112 138 -117 -316 -159 -339 19 103 -2 -9 23
3060B3j6j08L00l13M6m7L84m76J45j20K06Q4o2J3R2k44r7J55O6J31k32J84j37
$$ 23 7 -101 199 -114 -68 -115 269 -207 -62 -182 24 108 46 59 151 -93 -190 -35 31 162 -70 114 -23
3083b3J82j66k11K51Q2L8j67K88l52p4J05K20j88R9o4q1J36P3j37J95l20P5N2
$$ -23 159 -7 -218 33 115 153 -14 274 -78 -152 -47 173 -15 84 20 -61 75 148 11 206 -114 -39 13
3106A3n3p4K68o1m1J84l06K01j62q3P1O3j97J24PL1J43j41m6Q9N9k16k8L93p8
$$ 13 -40 -114 154 93 52 236 -70 131 -31 -114 -43 20 -177 -53 -46 -15 128 -13 -59 30 89 -127 -155 238 160
3131A60j19m4J37l48Q9K52l95M19j18j50J86j28l3r2J44M13o38J04Q1J3m9J51
$$ 160 41 -3 134 -214 -125 127 -268 151 33 -117 69 -59 -92 -184 -40 373 -265 -161 -80 -67 -116 35
3153C5j37j20K43lJ8k3J09k92K88l11J20%J10J03m7Rk02K9J37k32K13O4p7J39
$$ 35 -102 -222 21 18 36 13 122 -170 118 -193 -73 -73 37 140 93 102 -100 -71 66 -166 47 111 34 173
3177A73k02K14l15K87K15l08j67K0J30R0k3M7M6q6rK0k9P2j01j27J15r7r8L67
$$ 173 -29 185 -130 157 372 64 -103 -83 47 137 114 161 207 121 112 132 103 175 74 -53 62 -35 -133 234
3201B34n0k33MJ86L4j87Q6Q0k14j3J18j16J44k80J53k71L69Q2l05K22n5J22l5
$$ 234 184 -49 -45 141 175 -12 74 154 -60 -73 45 -71 73 -207 -54 -325 44 126 -179 43 -12 110 75
3224G5k38J60k11M01m31K72m0K37j9j75n0l24L57k74L59j55mj3j35M8L01j61J83
$$ 75 -163 -3 -214 187 -244 28 -12 225 206 31 -19 -343 14 -260 99 -56 -60 -73 -208 -160 141 -20 163
3247A63j76%K68l13r6J60j52K09M1l91M46k98o1O8J20J57K2k42J08K4r9J1J88
$$ 163 -13 -13 255 -58 -154 6 -146 63 104 -287 159 -139 -200 -132 -12 145 167 -75 33 57 -42 -31 157
3270A57j10q5L45j09l10J97j03J36j13p3rJ56J26k20L57l68p2J48M0j18J10o7
$$ 157 47 -38 307 198 -112 85 -18 118 5 -68 -77 79 205 -15 342 -26 -98 50 90 -28 82 15
3292A5PJ12l30L60q0j58Qn3K67L01m36r8j97L39L9m0J64l82o3L87j32k52K58k5
$$ 15 22 134 -196 164 84 -74 -66 -119 148 449 13 -85 -282 57 96 56 220 -162 -225 162 30 -222 36 11
3316A1N5J51l59O9o3N2K25n3j96J8q7P%k3J05l71M59J46k57k5m5L0n4L14Q5r5
$$ 11 66 217 -142 -73 -136 -84 141 88 -108 -90 -177 -170 -170 -193 -88 -459 0 146 -111 -136 -181 -151 -205 109 194 99
3342I9n9k22R5k7j52K13J83k57R4j30L54rk73J87k08N9N6J87j05k88J09R0K62
$$ 99 40 -182 -87 -114 -266 -53 130 -127 -33 -163 191 182 -91 96 -112 -53 3 190 85 -203 -94 -4 258
3365B58l78J80p4J07j12M4p3J13j59j16M14q8m1r4J77n34K89J9L18Kj00j58O5
$$ 258 -120 60 -14 93 -19 25 -48 65 -94 -210 204 116 75 -19 158 -376 -87 -68 250 252 152 -6 59
3388E9J06q5j10l0K73j94j14K77j74J59k99L77j97K37l04j11K03r9O2j76l58K34
$$ 59 165 80 -30 -60 213 19 -95 182 8 167 -132 245 48 285 -19 -130 73 -26 36 -140 -498 -264
3410b64N07n23J06J30O9PL8J88k87m9r0o2J50K0J47o9q6m2K71m96J14J98J8j0
$$ -264 243 -280 -174 -44 25 32 70 258 -29 -78 -168 -230 -80 -60 87 18 -68 -110 161 -335 -221 -23 -5 -15
3434a5o8Q5K72k98M4J08r3K4LM8J02r3k21J08r2o3L19m0r2R8k69J51L3O1j12J16
$$ -15 -83 2 274 -24 20 128 35 59 62 110 212 119 -102 6 -86 -149 170 130 38 136 -133 18 51 112 0 116
3460A16r5j66J55J53j70p1K69j79P1p8J33J64j94j00RQl01M80J14q4n7m0q9k40
$$ 116 21 -145 10 163 -7 -78 191 12 83 5 138 302 108 8 17 25 -276 204 318 234 177 137 48 -192
3484a92M1J27J26j75j01P6M8rJ59L2P7j21m4p4K39l29J35J73l00J5Q0K51j94r
$$ -192 -151 -24 102 -73 -174 -98 -50 -59 100 132 209 88 44 -30 209 -120 15 188 -112 -97 -17 234 40 31
3508C1l3p5K13k29J69j53k11K35Qj36J64J1J73k03m9k16M05j2l6j29j36L36j41
$$ 31 -2 -77 136 -93 76 -77 -288 -53 -45 -181 -17 -6 167 -36 -85 -301 104 92 56 -73 -209 127 -14
3531a4L76l42L1k0O4k89J97l5J3O3j72J37K3N0O6q2rj24J12O6q5Jq2JO9k0N9k9
$$ -14 362 20 51 31 95 -194 3 -32 -19 44 -128 9 32 82 148 66 57 -67 45 111 26 27 -55 -54 15 -5 54 25
3559B5j67L8J60j68J74j59r9N9R3n0j28K58n7J26J08n00J57J45o8Q2j2K25j45
$$ 25 -142 -104 56 -112 62 -97 -196 -137 -44 -94 -222 36 -21 105 213 -287 -130 15 -53 29 17 242 97
3582I7k79M14k84J93k2j21l80M05Q3J08k30j27J12p4J39K6j23K75j90j12J28J22
$$ 97 -182 232 -52 141 119 -2 -382 23 106 214 -16 -143 -31 -105 34 60 -63 212 22 -90 38 160
3604A60j07k57L41n4n1K2J17j97L2j39J5L31j10K8ol20L31k77O06m95K69k94P6
$$ 160 53 -204 137 83 32 54 171 -26 6 -133 -118 213 103 131 125 -195 136 -141 465 -30 239 -55 21
3627B1L2j44J96k39J9l4J08K53j10k23n1J49M8l7j12M2R7j29K8J78j63J60L0j69
$$ 21 53 -91 105 -134 -115 -149 -41 212 102 -121 -172 -23 25 -12 -124 -82 15 -114 -86 92 -71 89 119 -50
3651e0J2p3L2J79k57n8N66m36K22J47m59P5j3k27K65M0O7N3p3j85N6JL62l97L02
$$ -50 -38 -111 -79 100 -157 -215 351 -85 137 284 -175 -100 -113 -340 -75 -35 32 85 12 -173 -117 -116 246 -151 151
3676A51q6Oj45K33l13J14j96p3L80k31K23j58L25j09m14K65k9k5K40l25o3L77
$$ 151 65 71 -74 159 -154 -40 -236 -309 71 -160 63 -95 230 121 -293 -28 -57 -82 158 -167 -230 147
3698A47L1k35K43l86K77J42m79K93L12l79J05j35k3j41M09j98J27k66L4K03j36
$$ 147 178 -57 186 -200 77 219 -260 33 345 -34 71 -64 -87 -228 181 -17 110 -156 -122 81 -55
3719e5J2k08K28J51j23k7Lq6j76L00K79l98j1K6L88j97Oj50l8K42J9k87J76mm0
$$ -55 -43 -251 -23 128 5 -22 -19 -105 -281 19 298 -100 -111 -85 303 106 112 -38 -76 166 185 -102 74 70 30
3744C0QO3n66N03k2LK09l14K11l23J59k4Q8o0k25K15J29k23J09K02j58J83k77
$$ 30 38 101 -465 38 16 19 228 -86 125 -198 -39 -63 25 -35 -260 -45 84 -139 -30 172 14 197 -80
3767h0k49O45l27J28R0k28p8Q5r8P9p5j23J83l51K83j02J35J95k16J4J10j36K48
$$ -80 -329 316 -11 117 207 -21 -99 -14 -112 -33 -108 -231 -48 -399 -116 -218 -83 112 -104 -90 20 -116 132
3790A32j39p6P5n9K89j69J42m13J8J48j58L7J58J2j90R7J14j5K95n01J70J05K55
$$ 132 -7 -83 -8 -67 222 53 195 -218 -200 -52 -210 -173 -15 -3 -193 -96 18 3 298 -203 -33 72 327
3813C27l39R9k35L53k02k36M89k39l99L84J93j72J43j21j13p0K9j13J55J32K%
$$ 327 -12 87 -148 205 3 -233 256 17 -382 2 195 23 166 45 -68 -138 -109 -222 -67 65 67 67
3835F7J4J10j54q1N5J97k06j26J40j43J20J15l8l6J3j68j69J19K21m4J7k20J81
$$ 67 81 191 37 -44 11 208 2 -124 16 -127 -7 108 70 34 47 -121 -290 -171 50 6 23 -197 -16
3858a6j33O9k4k66N15k13J02j12J23q0K9k9P3j92M8J06o3M8qM4L0J24k6J43j70
$$ -16 -149 -80 -104 -370 145 -68 34 -78 45 -35 -6 -35 38 -154 -106 0 -63 -15 -23 21 51 175 149 292 122
3883A22p6o0J74l74N9K12l81M75j00q1J08J52J2m99M09j45p5j20L05q5j00M45
$$ 122 46 -14 160 -214 -155 57 -324 151 51 -30 78 230 242 -257 152 7 -68 -188 117 32 -68 377
3905C77m28q5L9K01k77K72M5P0j32k94L69k10j3J50J4r8P9J02k56j5Q4Q9pk16
$$ 377 -51 -136 -97 104 -173 99 144 214 82 -212 157 -53 -66 84 98 0 79 181 -75 -90 -6 83 76 -140
3929a40K14J00j27P7p4J95l08L6J59Mk26M1K2m1r8J33r1P5j94L31k17J64q1J26
$$ -140 74 174 47 124 50 245 -63 -27 132 136 -90 -49 -27 -68 -166 -33 -124 -49 -243 88 -129 35 -46 80
3953H0o4ROQ6j71k18J32J15K10l41j41L75q6l91L34k94N46l40J53K24l83M27k17
$$ 80 16 25 31 117 -54 -272 -140 -25 185 -156 -297 78 -8 -399 -65 -359 187 -153 0 224 -159 268 51
3976E1k58K14m9R9k01M32k09l5J64r3n0m3n1p7J1K81l40lJ85J5P1K4j12k67K18
$$ 51 -207 7 -42 57 -144 288 79 44 208 115 65 22 -29 -106 -95 186 -154 -157 28 43 114 138 26 -241 -23
4001b3p0K77k07l8J33j04j3n6J33q5m2j4J00k29L46j79J2j13J48L27k13l65J62
$$ -23 -93 184 -23 -61 72 -32 -45 -101 32 -53 -95 -109 -9 -238 108 -71 -59 -172 -24 303 90 -275 -113
4024a13J32j%N3j47j52J98J91n20Q0L75Kn7j04Q2j47L0L87o53L76J19m00M16j83
$$ -113 19 18 18 71 -76 -228 -30 161 -359 -279 96 98 41 -63 19 -128 -98 289 -364 12 131 -269 147 -36
4048c6q4Qj71O61n58K4J19r1J83K3O1j16p0k44M96o6J09k02p7k12K38J72j08j38
$$ -36 -120 -112 -283 378 -180 -156 -37 -128 55 78 139 23 -47 -291 205 139 248 46 -31 -243 -5 167 59 -79
4072g9J55k4r2J39j30lNL35m21N7J77o7j26K42L4k00nj45j42M51j9m17M25k05
$$ -79 76 52 -40 99 -31 -34 -29 306 -115 -58 119 52 -74 168 202 2 -3 -148 -290 161 142 -275 150 -55
4096e5J47K6n2J18l4k47L47O0j83l17K32J05M0k28j42J75M1K8k90M02j2k47j16
$$ -55 92 118 66 184 150 -97 250 310 127 -190 42 147 187 -41 -183 -8 33 61 -229 173 161 -86 -202
4119b02K51J64l6m87J92J97j67J47m68M53N3o4M7N7k34k8J77j25j25K72k28L68
$$ -202 49 213 177 -310 -118 79 -88 59 -409 44 97 33 80 137 -97 -125 52 -73 -198 74 -154 214
4141B14m24K4J1J96pl1m77M93k45L47k60J06M9j56K68j58M35m97Q2O0o9P6j20
$$ 214 -210 -186 -175 21 14 -17 -494 -1 -246 101 -159 -53 -4 -160 108 -50 385 -112 -30 30 -39 37 -83
4164h3J2L90ml53nJ80j95r2O3j00M33k56J23k2j06k0m0K91j96J24j34J73j64j46
$$ -83 -71 319 315 -38 -43 137 -58 -150 -87 -187 246 -10 113 91 -15 -35 -75 216 20 144 10 183 19 -127
4188a27J63J11M8k63M87l38M3j86j37J15J3k8K92j84J24j2K17n70J38M79m12P3
$$ -127 36 147 195 -68 419 81 124 -62 -199 -84 -71 -99 193 9 133 121 338 -232 -94 385 -27 46
4210D6j58J97j59l4j7K49m51L77J0J76m57J97o4N0j52K03l1MK8p2K1Nj18K62m26
$$ 46 -112 85 -74 -108 -125 124 -327 50 60 236 -221 -24 -88 -38 -190 13 -18 -14 14 -58 -37 -32 -150 112 -314
4235c14L62q6K23k31m8K0j62o9K64j13J7K96k26Q6J9l54K16jJ28J10M8k67J68
$$ -314 48 -38 185 -46 -94 -74 -236 -305 -41 -154 -137 159 -67 19 38 -316 -100 -101 27 137 185 -82 86
4258H6L0k84K43j31P3N4q6J33l0O0k36P5J29j96M0J05J55k75O0kl5J89j44L9J0
$$ 86 116 -168 75 -56 17 71 -15 118 88 148 -88 -13 116 -80 -40 65 220 -55 5 3 -32 157 13 52 62
4283F2O4r0l1J1N9L9K2j38L52m23j0lJ5J69N5K4Nj71kqmj04L03j78k01L41k65
$$ 62 126 36 5 16 75 114 136 -2 350 -73 -83 -86 -71 98 153 177 182 11 9 1 -3 -107 196 18 -183 158 -107
4310a07O7m8J47L6J55k25k62j85L03p3M4K30j57R8p9Q3j66J58j14J75j99n3n1
$$ -107 -40 -88 59 95 250 25 -237 -422 -119 -192 -148 82 -75 23 -56 27 -139 19 -95 80 -119 -172 -223
4333b23J82Q1k31R5R7N1j07p9J55J91m58R4K62M7j17r6k2J58M9l41J43j31L98
$$ -223 -41 40 -191 -96 1 52 -55 -134 21 212 -246 -152 110 157 40 -56 -78 80 129 -212 -69 -200 198
4356A98j41k11J23m6p1K10j70K07j02Oj05L14j30P0o6j65O3K2J1q0N8J28l45K46
$$ 198 57 -154 -31 -77 -148 62 -108 99 -3 3 -102 212 82 152 86 -79 -16 6 17 -63 -5 123 -222 24
4380B4l4k2k04J63j8K6K8n4L8K3K34k22Q4P0j46J4j24j5J60J86l19j97L84N8j50
$$ 24 -10 -32 -236 -73 -91 -65 -37 -91 -53 -30 204 -18 66 136 -10 4 -120 -135 25 211 -108 -305 79 137 -13
4405a3k85J57K22qj56N0k5J04o2K10k86P6M4M8j44M9n0J43K30k41k39L68l17J03
$$ -13 -298 -141 81 73 -83 -33 -58 46 -16 194 -92 -16 28 76 -68 -19 -69 74 304 63 -176 192 -125 -22
4429b2N5o4N1K3m11M34N9j48J73n24O99m87k76L82K54k88J87j54j96K03J44j04
$$ -22 33 -31 20 43 -368 66 125 -23 150 -374 325 -162 -438 -56 198 -90 97 -57 -253 -50 94 -10
4451a0N6j22K55l41L27j74M0o6p8K40J12l57R3J35J3m6K59k50j75J59k00J45m1
$$ -10 46 -76 179 -162 165 -9 31 -35 -113 127 239 -118 -25 110 123 77 336 86 -89 70 -130 15 -26
4474b6K3j24L50j00j54N1k30J44J83l32j00K14j98M55r4J13l37J45J64j11n4M77
$$ -26 -3 -127 223 123 -31 20 -210 -66 117 -215 -315 -101 -299 156 62 175 -162 -17 147 36 -18 459
4496D59k04m24J23k58L00J64m6n7j30K16l09J98n8l5J17k39L85J11l96K44k05
$$ 459 255 -169 -46 -304 -4 160 114 57 -73 143 -166 32 -26 -61 56 -183 202 313 -83 161 -44
4517d4k3R9j16J98l7L0k07KK85lk97J91j02J64j2j97o8K68k08M68n43j04L82k38
$$ -44 -67 32 -84 114 77 107 -100 -98 187 184 -113 78 -24 140 128 -69 -137 131 -77 391 -152 -256 126 -112
4541a12N4K21J28k35j52j07M63n63J23K71k08J35L89n97J41k8K1R1L11l34j61
$$ -112 -58 163 291 56 -96 -203 260 -303 -180 91 -117 18 407 -190 -49 -77 -56 35 346 12 -149
4562a49J13r7k7M8n0J11m3J19j04k18L27l2Q0J4k68K13k7j52K04k02K55p3q8j04
$$ -149 -36 -133 -160 -112 -162 -51 -94 25 -79 -297 30 -2 78 92 -176 37 10 -142 62 -140 115 42 -46 -150
4586a50K33j07J2J62j80O3O5r8J82j19m38L27j80J18P2k60M23j42K02l15O2L2
$$ -150 83 -24 -12 150 -30 33 98 0 182 63 -375 -48 -228 -110 -38 -298 125 -17 185 -130 -68 -36
4608c6k9l0J72k04K7P4J70n1o8M5r5j35J08J42m7k88K45k15K59p1J5j23J60j48
$$ -36 -65 -95 77 -127 -100 -26 144 93 25 70 -25 -160 -52 90 43 -245 0 -215 44 -27 -12 -135 25 -123
4632a23K65k67K4K1K33J0j42Pl7j48J08J65j38j67L15j34j8j77N28n18J74Q1m7
$$ -123 142 -125 -101 -80 153 163 21 28 -9 -157 -49 116 -22 -189 126 -8 -26 -203 325 -193 -19 62 15
4655A5J4j82L37j74P7J75k81J84j07q7K03q1m6J49P0j33N2r6k29k14L22J21q9
$$ 15 29 -153 184 10 87 262 -19 165 58 -29 174 93 47 196 266 133 185 89 -140 -354 -32 89 0
4678@J54j03l7J41l60K08K87k04j04k19J55J6L65m00k41L66R1j00m9o3R5M2J52
$$ 0 154 51 14 155 -205 3 290 86 -18 -237 -82 -66 299 -101 -342 24 115 15 -34 -97 -2 40 192
4701A92k65Q9M4Q4j05k31L52l84J23K68j11R7J73q1j16J34j66l1K6o7P0L0j25
$$ 192 -73 16 60 144 39 -192 160 -224 -101 167 56 153 326 245 129 263 97 66 92 25 95 125 0
4724@R0k99K41J59k84No5J12L3M6K39k53k42K09J15j47J71j40k0Mp4m0k40L60
$$ 0 90 -209 32 191 -93 -88 -153 -41 -8 38 277 24 -218 -9 106 -41 130 -10 -30 -26 -100 -140 -380 -20
4748b0j6J29k97J54J12k1N1j11J5k51P57n88m0K18J13m29M50m1k63l1J16kO3J86
$$ -20 -36 93 -204 -50 62 41 92 -19 -4 -255 502 -86 -126 92 205 -224 226 185 -78 -109 7 5 68 254
4772B54k86j66L9R5j94K68NN3m4l31K49k80K25J19R1O8r8r7r7k8L31q5k93P9K33
$$ 254 -32 -198 -159 -64 -258 10 15 68 24 -307 -58 -338 -113 6 97 165 67 -30 -127 -155 176 91 -202 -123 110
4797A10j51J14P0k63J09j58K26l2j77j43L32qj30K08o0L0k2j24O9n8j16N6J18
$$ 110 -41 73 143 -120 -11 -169 57 25 -152 -295 37 29 -101 107 47 77 55 -69 0 -58 -174 -118 0
4820@j39R7J41l17J35M62m36K19k09ml3P4J13j25J25L1Q7j22q3l8J62K41m98j79
$$ 0 -139 -42 99 -218 -83 379 -57 162 -47 -51 -84 -10 103 -22 103 134 221 99 16 -22 140 381 -117 -296
4844b96J01L16l07J86p4J17j28k7j04j06L65j29KJ39p6j94j5R8L8K78M6k16K45
$$ -296 -195 121 -186 0 -74 43 -85 -112 -216 -322 43 -86 -84 55 -21 -215 -230 -132 -94 184 230 14 259
4867B59l31J66k91M46l22k4k92K86l9L39k37K6l7NK5J26k16R9O0R3j26q9K37j74
$$ 259 -72 94 -197 249 -73 -97 -389 -103 -142 197 -40 -14 -51 -46 -21 105 -111 -12 48 141 15 -74 163 -11
4891a1J53k47j0K65j74J79j32J0R3k11o9L90l70J2L01k98J94J83j97j30j48M07
$$ -11 142 -105 -115 150 -24 155 23 33 126 -85 -154 236 -134 -122 179 -119 75 258 61 -69 -217 190
4913A90j29r7L87j31Nl5l67J48J72k05m7j65J55Q4K82k14J03K0k77j63L94m52
$$ 190 61 -36 351 220 225 190 -177 -29 143 -62 -109 -274 -119 -35 247 33 136 156 -121 -284 110 -342
4935c42L06q6J50qK6k71K4N32l62O7j81J0Q2J59r1j36k24K35J12J40J73p7k99
$$ -342 -36 -122 28 20 46 -225 -201 331 -31 36 -145 -135 -53 106 15 -121 -345 -110 2 142 315 238 -61
4958f1mo8K1p5K59m5k08J60J75l10L39j75K1j6l13J93L18l85m6M30j5j33k27K59
$$ -61 -65 -133 -112 -187 72 27 -181 -21 154 -156 183 8 29 13 -300 -107 211 -174 -220 210 195 62 -165 94
4982I4j27n1K4QP4M7K30l39J15J4n1j5j5j1l4K9L8o1J07J17j66k06K3j9L53j94
$$ 94 -33 -84 -60 -52 22 69 299 -40 75 89 38 23 8 -3 -37 -8 30 -31 76 193 27 -179 -156 -175 178 -16
5008a6J94k54J21k02J44kJ56P0j95O9k66N17m99R5o7R3MJ24j89Q5J92k41L4K49
$$ -16 178 -76 45 -157 -13 -15 141 211 16 85 -181 336 -163 -68 -135 -42 -38 86 -103 -18 174 -67 -33 216
5032B16k17Q9l55L27j45J76J5N5K11l85J05j44J07M6l05J67J25k41K18j6J19k18
$$ 216 -1 88 -267 60 -85 91 106 161 372 -13 92 -52 55 101 -204 -37 88 -153 65 49 168 -50
5054e0n4r4m3K69o5P0j13l8J31J33j32n8K9k3R5O2k0rp3qJ02j97K05j08j47L04
$$ -50 -104 -198 -241 28 -37 33 -80 -118 13 146 14 -44 -15 -38 57 119 99 90 17 9 111 -86 119 11 -136 168
5080A68k87J67j1j15n9K60K8l40n1K25J54l05m0J66L8pk03K55j28Q0Q2j46L07
$$ 168 -119 48 37 -78 -137 123 151 -189 -240 -15 139 -166 -206 -40 -2 -9 -212 43 -85 -5 77 -69 238
5103B38j16L9l91L79k95J25k5j62J48q7J44q0J6J06J8q8m1R5M8m09J50J63j81
$$ 238 122 161 -230 149 -146 -21 -46 -208 -60 -147 -3 -83 -67 39 57 -31 -72 23 71 -338 -188 -25 -206
5126b06J34J77k40pR2j27L07k14j59K27l0k93M67Ol66K76j37Q6K08N5l34J10J20
$$ -206 -72 105 -135 -142 -50 -177 130 -84 -243 -16 -46 -339 128 134 -232 44 -93 -7 201 256 -78 32 152
5149A52k93J16q4J07k25L46k05k3k8J42j20L10k8m68J99R0K73k71O0p9j57M7R1
$$ 152 -141 -25 -109 -2 -227 119 -86 -109 -137 5 -115 195 167 -301 -102 -12 261 -10 50 -29 -186 -139 -48
5172d8J32J15j26jJ47R2j76p8j34J78j36J38Qj71Q4l0M9P5j57Q8jk60L74j53k06
$$ -48 84 199 73 72 219 311 135 57 -77 101 -35 103 111 -60 24 -6 43 118 -39 49 48 -212 162 9 -197
5197a97J02l8K67j74J65k07j09J24L6j30K30M9k6l59M32k1j8J28l00J73P0j23
$$ -197 -95 -133 134 -40 125 -82 -191 -67 -31 -161 69 118 92 -267 165 144 126 254 -46 127 197 74
5219G4j55K83ol10K08J6j54k0L69l47J67M1l14J61j14J09l9L01l63J06J23oj00
$$ 74 -81 202 196 -114 94 110 -44 -64 305 -42 125 166 -148 13 -101 8 -31 270 -93 13 136 130 30
5242C0o1j51K6K40l54K05Q4j68J26j05J24j22pK08K49m81M7J68L1no6O0l3n4J46
$$ 30 -31 -182 -156 84 -270 -65 19 -149 -23 -128 -4 -126 -133 75 324 -157 -110 58 89 84 18 78 45 -9 137
5267A37l25J43n8K49k4j13n9P6k17o3L80m47L95j90K10k45j3L45j91j1Kk71J53
$$ 137 -188 -45 -103 146 122 9 -50 26 -191 -254 126 -321 74 -116 94 -151 -164 181 -10 -21 -19 -290 -137
5290a37J64r0P1P8j46J67l29J07J33j13L26k38J01k24J87j15L7j06K89l88K61
$$ -137 27 -63 8 86 -60 107 -222 -115 18 -95 231 -7 94 -130 57 -58 -21 -127 162 -226 35
5311C5j66J16P7j26J25J05k81Q1J5j39o1K79K41m87J92LL48l77%Nj40Q0l92N49
$$ 35 -131 -15 62 -64 61 166 -115 -34 -19 -158 -219 60 301 -186 6 9 357 -20 -20 -15 -155 -75 -467 82
5335H2m5l42K73J72k03K95k59Q3M9k40r9OK10K24oj32l2j80M43n20K65J4PL51
$$ 82 37 -305 -32 140 -63 232 -27 56 105 -135 -234 -228 -18 206 200 68 36 -144 299 -221 44 58 65 416
5359D16k44k25J46j03J65k6k31L52j03k86K37j91P8K99k50m9j14O7j42K44k2L95
$$ 416 172 -53 93 -10 155 129 -102 250 147 -139 98 -93 -15 284 34 -15 -129 -62 -204 40 18 413
5381D13m11J50q3k64J60K56j53k6K53j56k47K22j37k0k7mJ49k58M1J20Q4j02K9
$$ 413 2 152 69 -195 -35 221 68 42 295 139 -108 114 -23 -43 -70 -74 75 -183 -142 -22 62 -40 -11
5404a1m3m04L65n5J37J3j01Q4OK38k51M9k35J54%K4j55J07r6K86J23n5J88l18
$$ -11 -54 -458 -93 -148 -11 2 -99 -15 -9 229 -22 27 -208 -54 -54 -30 -185 -78 -174 112 235 180 368 50
5428E0j32M28l18l25L32k77M57n55N00o6K3k98J83L3m9K21j66l1K54l58kK15k7
$$ 50 -82 346 28 -297 35 -242 215 -340 160 94 117 -181 2 35 -14 207 41 10 264 -94 -96 119 92
5451I2K08k66K08j28ql8k58L36j46J7N9j44J97j18K43k99m4n7K10J10P3k42mn3
$$ 92 300 34 242 114 106 68 -190 146 0 17 76 -68 129 11 254 -45 -89 -146 64 174 247 5 1 -52
5475e2J63m1oPj43n0L6J63j2j18n6jPJ83o2Nj81J78j42m1L3L35k22K27Qk77j32
$$ -52 111 70 64 71 -72 -122 -86 77 65 -53 -109 -110 -103 80 18 23 -158 20 -122 -163 -130 205 -17 210 218 -59 -191
5502a91M9P4p7R7j93K21j1J12k3nj29m5J43k52K66N5j69p9L73p4k30q0L02j06
$$ -191 -142 -68 -145 -48 -241 -20 -31 81 58 53 -76 -121 22 -230 36 91 -78 -157 216 142 -88 -168 134 28
5526B8m6r9K18j73P9k32J1n2M7N01l47J06k05N3K00J54k62N5R1k07N61j91k31
$$ 28 -18 -117 101 -72 7 -225 -214 -266 -219 282 -65 41 -164 -111 89 243 -19 36 127 -80 481 290 59
5549E9J29o5l25J48k11N1j46K90K60j74ok58M00j25j14r0J55j11L30l04J38O9
$$ 59 188 123 -202 -54 -265 -214 -360 -70 190 16 10 -248 152 27 -87 -177 -22 -133 197 -107 31 100
5571A00j58k02L09K7K72m97J4K88Om1j71J25j75J26m0M0n3m7p8OK20J41j14k10
$$ 100 -58 -260 49 76 348 -149 -135 153 159 118 -53 72 -103 23 -17 23 -30 -77 -155 -149 71 212 98 -112
5595a12Q4k4O0k85N58k20jk62L96j90M3O7j64K35O7l9l04J55l36K45J4J36m98
$$ -112 -28 -52 8 -277 281 61 60 -202 194 4 47 114 -50 185 252 213 -91 64 -272 -27 -13 123 -375
5618c75M33j59J44K45l44J75k41J34J87k34J66L6j52O0j87J66k03K51K1j50P9
$$ -375 58 -101 43 288 -56 119 -122 12 199 -35 131 167 15 75 -112 54 -149 102 123 -27 52
5639E2k54K38j40R2Q8m8L04j51k64q3O7K53l96K82J2Kk99L06l4j23J11J2j97n4
$$ 52 -202 36 -104 -12 76 28 332 181 -83 -166 -99 154 -242 40 52 54 -245 61 27 -96 15 27 -170 -224
5663b24J33O7L2O2K40n54L54l22L55l13J31M5k27P2O4N0l12N99Rl01k58N08k74
$$ -224 -91 -24 8 70 310 -244 110 -212 143 -170 -39 6 -221 -149 -85 -35 -347 252 261 -40 -298 210 -64
5686f4j01J19Q3oj01J14p8nL19k99%M4j98J22n6K34l32O2Q7R4o2P0j77J67K63
$$ -64 -165 -46 37 31 -70 44 -34 -39 280 -19 -19 25 -173 -51 -107 127 -205 -143 -56 38 -24 46 -131 36 299
5711B99n20M11M5m83K90j58R2J97j95k27K52l1j9J65l9j24n5P9K82k62P6j23L3
$$ 299 -221 190 235 -248 42 -116 -24 173 -22 -249 3 -28 -47 118 79 -45 -100 -21 261 -1 75 -48 -15
5734a5L8j29K34j44n3k45L50J01k41J96k56N25j98m09J87K61j92k06K44qk8N2
$$ -15 23 -106 128 -16 -69 -314 36 137 -104 92 -164 361 163 -246 -59 202 10 -196 48 40 12 64
5756F4j90L21k44Q1Q4J03k79%J08N6k18j7K87m3j71j31K17rP2j24k3K65j97p4
$$ 64 -126 195 -49 32 116 219 -60 -60 48 104 -114 -131 156 113 -58 -189 28 19 91 -33 -56 209 12 -62
5780f2j24J39J18j24o0N7K63k66ML63l57O0J85j12o8j13j22J82K01j66n9l2K11
$$ -62 -186 -47 71 -53 -113 -56 207 -59 -55 308 -49 11 196 84 16 -97 -219 -37 164 -2 -61 -93 118
5803A18L6r4Qn9%J61l5q8j18J85K2k15l4J59j65K26j21O2p4M5n3K51m3k17p0K63
$$ 118 154 60 68 9 9 170 135 47 -71 114 136 -79 -113 46 -119 107 -14 48 -26 19 -34 217 174 -43 -113 150
5829A50q5J05k8O8k20N0k17o8K94k08J63J52l41L01j40j44K21k39R8R8M5l06J08
$$ 150 65 170 142 210 -10 40 -177 -245 49 -159 4 156 -185 116 -24 -168 53 -186 -88 10 55 -251 -143
5852a43K24J30l37j04J22J11J06L0k8j21M16o89K58K86l62L23l90j4J09P8l49
$$ -143 81 211 -126 -230 -108 3 109 139 111 -10 406 -283 -25 261 -101 222 -168 -182 -73 5 -344
5873c44K30k51K17Q9k19K81J02pk07L4mm9J35K44j86J40k45JP8j03J29j25k8J72
$$ -344 -114 -365 -148 -59 -278 3 105 98 -109 -75 -79 -128 7 251 65 205 -40 -39 39 -64 65 -60 -88 84
5897H4n3J97k69j73L41k05L58l34N7j39Q9j9J11j77J61q2k3Q5Kj0k48M41m27J98
$$ 84 31 228 -41 -214 127 -78 280 -54 3 -136 -47 -66 45 -132 29 -53 -76 9 11 1 -247 194 -233 -35
5921c5J83k7j67J89N7k69J46J57l31J2J8q4K17m2j93K20q7J03j44k91L04L2K5
$$ -35 148 121 -46 143 200 -69 77 234 -97 -85 -67 -151 66 24 -169 51 -36 67 -77 -368 -64 -32 -7
5944gk20M13l30J86n7l5n4m4M4j56M19j91j50J42P0KK63l56J82M6j51K2r9K86
$$ -7 -227 186 -144 42 -15 -50 -104 -148 -104 -260 159 -32 -182 -40 30 32 295 -61 121 167 16 38 -61 225
5968B25l26O4N7K55k60J2M0k50J80J64q8k51J86J28j04J34l12J05N8l24K23j49
$$ 225 -101 -37 20 275 15 27 67 -183 -3 161 73 -178 8 136 32 166 -146 -41 17 -307 -84 -233
5990b33j8J67L76m31N3L02k50R1n3l4j11K28l6m7j24L3K60l11j82J87KL22m2k13
$$ -233 -251 -84 292 -139 -86 216 -34 57 4 -30 -141 87 51 4 -120 -87 173 -138 -320 -133 -131 191 149 -64
6014f4K01j03kk18j10L45%j40k1j30K89m2R6j03J27J7j42l56M58m03J24p3L52
$$ -64 137 34 32 -186 -296 49 49 -91 -112 -242 47 5 101 -2 125 142 0 -356 102 -301 -177 -250 102
6037A02J0J8o6R9k63Q9k77K81L7J59k00Q2J44l86M95j95j51j61J00q8R6J08k31
$$ 102 112 130 64 163 -100 -11 -288 -7 30 189 -11 71 215 -171 324 129 -22 -183 -83 -171 -75 33 -198
6060a98K31j20L85k43j52K80j79l24L09q3J52j80J72J36j43Q6k82J06o4L23r8
$$ -198 33 -87 298 55 -97 183 4 -320 -11 -94 58 -122 50 186 43 129 -153 -47 -111 212 114
6081A14o1k42K43j29M6K67P8k10j74k49L64q8o6r2p7J06L11mm3o0K01j99j47p7
$$ 114 53 -189 54 -75 -29 238 316 106 -68 -317 47 -41 -107 -199 -276 -170 141 137 94 34 235 36 -111 -188
6105a88L07RKj6Oj20K82n82L23j03J09j1p4N5j42K94r2k1R0k79J23p3p5L31j0
$$ -188 119 128 130 114 120 0 282 -300 23 -80 29 18 -56 -1 -143 151 59 38 128 -151 -28 -101 -176 155 145
$$ [...]
8191C22
##END NTUPLES=NMR FID
##END=
