##TITLE=1H_SR68_rm1
 , 8 sc, 
 4.06.2021
##JCAMPDX= 6.0         $$ Bruker NMR JCAMP-DX V2.0
##DATA TYPE= NMR FID
##DATA CLASS= NTUPLES
##ORIGIN= UXNMR, Bruker Analytische Messtechnik GmbH
##OWNER= root
$$ XWIN-NMR		Version 3.5
$$ Fri Jun  4 13:55:08 2021 Russian Standard Time (UT+4h)  she@DPX200
##.OBSERVE FREQUENCY= 200.131506
##.OBSERVE NUCLEUS= ^1H
##.DELAY= (6, 6)
##.ACQUISITION MODE= SIMULTANEOUS
##.ACQUISITION SCHEME= undefined
##.AVERAGES= 8
##.DIGITISER RES= 18
##SPECTROMETER/DATA SYSTEM= spect
##.PULSE SEQUENCE= zg30
##.SOLVENT NAME= DMSO
##.SHIFT REFERENCE= (INTERNAL, DMSO, 0, 15.7039)
##AUDIT TRAIL= $$ (NUMBER, WHEN, WHO, WHERE, WHAT)
$$ ##TITLE= Audit trail, XWIN-NMR		Version 3.5
$$ ##JCAMPDX= 5.01
$$ ##ORIGIN= Bruker BioSpin GmbH
$$ ##OWNER= she
$$ F:/spectra/data/she/nmr/H-F/1/audita.txt
$$ ##AUDIT TRAIL=  $$ (NUMBER, WHEN, WHO, WHERE, WHAT)
(   1,<2021-06-04 13:53:30.68 +0400>,<she>,<DPX200>,
      <created by zg, POWCHK disabled, PULCHK disabled
       configuration hash MD5:
       00 E9 B6 7A A2 85 ED C7 34 08 36 98 17 FE 4E 26
       data hash MD5: 16K
       CE B0 D6 52 04 4D CA 0E B8 3F 58 A2 E1 5F 09 F0>)
$$ ##END=
$$ 
$$ hash MD5
$$ C0 BE 64 4D BA 26 BC 2B 39 40 A3 24 A8 92 FB 77
##$RELAX= 
##$RELAX= 
##$RELAX= 
##$RELAX= 
##$RELAX= 
##$RELAX= 
$$ Bruker specific parameters
$$ --------------------------
##$DU= <F:/spectra>
##$EXPNO= 1
##$NAME= <H-F>
##$PROCNO= 1
##$TYPE= <nmr>
##$USER= <she>
##$AMP= (0..31)
100 100 100 100 100 100 100 100 100 100 100 100 100 100 100 100 100 100 
100 100 100 100 100 100 100 100 100 100 100 100 100 100 
##$AQSEQ= 0
##$AQ_mod= 1
##$AUNM= <au_zg>
##$AUTOPOS= <>
##$BF1= 200.13
##$BF2= 200.13
##$BF3= 200.13
##$BF4= 200.13
##$BF5= 200.13
##$BF6= 200.13
##$BF7= 200.13
##$BF8= 200.13
##$BYTORDA= 1
##$CFDGTYP= 0
##$CFRGTYP= 5
##$CHEMSTR= <none>
##$CNST= (0..31)
1 1 145 1 1 1 1 1 1 1 1 1 1 1 1 1 1 1 1 1 1 1 1 1 1 1 1 1 1 1 1 1 
##$CPDPRG= <>
##$CPDPRG1= <>
##$CPDPRG2= <>
##$CPDPRG3= <>
##$CPDPRG4= <mlev>
##$CPDPRG5= <mlev>
##$CPDPRG6= <mlev>
##$CPDPRG7= <mlev>
##$CPDPRG8= <mlev>
##$CPDPRGB= <>
##$CPDPRGT= <>
##$D= (0..31)
0 1.2 0 0 0 0 0 0 0 0.06 0 0.03 0 0 0 0 0.0002 0 0 0 0 0 0 0 0 0 0 0 0 
0 0 0 
##$DATE= 1622800410
##$DBL= (0..7)
120 120 120 120 120 120 120 120 
##$DBP= (0..7)
150 150 150 150 150 150 150 150 
##$DBP07= 0
##$DBPNAM0= <>
##$DBPNAM1= <>
##$DBPNAM2= <>
##$DBPNAM3= <>
##$DBPNAM4= <>
##$DBPNAM5= <>
##$DBPNAM6= <>
##$DBPNAM7= <>
##$DBPOAL= (0..7)
0.5 0.5 0.5 0.5 0.5 0.5 0.5 0.5 
##$DBPOFFS= (0..7)
0 0 0 0 0 0 0 0 
##$DE= 6
##$DECBNUC= <off>
##$DECIM= 32
##$DECNUC= <off>
##$DECSTAT= 4
##$DIGMOD= 1
##$DIGTYP= 9
##$DL= (0..7)
0 120 120 120 120 120 120 120 
##$DP= (0..7)
150 150 150 150 150 150 150 150 
##$DP07= 0
##$DPNAME0= <>
##$DPNAME1= <>
##$DPNAME2= <>
##$DPNAME3= <>
##$DPNAME4= <>
##$DPNAME5= <>
##$DPNAME6= <>
##$DPNAME7= <>
##$DPOAL= (0..7)
0.5 0.5 0.5 0.5 0.5 0.5 0.5 0.5 
##$DPOFFS= (0..7)
0 0 0 0 0 0 0 0 
##$DQDMODE= 0
##$DR= 18
##$DS= 0
##$DSLIST= <SSSSSSSSSSSSSSS>
##$DSPFIRM= 0
$$ [...]
##$SUBNAM2= <"">
##$SUBNAM3= <"">
##$SUBNAM4= <"">
##$SUBNAM5= <"">
##$SUBNAM6= <"">
##$SUBNAM7= <"">
##$SUBNAM8= <"">
##$SUBNAM9= <"">
##$SW= 20.0188882624521
##$SWIBOX= (0..15)
0 0 2 0 0 0 0 0 0 0 0 0 0 0 0 0 
##$SW_h= 4006.41025641026
##$TD= 16384
##$TD0= 1
##$TE= 0
##$TE2= 300
##$TE3= 300
##$TEG= 300
##$TL= (0..7)
0 120 120 120 120 120 120 120 
##$TP= (0..7)
150 150 150 150 150 150 150 150 
##$TP07= 0
##$TPNAME0= <>
##$TPNAME1= <>
##$TPNAME2= <>
##$TPNAME3= <>
##$TPNAME4= <>
##$TPNAME5= <>
##$TPNAME6= <>
##$TPNAME7= <>
##$TPOAL= (0..7)
0.5 0.5 0.5 0.5 0.5 0.5 0.5 0.5 
##$TPOFFS= (0..7)
0 0 0 0 0 0 0 0 
##$TUNHIN= 0
##$TUNHOUT= 0
##$TUNXOUT= 0
##$USERA1= <user>
##$USERA2= <user>
##$USERA3= <user>
##$USERA4= <user>
##$USERA5= <user>
##$V9= 5
##$VALIST= <valist>
##$VCLIST= <CCCCCCCCCCCCCCC>
##$VD= 0
##$VDLIST= <DDDDDDDDDDDDDDD>
##$VPLIST= <PPPPPPPPPPPPPPP>
##$VTLIST= <TTTTTTTTTTTTTTT>
##$WBST= 1024
##$WBSW= 4
##$XGAIN= (0..3)
0 0 0 0 
##$XL= 0
##$YL= 0
##$YMAX_a= 607514
##$YMIN_a= -630681
##$ZGOPTNS= <>
##$ZL1= 120
##$ZL2= 120
##$ZL3= 120
##$ZL4= 120
##$ABSF1= 10
##$ABSF2= 0
##$ABSG= 5
##$ABSL= 3
##$ALPHA= 0
##$AQORDER= 0
##$ASSFAC= 0
##$ASSFACI= 0
##$ASSFACX= 0
##$ASSWID= 0
##$AUNMP= <proc_1d>
##$AZFE= 0.1
##$AZFW= 0.1
##$BCFW= 1
##$BC_mod= 2
##$BYTORDP= 1
##$COROFFS= 0
##$CY= 11.3945322036743
##$DATMOD= 1
##$DC= 2
##$DFILT= <>
##$DTYPP= 0
##$F1P= 15.9154993809931
##$F2P= -4.1035820241983
##$FCOR= 0.5
##$FTSIZE= 0
##$FT_mod= 4
##$GAMMA= 1
##$GB= 0.15
##$INTBC= 1
##$INTSCL= 1
##$ISEN= 128
##$LB= 0.24
##$LEV0= 0
##$LPBIN= 0
##$MAXI= 10000
##$MC2= 0
##$MEAN= 0
##$ME_mod= 0
##$MI= 1.114404
##$NCOEF= 0
##$NC_proc= 0
##$NLEV= 6
##$NOISF1= 3.799351
##$NOISF2= 2.8
##$NSP= 1
##$NTH_PI= 0
##$NZP= 0
##$OFFSET= 15.70392
##$PC= 1
##$PHC0= -11037
##$PHC1= 16.60101
##$PH_mod= 1
##$PKNL= yes
##$PPARMOD= 0
##$PSCAL= 0
##$PSIGN= 0
##$REVERSE= no
##$SF= 200.130013532006
##$SI= 16384
##$SIGF1= 3
##$SIGF2= 2
##$SINO= 400
##$SIOLD= 16384
##$SREGLST= <1H.CDCl3>
##$SSB= 0
##$STSI= 0
##$STSR= 0
##$SW_p= 3612.71676300578
##$SYMM= 0
##$S_DEV= 0
##$TDeff= 0
##$TDoff= 0
##$TI= <>
##$TILT= no
##$TM1= 0
##$TM2= 0
##$TOPLEV= 0
##$USERP1= <user>
##$USERP2= <user>
##$USERP3= <user>
##$USERP4= <user>
##$USERP5= <user>
##$WDW= 1
##$XDIM= 8192
##$YMAX_p= 0
##$YMIN_p= 0
$$ End of Bruker specific parameters
$$ ---------------------------------
##NTUPLES= NMR FID
##VAR_NAME=  TIME,          FID/REAL,        FID/IMAG
##SYMBOL=    X,             R,               I
##VAR_TYPE=  INDEPENDENT,   DEPENDENT,       DEPENDENT
##VAR_FORM=  AFFN,          ASDF,            ASDF
##VAR_DIM=   8192,          8192,            8192
##UNITS=     SECONDS,       ARBITRARY UNITS, ARBITRARY UNITS
##FACTOR=    0.0002496,     1,               1
##FIRST=     0,             0,               0
##LAST=      2.0444736,     0,               0
##MIN=       0,             -630681,         0
##MAX=       2.0444736,     607514,          0
$$ Real data points
##PAGE= N=1
##DATA TABLE= (X++(R..R)), XYDATA
0 0 0 0 0 0 0 0 0 -7 8 -8 8 -8 16 -16 24 -32 34 -44 56 -64 80 -95 112 -134 156 -180 212 -246 284 -325
30 -325 371 -426 484 -548 620 -700 784 -878 985 -1098 1224 -1360 1509 -1673 1849 -2044
46 -2044 2257 -2490 2743 -3022 3329 -3668 4043 -4457 4923 -5449 6043 -6723 7511 -8439
60 -8439 9546 -10892 12574 -14743 17670 -21837 28289 -39709 65929 -253537 176628 452057
72 452057 -310573 -7601 418641 -14086 -484556 -157630 205305 301919 80075 -206390
82 -206390 -162934 75466 -58157 -63468 293075 215538 -331773 -290881 167680 172597 -78038
93 -78038 26536 162596 -66198 -306162 -50777 332930 164540 -254455 -127254 189056
103 189056 -2300 -220388 71397 275949 1523 -248429 -118555 151391 167158 -112422
113 -112422 -149322 180620 127434 -280915 -101134 326907 40044 -301277 48147 222052
123 222052 -131222 -133879 170100 77115 -141613 -60009 71373 72614 -21137 -121995 15407
134 15407 192071 -45182 -244820 98836 266597 -145896 -258564 154874 217670 -138519
144 -138519 -170889 119712 158338 -90772 -167498 61894 168509 -59527 -160473 77918
154 77918 147359 -91088 -122727 93827 98105 -86215 -84398 76670 81009 -87986 -96383 117573
166 117573 121499 -144722 -121820 171351 89159 -204299 -57815 216767 43675 -193313 -42701
177 -42701 151888 54605 -117814 -77334 106694 101066 -123765 -122891 146389 129328 -149118
188 -149118 -98479 141598 45087 -137252 -9508 124096 3008 -94526 -2661 73260 -973
199 -973 -78039 6472 103701 -13402 -132985 22321 148390 -35800 -144655 57350 140235
210 140235 -70850 -146069 57366 146956 -33222 -139656 23956 140086 -27832 -149644
220 -149644 30818 150540 -33638 -138134 35175 115135 -36761 -90765 42338 80741
230 80741 -45531 -85100 41561 84678 -47582 -77455 73425 77635 -98885 -79132 111498
241 111498 72485 -116649 -65367 116438 66326 -109931 -72415 106689 86578 -106103 -103237
252 -103237 103561 108426 -104439 -102078 108793 93413 -105089 -80939 92896 64279 -82081
263 -82081 -53576 71328 46799 -63319 -38265 65177 30538 -73846 -24518 80619 12574
274 12574 -89484 -116 99761 -5541 -104227 9219 106581 -12507 -113231 9566 118814
285 118814 -3138 -118537 1718 118518 -800 -116640 -1692 109656 2533 -101202
295 -101202 -2523 94122 4325 -84519 -1068 77088 -7713 -75160 15716 71894 -25451 -65863
307 -65863 40046 63543 -52779 -63921 59711 62093 -67287 -64284 72889 71043 -73488
318 -73488 -76749 73374 81360 -74598 -87703 72135 90570 -68333 -89413 65834 88327
329 88327 -60452 -84028 54150 75360 -51623 -67617 49820 61003 -45688 -49839 46517
340 46517 39832 -51050 -34024 53990 27391 -58256 -19714 67308 17002 -74633 -15999 79231
352 79231 13278 -85439 -13813 89892 17015 -90521 -19317 90454 21867 -89950 -25907
363 -25907 85593 26424 -81264 -25232 77079 24329 -69907 -20560 62113 13282 -57932
374 -57932 -7491 53987 1618 -49432 8151 49362 -17403 -51689 24589 52789 -32476 -54781
386 -54781 40039 59569 -42765 -62758 43804 65513 -44409 -70185 42233 73962 -38712
397 -38712 -74861 36941 75404 -34535 -73945 30825 67984 -29779 -62139 28868 56768
408 56768 -26395 -48912 26417 40782 -30707 -36615 34104 32208 -38224 -26780 45436 24010
420 24010 -52401 -23393 57387 22594 -62854 -23927 67381 27430 -68926 -29410 70803 31983
432 31983 -71458 -35274 68425 36119 -63936 -34531 60503 34378 -54670 -32866 48081
443 48081 28340 -44435 -23993 41919 19116 -39396 -11339 39616 3069 -41939 3182 42583
455 42583 -10578 -44280 17634 48131 -21197 -51613 22263 53739 -23270 -57161 22140 60182
467 60182 -19639 -61707 17670 63144 -14866 -62976 11778 59854 -11011 -56082 11667 52918
479 52918 -10898 -46842 12102 39898 -15963 -35050 19645 31078 -22940 -26329 28741 24072
491 24072 -34817 -24128 39484 24239 -44420 -25699 48655 28497 -51091 -30973 52953 33897
503 33897 -54235 -38141 51917 39526 -49190 -38429 47887 38183 -44970 -37545 39239 33491 -34631
516 -34631 -28261 31854 23831 -29706 -19140 29222 14810 -29739 -10196 30711 4025 -33887
528 -33887 2040 39727 -4117 -43207 5144 44533 -7345 -47248 8572 51510 -6683 -54235
540 -54235 3670 54697 -1246 -53064 160 50066 -915 -48211 18 45841 3171 -39908
552 -39908 -4073 32876 -269 -30707 4700 31100 -7354 -29360 11557 25715 -18910 -23340
564 -23340 26863 23229 -32626 -24950 34462 26416 -33706 -26012 35140 27842 -37690 -33613 36779
577 36779 38677 -32703 -38665 30708 37108 -30346 -36472 28891 35747 -25944 -33657 22563 29241
590 29241 -20709 -22911 22165 17560 -24805 -14530 24648 9864 -24264 -3989 26670 877
602 877 -30481 -1764 33227 3466 -36416 -5125 40248 6184 -44307 -6439 47920 7117
614 7117 -48914 -8111 45989 7763 -41574 -6893 38004 8117 -33613 -9555 28851 9024
626 9024 -25792 -6915 24477 4289 -22920 109 22017 -5341 -21957 10145 22261 -14603
638 -14603 -23384 18391 25187 -21283 -26863 23962 28681 -26232 -31295 25514 32099 -23084 -30995
651 -30995 21138 30807 -18953 -32528 14755 33133 -11123 -31892 10375 29811 -11865 -27051
663 -27051 14505 23728 -16439 -19196 17106 12898 -18399 -6835 21900 5106 -24342 -6118 24863
676 24863 6456 -26444 -6179 30593 7689 -34652 -10582 36695 13350 -36445 -14750 34941
688 34941 14326 -34521 -14416 34505 16082 -31984 -16582 27006 13159 -23633 -8812 21949
700 21949 6289 -19747 -4971 16462 2760 -14289 469 14893 -3935 -18417 6225 22495
712 22495 -7438 -24492 10308 25700 -14510 -28144 16611 30632 -14995 -30315 12649 28821
724 28821 -10935 -28173 9167 28382 -6851 -28175 4600 26551 -3300 -23425 3995 20273
736 20273 -6208 -18528 7628 16416 -8951 -13311 11920 10698 -16258 -9852 19756 9282 -22495
749 -22495 -8837 24421 8868 -25594 -9537 26318 11407 -26500 -14518 25541 17154 -24342
761 -24342 -18279 24214 19184 -23772 -19194 22150 17551 -20135 -14669 18205 11919 -15893 -8987
774 -8987 14100 6149 -13230 -3786 13047 1361 -13962 1106 15986 -2810 -18193 4024 20146
787 20146 -5428 -22714 5782 25099 -5207 -26597 4541 27398 -4106 -27950 3077 27237
799 27237 -1981 -25561 1053 23341 -98 -20666 -411 18076 254 -16113 322 14485
811 14485 -1542 -12582 4317 11523 -7667 -11094 10688 10517 -13439 -9944 16216 10289 -18070
824 -18070 -11168 19068 12323 -19553 -13993 19291 15516 -18549 -16565 17734 17443 -16662 -18148 14760
838 14760 17594 -13218 -16340 12157 14847 -11233 -12849 10527 10133 -10520 -7451 10778 4714 -11394
852 -11394 -2081 12821 479 -14328 491 15773 -1257 -17786 1428 20195 -661 -21750
864 -21750 -55 22874 788 -23574 -1773 23456 2765 -22538 -3435 21276 4104 -19450
876 -19450 -4440 17160 3864 -15246 -3053 13417 1938 -11560 -209 10070 -2079 -9471
888 -9471 4114 9153 -6348 -9333 8669 10153 -10609 -11192 12026 12224 -13219 -13491 13672 14783
902 14783 -13247 -15583 12609 16296 -11582 -16763 10234 16659 -8890 -15870 7938 14892 -7031
915 -7031 -13237 6475 11112 -6538 -9040 6935 7058 -7639 -5071 8970 3369 -10767 -2390 12334
929 12334 1495 -14177 -1132 15936 1418 -17292 -2077 18125 2851 -18863 -4119 18953
941 18953 5291 -18522 -6096 17844 6707 -16780 -7022 15122 6642 -13483 -5856 11949 4978
954 4978 -10289 -3484 9072 1730 -8423 55 8131 -1942 -8122 4019 8799 -5730 -9773 6903
968 6903 10678 -7936 -11996 8419 13369 -8314 -14490 7948 15290 -7438 -15876 6484 15695 -5632
982 -5632 -15082 4779 14128 -3932 -12822 3238 11041 -3164 -9433 3473 7956 -4025 -6363 5143
996 5143 4885 -6726 -3919 8369 3234 -9972 -2841 11665 3035 -12949 -3387 14034 4026 -14832
1010 -14832 -5012 15151 6085 -14786 -6752 14215 7337 -13425 -7927 12221 8064 -10895 -7775
1023 -7775 9705 7034 -8651 -5848 7875 4207 -7554 -2595 7187 735 -7065 1285 7505 -2881
1037 -2881 -8369 3809 9179 -4472 -10163 4925 11479 -4868 -12708 4592 13800 -3961 -14517
1050 -14517 3235 14619 -2550 -14256 2177 13811 -1507 -12749 951 11101 -874 -9401
1062 -9401 1130 7919 -1517 -6518 2098 5261 -3083 -4432 4294 3895 -5860 -3869 7478 4213 -8909
1077 -8909 -4665 10077 5008 -11328 -5610 11994 6409 -11920 -6980 11383 7393 -10571 -7815
1090 -7815 9505 8109 -8378 -8097 7392 7909 -6449 -7143 5903 5960 -5792 -4594 5916 3070
1104 3070 -6071 -1233 6567 -424 -7321 1627 8020 -2522 -8766 2997 9696 -2933 -10577 2417
1118 2417 11359 -1766 -12137 847 12566 -58 -12755 -519 12678 1007 -12114 -1289
1130 -1289 10916 1123 -9567 -701 8224 345 -6751 129 5319 -918 -4283 1927 3834 -2892
1144 -2892 -3748 4063 4160 -5122 -4620 6362 5280 -7640 -6191 8537 7111 -8724 -7567 8644 7758
1159 7758 -8482 -7997 7794 8174 -6683 -8126 5485 7661 -4540 -7026 3946 6298 -3773 -5571
1173 -5571 3696 4512 -3824 -3042 4556 1633 -5633 -624 6580 -161 -7265 925 8063 -1345 -8891
1188 -8891 1293 9711 -690 -10155 -250 10310 1029 -10265 -1591 10402 2333 -10285 -3038
1201 -3038 9596 3238 -8572 -2835 7673 2210 -6769 -1603 5760 854 -4726 85 3914 -1265
1215 -1265 -3613 2385 3853 -3224 -4282 3889 4738 -4763 -5500 5536 6520 -5875 -7430 5829 7964
1230 7964 -5664 -8285 5363 8432 -4812 -8352 4127 8084 -3311 -7416 2645 6488 -2303
1243 -2303 -5582 2217 4753 -2175 -3744 2461 2718 -3182 -1861 4036 1278 -4957 -828 5933 568
1258 568 -6866 -513 7673 663 -8344 -1155 8686 1724 -8740 -2323 8637 2901 -8350 -3493
1272 -3493 7811 3803 -7080 -3799 6383 3599 -5651 -3187 4911 2476 -4323 -1596 3921 590
1286 590 -3785 525 3889 -1539 -4145 2399 4503 -3178 -5031 3783 5794 -3943 -6419 3825 6933
1301 6933 -3651 -7477 3295 7902 -2744 -8052 2182 7946 -1620 -7495 1222 6830 -1026 -6151
1315 -6151 904 5253 -873 -4239 1083 3253 -1612 -2499 2280 1972 -2914 -1524 3689 1284 -4540
1330 -4540 -1375 5352 1674 -6037 -2146 6563 2718 -6790 -3130 6968 3571 -6902 -3979 6507
1344 6507 4222 -5845 -4148 5125 3998 -4501 -3685 3829 3258 -3324 -2674 3014 1879 -2929 -1020
1359 -1020 3130 46 -3536 688 3956 -1408 -4395 2047 5043 -2426 -5734 2530 6148 -2304 -6615
1374 -6615 1987 6821 -1542 -6970 1011 6922 -325 -6780 -218 6409 460 -5804 -495 5223 410
1389 410 -4403 -156 3742 -252 -3003 917 2266 -1652 -1900 2328 1712 -2968 -1723 3595 1894 -4189
1405 -4189 -2413 4738 2909 -4892 -3380 5162 3925 -5172 -4374 4932 4598 -4553 -4647 4068 4479 -3543
1421 -3543 -4196 2959 3652 -2571 -3066 2183 2400 -1971 -1815 2038 1097 -2308 -423 2768 -149 -3419
1437 -3419 612 3956 -875 -4579 1167 5177 -1137 -5525 988 5870 -508 -5997 213 5905 156
1452 156 -5833 -813 5561 1238 -5079 -1602 4714 1382 -4169 -1194 3519 892 -3043 -361 2735
1467 2735 -396 -2347 970 2060 -1717 -2076 2472 2098 -2820 -2437 3294 2836 -3597 -3168 3730 3592
1483 3592 -3705 -4205 3453 4571 -3303 -4821 2941 4673 -2521 -4538 2079 4159 -1741 -3629 1486
1498 1486 3062 -1234 -2394 1256 1647 -1358 -1132 1632 696 -2176 -273 2670 -15 -3295 98 3882
1514 3882 -95 -4388 -34 4795 343 -5032 -639 5105 1005 -5068 -1351 4825 1698 -4424 -1836
1529 -1836 4008 1954 -3484 -1859 3019 1600 -2615 -1211 2296 685 -2074 -66 1945 -643 -2004
1544 -2004 1230 2161 -1793 -2390 2230 2724 -2519 -3112 2608 3461 -2628 -3874 2431 4175 -2167 -4376
1560 -4376 1827 4461 -1483 -4389 1075 4175 -816 -3779 567 3347 -442 -2797 462 2177 -608
1575 -608 -1620 860 1119 -1268 -758 1724 495 -2211 -400 2725 457 -3172 -639 3620 880 -3901
1591 -3901 -1173 4077 1489 -4071 -1803 3974 2034 -3691 -2196 3340 2240 -2951 -2203 2522 1972
1606 1972 -2147 -1668 1816 1251 -1616 -733 1484 204 -1564 332 1662 -792 -1954 1213 2332 -1494
1622 -1494 -2727 1657 3129 -1705 -3430 1625 3693 -1383 -3886 1156 3987 -814 -3978 334 3754
1637 3754 -5 -3509 -107 3104 244 -2765 -253 2211 98 -1838 169 1499 -578 -1048 1017
1652 1017 944 -1538 -674 1822 743 -2382 -831 2712 1063 -3031 -1283 3138 1688 -3148 -1955 3093
1668 3093 2298 -2887 -2529 2673 2532 -2393 -2491 2068 2322 -1605 -2012 1505 1723 -1221 -1214 1115 808 -999
1686 -999 -256 1135 -82 -1447 442 1708 -603 -2129 907 2393 -1023 -2930 845 3178 -610
1701 -610 -3281 393 3535 -268 -3592 73 3390 233 -3126 -454 2819 601 -2506 -622 2087
1716 2087 615 -1728 -450 1485 101 -1129 203 1018 -721 -1053 1104 997 -1574 -1069 2093 1204
1732 1204 -2153 -1437 2389 1723 -2373 -2092 2361 2204 -2267 -2387 1982 2555 -1753 -2685 1413 2604 -1011
1749 -1011 -2313 981 1959 -662 -1556 574 1197 -639 -565 689 388 -888 93 1111 -251 -1562 218
1766 218 1719 -405 -2111 253 2418 -39 -2670 -129 3008 125 -3114 -532 2845 750 -2800
1781 -2800 -850 2523 942 -2241 -937 1869 841 -1539 -779 1227 545 -1073 -210 898 -8 -816
1797 -816 453 891 -848 -1020 1395 1243 -1541 -1429 1767 1557 -1715 -1878 1633 2195 -1663 -2186 1474
1814 1474 2509 -1187 -2729 767 2392 -599 -2333 367 2161 -282 -1811 316 1495 -227 -1115
1829 -1115 273 738 -630 -505 723 89 -1204 -30 1171 -338 -1654 -11 1948 50 -2093 -134
1845 -134 2305 517 -2582 -658 2434 895 -2520 -1357 2134 1366 -1943 -1199 1625 1111 -1523 -1321
1861 -1321 1183 1072 -964 -463 821 364 -605 -38 662 -326 -775 628 868 -1021 -1175 1132 1392 -1103
1879 -1103 -1688 1168 2026 -1023 -2119 1261 2132 -739 -2139 544 2309 -448 -2122 85 1876 -143
1895 -143 -1866 -197 1618 134 -1276 -42 920 -19 -716 380 357 -581 -298 888 246 -1329 -259
1912 -259 1439 236 -1629 -335 1897 733 -1836 -951 1747 972 -1871 -1189 1677 1278 -1666 -1549
1928 -1549 1312 1415 -1229 -1468 925 1114 -681 -759 596 749 -327 -297 716 -45 -541 197 561 -434
1946 -434 -1016 527 1208 -556 -1437 728 1555 -586 -1771 449 1928 -377 -1974 141 1942 -100
1962 -100 -2024 -172 1824 287 -1535 -316 1363 256 -1022 -180 1028 306 -707 -122 388 -239
1978 -239 -468 260 278 -909 -471 991 386 -1219 -467 1473 583 -1361 -844 1613 1041 -1390 -1159 1408
1996 1408 1251 -1203 -1330 931 1486 -760 -1344 532 1179 -539 -1170 400 777 -420 -639 350 323 -368
2014 -368 78 515 31 -660 302 808 -314 -1044 346 1220 -264 -1431 268 1695 -116 -1718 86
2031 86 1828 201 -1633 -429 1604 294 -1494 -505 1299 532 -1082 -428 746 475 -664 -285 531
2048 531 64 -342 237 284 -458 -294 590 408 -903 -523 983 634 -1053 -868 1103 922 -1124 -1144 1070
2067 1070 1332 -977 -1401 741 1412 -614 -1375 435 1340 -313 -1153 199 852 -92 -738 90 537 -190
2085 -190 -423 318 76 -408 -50 754 -144 -870 110 1037 -139 -1330 75 1294 -60 -1397 -170 1461
2103 1461 268 -1377 -414 1393 510 -1228 -527 1171 677 -1065 -545 897 509 -710 -414 455 172
2120 172 -261 -69 191 -73 -263 269 284 -405 -499 689 608 -763 -847 774 834 -854 -1072 729 1123 -734
2140 -734 -1233 553 1348 -332 -1306 201 1213 -137 -1060 17 849 84 -743 -76 756 -69 -326 109
2158 109 115 -163 -143 475 47 -590 -34 664 -21 -1019 -31 1057 109 -1134 -315 1234 376 -1206 -549 1118
2178 1118 612 -1070 -744 893 766 -775 -790 661 692 -504 -672 400 435 -327 -302 253 118 -265 92
2197 92 301 -257 -358 404 496 -480 -587 563 765 -536 -891 489 1055 -427 -1136 360 1208 -236 -1210
2216 -1210 102 1165 13 -1065 -86 920 133 -784 -138 596 126 -447 -72 278 -27 -184 179 97
2234 97 -339 -94 511 85 -690 -148 812 229 -930 -316 981 421 -997 -547 950 670 -882 -724 745
2253 745 818 -637 -794 500 769 -348 -685 265 577 -193 -464 166 290 -170 -102 185 -55 -278 192 388
2273 388 -320 -534 325 619 -359 -782 326 878 -291 -976 169 1025 -84 -1063 -17 1053 129 -986
2291 -986 -206 887 244 -751 -275 618 250 -478 -176 309 134 -232 7 136 -149 -124 297 133 -452 -168
2311 -168 576 243 -637 -361 743 437 -753 -566 750 663 -703 -749 598 783 -523 -794 370 788
2329 788 -286 -722 174 633 -113 -510 66 376 -75 -225 119 105 -162 48 259 -112 -355 185 533 -202
2349 -202 -624 196 740 -157 -827 101 890 -2 -903 -129 898 207 -829 -295 772 342 -664 -372 536
2368 536 381 -427 -307 320 191 -240 -133 148 -1 -146 128 111 -286 -155 390 208 -476 -306 525 376
2388 376 -574 -507 540 589 -483 -679 470 751 -387 -779 298 735 -221 -681 124 643 -24 -514 -25
2407 -25 401 10 -267 38 152 -94 -76 163 -21 -254 64 361 -73 -502 66 563 -57 -678 18 741 113
2428 113 -759 -171 761 254 -737 -363 652 388 -534 -422 445 401 -352 -374 278 328 -163 -199 151 119 -111
2449 -111 17 123 -107 -158 250 213 -309 -288 406 367 -421 -462 392 510 -401 -625 312 657 -277 -683 176 671
2471 671 -130 -679 29 604 29 -518 -43 410 94 -302 -32 199 7 -123 69 35 -135 23 264 4
2491 4 -330 29 432 39 -505 -101 575 164 -611 -233 596 313 -596 -396 526 405 -499 -425 376 403 -292
2512 -292 -440 220 374 -133 -293 71 158 -47 -104 84 -15 -128 97 141 -198 -221 263 297 -255 -394 288 473
2534 473 -231 -547 228 589 -162 -622 112 627 2 -619 -68 560 111 -465 -130 429 145 -300 -122 241
2554 241 89 -123 -33 60 -35 -24 104 -1 -242 5 310 34 -366 -84 431 144 -478 -235 475 366 -443
2575 -443 -380 479 485 -346 -440 241 444 -184 -489 205 381 -115 -375 122 240 -26 -109 160 23 -40 189 -33
2597 -33 -193 -157 279 246 -212 -328 122 333 -241 -446 145 448 -57 -569 32 501 56 -453 -151 400 202
2618 202 -458 -221 337 224 -293 -169 188 161 -123 -103 105 45 -62 64 28 -114 -43 200 69 -282 -103 320
2640 320 167 -367 -217 361 295 -368 -370 361 419 -269 -431 225 433 -169 -429 92 354 -46 -360 17 272
2661 272 21 -177 -45 100 -3 -48 58 -54 -78 58 174 -89 -266 113 336 -114 -383 61 430 8 -441
2682 -441 -49 456 119 -462 -160 417 239 -359 -193 299 226 -285 -235 166 192 -115 -162 73 93 -59 -34 1
2704 1 -65 -41 126 64 -178 -112 253 143 -265 -185 251 283 -274 -309 265 380 -180 -385 158 422 -77 -375 49
2727 49 388 -9 -348 -29 278 70 -207 -68 126 23 -78 1 -15 -50 52 102 -80 -187 50 245 -42 -326
2749 -326 6 339 33 -367 -88 381 120 -379 -197 368 234 -319 -251 281 262 -220 -253 160 233 -96 -188 55
2771 55 147 -30 -85 5 3 -33 45 29 -101 -61 136 100 -190 -187 222 223 -228 -288 179 342 -150 -367 77 370 -68
2796 -68 -368 -32 336 31 -331 -62 260 113 -234 -105 132 90 -90 -58 24 1 19 60 -55 -113 26 169 -11
2819 -11 -206 4 281 46 -307 -80 334 127 -299 -185 281 228 -274 -255 226 276 -176 -272 102 221 -75 -189
2841 -189 27 167 -3 -129 -2 44 22 18 12 -67 -20 107 96 -126 -154 146 196 -147 -228 115 305 -92 -309 50
2865 50 310 -4 -353 -29 287 81 -270 -86 232 130 -177 -131 117 96 -87 -99 22 55 -21 -27 -20 -84 5 83
2889 83 -17 -178 -20 194 66 -234 -99 242 102 -260 -175 206 228 -217 -251 168 274 -123 -256 63 249
2910 249 -33 -206 56 177 -3 -125 2 80 17 -15 -30 -40 -40 79 45 -71 -108 82 168 -110 -177 51 240 -70
2934 -70 -262 19 275 40 -306 -89 261 99 -243 -138 204 141 -140 -133 115 129 -110 -108 37 86 -14 -43 -29
2957 -29 -5 6 73 -7 -98 -35 139 41 -167 -99 196 116 -188 -182 170 192 -164 -220 113 211 -106 -254 77 205 -21
2982 -21 -218 -35 151 14 -133 -66 74 38 -72 -57 1 -12 26 38 -71 -70 42 132 -65 -149 70 175 -19 -189
3006 -189 -3 249 35 -246 -60 220 112 -213 -112 215 149 -142 -165 88 132 -60 -104 40 75 -7 -58 -10 20
3029 20 29 3 -10 -72 -37 110 29 -127 -74 141 118 -147 -140 125 161 -158 -207 71 238 -69 -198 33 238 -1 -193
3054 -193 -1 183 63 -144 -65 82 41 -44 -44 44 18 -4 13 -33 -35 42 102 -49 -114 34 169 2 -181 -10 186
3079 186 39 -206 -94 178 86 -196 -130 145 157 -122 -147 121 145 -16 -127 18 88 6 -56 -25 38 39 24 8 -41
3104 -41 0 50 23 -119 -51 111 114 -117 -109 85 172 -92 -171 70 211 -49 -195 -1 190 7 -202 -50 143 39
3128 39 -114 -77 90 79 -78 -83 46 33 -2 4 -42 -38 24 43 -81 -69 22 134 -17 -111 -6 171 50 -184 -61 156
3154 156 83 -153 -117 95 146 -90 -159 67 142 -35 -123 8 100 6 -57 -21 25 28 -5 -1 -16 2 26 -5 -76 -64 95
3181 95 76 -98 -111 91 143 -76 -178 38 165 -20 -170 5 160 7 -173 -53 128 90 -128 -72 81 86 -66
3204 -66 -67 47 38 -14 -36 -19 10 3 9 -16 -51 16 78 12 -141 -25 127 55 -128 -81 130 85 -116 -121 102 141 -94 -143
3232 -143 71 111 -46 -155 2 90 38 -82 -21 56 32 -16 -44 5 -6 22 12 -49 -36 66 77 -70 -82 76 109 -72
3258 -72 -146 19 155 -5 -175 -22 153 35 -125 -35 125 83 -143 -107 113 88 -46 -73 19 74 -23 -29 -12 5 25
3283 25 9 -21 -43 7 43 -17 -85 -8 113 44 -105 -73 94 83 -87 -102 84 124 -68 -142 31 130 -40 -119 1 89
3309 89 15 -96 2 53 -1 -37 -42 12 17 -12 -5 -31 -23 55 50 -18 -59 48 86 -39 -118 47 133 -9 -127 -45 127 40 -100
3338 -100 -57 88 81 -71 -65 66 53 -39 -72 37 57 -34 -60 -12 -24 21 3 -27 -27 7 37 0 -62 -26 94 6 -103 -62
3366 -62 52 54 -77 -118 68 99 -48 -123 24 139 -8 -99 4 74 37 -88 -60 63 16 -43 -30 29 45 -3 -15 -10
3392 -10 16 32 36 -30 -70 41 83 -32 -108 -10 95 -15 -107 -33 105 24 -78 -95 80 58 -88 -71 79 84 -30 -76
3418 -76 8 69 -7 -46 3 39 14 -22 -4 -1 19 54 6 -43 -27 66 27 -47 -54 80 46 -56 -64 48 88 -55 -71 34 79
3447 79 -22 -76 -43 80 49 -71 -33 52 47 -32 -60 16 25 -13 -2 -36 12 35 31 -24 -62 26 46 -14 -65 31 120 1 -88 -25
3477 -25 108 36 -81 -52 70 50 -45 -88 54 73 -49 -84 25 68 -14 -52 -13 22 -7 -27 -4 1 -15 13 -5 -40 -18 40
3505 40 20 -59 -55 44 53 -53 -88 53 74 -24 -91 31 85 10 -103 -24 87 17 -68 -63 70 27 -23 -43 37 38 -11 -38 -20
3534 -20 13 -1 24 -7 -40 13 57 -20 -50 0 77 -20 -85 -38 83 30 -98 -65 80 58 -65 -61 32 71 -25 -60 31 58 12
3563 12 -75 -6 75 22 -30 18 31 15 10 2 -8 9 66 4 -42 -7 64 58 -29 -85 23 51 -3 -70 8 88 7 -92 -7 71 11
3594 11 -49 -55 69 43 -30 -49 41 24 -15 -17 -17 31 19 -1 3 8 36 18 -14 -69 -6 68 30 -45 -25 63 50 -62 -30 73 81 -58
3626 -58 -46 49 73 11 -56 -21 82 9 -60 -35 41 29 -20 -14 12 12 -3 -12 -19 4 14 19 -12 -8 33 46 -19 -71 14 75 -12 -56 16
3659 16 77 6 -79 -21 87 48 -56 -33 61 43 -15 -22 35 52 -18 -11 -1 9 11 -2 -29 -19 24 25 -21 -44 -6 45 28 -42 -37 40
3691 40 41 -55 -52 50 38 -54 -82 40 53 -21 -51 -8 64 -2 -42 -25 49 8 -49 -7 21 10 -8 -30 -27 9 43 -5 -26 -30 12
3722 12 45 -27 -62 16 76 -4 -53 -6 50 24 -51 -16 55 46 -88 -67 34 65 -66 -44 18 44 4 -35 -19 9 -13 -24 0
3751 0 28 4 -18 -26 -28 -9 25 37 -43 -24 47 40 -48 -35 26 61 -36 -71 8 49 4 -67 -24 43 4 -61 -13 37 21 -48 -37 12
3783 12 -3 23 6 -19 -1 3 -9 -26 -5 25 47 -34 -34 46 37 16 -52 4 49 28 -57 -27 44 35 -47 -40 64 36 -39 -43 15 46 -2
3816 -2 -33 9 32 15 -10 -25 15 -13 10 5 -24 -20 19 17 -54 -22 37 44 -35 -36 16 57 -31 -38 8 71 2 -62 4 24 3 -63 -13 25
3850 25 28 -49 -3 37 13 7 15 -16 27 8 -7 -16 -4 17 26 21 -30 7 50 17 -54 20 49 15 -47 -45 47 46 -52 -37 19 25 -21 -44 5
3885 5 21 -1 -35 6 45 8 -13 -11 12 29 31 -19 -32 -23 32 20 -13 -16 19 19 -21 -37 9 33 -44 -45 -10 44 16 -76 15 48 22 -65
3919 -65 -12 19 33 -31 -36 18 18 -7 -28 -13 7 45 8 -13 -8 0 15 -1 -22 22 31 16 -44 -10 56 20 -30 9 41 29 -31 -33 15
3952 15 51 -5 -50 6 19 -1 -36 -22 7 12 -9 5 4 -3 6 11 -30 -32 33 -11 -9 -11 30 33 -27 -38 -7 20 -12 -50 6 54 -2 -71 -33
3987 -33 45 26 -1 -12 34 43 -13 -33 8 31 0 -42 14 2 -8 -17 -6 -6 27 21 -1 -19 -9 9 -20 -48 -43 34 8 -14 -25 -11 45
4020 45 -31 -65 13 34 -47 -38 13 30 17 -36 -18 27 9 -20 15 22 -15 -6 -16 6 -3 -39 0 -23 -14 37 27 -13 -36 -12 54 14 -69
4053 -69 -10 17 11 -68 0 -10 18 -29 -34 33 12 -35 -43 20 18 8 -29 18 17 14 -15 -35 -15 22 12 -9 -1 15 26 -6 -23 2 63 42
4087 42 -18 -25 6 22 -48 -44 16 54 15 -34 4 20 -4 -35 1 24 20 7 0 -15 18 -17 -10 0 -3 16 -10 -5 -18 20 4 -27 -30 29
4121 29 28 2 -55 21 55 38 -8 -26 46 58 1 -1 29 44 -16 -23 7 29 -30 -52 -20 47 23 -28 -26 7 12 -30 -7 -27 -14 -9 9
4154 9 -31 3 -9 -1 -29 -18 12 29 -16 -47 12 12 4 -6 11 35 -12 -2 -8 9 34 -10 -18 -7 41 10 -17 15 35 -1 1 -20 -24 13
4188 13 39 -8 -27 -9 16 -1 -47 -2 33 26 -59 -19 31 8 -28 -39 12 45 -19 -34 14 18 -12 -1 -17 2 2 -14 -7 7 26 16
4220 16 -3 -10 26 -6 -4 -7 6 17 27 -23 -11 21 14 -31 -36 -6 44 13 -39 -25 59 -2 -25 -2 40 19 -40 -19 -38 17 7 -15 -29
4253 -29 22 -12 -27 -36 -6 -8 20 -22 -24 2 17 -10 -25 -8 22 -5 -3 -32 -9 44 0 -38 35 51 -14 -42 0 50 -5 -14 -11 38 -21
4286 -21 -13 -15 17 0 5 10 -3 14 17 12 -25 -11 28 3 -32 -35 -6 34 0 -56 -12 17 -12 0 5 47 13 -20 13 32 26 -12 -13 -6 16 20
4322 20 0 10 10 11 -23 -12 -19 12 10 -38 -19 15 29 -26 -28 20 8 23 -21 -21 37 27 7 -17 -21 47 37 -26 -27 -16 10 -27 -13 8
4356 8 15 -30 -5 11 -31 20 12 2 25 16 -3 -20 -2 6 39 -8 -14 29 18 7 -20 2 21 -5 -7 12 46 -2 -26 -2 13 25 -20 -11
4390 -11 -12 11 -19 -11 10 20 7 15 8 5 12 -24 -4 8 3 14 -1 7 -1 16 6 -15 -4 8 29 -14 -12 13 44 -15 -8 1 20 17 -15 -12 18
4427 18 14 -11 -8 6 -5 -16 -31 9 7 -2 -19 17 -16 9 13 -35 13 -19 28 -15 -17 -17 36 3 -19 -25 38 11 -19 -14 4 33 -6 -1 14
4462 14 32 -2 1 20 15 25 -6 -1 -1 -10 17 -3 -40 7 35 11 -29 7 8 2 -22 -14 24 -2 -17 -20 17 32 2 1 4 28 9 -35 4 -8
4498 -8 13 10 -9 16 18 -25 1 5 16 30 -11 -16 -20 12 -24 -5 -6 17 22 -19 -34 -12 41 -24 -27 -37 13 37 4 -11 -4 19 -35 -29 14 48
4534 48 -8 -7 2 24 16 -3 -15 5 -18 6 11 -21 -48 13 -6 -15 5 9 -2 -23 -22 -5 21 -5 -19 30 20 14 -15 -4 25 -5 -15 -5
4568 -5 24 11 -19 -27 0 11 -15 -3 -6 -19 -20 1 -21 3 -30 -4 -29 -37 2 10 -2 1 -12 8 -3 -23 -6 6 11 -29 -28 0 2 -23 -12
4603 -12 3 52 2 -17 0 -1 15 4 -27 9 9 -30 -31 -8 -11 -25 -25 -24 -9 -6 8 -6 -28 11 5 -8 -22 0 17 22 4 7 -2 -34 -27 -3
4639 -3 19 14 -7 -13 -6 11 -17 -22 12 22 -8 1 -18 14 3 -10 -12 -6 5 19 -12 -8 -17 27 15 -4 -49 -1 -8 -37 -2 22 13 -14 -49 20
4675 20 28 -6 -45 -21 33 -11 -11 -15 -4 5 20 -33 -5 -2 -9 -11 -13 -3 25 20 10 -31 11 22 -6 -18 8 11 -1 -24 -23 20 -20 -24 -33 8 -1
4712 -1 -13 -23 -17 -18 -22 -13 17 -2 -8 6 -20 -1 -2 -6 -6 1 -15 10 7 -6 -37 11 5 -16 -14 16 26 -27 -22 10 4 -11 -43 3 16 12 -12 2
4750 2 -1 9 -16 -7 -17 2 -10 -18 16 -21 -16 -8 0 -12 4 4 -6 -25 16 9 -1 -2 -3 -6 -18 -49 -26 13 -14 -8 10 22 24 -14 -9 17 23 2
4788 2 -17 -31 13 8 -30 -5 7 15 17 -21 21 -3 -18 8 -32 29 11 22 -28 8 -1 21 -13 -16 -7 7 -17 -11 -3 27 11 -19 -24 -12 -24
4823 -24 0 -12 1 13 -9 -11 3 -22 -1 -7 14 -13 11 24 -14 19 -1 33 10 -46 -13 22 -3 -7 -19 22 12 -22 -33 30 10 -4
4855 -4 -39 -7 20 -9 -44 -29 26 -5 -25 -8 9 -9 -27 -13 -9 -7 -33 5 -17 2 -7 20 -16 -7 8 30 -3 -20 16 25 11 -22 4
4888 4 27 -1 11 10 43 -13 -28 -15 11 16 -10 -19 -16 -20 -7 -16 19 18 -30 -2 6 2 -17 14 20 -46 11 16 -16 3 4 32 -9 5 -22 30 27
4925 27 -15 22 25 2 17 -9 12 22 -2 -12 5 17 0 -32 -23 -20 30 17 43 -1 -3 37 5 -16 15 8 -9 -5 -27 -7 2 9 -20 10
4959 10 8 -8 -22 -19 1 -8 -22 -21 1 16 -23 -7 12 26 -36 -7 19 15 -29 4 -8 13 -3 -10 3 11 -3 12 1 26 -7 9 -12 14
4993 14 -20 4 28 -8 -32 16 17 14 -17 0 8 -4 -6 24 17 5 -13 2 -7 0 9 18 -4 -2 15 8 -20 -1 19 -1 -1 -3 -3 36 -15 -24 -10 20
5031 20 -23 -19 -20 24 26 -28 4 -3 -18 -16 -24 -20 22 -1 -6 -11 12 8 2 -33 7 -2 -11 -13 -27 14 -8 -1 -8 -18 26 29 -6 -9 8 10 -18 -13 -2 6 12
5072 12 -16 8 22 -21 -37 3 -24 -15 5 -6 -1 4 -1 -13 -30 -7 11 -12 -10 6 11 6 -23 13 -26 -14 23 -12 9 -11 -7 -20 -10 9
5106 9 9 -3 3 -16 11 -12 -11 14 10 -6 28 -3 9 -12 -13 -4 -6 12 -20 -32 12 10 6 -6 8 -17 20 21 -20 9 10 11 6 -22 -7 -26 -26 -25
5144 -25 -15 -21 3 -7 9 -22 -6 -12 -27 8 -1 21 -5 2 -3 2 -12 -15 8 -3 -17 -29 -13 -5 6 18 -7 5 -4 12 -7 21 -19 7 -16
5179 -16 14 17 13 -19 -33 18 11 -18 -15 -26 -8 -4 -1 -16 2 2 -16 -6 -11 12 13 14 3 7 25 5 -15 -13 -20 21 -8 5 26 4 12 -20 -11 7
5217 7 -2 23 -19 31 26 -3 -7 -22 19 -34 -6 4 19 -14 -21 13 -7 12 -3 -6 0 5 20 -20 0 -7 12 14 -20 -23 -7 5 -32 -1 0 15
5253 15 11 -14 19 26 31 -16 10 16 8 1 -23 -2 13 -21 -12 -7 -12 11 -19 13 -21 0 46 -17 -22 -3 3 15 -19 -16 -2 -17 -4 21 16 9 -22
5290 -22 -25 -7 -19 -7 -27 -33 -1 25 -22 -32 -25 0 -13 -3 -5 -8 -3 24 -16 -5 1 -2 3 -33 35 8 -3 0 -14 -2 6 -15 7 -16 5 -20
5326 -20 -11 -9 -7 -15 5 -3 8 -12 15 -5 8 -7 16 -16 -2 14 -4 -1 9 32 -6 -22 -16 6 11 -14 14 -2 2 15 -5 4 -28 1 3 -14
5362 -14 12 36 -1 18 -8 17 -19 -18 19 25 -3 -5 2 12 0 11 7 -13 -10 2 8 -6 -4 23 -26 -17 -19 -5 7 -3 -7 0 9 -12 -32 13 -17
5399 -17 -8 -12 -12 21 -20 -7 -12 8 -4 10 -18 7 -22 -2 -8 -15 13 -4 -9 -14 -29 -9 -3 25 -24 -4 7 -6 -11 -3 8 -40 -12 -32 -11 -1
5435 -1 -3 3 15 3 11 -1 -10 4 11 -14 -18 -6 31 15 15 25 20 -36 -11 16 -15 1 -7 1 -19 30 21 1 1 7 3 12 -14 -11 17 -10 -4 -15 26
5474 26 12 7 16 -9 24 2 16 -3 8 11 4 35 -21 -33 0 -14 -2 -15 39 2 -18 -30 2 -12 3 6 18 12 19 7 3 37 -25 -15
5508 -15 0 12 -9 5 1 6 12 7 2 9 -2 21 -7 -9 -14 -12 -5 -24 -2 13 0 2 -26 36 15 -18 5 -5 15 4 -5 -6 11 -7 4 -15 12
5545 12 -5 23 -29 -22 0 27 11 -21 11 -5 -2 -11 15 13 -15 -28 -16 10 11 -9 -4 -16 20 -2 -10 7 37 8 6 0 -11 -4 -23 -25 -28 1
5581 1 -11 -19 -1 -12 9 12 -34 -13 -69 -56 88 9 -14 1 34 -37 -28 11 -75 38 -26 -47 -17 43 -68 -8 10 0 -98 54
5611 54 -64 26 -12 29 -69 23 -68 30 98 29 6 -69 113 -45 49 -65 91 25 -44 -22 -4 -17 -2 -52 -79 -30 69 -4
5639 -4 -33 -20 -43 26 -19 -10 50 17 10 8 -19 1 19 4 19 14 15 13 -9 12 4 -16 -12 -7 26 -2 12 3 14 6 1 -11 -30 -32 -19 24 -25
5676 -25 13 -4 -32 24 3 -15 -9 -27 10 -2 16 22 15 4 -14 30 15 1 -12 -15 -2 17 -8 -14 -16 2 -3 -5 -11 3 -35 -13 -4 -1 11 -11
5712 -11 -13 33 12 -14 -13 2 12 1 -19 -10 7 22 0 27 23 -8 -2 -22 0 7 -30 12 -9 5 4 0 3 -2 39 -18 -10 9 11 6 4 3 -6 -20
5750 -20 -2 -11 -12 -25 -22 -2 -8 15 27 -23 6 12 11 1 -11 -1 1 -17 7 -25 18 -2 -11 11 10 -10 8 -2 -2 23 -18 -1 -17 -20 -14 -9 -25
5787 -25 22 -19 -2 -13 -15 -21 -38 -5 -28 -6 -6 -9 11 -36 -6 -4 7 -17 -13 -15 3 17 17 -11 -2 2 -6 -9 -18 -10 12 -25 -3 17 -2 -26 4
5824 4 7 -4 -7 -17 18 -17 11 5 -8 3 -13 14 5 8 -16 5 -7 -5 -9 21 9 20 -4 -18 11 -31 -44 -2 -7 25 8 -12 -25 4 12
5859 12 18 7 2 13 0 12 30 -14 -37 19 -4 5 -24 1 22 3 -1 -32 19 8 12 2 -16 -10 -4 -13 8 -4 -17 13 -2 11 2 -3 6 36
5895 36 -17 8 19 -15 15 -2 -14 -17 16 4 10 -2 24 21 -11 7 -3 2 7 -13 -19 7 6 -2 -1 -14 -10 -8 9 -25 -26 -8 5 10 -19 -27 -3
5932 -3 13 -7 -17 -3 -8 -16 10 -17 17 3 21 -22 -10 2 4 -17 1 -1 -7 1 8 -8 -18 -12 -8 -10 -16 0 19 -2 15 21 -19 13 12 -11 13
5969 13 7 -4 -4 -6 -12 1 -27 7 -23 -22 14 -12 -23 -12 -25 24 11 8 8 -1 -7 11 -9 -22 -1 10 23 -11 -12 5 10 -15 0 3 -6 -11 -16 -2
6007 -2 16 -21 6 11 1 0 -11 12 -13 5 12 -5 25 -2 4 20 1 -3 -10 23 -5 -11 2 16 -23 -7 -1 10 -15 -15 -19 -6 -2 7 8 -21 22
6044 22 -12 -5 -8 7 -17 7 19 3 -18 8 -4 -2 -17 25 37 1 -9 21 19 -17 5 11 -22 -14 20 12 0 -21 -4 -12 6 -5 11 -4
6078 -4 -7 -2 -4 9 -18 -3 20 -7 25 9 -12 -2 -16 2 -6 14 -6 -13 -11 7 40 -17 15 -2 8 10 3 -1 7 -3 11 4 -18 -22 11 28 6
6115 6 -21 -11 8 -19 10 -6 -23 2 -27 -2 29 -1 -12 -12 1 -10 6 19 -22 -1 9 -24 3 -5 7 -12 9 -14 7 12 3 17 1
6148 1 15 6 26 -4 -9 -5 -8 3 3 0 -14 3 -35 22 1 -25 -17 4 -14 -13 -1 -4 -13 -1 6 -13 -14 -32 -12 -11 -4 4 4 7 6 -17 3 -5 -11 3 22
6189 22 -3 -25 -12 -10 9 -7 8 27 11 8 -27 -7 -16 6 3 -12 0 -15 -3 14 -23 5 10 11 -2 -13 4 -16 8 -12 -1 -15 -9 -7
6223 -7 9 -19 -4 -3 -25 0 -16 0 0 -10 -23 2 6 10 15 -7 14 -3 10 0 9 -28 -8 5 -10 -13 -27 7 6 -11 8 2 12 -1 -26
6258 -26 -4 -11 11 -9 7 -1 19 -14 2 11 5 11 16 1 0 -32 -2 2 0 -13 -11 6 -20 1 6 -8 9 10 -6 3 27 14 -6 0 -11 -19 -3 -2
6296 -2 -7 2 -9 -27 -23 -16 -9 16 -12 -29 -19 -19 -21 -37 -19 1 -19 16 1 -3 -12 -16 2 -1 -12 5 -7 -32 0 -7 11 15 -6 3 -23 -10 -28 -3
6334 -3 -25 -15 -10 -15 31 32 17 11 0 -10 5 -3 13 11 -28 -19 23 10 -4 1 14 5 -10 3 -5 7 -18 -17 -29 -14 -12 -9 -5 -10 29 -5 6 -9
6372 -9 -33 -12 6 -11 -12 -6 9 -13 16 -11 2 7 3 -2 -6 1 -1 6 13 7 -7 -6 0 -18 1 -7 7 6 -15 -4 11 16 -7 -10 -12 5 -17 13 19 -6
6412 -6 -21 -5 -18 -12 -8 21 6 15 -13 10 9 -5 -5 -6 -21 -1 -2 -2 -18 3 3 6 -8 7 -18 19 5 -11 0 -9 -16 -24 2 -23 -13 -6 28 -8
6450 -8 21 -1 -28 -10 5 -10 -11 -10 28 3 -5 3 -5 14 6 -13 -21 -1 2 -6 -29 18 -12 1 -11 11 13 3 -4 7 12 -7 16 -12 10 28 15
6487 15 -6 -2 29 -7 -11 2 -31 9 -2 -31 -48 -11 -1 6 23 6 10 -4 -2 -14 -4 12 -27 -54 -6 -30 -24 -4 3 20 -27 12 -3 8
6521 8 2 -8 12 32 25 12 -6 -2 13 39 7 -12 -7 -15 -17 -17 -16 8 6 16 -3 -5 -16 -16 -8 -32 6 -3 -3 6 -10 31 -2 -23 -12 9 -6 -11 -10
6560 -10 -3 6 -26 -18 -24 -28 -5 -19 -7 -7 -15 11 3 7 -9 -21 -13 -10 4 20 17 6 15 3 -6 -2 -7 8 0 -1 20 -5 -12 -18 -8 -10 12 -20 -10 -24 -18
6601 -18 35 -19 -9 25 -1 -31 -42 -3 -5 -8 9 -9 -20 -16 13 8 -4 24 -20 0 35 1 -7 -39 8 -23 -2 16 -9 13 -9 -13 -28
6634 -28 -20 -31 1 -6 -1 15 16 8 -18 -13 -42 -3 7 10 -25 10 27 -13 -12 6 8 9 -12 -5 5 -15 -1 8 1 -7 -24 5 13 16 -18 -24 1 -5 6
6673 6 -7 29 -11 4 2 -3 -4 -6 -5 19 -35 -3 -2 -13 25 3 5 -9 11 8 22 -3 14 -19 4 -12 -28 -26 3 10 -22 11 6 1 -9 12 13
6710 13 -8 21 -9 5 -7 1 20 -22 22 -1 24 6 11 4 -9 4 4 21 -12 3 3 -4 -26 -2 -1 -13 -24 -25 9 20 -10 -19 -16 -9 2 -8
6746 -8 -17 -3 -2 1 5 12 -1 -13 -31 -11 -1 -1 8 -5 -4 9 -19 -7 2 14 -8 -23 4 -6 14 10 -7 20 -15 9 20 -22 10 -4 0 11
6782 11 5 -16 -7 -18 -10 -33 -2 -22 -17 0 14 -20 5 27 -1 5 -19 -7 19 -9 -6 -21 -2 14 -5 -8 5 -5 -26 -12 -1 -3 4 24 -1
6817 -1 -8 -15 30 8 -1 -26 -27 -11 -19 -5 -17 16 -8 8 10 -17 -29 -6 -15 -9 -17 -11 -26 -9 -17 6 10 16 -24 -13 -19 -5 3 -8 -19 -24 1 -7 -17
6856 -17 -14 20 -16 19 -26 16 9 -13 -22 -1 -15 -9 -3 -5 31 -1 3 -4 11 7 6 -5 -17 35 -6 -29 -8 -8 -13 17 -7 -9 -14 5 -12 17 7
6893 7 -28 -32 -25 -23 20 14 -9 11 8 28 -20 -3 -23 5 10 -11 1 3 -19 -14 13 -6 -1 -11 -17 1 -17 -13 -28 -32 -4 -16 3 1 4 -14 13 5
6931 5 -24 -16 -12 -26 -9 -12 -26 -15 -36 13 10 5 -5 -16 -25 16 12 1 10 -17 -32 21 3 -14 -7 -4 -25 -23 -18 -7 -12 -20 12 -11 1 -23 -2 -1
6969 -1 -3 -31 -30 -11 -17 -27 7 -16 -7 -14 12 -10 -20 10 7 -6 -1 -15 5 -17 3 22 5 12 5 7 -11 34 9 -7 28 -15 -13 -9 -9 -15 2 8
7007 8 -18 -10 -12 0 5 -4 -7 -16 8 0 -25 -8 24 13 -1 -29 -29 17 42 -11 -11 -21 -21 -20 0 0 3 6 -5 -4 -9 6 0 -13 12 -14 7 13 -29 -4
7047 -4 5 -13 -5 -21 -11 -1 4 -37 -2 1 -8 17 6 4 -7 -20 -29 4 6 -9 0 -29 -8 2 3 17 -17 14 12 -20 10 1 1 2 5 6 -15 -21 28
7086 28 0 12 26 3 3 13 28 -21 -6 -2 3 13 -14 5 18 -1 -6 -5 13 -6 -9 27 8 14 -8 -17 -12 2 0 3 6 -10 -2 -3 24 -14 8
7123 8 -6 -6 8 -12 1 6 -7 -11 -13 0 -13 -8 -6 -4 19 -5 0 9 -13 1 -3 19 29 -17 10 -16 0 -9 -8 4 0 13 -14 11 2 4 6 13 -4
7162 -4 -2 -12 13 -14 2 -1 -24 12 -31 -15 -9 28 17 -4 -7 -5 -15 2 -10 21 -1 -5 -15 7 18 3 -12 -6 11 0 5 2 -20 -39 -2
7197 -2 -27 5 -22 -14 -32 -5 -7 9 -10 -4 -6 -17 -2 -47 3 -14 -20 -9 -13 -8 -5 -13 -25 -28 -12 1 -4 20 -3 -22 11 -1 -20 -10 -30 -3
7233 -3 20 23 3 11 -14 -2 -19 -15 -22 -19 -1 16 -4 -5 -12 -17 -14 -13 14 0 7 3 -15 14 -11 -1 3 -6 -5 -9 6 -8 -9 2 -6 12 13 -18 -7 2 9
7274 9 11 -12 -16 -18 10 14 12 0 14 -38 -4 8 -5 -2 -12 5 -6 0 0 -13 -26 8 -22 -3 4 2 -6 -24 -6 26 -44 1 11 0 13 12 -7
7311 -7 -13 25 -13 3 0 11 -4 6 -4 -18 0 1 -33 11 -15 -2 3 -13 -5 7 19 -7 3 -9 2 -10 -3 5 -25 -15 -12 5 0 -29 -1
7346 -1 8 -9 10 -27 -18 -44 1 -3 13 1 -27 13 19 13 -9 -3 -3 9 7 -13 23 3 25 -29 -12 -20 -2 6 -12 10 -32 -1 -7 1 2 -8 -4 -19
7384 -19 -16 -20 2 -6 -29 12 -30 -14 -11 14 -1 -19 -20 -4 0 -2 10 -11 -10 0 20 -10 -2 -19 -9 14 20 -9 5 -4 5 -5 -7 -29 -5 -8 2
7421 2 5 -9 -31 -15 -18 20 -19 -31 12 3 -8 -8 -6 3 -1 2 5 -8 -10 -22 5 3 -2 -18 -19 -11 -1 -7 -17 -4 -17 5 -8 8 -4 1 1 5 -3 -5 12
7462 12 21 2 2 6 10 3 9 -22 1 -12 6 -18 -2 -12 2 29 1 -4 -19 -13 9 11 -11 6 -23 -18 -9 3 6 6 -9 19 -27 -24 5 14 6 1 8
7501 8 2 -12 -5 -4 -17 -9 -17 -7 0 12 -15 18 19 4 -20 -22 -3 -12 17 -1 -8 14 -16 10 -22 -10 4 -8 1 -6 -8 -2 6 -20 7 4 -39 -21 -12
7540 -12 11 -8 -19 -5 -26 4 -4 14 7 -3 13 -9 -16 3 23 -2 9 23 3 17 -10 -41 10 -6 -27 -16 -15 7 21 1 16 4
7572 4 5 11 6 3 -17 -6 -25 -33 -29 16 -19 -8 -7 33 -22 -6 -17 -7 -7 -1 -9 -23 -26 -17 -21 -12 5 -1 -17 18 8 -14 -14 4 -24 -27 -20 -1 1 7 -17
7613 -17 14 -18 -5 -23 -30 22 -2 9 12 3 -10 7 -15 -18 5 -11 -7 -10 -29 -21 -12 3 -11 2 -3 6 22 1 -2 -37 -37 14 6 2 -34 13 -21
7650 -21 -16 -9 -11 -19 -14 13 10 -9 23 -9 2 -10 3 18 17 -23 -2 -12 36 32 -9 11 4 -19 24 -20 -9 3 -2 4 -11 -4 5 9 12 -5 3 11 0
7689 0 -1 -17 -11 20 -17 24 -37 -4 0 -36 18 -5 4 -10 -22 8 8 -26 -13 4 1 -7 -24 -21 -18 -8 4 -24 11 10 3 -2 -27 -7 1 -26 12
7726 12 0 -2 19 -12 5 -41 -37 1 10 25 -20 17 0 -31 3 -26 1 -6 -14 9 10 -2 15 7 -10 -43 7 -8 9 -18 2 20 -17 -1
7760 -1 -17 -14 -4 -11 22 6 -11 6 0 20 -9 -8 3 -10 13 -31 -24 -9 19 -13 -29 -9 25 -14 -3 3 8 -14 -22 -1 -41 -8 -2 17 14 -22
7796 -22 -16 25 23 -20 -25 -26 -3 -11 -1 6 11 25 -9 -1 20 -5 -24 12 -6 -5 -23 -10 -5 -7 -3 -10 -26 4 12 -22 -19 0 1 15 -17 16 8 -9 -3
7835 -3 -32 -25 5 2 16 -3 -8 -13 -5 21 -12 -16 9 10 -10 -21 26 7 19 -4 -30 -12 -19 -2 2 -3 7 9 -22 3 4 -7 -24 -2 -8 -15 -27 -3
7873 -3 19 -29 -11 -3 -24 -21 -24 3 -26 9 -1 -11 34 -18 -10 11 9 4 11 -21 4 3 -3 4 -5 -27 8 -21 -22 2 13 -6 2 4 -17 -21 -2 -6 -19
7912 -19 -6 -16 -20 -1 4 12 7 8 -41 -24 0 5 -1 -18 12 7 13 0 19 8 14 -7 15 11 -9 2 -10 2 -3 -6 10 -12 -25 -25 8 -1 9 5
7950 5 13 -14 -19 -4 18 -9 2 -9 -21 -7 -9 -4 -14 5 -31 34 -3 5 -6 14 0 -11 -37 7 7 -12 12 -2 -10 38 12 -15 18 32
7984 32 8 -7 23 7 -10 8 6 -5 -15 -19 -1 -3 10 17 -10 2 -3 13 -9 -48 10 2 -8 6 10 -5 7 2 36 6 -15 30 -7 -3 -2
8019 -2 6 -10 -29 9 -13 29 -6 16 3 15 9 1 13 -10 17 5 -1 17 6 -28 -4 -25 -9 16 -25 10 -11 17 11 -21 8 -19 -9
8052 -9 9 -31 0 12 6 14 22 -16 -11 12 2 -35 -5 -1 0 -2 -32 -25 7 -19 16 1 -23 -6 -20 2 7 26 -22 16 -11 -21 5 -1 -3 3 22
8089 22 3 -5 -2 -14 -18 -11 -6 12 3 -2 -4 -3 9 -14 -4 -26 -11 -10 -23 12 -3 -17 -12 5 3 -1 -9 -8 1 12 -7 -9 -3 8 7 -5 -16 8 -1 -8 -10
8130 -10 6 25 10 9 -4 17 -16 12 -4 -6 -10 -25 -2 9 -38 -11 22 -5 -1 6 -21 -4 -22 -8 5 1 -2 -7 25 -29 -9 15 1 -8 -32
8165 -32 -12 18 -3 -20 6 7 -32 1 13 -5 5 9 -22 26 26 2 -16 -17 -33 -5 1 -20 -19 -11 -10 -6
8191f
$$ Imaginary data points
##PAGE= N=2
##DATA TABLE= (X++(I..I)), XYDATA
0 0 0 0 0 0 0 0 -8 8 0 8 -8 8 -16 16 -24 32 -36 46 -56 64 -80 96 -112 130 -152 176 -206 238 -274 314 -358
31 -358 408 -462 522 -590 663 -745 834 -930 1039 -1154 1282 -1421 1573 -1737 1921 -2117
47 -2117 2335 -2571 2832 -3122 3439 -3790 4184 -4627 5127 -5698 6356 -7124 8037 -9139
61 -9139 10500 -12233 14524 -17699 22405 -30094 44784 -82670 379636 607514 -630681
72 -630681 -493493 321641 255563 -185655 24658 144425 -30710 -167376 -113503 97001
82 97001 275496 -30897 -272003 38057 194784 -149523 -118339 231156 87134 -260222
92 -260222 -69543 240404 84777 -209900 -91114 185831 65734 -220677 -24705 285764
102 285764 15964 -317677 -31321 274665 53240 -187250 -61985 121051 69656 -135124
112 -135124 -102197 213396 164256 -276096 -185194 281691 105957 -262046 37193 245547
122 245547 -146574 -213300 170221 148155 -124169 -67715 65912 19874 -47210 -59517 55157
133 55157 171345 -50373 -262003 49014 272590 -92230 -242819 150424 214671 -171848
143 -171848 -193343 149190 181222 -102193 -176831 55887 164006 -45642 -148603 74375
153 74375 146406 -100798 -143015 101181 124152 -82500 -94862 66287 70603 -76703 -73218
164 -73218 114301 111436 -141819 -139006 152312 114008 -176993 -64774 212278 39992 -216123
175 -216123 -41801 178957 52777 -131965 -69403 103794 88092 -109658 -109033 137059 126723
186 126723 -153993 -119410 148155 75649 -138372 -26163 128592 1792 -108116 1380
196 1380 84425 564 -76163 -281 88473 -6805 -114962 19792 142365 -30895 -150341
207 -150341 46074 143096 -64677 -141726 66657 146965 -44994 -142962 26645 138097 -25850
218 -25850 -145186 29973 152781 -31628 -146429 33215 126301 -35805 -101007 40583
228 40583 83842 -45917 -84088 42312 86185 -40820 -79449 59480 75857 -88909 -80258
239 -80258 106432 77343 -113742 -67597 117504 64611 -113778 -68802 107641 78650 -106243
250 -106243 -95070 105441 108119 -103144 -106324 106461 97810 -107982 -87215 100051 72668
261 72668 -87637 -58601 76386 50411 -65805 -42121 63023 33571 -70113 -28459 77236
272 77236 19549 -84135 -5499 94863 -3851 -103348 6798 104829 -11286 -109285 12195
283 12195 116820 -6220 -119382 1447 118113 -1466 -117879 -71 113980 2449
293 2449 -105456 -2551 97737 3793 -89075 -3241 80257 -3146 -75925 11805 74236 -19618
305 -19618 -68423 32715 64097 -47334 -64095 56425 63092 -63129 -62168 70821 67409 -73871
317 -73871 -74539 72890 78710 -74124 -84428 73953 89776 -70285 -90553 66829 88806 -63586
329 -63586 -86777 57079 79883 -52639 -71286 50933 64697 -47495 -55707 45379 44254
340 44254 -48846 -36727 52772 31256 -55261 -23002 62682 17786 -71559 -16724 76987 14745
352 14745 -81958 -12707 88388 15431 -90583 -18451 90311 20364 -90469 -23900 88164
363 88164 26617 -83395 -25965 79283 24835 -73898 -23066 65603 16884 -59876 -10281 56093
375 56093 4930 -51464 2888 48689 -13254 -50676 20964 52374 -28254 -53269 36792 57142
387 57142 -41968 -61502 43242 63975 -44203 -67524 43939 72590 -40261 -74609 37696
398 37696 75209 -35884 -75080 32680 71399 -29940 -64871 29563 59656 -27600 -53159
409 -53159 25762 44428 -28452 -38460 32499 34643 -35838 -29396 41506 24847 -49367 -23824
421 -23824 54851 22833 -60044 -22887 65419 25674 -68430 -28678 69702 30437 -71472 -33652
433 -33652 70438 36180 -66044 -35279 62302 34399 -57858 -33957 51252 30893 -45819 -25976
445 -25976 43330 21972 -40379 -15477 39105 7008 -40785 139 42473 -6650 -43048 14410
457 14410 46049 -19972 -50199 21741 52589 -22922 -55339 22953 58798 -21019 -61139 18524
469 18524 62356 -16502 -63504 13145 61665 -11079 -57904 11389 54620 -11365 -50245 11097
481 11097 43221 -13846 -37145 18021 33269 -21037 -28529 25633 24835 -31884 -23946 37290 24229
494 24229 -41788 -24599 46862 27104 -50046 -29807 51996 32248 -53898 -36071 53488 39324
506 39324 -50424 -39129 48407 38066 -46918 -38232 42200 35823 -36697 -30855 33069 25947 -30742
519 -30742 -21590 29191 16868 -29499 -12696 30057 7308 -31814 -628 36779 -3525 -41878
531 -41878 4548 43939 -6105 -45510 8374 49475 -7839 -53130 5246 54777 -2293 -54065
543 -54065 515 51630 -394 -48923 881 47396 1507 -43320 -4276 36077 2296 -31196
555 -31196 2700 30908 -6147 -30670 8975 27494 -15021 -24324 22946 22940 -30214 -23993 34012
568 34012 25874 -34134 -26363 33994 26348 -36576 -30368 37849 36696 -34753 -39177 31368 37856
581 37856 -30480 -36681 29911 36291 -27472 -34879 24272 31807 -21223 -26108 21099 19950 -23617
594 -23617 -15968 25080 12545 -24186 -6821 25085 1850 -28642 -1033 31913 2592 -34762
606 -34762 -4367 38265 5724 -42309 -6410 46173 6605 -48978 -7729 47847 8108 -43768
618 -43768 -7163 39714 7206 -35972 -8997 31136 9563 -27003 -8012 25078 5765 -23660
630 -23660 -2250 22364 -2683 -21840 7876 22120 -12336 -22647 16650 24277 -19884 -26039
642 -26039 22601 27700 -25295 -30011 26277 32045 -24310 -31686 21987 30584 -20306 -31648 17006
655 17006 33040 -12699 -32703 10331 30849 -10944 -28593 13101 25417 -15702 -21716 16844
667 16844 16201 -17509 -9518 20034 5362 -23456 -5522 24720 6529 -25286 -6179 28342 6732
680 6732 -32771 -9032 36053 12092 -36795 -14248 35737 14689 -34521 -14141 34692 15189
692 15189 -33667 -16767 29571 15283 -24988 -10839 22733 7256 -21085 -5699 18078 3991
704 3991 -15155 -1299 14134 -2330 -16383 5286 20574 -6830 -23805 8524 24995 -12445
716 -12445 -26788 16044 29612 -16078 -30781 13766 29568 -11734 -28291 10171 28268 -8037
728 -8037 -28359 5729 27606 -3704 -25095 3398 21724 -5089 -19257 7108 17665 -8155
740 -8155 -14886 10190 11804 -14104 -10173 18146 9571 -21220 -9027 23557 8713 -25160 -9142
753 -9142 25932 10242 -26575 -12916 26132 15989 -24895 -17873 24153 18724 -24166 -19391 23068
766 23068 18612 -21098 -16137 19180 13293 -17024 -10475 14935 7498 -13554 -4905 13095 2645
779 2645 -13293 -20 14887 -2043 -17153 3420 19147 -4726 -21323 5769 24034 -5539
791 -5539 -26012 4808 26994 -4380 -27747 3605 27726 -2521 -26535 1466 24483 -601
803 -601 -22101 -306 19300 423 -17047 -45 15316 -792 -13548 2768 11957 -6022 -11291
816 -11291 9257 10902 -11997 -10155 14922 10041 -17232 -10622 18650 11702 -19359 -13057 19570
829 19570 14854 -18889 -16064 18148 16958 -17281 -17881 15774 18024 -13887 -16969 12644 15618 -11749
843 -11749 -13977 10775 11517 -10481 -8806 10587 6075 -11041 -3370 11992 1115 -13626 18
856 18 14996 -917 -16712 1449 19021 -1109 -21079 275 22351 441 -23259 -1222 23642
869 23642 2310 -23025 -3092 21968 3797 -20397 -4319 18339 4274 -16142 -3433 14390
881 14390 2596 -12474 -1167 10712 -913 -9687 3085 9301 -5215 -9188 7516 9643 -9765
894 -9765 -10701 11295 11679 -12695 -12843 13517 14152 -13543 -15261 12928 15896 -12151 -16598 10902
908 10902 16796 -9485 -16333 8379 15434 -7491 -14139 6700 12207 -6418 -10020 6755 8104
921 8104 -7193 -6026 8240 4140 -9868 -2806 11580 1940 -13235 -1210 15117 1205 -16696
934 -16696 -1738 17694 2437 -18534 -3462 18980 4743 -18762 -5779 18174 6370 -17405
946 -17405 -6948 15997 6895 -14317 -6284 12707 5425 -11092 -4337 9582 2614 -8710 -860
959 -860 8268 -938 -8053 3024 8416 -4926 -9247 6395 10239 -7418 -11255 8293 12724 -8382
973 -8382 -13938 8144 14898 -7704 -15605 6985 15853 -6056 -15428 5203 14684 -4383 -13552 3509
987 3509 11895 -3158 -10208 3281 8690 -3699 -7153 4484 5527 -5953 -4389 7520 3549 -9162
1001 -9162 -2994 10845 2864 -12346 -3224 13481 3646 -14432 -4445 15119 5589 -14978 -6455
1014 -6455 14492 7059 -13867 -7658 12891 8098 -11481 -7946 10282 7439 -9164 -6493 8217
1027 8217 5052 -7697 -3409 7366 1703 -7072 234 7204 -2171 -7934 3396 8718 -4171 -9640
1041 -9640 4749 10781 -4978 -12118 4731 13267 -4296 -14234 3607 14632 -2882 -14482 2361
1054 2361 14054 -1848 -13361 1176 11963 -788 -10193 998 8666 -1299 -7210 1799 5873
1067 5873 -2552 -4818 3679 4099 -5024 -3816 6677 4008 -8216 -4443 9501 4823 -10740 -5283
1081 -5283 11726 5987 -12054 -6757 11700 7155 -11039 -7641 10076 7972 -8928 -8138 7877
1094 7877 8059 -6898 -7603 6090 6598 -5778 -5266 5836 3860 -5963 -2163 6284 378 -6931 1113
1109 1113 7693 -2085 -8340 2852 9250 -2987 -10125 2728 10990 -2110 -11761 1372 12413
1122 12413 -415 -12672 -225 12751 748 -12467 -1178 11546 1250 -10253 -908 8900
1134 8900 491 -7537 -161 5973 -509 -4748 1401 3989 -2420 -3737 3489 3885 -4604 -4366 5704
1149 5704 4903 -7004 -5719 8166 6732 -8697 -7455 8735 7699 -8590 -7856 8193 8135 -7262
1163 -7262 -8155 6085 7899 -4944 -7344 4180 6661 -3828 -5930 3732 5154 -3681 -3813 4103
1177 4103 2276 -5091 -1065 6127 189 -6955 540 7623 -1234 -8486 1388 9277 -1065 -10009 248
1192 248 10291 635 -10257 -1333 10314 1925 -10423 -2715 10035 3247 -9081 -3074 8144
1205 8144 2518 -7250 -1906 6322 1283 -5214 -393 4299 -658 -3701 1834 3703 -2836 -4058 3551
1220 3551 4496 -4290 -5052 5193 5974 -5806 -7029 5867 7718 -5780 -8155 5493 8349 -5129
1234 -5129 -8429 4483 8232 -3742 -7824 2934 6932 -2449 -6036 2253 5150 -2164 -4254 2254
1248 2254 3218 -2765 -2267 3617 1589 -4481 -985 5465 675 -6380 -487 7275 566 -8045 -880
1263 -880 8604 1450 -8722 -2038 8686 2596 -8546 -3189 8102 3679 -7439 -3851 6724 3700
1277 3700 -6056 -3452 5244 2841 -4607 -2063 4110 1071 -3846 -28 3796 -1045 -4010 1957 4271
1292 4271 -2834 -4710 3570 5431 -3887 -6147 3927 6732 -3748 -7214 3515 7689 -3016 -8017
1306 -8017 2459 8060 -1849 -7773 1428 7196 -1104 -6462 979 5731 -867 -4771 899 3707 -1317
1321 -1317 -2819 1934 2214 -2607 -1732 3270 1384 -4111 -1282 4913 1475 -5735 -1903 6323 2419
1336 2419 -6702 -2957 6906 3333 -6979 -3760 6774 4147 -6184 -4244 5480 4104 -4777 -3814
1350 -3814 4197 3508 -3586 -2950 3156 2264 -2882 -1420 2976 519 -3307 307 3771 -1033 -4107 1781
1366 1781 4730 -2264 -5354 2414 5935 -2481 -6310 2176 6719 -1777 -6872 1226 6925 -565 -6961
1381 -6961 97 6580 316 -6189 -479 5561 593 -4874 -500 4162 70 -3410 604 2778 -1135
1396 -1135 -2164 1945 1778 -2612 -1497 3254 1861 -3883 -2086 4462 2621 -4845 -3193 5026 3740
1411 3740 -5147 -4177 5063 4513 -4760 -4579 4416 4507 -3744 -4341 3265 3980 -2637 -3409 2307 2873 -2254
1428 -2254 -2161 1957 1490 -2286 -885 2493 210 -3049 436 3615 -610 -4253 1004 4792 -962 -5316
1444 -5316 1127 5935 -790 -5982 235 6067 205 -5934 -663 5611 1171 -5213 -1400 4859 1412
1459 1412 -4358 -1460 3800 1007 -3272 -597 2980 159 -2478 640 2165 -1460 -2025 1990 2151
1474 2151 -2694 -2160 3056 2366 -3505 -3067 3593 3524 -3746 -4045 3727 4502 -3415 -4575 3146 4758 -2679
1491 -2679 -4541 2299 4323 -1866 -3796 1590 3295 -1309 -2702 1220 2056 -1337 -1449 1564 899 -1888
1507 -1888 -435 2388 85 -3008 42 3594 -114 -4112 41 4600 149 -4946 -483 5124 810
1522 810 -5093 -1197 4932 1544 -4657 -1777 4204 1905 -3755 -1927 3257 1759 -2817 -1384 2494
1537 2494 972 -2164 -378 2015 -273 -1929 944 2070 -1506 -2245 2054 2541 -2375 -2886 2594 3297
1553 3297 -2635 -3652 2536 4023 -2300 -4289 1983 4427 -1660 -4437 1300 4289 -953 -3990 668
1568 668 3537 -529 -3068 439 2478 -501 -1895 735 1380 -1058 -930 1492 622 -1971 -445 2488
1584 2488 450 -2945 -498 3462 770 -3781 -1016 4038 1377 -4098 -1659 4078 1962 -3845 -2143
1599 -2143 3549 2232 -3180 -2256 2727 2069 -2339 -1831 1945 1465 -1687 -1048 1500 449 -1476 30
1615 30 1600 -575 -1833 999 2115 -1395 -2526 1588 2887 -1743 -3218 1689 3572 -1550 -3751
1630 -3751 1298 3965 -956 -3989 660 3935 -135 -3615 -61 3348 208 -2993 -267 2647 194
1645 194 -2072 37 1623 -314 -1196 737 957 -1228 -862 1672 715 -2142 -646 2521 834 -2914
1661 -2914 -1194 3056 1532 -3120 -1834 3098 2177 -3022 -2435 2797 2519 -2407 -2532 2194 2525 -1876
1677 -1876 -2105 1560 1842 -1327 -1354 1092 907 -989 -501 1205 99 -1288 199 1561 -561 -1755
1693 -1755 775 2277 -986 -2756 973 3056 -783 -3255 603 3272 -460 -3462 115 3407 145
1708 145 -3267 -490 2952 588 -2660 -747 2351 765 -1904 -636 1560 394 -1267 37 1172
1723 1172 -414 -1014 931 1017 -1390 -920 1788 1033 -2141 -1326 2304 1655 -2422 -1920 2478 2083 -2175
1740 -2175 -2377 2109 2533 -1842 -2657 1460 2577 -1265 -2374 1067 2221 -913 -1875 723 1485 -601
1756 -601 -924 570 537 -1007 -148 1068 -88 -1073 -31 1536 -466 -1945 477 2185 -137 -2577
1772 -2577 80 2871 224 -2804 -453 2944 624 -2912 -778 2656 903 -2483 -927 2107 1021
1787 1021 -1727 -833 1356 668 -1080 -394 823 21 -816 186 865 -465 -930 904 1008 -1493 -1430
1804 -1430 1774 1586 -1732 -1676 1883 2090 -1769 -2105 1607 2402 -1406 -2331 1000 2519 -542 -2399 621
1821 621 2283 -485 -2031 233 1726 -105 -1371 411 984 -310 -525 667 481 -907 -230 1297
1837 1297 4 -1602 97 1717 266 -1815 -136 2149 548 -2201 -688 2309 875 -2382 -988
1852 -988 2294 1137 -1998 -1115 1792 1268 -1584 -1226 1342 977 -1032 -551 714 416 -447 -25 576
1869 576 -151 -792 510 924 -557 -1058 970 1154 -1115 -1579 1207 2041 -1329 -1995 1068 2127 -895
1886 -895 -2338 748 2293 -423 -2157 217 2024 36 -1981 -61 1613 -10 -1300 18 1104
1901 1104 -160 -708 208 513 -643 -258 762 339 -1001 -349 1412 115 -1622 -306 1640 545
1917 545 -1852 -770 1907 1161 -1826 -1400 1778 1286 -1701 -1325 1504 1460 -1086 -1362 1085 1301 -915
1934 -915 -1204 801 928 -295 -310 642 107 -457 44 620 -176 -662 373 1042 -700 -1317 597 1419 -578
1953 -578 -1792 519 1718 -489 -1895 470 2076 35 -1812 -71 1907 106 -1559 -310 1522
1968 1522 447 -1396 -351 1025 97 -882 -81 528 15 -386 364 373 -730 -428 1020 442 -1031 -445
1986 -445 1292 609 -1446 -832 1510 992 -1462 -1185 1335 1141 -1157 -1428 1144 1376 -926 -1538 462
2003 462 1453 -612 -1190 473 1034 -312 -720 351 597 -288 -241 413 57 -639 226 753 -313 -1038 400
2022 400 1146 -379 -1416 381 1521 -184 -1608 132 1743 116 -1706 -283 1695 437 -1629
2037 -1629 -436 1340 499 -1266 -416 1034 490 -801 -271 714 88 -497 101 360 -327 -442 473 450
2055 450 -824 -514 875 548 -1006 -799 1059 908 -1104 -1218 1065 1242 -962 -1353 931 1410 -615
2072 -615 -1312 546 1319 -407 -1212 198 1027 -130 -873 92 601 -227 -444 245 221 -388 -97 448 -81
2091 -81 -767 132 937 -136 -1074 200 1149 1 -1167 -82 1419 215 -1435 -372 1490 610 -1378
2108 -1378 -601 1155 703 -1012 -573 917 521 -621 -378 647 480 -449 -389 395 -7 -355 252 282 -318
2127 -318 -366 653 671 -666 -658 883 832 -722 -999 776 1221 -816 -1171 541 1324 -530 -1418 364 1245
2146 1245 -319 -1162 211 1021 83 -784 -44 630 160 -519 127 352 -88 -253 406 96 -432 111 571
2165 571 -43 -950 5 1047 99 -1144 -167 1200 263 -1228 -404 1239 526 -1074 -694 974 780 -889
2183 -889 -800 710 742 -603 -674 468 567 -351 -380 288 189 -253 -11 257 -134 -295 325 398 -445 -510 544
2204 544 681 -545 -827 536 974 -435 -1043 391 1204 -281 -1206 150 1184 -77 -1115 -25 1009
2221 1009 87 -826 -143 698 122 -503 -81 360 26 -236 107 145 -233 -104 432 70 -606 -98 758 184
2241 184 -888 -247 979 380 -984 -484 997 598 -925 -677 863 777 -726 -753 590 798 -434 -756
2259 -756 327 653 -216 -524 170 356 -178 -198 175 35 -249 131 338 -217 -479 333 572 -379 -720 365
2279 365 826 -332 -923 240 988 -153 -1031 50 1035 75 -995 -150 935 193 -832 -248 680 270
2297 270 -522 -195 406 171 -274 -45 203 -64 -137 192 108 -339 -151 496 203 -611 -283 722 377 -751
2317 -751 -516 757 588 -745 -687 659 765 -574 -801 443 812 -334 -764 246 646 -131 -540 89
2335 89 426 -73 -304 93 176 -121 -13 208 -61 -307 129 476 -198 -556 233 718 -178 -790 138 852 -22
2356 -22 -899 -40 920 168 -838 -242 825 344 -701 -380 609 376 -504 -355 336 259 -255 -178 217 69
2376 69 -124 63 113 -198 -143 318 182 -439 -240 517 368 -546 -454 590 576 -548 -634 505 700 -415 -744
2397 -744 347 755 -233 -743 177 669 -105 -545 56 456 -5 -338 13 228 -43 -120 100 25 -228 59
2417 59 313 -104 -443 74 577 -73 -622 11 716 48 -750 -123 773 240 -759 -287 660 357 -599 -400
2437 -400 500 440 -379 -376 302 346 -204 -270 160 166 -116 -39 92 -69 -130 184 174 -299 -225 347 299 -418 -396 425
2461 425 486 -420 -596 370 647 -284 -696 238 705 -130 -668 48 643 -16 -554 -60 481 76 -357 -44
2481 -44 255 69 -146 29 86 -91 -18 212 -8 -282 56 422 5 -473 -72 574 133 -573 -203 615 285
2502 285 -632 -351 567 411 -533 -443 439 417 -299 -420 259 397 -143 -312 129 250 -89 -150 80 57 -77
2523 -77 56 116 -131 -192 244 262 -245 -326 296 452 -276 -478 259 556 -208 -606 126 625 -50 -609 -30 569
2545 569 54 -503 -132 474 145 -368 -140 263 141 -190 -54 97 11 -72 108 11 -188 12 269 21 -355
2566 -355 -64 412 129 -425 -234 503 273 -488 -262 459 432 -470 -493 394 474 -287 -375 147 448 -118 -301
2587 -301 -27 261 -53 -237 -15 192 -112 -95 -17 -78 -48 3 174 -253 -271 196 273 -270 -408 0 513 -309
2609 -309 -550 174 548 -55 -565 -110 514 191 -423 -218 400 247 -283 -223 242 185 -156 -140 96 88 -64 13
2631 13 42 -94 -15 181 44 -254 -70 309 149 -358 -186 356 244 -375 -329 353 376 -351 -427 253 448 -193
2653 -193 -439 115 417 -91 -350 28 288 18 -235 -18 139 10 -54 29 6 -67 79 123 -112 -234 113 278
2675 278 -91 -335 88 408 -27 -422 -6 481 89 -471 -131 435 198 -402 -241 358 266 -262 -236 216 220
2696 220 -146 -204 103 129 -62 -69 13 -17 -40 95 48 -143 -70 233 125 -259 -183 285 210 -297 -293 264 340 -248 -388
2721 -388 165 417 -135 -423 75 397 -19 -340 -59 317 24 -244 -60 165 47 -91 -21 40 -33 26 76 -50
2743 -50 -158 50 205 -51 -269 0 325 -21 -382 -38 370 116 -380 -165 365 235 -304 -227 270 260 -233
2764 -233 -234 199 274 -104 -191 63 145 -45 -106 30 29 -12 29 6 -92 -20 135 110 -199 -144 206 204 -207 -265 184 294
2790 294 -184 -341 132 373 -74 -367 19 371 15 -304 -83 292 90 -243 -93 171 120 -124 -52 65 53
2811 53 13 23 -1 -55 51 150 -25 -184 18 253 46 -289 -61 301 110 -290 -132 306 185 -270 -227 234
2833 234 248 -195 -291 132 262 -101 -232 58 197 -27 -124 13 74 -10 -1 2 -36 -30 80 79 -132 -107 133 202 -142
2858 -142 -227 133 256 -98 -302 77 332 -16 -311 -28 319 76 -281 -88 270 128 -215 -137 154 92 -74
2879 -74 -97 43 58 -44 -36 -5 -27 -6 71 -27 -136 -2 191 15 -226 -75 249 108 -243 -152 223 198 -222 -222 188
2904 188 263 -149 -259 123 257 -88 -220 7 202 -1 -162 -14 76 13 -25 16 -4 -22 72 11 -70 -73 95 112
2928 112 -105 -168 66 218 -70 -252 26 289 -1 -293 -65 256 77 -256 -115 221 108 -178 -131 139 158
2949 158 -80 -107 51 99 6 -50 -1 21 -5 40 7 -56 18 132 26 -159 -71 200 114 -178 -136 199 157 -179 -231
2974 -231 139 223 -109 -231 55 219 -15 -235 -37 191 6 -148 -53 84 56 -81 -31 35 20 -4 18 -52 -65
2997 -65 83 105 -78 -154 67 168 -28 -196 14 216 13 -246 -31 220 110 -225 -98 192 151 -215 -163 137
3019 137 142 -83 -136 49 114 -21 -76 -25 45 18 -8 -14 -56 19 59 13 -118 -48 140 89 -175 -131 142 180 -115 -191 116
3046 116 227 -90 -212 43 229 15 -223 -8 183 40 -141 -69 115 44 -87 -39 51 19 -21 -30 -25 -32 23 68 -25
3071 -25 -101 31 134 -39 -201 -10 182 11 -197 -46 197 92 -172 -136 140 135 -149 -172 109 157 -62 -143 65
3094 65 132 -24 -76 1 45 38 7 -4 -35 19 62 30 -90 -38 94 95 -118 -114 118 142 -119 -180 86 175 -45 -221 30
3121 30 188 -6 -185 -35 179 45 -152 -78 127 91 -73 -45 40 80 -6 -34 -17 10 49 73 -33 -53 19 92 -7
3146 -7 -156 -8 148 24 -160 -78 157 83 -142 -127 152 128 -128 -138 82 147 -37 -172 40 108 -33 -107 -42 72
3170 72 18 -50 -14 5 15 15 16 -66 -21 92 72 -85 -89 70 120 -59 -164 51 132 -45 -158 8 165 29 -168 -55
3196 -55 154 54 -159 -88 101 93 -89 -96 35 64 -53 -49 11 9 18 20 -6 -61 16 67 22 -106 -22 133 44 -150 -61 137
3224 137 96 -120 -99 118 134 -92 -131 81 159 -41 -123 22 133 14 -84 -22 95 38 -31 -11 6 36 11 12 -35 0
3250 0 45 53 -62 -77 74 103 -38 -99 30 145 -21 -158 -19 168 18 -153 -58 143 87 -118 -96 95 105 -65
3274 -65 -67 44 78 -2 -58 -13 8 4 25 -15 -19 -3 54 3 -60 3 92 58 -102 -41 85 64 -113 -116 84 115 -99 -111 45
3303 45 141 3 -128 15 98 24 -81 -30 66 24 -52 -41 37 8 10 -7 -21 12 50 35 -51 -62 56 100 -25 -95 18
3330 18 116 -4 -148 -3 143 -1 -102 -63 114 49 -98 -72 79 81 -44 -56 36 88 7 -42 -6 53 27 -10 7 -1
3356 -1 20 34 27 -60 -1 102 13 -89 -54 100 80 -90 -77 83 102 -52 -93 61 131 -33 -87 34 66 33 -97 -30
3382 -30 44 29 -40 -39 25 34 -9 -21 -11 1 26 -20 -41 -44 17 35 -58 -86 38 78 2 -104 -11 138 37 -101 -44 102 79
3411 79 -84 -73 71 82 -49 -108 30 60 1 -56 10 68 -5 -11 18 15 27 15 16 -62 -11 71 34 -76 -61 57 64 -82 -67
3440 -67 46 80 -47 -115 30 123 -3 -117 -19 89 8 -83 -38 71 32 -73 -50 12 30 -9 -30 -6 13 22 22 -25 -17 49
3468 49 85 -10 -62 19 84 4 -101 -31 106 37 -106 -50 67 56 -69 -91 54 81 -86 -89 -6 80 -14 -89 2 26 -3
3495 -3 -12 -16 -29 20 -6 0 -12 1 18 10 -62 -45 46 76 -50 -59 50 68 -20 -90 32 119 21 -110 13 74 45 -72 -50 55
3525 55 50 -12 -29 31 48 -6 -36 19 2 3 1 -32 -8 27 20 -12 -43 12 55 -12 -97 -29 67 25 -90 -65 70 65 -43 -43 53 68
3557 68 -43 -78 35 90 -7 -58 24 66 0 -19 21 46 19 -20 -38 -52 2 46 31 5 -40 43 16 -35 -76 45 59 -48
3585 -48 -87 5 97 14 -92 -31 64 26 -82 -33 46 23 5 -34 38 53 -19 -14 4 32 4 -17 -22 -5 -13 35 -7 -20 23 81 26
3616 26 -64 -16 68 60 -70 -49 65 64 -62 -54 53 69 -32 -87 -1 65 13 -62 -1 64 40 -32 -12 33 12 -21 -2 -52 27
3645 27 36 -1 -43 -36 44 28 -21 -43 -2 72 -38 -58 5 73 3 -62 -6 51 12 -80 -17 44 26 -35 -34 24 39 9 -37 -3 24
3676 24 2 -30 -16 -9 -14 36 -15 -29 5 57 22 -79 -45 49 30 -68 -80 62 71 -55 -70 16 86 -15 -66 0 74 14 -44 -10
3706 -10 35 33 -34 -1 -15 16 6 -7 9 15 14 1 -2 -7 30 10 -24 -82 17 54 -13 -51 8 58 3 -55 -9 38 14 -59 -44 56
3738 56 32 -49 -51 31 53 -20 -31 -27 49 0 -7 -3 11 17 31 8 -5 25 34 28 -49 -20 44 15 -45 -40 36 53 -42 -60 27 72 -39 -66
3772 -66 0 56 6 -84 -38 54 11 -71 -15 43 14 17 -23 35 -4 -2 8 -28 -6 36 -17 5 -33 20 66 -6 -52 13 73 23 -78
3803 -78 -6 80 29 -59 -45 17 61 -23 -70 16 33 -9 -22 -26 46 -9 -24 -24 8 19 20 18 -18 13 35 -7 -20 -27 48 35 -27 -24 11
3836 11 45 -33 -25 25 46 -9 -72 -11 49 31 -26 -6 73 35 -63 -5 18 34 15 -1 -20 0 19 9 4 8 40 43 12 -45 -4 26
3868 26 7 -43 -5 27 40 -58 -13 48 33 -51 -26 43 40 -35 -53 23 72 15 -46 1 30 -20 2 0 27 4 -1 -4 23 -3 20 14 -26
3901 -26 -17 -5 20 -24 -9 15 60 -20 -40 27 37 -8 -30 -1 47 29 -43 -17 37 3 -27 -51 13 19 -26 -13 17 34 27 -22 -21 16
3933 16 15 24 1 3 19 40 -5 -33 0 22 47 -45 -22 49 40 -19 -29 26 66 9 -38 -2 47 -14 -34 9 5 31 -26 -32 11 21 -1
3966 -1 -34 -12 14 4 4 -26 -19 18 26 -37 -30 10 47 5 -30 7 55 28 -29 19 68 50 -4 -44 36 35 -2 -31 10 29 2 -27 -13
3999 -13 27 -4 -12 -30 -1 17 34 -19 -15 -11 32 -15 -58 -15 56 1 -37 -6 30 47 -23 -30 56 47 -12 -49 35 39 21 -54 14 61 34
4032 34 0 31 11 27 -17 -17 -14 11 35 -8 6 -12 -3 16 -1 -27 13 23 -18 -42 14 23 24 -45 -4 47 -22 -53 -2 50 24 -26 -13
4065 -13 1 51 6 -30 9 33 8 -16 -11 20 7 -1 8 -10 0 39 32 -31 -15 60 47 -7 -28 18 32 -27 -48 26 49 -17 -41 -34 23
4098 23 -5 -50 1 14 14 -17 4 -23 -4 -5 -5 -8 11 -10 4 -35 22 33 12 -24 -5 8 51 3 -22 -4 38 10 -55 -4 31 6
4130 6 -23 -23 37 30 -4 -40 21 34 0 -13 16 9 -19 -44 -3 17 -20 7 2 -23 31 -3 -10 -19 -14 13 14 -21 -23 30 41 -20 -30 5 72
4165 72 -17 -47 21 42 3 -46 -10 20 19 -24 4 39 14 16 -32 8 -19 5 16 -25 -3 10 15 -27 -29 -16 30 -19 -44 9 18 34 -25
4198 -25 -21 18 28 -34 -33 36 18 1 -27 6 17 3 -48 -28 40 8 -9 -6 4 18 0 -13 0 29 13 -8 -5 -17 8 24 -1 -33
4230 -33 3 27 -20 -41 18 37 -22 -31 -15 17 2 -34 -37 11 32 -29 -29 11 8 11 -42 1 36 5 -22 -12 -5 10 5 -26 -5 -7 37 7
4264 7 1 11 37 8 -15 -15 46 27 -32 9 24 19 -18 -8 30 35 -4 -30 5 49 -4 -13 -4 21 9 16 -17 0 -8 5 7 -10 6 9 -14 -15
4300 -15 -12 8 9 6 -43 19 43 -1 -14 9 52 35 -12 5 41 27 -21 -7 25 21 4 -31 26 17 -5 7 -17 15 6 18 8 0 -4 -19
4334 -19 0 -33 5 0 -25 -21 -11 23 36 -29 -1 3 17 -25 -19 -5 12 8 -1 -13 37 20 -10 0 37 13 1 8 23 -4 16 9 2 15 31
4369 31 19 -21 -9 6 23 -15 -19 38 44 7 -34 -5 45 -12 -7 -30 23 45 -15 -35 9 4 -21 -15 8 9 4 -13 14 13 20 22 -33 -10 19
4404 19 19 27 -24 -20 7 -20 -13 -7 14 18 -9 -25 35 27 2 -27 -15 48 3 -36 4 -17 1 -4 -20 22 18 0 -23 10 14 6 -18 -16 -4 8
4440 8 0 14 12 1 17 3 -3 28 13 22 -43 -8 46 3 -32 -20 36 27 1 -6 14 32 -20 -6 26 -5 -13 -24 -11 3 6 -33 -12 -24 8
4475 8 -5 -6 -18 5 -7 -18 -53 -14 26 14 -25 -33 8 11 -18 -38 13 34 -13 -28 0 12 -2 -14 -1 30 -7 1 -1 -9 31 14 1 -5
4509 -5 22 5 1 20 -9 -5 29 -24 1 -18 11 2 -49 16 17 17 -16 -33 29 5 -24 -60 -10 -3 -18 -45 -12 9 -7 -11 17 30 12 -3
4543 -3 -7 15 8 17 -20 -14 -10 6 17 -16 -20 7 1 7 -23 4 -4 1 -6 -6 16 -26 -41 -2 17 1 -28 -11 7 -3 -29 -4 -10 -2 11 4 22 -15
4581 -15 -6 25 -37 -15 17 9 -10 6 12 22 26 -2 14 23 8 -3 -25 -1 6 -13 -26 10 20 6 -10 6 13 18 -10 -7 18 6 -7 2 -11
4616 -11 -17 -9 4 -33 24 14 -5 -22 -16 3 -14 -26 -9 -2 11 10 -35 -25 42 3 -37 1 6 15 11 -16 15 17 -18 -5 20 12 24 -7 -5 11
4652 11 -9 -7 -41 -11 20 16 -17 -42 0 -19 7 -24 3 21 2 -16 -2 1 -9 -3 -38 25 15 0 -37 2 29 9 0 -26 5 21 -9
4685 -9 6 14 14 -1 5 5 -15 32 -10 -17 21 -13 3 0 -10 17 19 -17 -9 4 15 -2 -19 1 12 2 -40 -3 -5 -18 -9 -22 20 19 -6 -30
4721 -30 -3 -4 31 16 -3 -28 5 -33 17 9 19 23 18 0 20 7 20 -14 -4 7 55 10 -34 7 42 7 -2 42 25 1 1 6 -28 -13
4755 -13 -17 3 -15 17 -7 -12 -27 -9 -23 -18 -26 -14 -7 -19 -2 10 2 18 22 3 16 33 11 -27 0 28 -3 16 -21 -8 19 0 -20 -17
4789 -17 2 5 -1 -3 1 2 -4 -17 -2 8 -8 -14 -27 -14 29 -20 -5 -33 29 -2 9 9 7 41 -9 -23 -8 9 -21 6 -12 20 -1 -6 -9 10
4825 10 5 -12 10 8 16 12 9 13 -17 -13 10 20 14 26 19 5 -20 21 23 -20 -23 -17 14 15 -5 -23 28 29 -17 -29 -6 -6 -12 -32 -2 -3 2 -28 -15
4864 -15 20 1 -3 -14 -17 1 31 -4 -9 -17 11 4 -8 -6 25 24 -1 -16 -1 13 7 -29 10 -22 -15 -7 -7 30 15 -10 -16 10 12 -21 -16 19 13 -16
4902 -16 -23 -12 -14 2 -42 17 -15 18 11 7 21 -12 -2 17 -5 -6 27 -6 5 -11 -2 12 -7 -14 12 14 -32 -17 7 27 -10 6 -6 18
4936 18 29 16 -5 24 3 19 3 3 8 -23 -11 -2 2 -23 30 1 10 5 18 11 -30 21 21 2 -16 -9 13 22 -13 -3 30 8 15 -2 10 25
4972 25 -21 -23 6 29 -2 0 -13 15 -6 -16 -3 -8 -6 -13 3 -15 5 13 16 -22 -9 27 -18 -7 -1 -7 -2 2 -37 1 38 -10 -1 4 -2 -3 13 -29
5010 -29 4 28 19 4 -5 24 11 -8 -20 18 6 -3 0 3 -2 11 40 16 8 -4 3 -42 8 -13 10 -8 -12 7 -2 3 -31 7 -4 -5 -22 1
5046 1 -4 -21 14 -3 7 -15 22 0 -21 -8 -19 12 7 -1 14 48 0 9 29 38 -14 -1 12 21 7 -2 21 39 -13 -19 -6 -11 26 -7 -11 1
5082 1 -3 1 -13 10 11 -10 -36 2 -15 12 2 8 -7 5 -5 -4 -30 -9 25 6 -12 -6 9 31 -18 -7 7 28 27 -34 3 45 20 -7
5116 -7 35 6 13 19 -2 -13 13 10 -16 7 1 12 17 1 2 18 -5 -3 -5 14 7 -23 -39 -7 24 17 3 -15 26 -7 -23 16 3 18 -10 5
5152 5 28 3 -11 -25 28 5 12 -32 23 5 -18 1 -6 -9 6 -5 18 -18 14 5 1 12 1 -21 -10 27 -5 16 8 -15 -18 -12 12 -9 -22
5187 -22 -10 19 20 -13 5 31 -1 -4 18 1 -3 -1 22 12 27 2 0 12 2 9 -2 -6 -14 -4 31 13 -20 -1 33 -15 -40 7 0 9 -3
5222 -3 -30 -4 -24 7 10 12 -3 -6 19 -2 7 8 4 21 3 10 19 -14 -60 -6 14 -2 1 12 18 8 -3 -29 15 27 26 -7 -26 5 10 8 0 -5
5260 -5 15 -27 -38 9 29 -6 -7 -3 9 11 35 -14 -7 2 17 1 -41 7 6 8 -7 -7 -10 9 5 -13 11 -6 9 -9 17 10 14 9 9 11 -8 6
5298 6 9 4 -12 -20 2 13 12 4 -6 -1 -20 -10 25 -9 4 -14 -20 -33 -24 25 -17 -11 -23 24 11 11 -2 11 30 6 -8 5 -4 0 -23 3 5
5335 5 4 18 3 14 -3 38 21 -30 5 -4 -6 3 4 11 12 11 12 -4 13 21 -5 4 26 30 -22 1 12 -6 -11 -9 -25 12 -11 -12 -10 -18 -13 -15 10 -20
5375 -20 -14 21 -15 12 12 -35 6 -6 17 17 37 9 5 12 24 -9 15 24 17 -29 -20 29 34 28 -13 7 13 22 -26 2 9 -20 -12 -10 7 2 -18 -5
5413 -5 -30 -19 -8 22 7 2 -8 30 -13 0 -17 10 8 -1 2 20 12 15 3 -12 25 3 -1 16 15 16 -21 2 13 -1 -8 8 3 -18 0 1 9
5450 9 -5 6 -25 1 -10 -1 7 11 -11 13 15 -19 -41 -16 17 -40 19 -4 36 24 4 -8 -9 -22 19 -18 -15 -16 -2 1 -12 26 28 14 8 2
5486 2 13 3 13 17 1 11 24 -9 13 27 15 -18 -2 0 -10 -4 -5 12 23 -5 5 -3 -6 6 9 1 19 12 1 0 12 7 11 -22 17 4 -8
5523 -8 10 11 -8 20 4 -28 8 -6 40 37 14 33 21 3 4 8 21 6 -5 5 29 17 -10 -2 1 -2 -8 -18 1 3 -1 -13 25 -11 -15 -25
5559 -25 -35 -15 23 3 -5 14 -4 22 -4 -4 -15 -9 8 -17 -2 -3 19 20 16 16 20 8 9 -24 34 2 7 -50 7 13 69 41 17 -34 -69 -70
5595 -70 -23 24 22 -12 -83 15 -86 18 -129 -91 80 -28 -42 -21 -39 40 40 -104 -47 -13 -32 13 50 -28 -109 14 0 -27
5623 -27 -76 -63 -12 -66 3 -42 -8 32 -45 -34 -129 -109 -46 -18 3 5 -33 10 19 39 24 -8 61 -36 -46 -4 -14 -24 -2 17 12 -13
5655 -13 13 -19 35 6 34 -4 24 12 10 -27 -6 9 3 20 7 -5 8 -26 16 33 20 24 7 -8 -11 -12 34 12 18 -43 -28 4 -38
5688 -38 -10 -4 19 3 -10 -13 2 -3 -2 12 -10 -9 15 5 17 1 27 -15 0 -5 49 31 -10 -8 -8 20 -2 10 15 7 -1 -7 16 -5 9 -17
5724 -17 18 6 11 -4 10 4 -7 0 6 -9 -13 4 7 -20 15 10 -11 -20 -24 5 -17 1 -13 -6 -7 -4 12 21 -4 -12 5 -2 -7 -7 -2 -9 13 9 -4 -3 10
5765 10 8 -11 -7 23 8 0 25 -4 -17 6 20 9 15 12 10 -2 -3 -3 17 -18 8 -10 4 11 -17 -14 -37 14 -9 2 -3 -11 16 -23 -6 -12 -4
5802 -4 4 12 17 -23 -11 -8 14 -16 -11 -29 0 9 11 1 -1 1 -16 25 1 11 -15 -24 1 19 -24 -21 -5 -22 16 -10 -4 -5 -13 -17 -5 2 -17 -11 -14 7
5842 7 -3 -39 4 -9 -10 24 -8 -10 11 7 -23 -23 12 50 -13 -28 -2 10 7 -15 -21 11 38 -1 -25 -2 -6 -4 0 25 8 1 -6 -10 5 -3 -18
5879 -18 5 5 -35 -21 -11 -3 6 21 12 31 4 7 -23 -13 -2 10 21 3 3 -26 0 -6 17 3 2 19 -7 -15 7 22 5 -9 28 -15 16
5914 16 -8 -2 15 -9 4 -1 -13 1 -13 -7 11 19 13 -23 8 -2 -1 -4 -35 9 11 10 -8 -10 -5 -1 -9 -13 10 -16 9 -10 -12 12 1 -7 30 6
5952 6 8 17 11 14 29 -9 2 14 9 22 0 8 6 18 -6 5 -3 20 25 -10 -6 -11 -17 7 -19 -12 -11 10 -17 2 -18 -10 -3 -16 14 1 1 14 6 11
5992 11 21 -9 13 10 36 18 -16 2 18 20 13 -2 18 29 33 -5 -14 8 2 10 10 19 -6 -7 20 -4 -2 -12 -7 3 6 -33 -23 9 15 17 0 25
6030 25 -8 -6 8 -9 -29 1 -10 4 -10 -11 4 -18 9 -26 -20 16 5 -24 11 12 9 15 15 21 -2 -1 10 2 10 14 24 -19 3 -7 -7 -19 8
6067 8 0 -34 -5 -16 20 -16 -6 -19 0 -2 -17 -9 -10 6 -24 -20 -38 -2 -6 -7 -11 -30 17 6 -7 -16 -12 -12 21 5 19 4 10 -5 -11 18 6
6104 6 13 -8 -11 10 -4 -2 -3 -28 15 4 -10 -28 20 -2 -39 34 -5 -5 3 -12 -2 -5 -5 -16 2 8 -5 7 7 -5 -5 17 -14 -6 2 8 -10 -10
6142 -10 16 0 -17 -10 10 22 3 14 -22 9 -7 -2 -11 -6 16 -4 -1 15 -12 6 -15 -54 -8 0 -15 0 16 17 3 6 10 10 -7 -4 1 20
6178 20 -3 21 21 17 -5 0 -11 4 -4 -10 -16 -6 -26 -16 -2 20 10 -29 -15 -17 -25 -6 17 -4 -10 -20 -28 6 -2 -10 6 14 9 -19 -36 7 -29
6215 -29 -3 6 4 -8 23 -9 -9 26 -4 -13 0 -14 16 3 2 33 39 -14 0 -2 -6 47 -12 -4 -12 27 -21 -19 -20 6 -1 10 -8 -10 14 -7 3
6252 3 -34 -2 7 -24 -14 -24 -33 9 11 -7 -6 -17 -4 -11 -9 1 -15 -15 2 27 3 -9 -4 -13 -15 -16 3 0 15 -4 -2 12 -7 13 -19 11 -2
6289 -2 -9 -4 -6 -6 4 19 -2 -29 11 15 18 -28 4 20 -14 -22 20 -13 1 6 -22 -15 -10 12 -5 -2 -26 -2 -9 -7 -12 -12 -2 -23 -4 25 -1 -15
6327 -15 -9 8 -17 2 -6 9 5 23 -6 -18 21 19 -13 -7 -14 9 -12 -2 -2 11 -2 -20 -23 -25 -15 -6 -9 6 -13 6 -10 -14 -15 -25 -6 -16 6
6364 6 9 -9 23 15 3 5 -11 -22 -15 -12 30 -10 14 -5 11 -3 -8 23 -19 -4 -34 10 17 -3 -6 0 -14 2 -22 -5 5 -1 -23 -2 -6 -1 -31
6401 -31 26 -19 -4 -35 -11 2 1 11 4 -2 8 23 -2 2 -36 -2 -3 0 -18 21 -17 -6 30 21 -14 11 -10 -28 7 2 -2 -17 13 -12 -10
6436 -10 -16 2 17 -18 5 -13 -8 11 11 -14 -7 11 -5 -2 -24 -5 -14 3 18 -8 -9 -7 -7 -10 -19 3 -32 12 -10 -10 -23 1 18 -2 21 3
6472 3 -5 9 8 -36 -5 -1 -10 -3 6 -34 -26 7 -27 7 -37 -55 -19 -7 -21 -15 17 41 7 -4 -36 13 12 -3 -16 13 11 -12 -18 -10 -6 -15 4 -23
6510 -23 -35 32 -30 0 -20 -5 -2 2 -2 -17 -22 -8 17 -16 -10 1 -14 3 -2 -10 -1 -33 -20 -15 -27 -8 -4 -1 -23 24 -3 17 12 -21 -19 -25 -11
6547 -11 17 -29 -17 -15 -19 2 -17 -29 3 22 -20 -7 -16 21 17 24 -4 2 -35 -1 4 -13 18 -8 10 -15 -2 -3 -8 -12 3 5 6 6 10 -10 -17 -19
6585 -19 -35 -21 -3 -20 -13 -1 -28 -5 0 2 1 -1 -15 -8 12 -24 -18 -18 -27 0 -11 5 3 -6 12 11 4 9 -11 4 -2 -2 23 -17 -26 -8 14 17 6
6624 6 -19 -28 1 1 -6 -5 6 4 12 -14 17 2 15 -8 -8 -1 11 13 -2 -16 -24 -17 -13 -2 28 13 8 11 -13 4 15 15 -14 2 -14 -24 8 6 9
6663 9 -2 4 17 16 0 -28 1 0 20 1 -17 20 -35 -4 11 -39 -10 -4 -26 -21 -14 -3 -16 -14 -9 11 0 -14 21 -28 -21 -12 -12 9 -16 0
6699 0 14 2 12 -18 -25 15 -7 -2 16 0 -24 -12 -32 0 -24 -3 -12 2 16 -2 -1 5 -14 -8 0 -11 7 13 -32 -15 3 -4 -16 -10 -8 -10 -6
6736 -6 5 -8 5 -18 -2 19 -13 -4 -2 18 9 -1 -14 8 22 2 15 -16 22 12 -6 11 23 0 22 9 0 2 -14 -6 -15 -7 -5 24 -13
6771 -13 8 2 -2 5 11 -26 -17 -11 -15 -6 -2 -10 -12 -18 -13 14 -35 -3 -15 4 -6 -7 -5 -30 0 24 29 22 3 6 -4 -15 -10 -13 -6 -2 1 12 7 13 1 -18 12
6814 12 -33 -25 16 -8 8 -9 9 -2 1 -15 5 -1 4 14 16 -8 1 2 -8 -7 -23 1 -14 -10 -21 1 -14 -6 -4 1 20 -11 -2 17 16 -23 -11
6851 -11 1 2 -3 -4 -22 2 -3 6 -4 16 8 -34 18 -12 -7 -12 -3 -14 -9 6 -13 -20 10 -9 -10 -3 -13 17 4 -7 9 -13 0 -2 -7 -13 16 39
6889 39 18 18 2 13 21 -26 15 -15 21 -33 1 31 14 8 21 -1 -6 -9 -15 -27 19 35 14 -14 2 -6 -11 7 -21 -18 -28 -14 9 32 -10
6924 -10 10 14 0 -3 -9 -14 12 16 -8 -2 -6 -9 -5 9 18 6 27 13 22 -10 14 6 -10 2 -23 15 19 -2 20 -6 -3 -8 7 4 16 -1 -13 2
6962 2 -17 -11 10 7 -27 -15 -10 -8 2 19 14 -14 1 9 -12 6 -16 -3 -14 9 13 3 9 32 -9 4 -3 -1 22 23 6 -1 10 -7 19 -3 2
6999 2 -8 1 16 30 -26 18 -1 7 29 21 -6 12 -5 -16 9 -8 11 -19 -6 -16 -2 -17 4 5 9 0 20 5 1 7 3 23 13 9 -9 -2
7035 -2 35 10 10 -12 -2 -19 20 -1 -14 -8 9 -15 15 -6 -1 -1 5 5 16 -26 28 15 2 13 6 22 -2 -7 4 14 -11 3 7 0 19 27
7071 27 -23 -16 2 -11 -16 0 -5 7 8 -17 13 30 42 17 -19 -6 -5 33 -21 -5 14 -2 38 -14 -1 33 -2 -10 -5 -13 20 -14 -6 -2 -22
7106 -22 16 31 -26 -21 -18 -1 6 -8 17 -1 -9 7 -14 -17 9 7 14 14 16 -15 18 -12 35 6 8 14 24 11 3 -11 -5 -11 3 11 0 10 2 28
7144 28 -12 28 -6 -26 0 2 2 -4 -14 -19 -14 2 15 12 6 15 -13 8 -14 -3 3 4 30 20 -8 16 -16 3 -32 -28 13 15 3 -10 -16 -28 -3
7181 -3 41 -16 29 36 14 4 -7 -19 -17 11 -17 -6 -9 11 33 -7 12 20 1 -2 -10 -7 -3 15 -16 -15 0 8 -40 9 -9 3 -5 0 26 -24 15
7218 15 27 -8 5 -17 -1 -6 -8 3 -4 -1 13 0 26 7 -7 8 14 -4 1 -11 -5 8 3 -8 -13 -15 19 -10 13 25 -5 0 0 -11 42 -35
7254 -35 -20 6 -10 2 3 -4 -10 -10 2 -29 8 2 8 -3 2 22 -5 1 7 2 0 -17 -15 5 23 -11 1 26 -15 -2 1 7 -22 0 -4 6 -7 -9
7292 -9 -3 5 22 -14 -2 -36 8 -11 -12 9 -7 -5 15 18 -7 4 1 -11 14 -11 -19 17 -4 29 -3 -6 -4 37 -5 16 3 8 8 -7 -19 38
7328 38 -4 -23 -9 -26 1 -3 -13 -3 -39 -25 -5 -1 4 1 -15 -1 -17 16 1 -3 19 22 -8 6 0 9 7 -4 -11 -3 -21 15 14 21 5 0 4 -19
7366 -19 -20 4 10 0 7 -17 5 0 -13 -8 4 15 2 -7 16 -16 12 -12 29 -7 4 19 0 9 -30 20 19 9 -9 14 -6 -21 10 -2
7400 -2 -25 17 -22 32 4 -10 7 10 30 -2 -14 0 13 12 8 -2 10 2 26 -16 13 -2 12 12 5 23 16 -12 8 -13 7 -3 -5 20 -3
7435 -3 1 -23 4 8 3 -6 7 -3 21 -18 -29 -16 -8 -4 4 17 17 -9 -4 -14 -14 -5 -15 7 4 3 -6 6 2 8 11 2 2 -17 -6 1 16 -24 -1 26 -8
7476 -8 -38 8 -19 -2 15 -14 0 1 -22 10 30 -9 -2 -25 -4 -16 4 7 13 2 -2 -2 -4 -2 7 -22 -15 36 2 -8 -18 -11 20 13 -19 -10 -10 -10
7514 -10 -8 -13 -3 6 31 -5 12 -5 -23 -15 -17 -19 -13 13 -24 -22 -14 -16 0 0 -22 5 -13 -21 10 -13 2 -6 9 17 16 -9 14 14 -1 -12 17 -5
7552 -5 -20 7 2 -16 -5 0 -24 3 14 41 -3 5 3 -5 -4 -9 4 -6 18 -7 -11 -4 -4 13 25 -17 1 -5 -9 1 14 -8 19 6 3 13 -26
7589 -26 7 -18 20 -7 3 10 -6 29 -1 30 0 12 12 -21 -36 -2 9 -29 -3 1 7 16 -9 -10 -9 -14 -26 -5 2 -25 -8 -39 1 15 -11
7624 -11 -16 25 11 -12 -6 4 -4 -3 0 -14 -13 -8 -19 -17 10 -12 4 19 1 20 -5 9 -21 -7 30 25 1 20 23 -17 -3 -2 8 -16 -16 -4
7660 -4 -14 16 -10 -5 -9 0 26 26 12 -25 0 -4 12 -9 -22 -3 11 -7 1 -3 2 13 4 -16 -1 1 -10 9 -25 4 -37 15 -6 0 11 -25
7696 -25 13 16 -5 -11 14 -21 -7 -20 -14 -3 -4 7 2 -26 -7 -3 -24 20 -23 -35 -16 -16 20 -17 8 -8 14 6 -3 -9 -3 0 -4 -11 -17 5 4 3 -17
7735 -17 -5 -5 1 4 -14 2 -1 13 14 -1 25 10 -9 -12 -5 15 -4 -15 -6 -23 -5 5 1 -14 -8 6 14 11 15 -5 -27 8 -15 -2 -10 10 -5
7772 -5 4 0 22 -26 4 10 10 -9 26 -4 8 8 -3 -11 -22 -7 0 5 23 54 29 -6 -2 5 16 -12 -22 13 -8 3 -18 -7 -30 7 -2 6 -5
7809 -5 -18 -35 -1 -22 0 -15 -9 -17 -18 5 9 0 0 2 -9 -8 -6 -19 17 -13 -9 -1 -11 9 -36 -2 31 -19 7 6 40 9 4 -7 -15 -9 21 2
7847 2 -39 -8 1 20 -1 8 -28 13 4 -11 -2 8 0 -13 -10 4 5 2 4 7 -2 9 17 15 15 -20 -1 -4 7 -7 23 11 -1 23 -9 7 -10 -13 0
7886 0 3 -18 -30 -20 2 0 -14 -4 -26 5 -20 -7 -17 9 -12 -23 -17 -20 11 -1 -13 6 10 -9 -14 16 -3 -25 -18 5 6 15 12 -1 2 -17
7922 -17 5 -10 5 -6 -19 8 -25 -1 -14 13 -26 9 -18 -5 -35 -18 -9 -1 22 4 0 6 -24 -13 17 -8 -10 13 -22 8 4 -5 2 -14
7956 -14 -12 -20 -23 -17 12 -5 -6 -16 26 -8 11 -15 -4 -5 -1 2 -7 -27 23 5 7 -10 28 -3 1 39 6 21 21 -1 16 16 15 -1 -30 -18 -8
7993 -8 -6 2 -4 -11 -14 15 19 -10 -8 10 10 -3 -20 -9 8 -3 -14 31 16 9 2 15 23 -8 -6 -17 19 -2 8 -6 -8 -12 -23 -1 -27 22 -9 18
8031 18 -36 9 9 -26 -6 -16 -18 -1 -12 -21 27 -2 28 8 -4 3 -12 -2 -3 10 7 8 -14 -2 2 -20 1 21 -9 -24 -25 -6 12 4 4 29
8067 29 -5 2 27 -2 -1 -9 18 -1 1 -2 -3 31 -24 -14 -7 5 9 -15 21 -13 -17 5 -5 -13 11 30 15 17 -4 -7 -6 -17 -3 28 -12 21 14
8104 14 -23 9 3 13 19 28 11 15 6 5 -7 15 12 2 -7 -35 -9 -3 -5 10 9 -5 -23 7 -21 -20 7 -31 -23 3 -40 -14 -11 -21 10 10 19 7
8142 7 -18 -1 21 -9 -12 23 -5 7 -3 5 12 5 9 3 0 9 -7 -10 -6 -22 -24 4 -18 -20 14 -7 6 -2 -9 5 -18 -5 1 -2 -3 3 -3 -12 4 -18 -22
8183 -22 15 4 -4 -5 -14 -14 18 -23
8191b3
##END NTUPLES=NMR FID
##END=
