##TITLE=1H_SR64_kw2
 CDCl3, 8 sc, 
 6.07.2021
##JCAMPDX= 6.0         $$ Bruker NMR JCAMP-DX V2.0
##DATA TYPE= NMR FID
##DATA CLASS= NTUPLES
##ORIGIN= UXNMR, Bruker Analytische Messtechnik GmbH
##OWNER= root
$$ XWIN-NMR		Version 3.5
$$ Tue Jul  6 13:12:53 2021 Russian Standard Time (UT+4h)  she@DPX200
##.OBSERVE FREQUENCY= 200.131506
##.OBSERVE NUCLEUS= ^1H
##.DELAY= (6, 6)
##.ACQUISITION MODE= SIMULTANEOUS
##.ACQUISITION SCHEME= undefined
##.AVERAGES= 8
##.DIGITISER RES= 18
##SPECTROMETER/DATA SYSTEM= spect
##.PULSE SEQUENCE= zg30
##.SOLVENT NAME= CDCl3
##.SHIFT REFERENCE= (INTERNAL, CDCl3, 0, 15.7039)
##AUDIT TRAIL= $$ (NUMBER, WHEN, WHO, WHERE, WHAT)
$$ ##TITLE= Audit trail, XWIN-NMR		Version 3.5
$$ ##JCAMPDX= 5.01
$$ ##ORIGIN= Bruker BioSpin GmbH
$$ ##OWNER= she
$$ F:/spectra/data/she/nmr/H-F/1/audita.txt
$$ ##AUDIT TRAIL=  $$ (NUMBER, WHEN, WHO, WHERE, WHAT)
(   1,<2021-07-06 13:11:50.07 +0400>,<she>,<DPX200>,
      <created by zg, POWCHK disabled, PULCHK disabled
       configuration hash MD5:
       00 E9 B6 7A A2 85 ED C7 34 08 36 98 17 FE 4E 26
       data hash MD5: 16K
       5E 7B E0 23 6A D9 8D 39 58 B8 E2 28 90 CC B6 BD>)
$$ ##END=
$$ 
$$ hash MD5
$$ A8 D7 69 BC 48 AD B6 D9 55 9D B4 96 72 37 83 8A
##$RELAX= 
##$RELAX= 
##$RELAX= 
##$RELAX= 
##$RELAX= 
##$RELAX= 
$$ Bruker specific parameters
$$ --------------------------
##$DU= <F:/spectra>
##$EXPNO= 1
##$NAME= <H-F>
##$PROCNO= 1
##$TYPE= <nmr>
##$USER= <she>
##$AMP= (0..31)
100 100 100 100 100 100 100 100 100 100 100 100 100 100 100 100 100 100 
100 100 100 100 100 100 100 100 100 100 100 100 100 100 
##$AQSEQ= 0
##$AQ_mod= 1
##$AUNM= <au_zg>
##$AUTOPOS= <>
##$BF1= 200.13
##$BF2= 200.13
##$BF3= 200.13
##$BF4= 200.13
##$BF5= 200.13
##$BF6= 200.13
##$BF7= 200.13
##$BF8= 200.13
##$BYTORDA= 1
##$CFDGTYP= 0
##$CFRGTYP= 5
##$CHEMSTR= <none>
##$CNST= (0..31)
1 1 145 1 1 1 1 1 1 1 1 1 1 1 1 1 1 1 1 1 1 1 1 1 1 1 1 1 1 1 1 1 
##$CPDPRG= <>
##$CPDPRG1= <>
##$CPDPRG2= <>
##$CPDPRG3= <>
##$CPDPRG4= <mlev>
##$CPDPRG5= <mlev>
##$CPDPRG6= <mlev>
##$CPDPRG7= <mlev>
##$CPDPRG8= <mlev>
##$CPDPRGB= <>
##$CPDPRGT= <>
##$D= (0..31)
0 1.2 0 0 0 0 0 0 0 0.06 0 0.03 0 0 0 0 0.0002 0 0 0 0 0 0 0 0 0 0 0 0 
0 0 0 
##$DATE= 1625562709
##$DBL= (0..7)
120 120 120 120 120 120 120 120 
##$DBP= (0..7)
150 150 150 150 150 150 150 150 
##$DBP07= 0
##$DBPNAM0= <>
##$DBPNAM1= <>
##$DBPNAM2= <>
##$DBPNAM3= <>
##$DBPNAM4= <>
##$DBPNAM5= <>
##$DBPNAM6= <>
##$DBPNAM7= <>
##$DBPOAL= (0..7)
0.5 0.5 0.5 0.5 0.5 0.5 0.5 0.5 
##$DBPOFFS= (0..7)
0 0 0 0 0 0 0 0 
##$DE= 6
##$DECBNUC= <off>
##$DECIM= 32
##$DECNUC= <off>
##$DECSTAT= 4
##$DIGMOD= 1
##$DIGTYP= 9
##$DL= (0..7)
0 120 120 120 120 120 120 120 
##$DP= (0..7)
150 150 150 150 150 150 150 150 
##$DP07= 0
##$DPNAME0= <>
##$DPNAME1= <>
##$DPNAME2= <>
##$DPNAME3= <>
##$DPNAME4= <>
##$DPNAME5= <>
##$DPNAME6= <>
##$DPNAME7= <>
##$DPOAL= (0..7)
0.5 0.5 0.5 0.5 0.5 0.5 0.5 0.5 
##$DPOFFS= (0..7)
0 0 0 0 0 0 0 0 
##$DQDMODE= 0
##$DR= 18
##$DS= 0
##$DSLIST= <SSSSSSSSSSSSSSS>
$$ [...]
##$SUBNAM2= <"">
##$SUBNAM3= <"">
##$SUBNAM4= <"">
##$SUBNAM5= <"">
##$SUBNAM6= <"">
##$SUBNAM7= <"">
##$SUBNAM8= <"">
##$SUBNAM9= <"">
##$SW= 20.0188882624521
##$SWIBOX= (0..15)
0 0 2 0 0 0 0 0 0 0 0 0 0 0 0 0 
##$SW_h= 4006.41025641026
##$TD= 16384
##$TD0= 1
##$TE= 0
##$TE2= 300
##$TE3= 300
##$TEG= 300
##$TL= (0..7)
0 120 120 120 120 120 120 120 
##$TP= (0..7)
150 150 150 150 150 150 150 150 
##$TP07= 0
##$TPNAME0= <>
##$TPNAME1= <>
##$TPNAME2= <>
##$TPNAME3= <>
##$TPNAME4= <>
##$TPNAME5= <>
##$TPNAME6= <>
##$TPNAME7= <>
##$TPOAL= (0..7)
0.5 0.5 0.5 0.5 0.5 0.5 0.5 0.5 
##$TPOFFS= (0..7)
0 0 0 0 0 0 0 0 
##$TUNHIN= 0
##$TUNHOUT= 0
##$TUNXOUT= 0
##$USERA1= <user>
##$USERA2= <user>
##$USERA3= <user>
##$USERA4= <user>
##$USERA5= <user>
##$V9= 5
##$VALIST= <valist>
##$VCLIST= <CCCCCCCCCCCCCCC>
##$VD= 0
##$VDLIST= <DDDDDDDDDDDDDDD>
##$VPLIST= <PPPPPPPPPPPPPPP>
##$VTLIST= <TTTTTTTTTTTTTTT>
##$WBST= 1024
##$WBSW= 4
##$XGAIN= (0..3)
0 0 0 0 
##$XL= 0
##$YL= 0
##$YMAX_a= 251646
##$YMIN_a= -226980
##$ZGOPTNS= <>
##$ZL1= 120
##$ZL2= 120
##$ZL3= 120
##$ZL4= 120
##$ABSF1= 10
##$ABSF2= 0
##$ABSG= 5
##$ABSL= 3
##$ALPHA= 0
##$AQORDER= 0
##$ASSFAC= 0
##$ASSFACI= 0
##$ASSFACX= 0
##$ASSWID= 0
##$AUNMP= <proc_1d>
##$AZFE= 0.1
##$AZFW= 0.1
##$BCFW= 1
##$BC_mod= 2
##$BYTORDP= 1
##$COROFFS= 0
##$CY= 11.3945322036743
##$DATMOD= 1
##$DC= 2
##$DFILT= <>
##$DTYPP= 0
##$F1P= 15.9154993809931
##$F2P= -4.1035820241983
##$FCOR= 0.5
##$FTSIZE= 0
##$FT_mod= 4
##$GAMMA= 1
##$GB= 0.15
##$INTBC= 1
##$INTSCL= 1
##$ISEN= 128
##$LB= 0.24
##$LEV0= 0
##$LPBIN= 0
##$MAXI= 10000
##$MC2= 0
##$MEAN= 0
##$ME_mod= 0
##$MI= 1.114404
##$NCOEF= 0
##$NC_proc= 0
##$NLEV= 6
##$NOISF1= 3.799351
##$NOISF2= 2.8
##$NSP= 1
##$NTH_PI= 0
##$NZP= 0
##$OFFSET= 15.70392
##$PC= 1
##$PHC0= -11915.7
##$PHC1= 14.60099
##$PH_mod= 1
##$PKNL= yes
##$PPARMOD= 0
##$PSCAL= 0
##$PSIGN= 0
##$REVERSE= no
##$SF= 200.130013532006
##$SI= 16384
##$SIGF1= 3
##$SIGF2= 2
##$SINO= 400
##$SIOLD= 16384
##$SREGLST= <1H.CDCl3>
##$SSB= 0
##$STSI= 0
##$STSR= 0
##$SW_p= 3612.71676300578
##$SYMM= 0
##$S_DEV= 0
##$TDeff= 0
##$TDoff= 0
##$TI= <>
##$TILT= no
##$TM1= 0
##$TM2= 0
##$TOPLEV= 0
##$USERP1= <user>
##$USERP2= <user>
##$USERP3= <user>
##$USERP4= <user>
##$USERP5= <user>
##$WDW= 1
##$XDIM= 8192
##$YMAX_p= 0
##$YMIN_p= 0
$$ End of Bruker specific parameters
$$ ---------------------------------
##NTUPLES= NMR FID
##VAR_NAME=  TIME,          FID/REAL,        FID/IMAG
##SYMBOL=    X,             R,               I
##VAR_TYPE=  INDEPENDENT,   DEPENDENT,       DEPENDENT
##VAR_FORM=  AFFN,          ASDF,            ASDF
##VAR_DIM=   8192,          8192,            8192
##UNITS=     SECONDS,       ARBITRARY UNITS, ARBITRARY UNITS
##FACTOR=    0.0002496,     1,               1
##FIRST=     0,             0,               0
##LAST=      2.0444736,     0,               0
##MIN=       0,             -226980,         0
##MAX=       2.0444736,     251646,          0
$$ Real data points
##PAGE= N=1
##DATA TABLE= (X++(R..R)), XYDATA
$$ [...]
1833a24K06J52l64R1J69l13L11j81L51q9J1j86K33k63J11j46J40l13K44k50J19
1854i1J09O9R9K00m80K13NN0J56m80j20J94j28K43K11J4k64n1K3lJ19l75J97K71
1878A81j98j59Q9j43J33RL15k17J0k62P6j59L62k96K14J42q0o9k7L6j01P5j14
1901a83j53L83j02j65K39J28j61j86J69k09M2K86p2m61J92K99j49J84k9l13K16
1922d5p0K0j25n4L3J92n8J81Q2j66q4k19N53k86J89k83K42k60J93J3J62j21n7
1945C2l7J02o7J26k2J20k72j54J39k01L22j28J35J30m12K30j34j27L95q5j19k75
1967c02M25L3j86K01j76K86l3l97M9K20n7j40J46L9rM5j00K45l03L5m1j45L77
1990B12j98nj15K25j35K9k10L51j50P4l3RN7k13o5L41j53j2M01j97p4k03j95K80
$$ plain form
1833 -124 82 234 -130 -39 130 -183 128 -53 298 209 220 34 267 4 115 -31 109 -204 40 -210 -91
1854 -91 18 87 186 386 -94 119 124 174 330 -150 -270 -76 -204 39 250 264 0 -51 -28 -31 88 -287 -90 181
1878 181 -17 -176 -87 -230 -97 -88 227 10 20 -242 -166 -325 37 -259 -45 97 17 -52 -79 -43 -144 -69 -183
1901 -183 -336 47 -55 -220 19 147 -14 -200 -31 -240 -198 88 16 -445 -253 46 -103 81 52 -261 -45
1922 -45 -115 -95 -220 -274 -241 -49 -107 74 156 -10 -94 -313 240 -46 143 -140 102 -158 35 48 210 89 32
1945 32 -5 97 30 156 134 254 -18 -172 -33 -234 88 -40 95 225 -187 43 -91 -218 177 92 -27 -302
1967 -302 123 156 -30 171 -5 281 248 -149 -100 120 63 -77 69 108 99 144 44 289 -14 21 -20 -165 212
1990 212 14 9 -106 119 -16 13 -197 154 4 78 45 54 111 -102 -167 174 21 9 410 213 139 -64 -259 21
2014B1l1mJ95oPm29K41j3K05l48K81l48M99j38j37o4K09r9J41j93K34j57K95l18
2038D3N0K19l08PR8k5j37M60m77m5K3K54M8k71RK1lR5j19J27J5j25o7K36k18O0
2064c0k96K56O7J68n9k44K42p7Jno1k9J61R6l75N4R8J19q5j71n5K84j26j14J96
2089A5k63J79j93P3J44l18L63k97J85Pr3J34L0j06q7j65N09K6n47L87j97L99j60
2112B5Jj73L05l41n9M57j40l37K34K54k61Q5j01L6M3K60k96j16M77j91l22K14
2134E4j40J74j58J30p9q2J9J45K71m02K31O3k58J99j33K99k49n6J36j93L08j39
2156A40k11J12k30K66N5QJ02l18Rk6J25j51J00M2P5P8N3j96r6L0o6J48N6j99J69
2181G5M6M6l1j34O9m5k12K11K47r9j91K1r3k8j27L00pj8j86J96q5j93p2J5L81
$$ plain form
2014 21 -10 -14 181 175 182 -247 -6 -19 186 -162 119 -229 270 132 -5 -69 140 41 182 -11 223 66 361 43
2038 43 93 312 4 11 109 84 -53 407 -70 -115 -92 162 210 -61 -52 -31 -34 61 -58 69 84 -41 -108 128 -90 -30
2064 -30 -326 -70 -3 165 106 -138 104 27 28 23 -38 -67 94 190 -185 -131 -33 86 1 -170 -225 59 -67 -181 15
2089 15 -248 -69 -262 -189 -45 -363 0 -297 -112 -105 -198 -64 -34 -140 -227 -392 117 143 -404 -17 -214 185 25
2112 25 26 -147 158 -183 -242 215 75 -262 -28 226 -35 50 -51 -15 28 288 -8 -124 353 162 -160 54
2134 54 -86 88 -70 60 -19 -101 -82 63 334 -68 163 226 -32 167 34 333 84 28 164 -29 279 140
2156 140 -71 41 -189 77 132 140 242 -76 -67 -93 32 -119 -19 23 98 176 229 33 -63 -33 -99 49 105 -94 75
2181 75 121 167 136 2 71 26 -186 25 272 173 -18 3 -90 -118 -245 55 48 30 -156 40 -45 -238 -310 -295 86
2206H6J5k44K72k68K45j16K21mm66K65K79J41m60Q2K65l87J05N5j02n7P1r3j82
2229b77K60J12p1J17J39j96j58J25m32N25k7k9q1j10N7j09J67nn0K7p5J49q8j84
2253b14K06j24r0N67o8j44k07M4k19L88m17R5K63l41K23N8l3p6J5L3N5m3r7J42
2277A6k13L41j43Qk29L17j07j32J81j21K00J58m01R1j54K28l84K19K3r9K14K03
2299B16L7k71J16j70L56j69p7k56L15j22L07j92Q9q2j3k21L08J01k04K6J56j07
2321A43j77J39n5J92j38k54K36J58l72J94m04N45j81J84j84K81o08L46j94J54
2341El12J19J97J37l82J65K42l39N06n63K50J04m8n1J05m3n5J09j79k02M63k41
2363a3N2O5l3p2o6J54m5l35J22M06j06j98Pj40J77K8k38K22N2jL7l2J07j11J09
$$ plain form
2206 86 101 -143 129 -139 106 -10 211 207 -259 6 285 426 -34 48 313 -74 31 86 -16 -73 -2 -95 -277
2229 -277 -17 95 24 141 280 84 -74 51 -381 144 117 88 7 -103 -46 -155 12 7 -43 -16 -91 58 -30 -214
2253 -214 -8 -132 -222 345 277 133 -74 -30 -249 139 -278 -183 80 -261 -38 20 -13 -89 -74 -41 14 -29 -126 16
2277 16 -197 144 1 9 -220 97 -10 -142 39 -82 118 276 -125 -34 -188 40 -344 -125 -102 -201 13 216
2299 216 253 -18 98 -72 284 115 38 -218 97 -25 282 90 179 97 84 -137 171 272 68 94 250 143
2321 143 -34 105 50 242 104 -150 86 244 -128 66 -338 207 26 210 26 307 -301 45 -149 5
2341 5 -307 -188 9 146 -236 -71 171 -168 338 -225 25 129 81 30 135 92 37 146 -33 -235 228 -13
2363 -13 39 104 71 -1 -67 87 42 -293 -171 235 129 -69 -62 -202 -25 3 -235 -13 39 38 75 43 150 39 148
2388A48l13p2L45j96J49L5l2l4O2k11J95P0l87j59K69J95M2m2j20R5q9Q1l8m6
2412e3K08L2j23j77L11k40P8N1l09J46Q7k32L44l85M05k61k98N13N9j67j00J46
2434C5j96K97m25K32K8K2M7k44J08m9J95j62J20J51L8j38m01N65j25k05M1R6j03
2457g3Oj5K39k71K18j23kK1J59k81J0j41L64k09j57J22K88o8q8Q8j64J09O9k47
2481a46K67j21r7J50Nj7j49K8j9K16kr2qk49P1p0p0P4K15K34l85J66k75K33KL7
2507blL6k46J11L07m8j06J17l57L72l30J80k9o1r8J66J86l90L58q3Q6k89K19J4
2531A10J26j87q9j22J51N5J4k26K42j42Pn2j03K34J8RJ30k75K17k78J85l03J79
2554a00J46Q8M7j63k83K54J95j83K3N3j29K32j27R2o6K6k47L3k8J57J28k81K51
$$ plain form
2388 148 -165 -237 108 -88 61 96 64 30 92 -119 76 146 -241 -400 -131 64 106 64 -56 39 -50 31 -7 -53
2412 -53 155 187 64 -113 198 -42 36 87 -222 -76 11 -221 123 -262 143 -118 -416 97 156 -11 -111 35
2434 35 -161 136 -289 -57 -29 -7 40 -204 -96 -145 50 -112 8 159 197 59 -342 223 98 -107 -66 30 -73
2457 -73 -67 -82 157 -114 104 -19 -21 0 159 -122 -112 -253 111 -98 -255 -133 155 87 -1 87 -77 32 101 -146
2481 -146 121 0 -97 53 58 41 -108 -80 -99 117 115 23 15 -234 -163 -233 -303 -229 -14 220 -165 1 -274 -41 -39 -2
2507 -2 -5 31 -215 -104 203 155 49 166 -191 181 -149 31 2 -59 -157 9 195 -195 163 80 166 -123 96 110
2531 110 236 49 -40 -162 -11 44 58 -168 74 -68 -61 -113 -216 18 36 45 175 -100 117 -161 24 -279 -100
2554 -100 46 134 181 18 -265 -11 184 1 24 77 -52 180 53 145 79 105 -142 -109 -137 20 148 -133 118
2577A18J63k46n6M8j78P0J66m4P0r1J69j15k45M6P8oJ17pk41J8r2M56k2J82k78
2602H0l25M35j78K05j65J83j45J35r5J5m9j14k27J5J99n8N2O0j71K8m9Q0O6j9
2626d2k74L19j95N4J57k43L10j14j10J45k55K38O3J64k18N1J78n31J12L46j71
2647a6k3p1R9J15j76K30q2j20J47k09L00k38M0J86l23j01K30M5O1P2l10K3J58
2670C7J13k7O5j68j67K96k08Q9k07L81l20J34K47j15p6j61N5L3JM1j71J21N7J49
2694A99m12P0J2j7K24l28P5M39j31k02j9J06N7j99J84J7R9m1l00K50P9l76J66
2717d8J28J7Pr9O7j24J33q8Rj53J56N9O9j50n5J52j14o8k49J01J64lJ77q6j55
2742a53R8JJ36k22J59p5J08p8j1K23k34J28j37P3M1j04n6p9Q5K66J21l55p4K66
$$ plain form
2577 118 281 35 -21 27 -151 -81 85 41 111 20 189 74 -171 -125 -47 -53 64 57 -184 -166 -258 198 176 358 80
2602 80 -245 190 12 217 52 235 90 225 130 145 96 -18 -245 -230 -31 -89 -37 23 -148 -120 -169 -89 -23 -42
2626 -42 -316 3 -192 -138 19 -224 86 -28 -138 7 -248 -10 53 217 -1 50 228 -303 -191 155 -16
2647 -16 -39 -110 -11 104 -72 158 76 -44 103 -106 194 -44 -4 182 -141 -242 -12 33 94 166 -144 -121 37
2670 37 150 123 188 20 -147 149 -59 30 -177 204 -116 18 265 150 74 -87 -32 1 2 43 -128 -7 50 199
2694 199 -213 -143 -131 -148 76 -252 -177 262 131 -71 -90 16 73 -126 58 75 174 133 -167 83 162 -214 -48
2717 -48 80 97 104 5 72 -52 81 -7 2 -151 5 64 133 -17 -72 80 -34 -102 -351 -250 -86 -89 88 2 -153
2742 -153 -55 -54 82 -140 19 -56 52 -26 -37 186 -48 80 -57 16 57 -47 -103 -182 -97 169 290 -65 -139 127
2766A27R8j60r9k6K28k92O9K05q2R9m2j78K53k08K2k19J49J1o2M12m49N0J62m6
2790B2j85K16o4J26q7R8K9k14o8J09N1k17L81j73Q1k74J03k18O09l04J29M1k63
2813g2l1N6K03j09J16q0Q7j9k98K51LO3K92k35j24l87K03o8J33r9K99l96K64l07
2837b55K14J38n4j3qj18J15k36J66J38j6j62o2N36l68P8K4k5j51j2j77J63J15
2860C0J6j02L6L9k93L99L9l49K45p6N2K51k82P9M0J17k58k1J4n3L82l49NM1Q8
2885I0K7Q7l16m1J74J21k00j10K8J57J64l22O4r5J62rO0p8K8kN7l17K49j5m6j0
2911i3J38R0j25j48J00l7R7k38L7l4J95j27K2L42l44n7L53j72k9J59k8k03q9L76
2935A85j28J22k03l27L66L31o27L58j11OJ76q0k33N2J40k26j14K82L8J59j51j12
$$ plain form
2766 127 225 65 -34 -60 168 -124 -55 150 68 167 125 -53 200 -8 14 -205 -56 -45 -107 305 -144 -94 68 22
2790 22 -163 53 -11 115 28 126 155 -59 -127 -18 33 -184 197 24 105 -169 -66 -284 325 21 150 191 -72
2813 -72 -103 -47 156 47 163 83 170 151 -147 104 107 170 462 227 103 -284 -81 -149 -16 -115 184 -212 52 -255
2837 -255 -41 97 43 30 22 -96 19 -217 -51 87 71 -91 -153 383 15 93 117 92 -59 -71 -248 -85 30
2860 30 46 -56 -20 19 -274 125 164 -185 60 -16 36 287 5 84 124 241 -17 -38 -24 -77 305 -44 -39 2 90
2885 90 117 204 -112 -153 21 142 -58 -168 -140 17 181 -141 -77 -172 -10 -19 41 -37 -9 -11 46 -271 -22 -37 -83 -93
2911 -93 45 135 10 -138 -38 -75 22 -216 -179 -213 -18 -145 -123 219 -125 -182 171 -1 -30 129 101 -102 -191 185
2935 185 57 179 -24 -351 15 346 -281 77 -34 -28 148 68 -165 -113 27 -199 -313 -31 7 166 15 -97
2957i7K83k33P9l5J27l40O0J99J49o3l87K75p6Q1K8O1j48J05j31J04j98j51P3
2980b35J99j11j56K39P1j3L3K3j21p7L3R7k17L59j73K9J0Q5j03L09m11J93J75
3003B38l91K43o1j28l7J42j74K81o3j10O2L04k46n3P7J9k68R4j54K63r6P3j46
3026a31QP4K15q8J3J67l69P5L7j03K55p1jOj54K5K36j80k8R6k71J23J01L13m98
3051a50L16k44K29j27M1K0J58k3J01l8n76L45l9o7L26k36o0p8j05K69l5j46m4
3074a63N9J60k17J35O8m7K89k94j41L44k52J01J6j49J82rk54K10l6j28J51N5j59
3097g9k24L72M4J04k55j36J28K17j24J02j26J0Q3j24j46K92j58K95k91M9l29K72
3119b4K0J98Q8l78J09j03K45k9l66J65L36l33J09l8L66m97m1L13O7k08P8k92K32
$$ plain form
2957 -97 186 -47 32 -3 124 -216 -156 43 192 129 -258 17 -59 22 50 111 -37 68 -63 41 -157 -308 -235
2980 -235 -36 -147 -303 -64 7 -6 27 50 -71 -148 -115 -18 -235 124 -49 -20 -10 75 -28 281 -130 63 238
3003 238 -153 90 29 -99 -136 6 -168 113 50 -60 2 306 60 7 84 103 -165 -71 -225 38 -58 15 -131
3026 -131 -123 -49 166 78 91 258 -111 -36 1 -102 153 82 81 87 -67 -42 194 14 -14 82 -189 -66 35 348 -150
3051 -150 166 -78 151 24 65 85 243 220 321 283 -293 52 13 -54 272 36 -24 -102 -207 62 27 -119 -163
3074 -163 -104 56 -161 -26 42 -5 284 -10 -151 193 -59 42 58 -91 91 82 -172 38 2 -126 25 80 -79
3097 -79 -303 69 113 217 -38 -174 -46 171 47 149 23 33 116 -8 -154 138 -20 275 -16 33 -296 -24
3119 -24 -4 194 282 -96 13 -90 155 126 -240 -75 261 -72 37 -1 365 -132 -173 140 207 -1 77 -215 17
3142A7k51L19j38k25L27K8l05M18l20J47L71k28j43J31o8J02r6K7k21l6J1j72
3164c05K50j82K23j61K99r2q7n1J30J36j69j03J77J01l18L5J40k04R2P6l42N48
3186A93m18K46j07L09r3k3r8o0J44k2N5n04J98J94J89k69K8M6K34j60l38P0J92
3209Fk58K19j00J40j86J82j20J67o6K04l38K56k0j09j33oK96k48J80J26l01L46
3231B37k61k32J56o6K62k38M1J10O9p0K85j77j64K31j80J07J0j51L55j80j72l
3253c1LR3l3k37K19N7J41k09j65K38l24L71j01k96K88O9ok16L6J38k36L89k14
3276b6n0PP1P0k4k47O4O5M4L73o55J05L22j70J87o8q7K27m35O2L49p1M6P7j80
3301E6m3K7j14q2L92l45jM2L72k10K4p0M21l31k23K76j78k5J1k91J48K56k48K49
$$ plain form
3142 17 -234 85 -53 -278 49 77 -228 190 -130 17 388 160 17 148 80 182 86 113 -108 -144 -133 -305
3164 -305 -55 -237 -14 -175 124 32 -55 -106 24 160 -9 -112 65 166 -152 -117 23 -181 -89 -13 -355 193
3186 193 -225 21 -86 223 130 107 9 -51 93 71 126 -378 -180 14 203 -66 -38 8 242 82 -256 -186 6
3209 6 -252 -33 -133 7 -179 3 -117 50 -16 188 -150 106 86 -23 -156 -162 134 -114 66 192 -109 237
3231 237 -24 -256 -100 -166 96 -142 -101 9 78 8 293 116 -48 183 3 110 120 -31 324 144 -28 -31
3253 -31 -28 65 32 -205 14 71 212 3 -162 76 -248 123 22 -274 14 83 77 -139 -103 35 -201 188 -26
3276 -26 -76 -69 2 72 48 -199 -135 -70 -26 347 -308 -203 119 -51 136 68 -19 208 -227 -165 184 113 159 236 56
3301 56 13 40 -74 -156 236 -109 -110 -68 304 94 118 48 469 138 -85 191 13 -12 -1 -292 -144 112 -136 113
3325A13J62n85P3K33n0o7K55J10l63P7J15J09N9r1j45Q3J92k03j15j11M39o89
3347c99K70R0M3J29j29K48l30m7o3J01j6K85j39n8j69Q9o5J97K88k55j9q6m3Q1
3371Cn0MJ90k78Q3K58j04k49Q7J0p8P7K37P0m60J21n6j06M42j72%L7l5J36M3L7
3397B47j74L5j64K1J95J87j10j15j22k36o1K78M0J81k21Q4j41L06k31K56l58J71
3419F8k06qML58k39K04p1k72J58n8J77j54J11l4q4o0pK94qj89N3Q9j96j79L25
3444G6N1R6j83J67j17n6k30K35k59J52K56j46o1M2n3j8k8K83k05o6K51k03j43
3467a59Q1J14k0k43L13j98Q6L28k00j28K69m06M72k39j57j45M35j21K21k50j53
3488a00N80n90J19m3K22k85J65P4k42J55L4l07K93j18n0J25l09m8J68J3l5K8N1
$$ plain form
3325 113 275 -310 -237 -4 -54 -121 134 244 -119 -42 73 182 241 150 5 88 280 77 -38 -149 290 -399
3347 -399 -129 -39 4 133 4 252 -78 -125 -188 -87 -103 182 43 -15 -184 -95 -160 37 325 70 51 -35 -78 3
3371 3 -47 -43 147 -131 -48 210 106 -143 -56 -46 -124 -47 190 260 -200 -79 -135 -241 201 29 29 66 31 167 210 247
3397 247 73 108 -56 -35 160 347 237 122 0 -236 -297 -19 21 202 -19 65 -76 230 -1 255 -103 68
3419 68 -138 -146 -142 216 -23 181 110 -162 -4 -62 115 -39 72 38 -46 -106 -113 181 173 -16 37 126 -70 -249 76
3444 76 127 223 40 207 90 34 -196 39 -220 -68 188 42 -19 23 -30 -48 -76 207 2 -64 187 -16 -159
3467 -159 -78 36 16 -227 86 -112 -26 302 102 -26 243 -163 309 70 -87 -232 203 82 303 53 -100
3488 -100 480 -110 9 -34 188 -97 68 142 -100 55 89 -218 75 -43 -93 32 -277 -325 -157 -144 -179 -151 -100
3511a00J12r9J73Rj70r7M91k44K7n00L57M6J03mQ2j63k36K56N1m8q0N8jQ5j86
3536g8j51K67o5J41r6J67k36K15k32N5o0J47j62j3L12j34O1l11J75K4p6J64q6
3559B8K28k23l4J51l89K29O3J8j00j54J25J52j16pQ3q8k9K9PJ1K96m06L88j53
3583A09j06J01j75N2J5k02L97J6j94K04j13j6J40l22N0J48k72K90M4p7L9k04L08
3606B32l31J35m8j50k2K11j45O0j77J89K25k63J46J28L7j26k28L95j02k04J63
3627A25J46l35J8K29p5Lj53N2l8L24j33j62j19j16L53q4r0N1mQ4q9k1n0R9j03
3652h8j55L10K3j62o0L14j56k6K01m49K75l27M45j59m8K29M4j94O4L0l32K43j92
3675a70N4j35J64K04j2L9j8k19j97J49LJ79J89J09l84J65O1k40P0o2J71k50M61
$$ plain form
3511 -100 12 -87 86 95 -75 -172 319 75 102 -398 -41 5 108 104 186 23 -213 43 94 46 -34 24 23 108 -78
3536 -78 -229 38 -27 114 18 185 -51 164 -68 -13 -73 74 -88 -101 211 77 138 -173 2 26 -50 114 28
3559 28 256 33 -1 150 -239 -10 53 71 -29 -183 -58 94 -22 -29 54 -34 -63 -34 -27 -16 280 -126 262 109
3583 109 3 104 -71 -19 -4 -206 191 207 13 217 104 88 228 -94 -44 104 -168 122 166 89 128 -76 232
3606 232 -99 36 -12 -162 -184 27 -118 -58 -235 -46 179 -84 62 190 227 101 -127 268 166 -38 125
3627 125 271 -64 -46 183 108 111 -42 10 -28 296 163 1 -118 -234 119 35 -55 -4 -8 76 -13 -34 -84 15 -88
3652 -88 -243 67 90 -72 -132 182 26 0 201 -248 27 -300 145 -14 -62 167 211 17 81 111 -221 22 -170
3675 -170 -116 -251 -87 117 105 144 126 -93 -290 -141 -138 41 230 339 -45 120 181 -59 11 -51 120 -130 331
3698C31j84k32J45j88J95k19L27n46L50M9j76O3K5rk12K29K39l34P5o3L76o6l2
3721A43m84J28K10l05M13K6O8j97j6J06nj88J01l2J35Q0j76Kj1O1j1N1P9j60n9
3746d1L2J96J67j13Jj72Q9l84J00K79J1j27K19j30k27J14Q1l03K39K5k56K60j58
3769i8j4J35J44o6J64pk73k19J38J72j69O3o8O4K19k27OK7j37J65k2R2k64J74
3793aq5J00o5q3j65L59k22L23l64K97Q3k28o2P6p6K0K12n37M79k26L53k68J80
3816A00j06K9m4KM9r4J99K00n37K59L7OP1l3j02j96L39m55M76k00k23J1O8J40
3840dj87Q4K84j22m00K41K76OO8k52j25L57k08J77k91L14L2l91L20j27J47k11
3862a2K00k53O2k5K51k98jJ32k73J12J16P2k90K17j04O2Q4J82l06Q3J75l20j14
$$ plain form
3698 331 147 -85 60 -128 67 -152 175 -371 -21 28 -148 -85 -60 -69 -281 -52 187 -147 -72 -135 241 175 143
3721 143 -341 -213 -3 -308 105 131 199 2 -14 92 87 -101 0 -32 103 183 7 9 -2 59 48 99 178 18 -41
3746 -41 -9 187 354 241 242 70 159 -225 -125 154 165 38 257 127 -100 14 95 -208 31 56 -200 60 -98
3769 -98 -112 23 167 101 265 258 -15 -234 -96 76 -93 -30 -98 -34 185 -42 -36 -9 -146 19 -3 89 -175 -1
3793 -1 -86 14 -51 -134 -299 60 -162 161 -203 94 177 -51 -113 -37 -113 -93 119 -418 61 -165 188 -80 100
3816 100 -6 23 -21 -19 30 -64 135 335 -202 57 94 100 171 138 36 -160 179 -276 200 0 -223 -212 -144 -4
3840 -4 -191 -107 177 55 -345 -104 172 178 246 -6 -131 226 18 195 -96 218 250 -141 179 52 199 -12
3862 -12 188 -65 -3 -28 223 -75 -76 56 -217 -105 11 83 -207 10 -94 -32 52 234 -72 11 186 -134 -248
3885b48R6N3K12l22K14J20RK6j40N1j11J10j04j55J43J11o4k21nL44k2j09j67
3908a79K20r3K03r5j34L02k77K3J92K1k50JN2j16Q3P3rn1j29J71l3J56k18M3j67
3933b11K77J11m5j54J7q4L55L2l86j47K11L8j85Q9J30L6O3rj95K15m7k47N6Q0
3957@J27J37j04j82R3p9mk07L41j34j63K30n2jj6K01Pl33J41J31r9Q2K6J0j88
3982c6n0J76J38K1l89J13J23l89K54J57J07k24J9J1n5n3K34j34k94K90j74L39
4004A84j51J5K14k10j47K88j33l27K77j76J88O3K2q0j97M69k86n2J40k43%k03
4026c45K74J59l4j42O7J3N1l4l1O3l1k09J13Q6J05m5n6m9n6Q0j55K41k09L1J66
4051E3o5L8q9R2k48K71R3j63O3k38N47k84r3J53L4l59N7J27j4j76K75pj28P4J73
$$ plain form
3885 -248 -152 -99 113 -209 5 125 134 160 20 71 -40 70 -34 -189 -46 65 1 -220 -225 119 97 -12 -179
3908 -179 41 -52 151 56 -78 224 -53 -30 162 183 -67 -66 -14 -130 -47 26 17 -34 -163 8 -25 131 -87 -44 -211
3933 -211 66 177 132 -22 -5 -89 266 298 -88 -235 -24 14 -171 -82 48 84 147 138 -57 158 111 -136 -80 0
3957 0 127 264 160 -22 71 -8 -12 -219 122 -12 -175 55 3 2 -14 187 194 -139 2 133 34 116 142 152 -36
3982 -36 -86 90 228 249 -140 -27 96 -293 -39 118 225 1 20 31 -24 -77 157 23 -271 19 -155 184
4004 184 33 48 262 52 -95 193 60 -267 10 -166 22 85 107 27 -170 299 13 -39 101 -142 -142 -345
4026 -345 -71 88 54 -88 -21 -8 43 9 -22 41 10 -199 -86 0 105 60 4 -45 -101 -21 -176 65 -144 -113 53
4051 53 -12 26 -63 29 -219 52 145 -18 45 -193 354 70 -23 130 164 -195 -138 -11 -25 -201 74 67 -61 13 186
4076A86j97k3K96k12k01J81N4j64j44L44Q1K5l20j2K66m8q5p9j28L7J84j0L11
4099C42o37M68l38R4J56j77P0Q9j11Ro5K49o6JoKk52j6K54k20K51k23K84n2j27
4124b1J2K6J31k04J16K81m09J14j50K42K20k62j16j16K8L03k15K9l9L17k47R2
4146A32j30o2Q4j09O8O9J11m20L41Rn3j39jm7K70l11N6J44K8Q2k66J83rj48K1
4171i7N1J58l02K41q4n9nm9P5L5P3m9N4O1k91N4L40l12P7J22k22L76j43j34o6
4196i6j20P1L32l8k87K26r0P6J7r9K24m3k22p5R1o2J12m8j59R0j49L82j38K26
4220B21m27K06J56m7J48p3k04k8L0P2J64j87L33k86qmJ15k09j9k32J59R2r3R7
4244b4MQ3j20n5n7k0K76O6l09M7K64j41J92j24j10k9j3J30Q8m01J31M13m49J63
$$ plain form
4076 186 -11 -34 262 50 -151 30 84 -80 -224 120 201 226 -94 -106 160 112 27 -52 -180 -143 41 31 342
4099 342 -295 173 -165 -71 85 -92 -22 67 -44 -35 -100 149 83 84 78 80 -172 -188 66 -154 97 -126 158 106 -21
4124 -21 -9 17 148 -56 60 341 -68 46 -104 138 358 96 -20 -136 -108 195 -20 9 -30 287 40 132
4146 132 2 -60 24 -85 -17 52 163 -257 84 93 40 -99 -100 -147 123 -188 -132 12 40 122 -144 39 30 -118 -97
4171 -97 -46 112 -190 51 -33 -92 -97 -146 -71 -36 37 -12 42 103 -188 -134 206 -106 -29 93 -129 247 104 -30 -96
4196 -96 -216 -145 187 149 -138 88 -2 74 91 -8 216 173 -49 -124 -33 -95 17 -31 -190 -100 -249 133 -5 221
4220 221 -206 0 156 109 257 184 -20 -48 -18 54 218 31 364 78 70 66 181 -28 -47 -279 -120 -28 -121 -24
4244 -24 -20 63 -57 -112 -169 -189 87 153 -156 -109 155 14 206 82 -28 -57 -70 60 148 -253 -122 291 -158 5
4268Er6J36J94q5j39K3Q2J28l7m46L20L3j75j40K93j47j53m5J79L09m53J23K22
4291A31o2j12o7J69j91l6J96o3K2j15L60j65q3KK3l9J19m7P5o4n4J3lL8J65N5
4317B67k40J39k99J75j94RQ2J07n5Q2k77K09j56k12K03k5J85PqR7pk06J60M4J4
4342A01j52noN7J87r1j92K65l72J74Q1J16l80L42R4l08J39q5K26k0k61l6O8p0
4366a28k68N9M76k76K74k46Q7Q8k53M21j85l5R7n2j85m5K39l7m2l5R6O6r8J4J39
4391A71L3m05N8k18N89k02j98K76j26J62J65m22M00k84p0k15K23K08j72j9R8j05
4413e3J24l7j56J23J86k79K01j6j24k09L75m1j28n6L0J07k72M45j14k85L8K24
4435H3l5n2J8R7j99l0p3J93J52k8J16r1r9L0M2l13N5J78j89J40K9qL8k86K61j23
$$ plain form
4268 5 -91 45 239 154 15 38 120 248 211 -235 85 118 -57 -197 96 -51 -204 -249 -70 239 -214 -91 131
4291 131 69 -43 -110 59 -132 -168 28 -35 -13 -128 232 67 -16 -14 9 -30 89 42 117 53 -1 12 9 47 212 267
4317 267 27 166 -133 42 -152 -143 -61 46 -9 73 -204 5 -151 -363 -160 -185 0 7 -1 96 89 -117 43 87 101
4342 101 -51 -56 -62 -5 182 91 -101 164 -208 -34 47 163 -217 125 219 -89 50 -35 191 171 -90 -126 -58 -128
4366 -128 -396 -337 139 -137 137 -109 -22 66 -187 234 49 14 111 59 -126 -171 68 31 -11 -46 50 116 18 32 171
4391 171 204 -201 -143 -361 228 26 -172 104 -22 140 305 -117 283 -1 -71 -286 -63 145 -27 -46 52 -53
4413 -53 71 34 -122 1 187 -92 109 93 -31 -240 135 94 -34 -90 -60 47 -225 220 106 -179 -141 83
4435 83 48 -4 14 111 -88 -118 -191 2 154 126 242 151 52 82 124 -189 -134 44 -145 -5 24 16 54 -232 29 -94
4461i4L16m39L87N1n43N00O4k89K23l13K13j93J75r9J78j10K28m20K40J5j76J22
4483C6o0P9lm8q9m3J76k37K27pj14K66k21J38l3J03l44K73j44R6p0K87m66JJ75
4508b2J37k54J11J46l64O9j61J60L24j34N0J58l66L02j46N5j63J62l40K11L5j65
4530a95J86j90J65J35M3j78K3J5M7k60K95q5J74k84J67n6k7O4j7%k70M03j95m
4554d4Q1j82K08j20R9J65m62J01n0L62l8l04K74m1j90J34k1k3RJ05j63l3M99o10
4578b44M7J34J02L9nK0j68K18q5n8O5r0J04J15m8l42L53j43J09k65j49p3K38R5
4602c1R5K5l39K69K38m58J87j65j6K15j72K05p7j58P1L14l06L4L52k53j08Kk24
4625c00J19L60l12K38k00K83k21j8p6j35J05J04k4J40J22M0l00j68RO40m85j28
$$ plain form
4461 -94 222 -217 170 221 -322 178 242 -47 176 -137 76 -117 58 -41 137 27 255 -165 75 90 -86 36
4483 36 -24 55 52 4 -85 -128 48 -189 38 31 -83 183 -38 100 67 170 -174 99 -45 51 -19 268 -198 -197 -22
4508 -22 115 -139 -28 118 -246 -177 -338 -178 146 12 62 220 -146 156 10 65 -98 64 -276 -65 -30 -195
4530 -195 -9 -199 -34 101 144 -34 -11 4 51 -209 86 1 175 -109 58 2 -25 39 22 22 -248 155 -40 -44
4554 -44 37 -145 63 -57 42 207 -255 -154 -204 158 120 -184 90 49 -141 -7 -28 -51 -42 63 -100 -133 366 -244
4578 -244 -197 -63 39 78 73 93 -75 143 58 0 65 -25 79 194 146 -196 157 14 123 -142 -291 -364 -126 -31
4602 -31 64 89 -250 19 257 -201 -14 -179 -195 20 -152 53 -24 -182 -111 203 -103 -69 283 30 -78 -76 -300
4625 -300 -181 179 -133 105 -95 188 -33 -51 -127 -262 -157 -53 -77 63 185 225 -75 -243 -234 406 -79 -207
4647b07K11j68K58p0l53J81K55k61N35k95r9K9M7k10pK5l7O6J14j74J53K09j77
4670B5M0J50k56n5P0N3p0q0K79j90j08K1n3L91r1j87k55M10j24j15J36j19J20
4693hp1J34k45J57j10L89jj60j00K2J31j95j00K23Q7n5J45L4m43K12o7K23p6K5
4717A51j35j25L92m52L30OJ01k29k82K3M01l61P1l3J70K67lj88k93K43k19J97
4739C2J58lk9j31j33j30J09K07r3J06p6r8qK62q4r1M0jj16J66k12Q5J74l74M09
4764A69O0k50O7K80n30NL27j9j83lJ92J59l65Q3J77k37l4K58k51J32Jj22L5K98
4788B49j43k35R9k6J36j27J50j07N6n6k95L94j15J90j83o3O6j3K5J00j92J85p0
4811B5j89p3L78l27r9M02l80K28j5J27j07j56O4J15J83k54L2K87k98J97k73J39
$$ plain form
4647 -207 4 -164 94 24 -329 -148 107 -154 381 86 -13 16 63 -147 -154 -129 -166 -100 14 -160 -7 202 25
4670 25 65 215 -41 -96 -26 27 -43 -123 156 -34 -142 -121 -174 217 126 -61 -316 94 -30 -145 -9 -128 -8
4693 -8 -79 55 -190 -33 -143 246 245 85 -15 7 138 -57 -157 66 153 98 243 277 -166 46 -21 202 126 151
4717 151 16 -109 283 -169 161 167 268 39 -243 -220 181 -180 -109 -142 28 295 292 104 -189 54 -165 32
4739 32 190 187 158 27 -106 -236 -127 80 -13 93 17 -81 -89 173 89 -2 38 37 -79 87 -125 -40 134 -240 169
4764 169 229 -21 46 326 -204 -199 128 109 -74 -77 115 274 -91 -8 169 -68 -102 156 -95 37 38 -84 -49 249
4788 249 106 -129 -30 -56 80 -47 103 -4 52 -4 -299 95 -20 170 -13 -76 -10 -23 2 102 -90 95 25
4811 25 -164 -237 141 -186 -285 117 -263 -35 -50 77 -30 -186 -122 -7 176 -78 -46 241 -57 140 -133 6
4833FJ16J49k70J02r2j38J21J51l27J95J53j41k07Q1o4K43k28n4J89n0L72m19
4855a12P8m4l1J15J76j04j48J23j26J6J80k65J38R7j38k9J01Kj06J03R0q5l56
4878c25M05p1r5J51j05lJ55j40Q8q1O4j46K93n0l95J60J41R9k14q2pK58K53l95
4902d2L6J90p6j53l4K26l12K86j82J35j55K47l34J75K24j23K42l20m9J01m34M78
4924A26j91j46jJ21K36j36j37J86j35J72j05K21l51j2M45l35m9jp7K16k24J79
4946Bj68R6l4j44N9K28MM7m6m7K7R9M1j20J30j97K49j91Q4Or5j43O5Q2K12m37
4972a91P4P2K33n8k32L39j58j35q0J78K1J28k87j31K11O8O5p8L12k82Q3l97M47
4995B02m19J57J52j27O9p9M8p2K87j53k09j1R8K00j47K68l58K36l08K74L1r4J11
$$ plain form
4833 6 122 271 1 103 11 -127 -6 145 -182 13 166 25 -182 -101 -165 78 -150 -204 -15 -65 307 -112
4855 -112 -34 -78 -109 6 182 78 -70 53 -73 -57 123 -142 -4 93 -45 -74 27 29 -77 26 116 31 -325
4878 -325 80 9 -86 65 -40 -43 112 -28 60 -21 43 -103 190 140 -255 -95 46 145 -69 -151 -158 100 353 -42
4902 -42 -6 184 108 -45 -79 147 -165 121 -61 74 -81 166 -168 7 231 108 350 30 -19 82 -352 126
4924 126 -65 -211 -212 -91 145 9 -128 58 -77 95 -10 211 -140 -152 293 -42 -91 -92 -169 47 -177 2
4946 2 -166 -70 -104 -248 -189 39 43 90 44 -3 24 123 164 44 174 -23 226 35 119 125 30 -113 -48 34 246 -191
4972 -191 -117 -45 188 130 -102 237 79 -56 -136 42 63 191 -96 -227 -16 52 117 39 351 69 152 -245 202
4995 202 -217 -60 92 -35 34 -45 3 -69 218 65 -144 -155 -57 143 -4 264 -94 142 -166 108 139 45 156
5018A56l37K80K1l7n7k0N5o2O6j67L30l41J92J23l88L32l61L19j51r1k1o8N8K17
5042D8j24L83j54p8j17L04l97K3J37l4K78l96Q8J81j58J86j98p1j06M22l38J29
5064HK12j79K81m30J13Ok9J94k60Q0j3Ll2K80k39J1J15l78K28j4R1j64r2K60K37
5089B89O9l16kN3l19m5J65J70p0k08L57Kk11J61k35K28j12R4j73K2P1K24l05J12
5113B1p1J65j50K25k81l2o9M29j72R2r6k87j9J48J45L6J0l54K55K9o8J13m6j53
5137a30P5O9l8K47p4j78K27k50J75k54l4L09q7M8or7N1J19j10J56k79J03O9J07
5161B18j41j46P1N8r9J77j65lJ16j34N2q0K36o8J41m11P9J92L6r0j53J65l6Q7
5185A02Q9J49n83r8J76J56J05j64K4m4M1J08o1L8K48j50J3J02m29L60o2k65j22
$$ plain form
5018 156 -181 99 120 83 26 6 61 -1 65 -102 228 -113 79 202 -186 146 -215 104 -47 -138 -159 -227 -169 48
5042 48 -76 307 153 75 -42 262 -135 -112 25 -9 269 -127 -39 142 -16 170 -28 -99 -205 217 -121 8
5064 8 220 41 322 -108 5 11 -18 176 -84 -4 -17 -14 -46 234 -5 6 121 -257 -29 -43 48 -116 -208 52 289
5089 289 358 42 40 93 -226 -271 -106 64 -6 -214 143 145 -66 95 -140 88 -24 70 -103 -81 -10 214 -91 21
5113 21 -50 115 -35 190 -91 -123 -192 237 65 157 61 -226 -245 -97 48 84 94 -260 -5 24 -44 69 23 -130
5137 -130 -55 14 -24 223 149 -29 198 -52 123 -131 -165 144 57 105 99 2 53 172 62 218 -61 42 111 218
5161 218 77 -69 2 60 -39 138 -27 -30 86 -48 4 -76 160 92 233 -178 -99 93 129 39 -114 51 15 102
5185 102 191 340 -243 -341 -165 -9 96 -68 -44 -88 -47 61 0 38 286 136 149 251 -178 182 120 -145 -267
5208b67J51p6L93k9k13J2K52l1m50K17l7K07j48M7k87M94j82O5k22J02r4p0J09
5231e7M7J29j68K57p9k11J57J17m12J11J37k85J96O6J3L43k93j46J10J92j31j45
5253e2J36k62M21k27j22j6N02l82o0p0k08M34k9k05J41p7O8j21K73j55J89l68
5275a90Q0J11J4NJ55j96k30J23N1k4K33k66K14J36j85J2K7qJ69l31J03ON7O0k85
5300a59L89k79N6j21J46k88K00R6j37j54l5K82K38k97J00K0j68m3J40L7N8j57
5322g6J85n3l7K43l22j08J05K00j22k81L10J02n9m6k73J46L31m60o8N28k40j09
5344a04K22j08j47PK72J2Lk91J8kn2O1k10M23J62p9k30k5N9N6J19l17J34r1Q7
5369b1nj8J81k61K94k59J10L1p8r7%K63N2m68L49k74J68K90m55K29L69m72j4Q0
$$ plain form
5208 -267 -116 -192 201 172 -41 -29 223 192 -258 -41 -78 129 -19 28 -259 235 53 118 -104 -2 -96 -166 -57
5231 -57 -10 119 -49 208 129 -82 75 192 -220 -109 28 -257 -61 5 18 361 68 -78 32 224 93 -52
5253 -52 84 -178 243 16 -106 -122 380 -2 -62 -132 -340 94 65 -140 1 -76 -8 -129 144 -11 178 -190
5275 -190 -110 1 15 20 175 -21 -251 -128 -77 -101 132 -134 80 216 31 43 70 62 231 -100 3 9 66 126 -159
5300 -159 230 -49 7 -114 32 -256 -56 40 -97 -251 -286 -4 234 -63 37 57 -111 -154 -14 23 81 -76
5322 -76 109 56 19 262 -60 -168 -63 137 15 -266 44 146 87 41 -232 -86 245 -215 -283 245 5 -104
5344 -104 118 10 -137 -130 142 154 157 -134 -116 -118 -170 -109 -319 104 266 187 -43 -68 -9 47 166 -151 -17 -108 -21
5369 -21 -26 -44 137 -124 170 -89 21 52 -26 -123 -123 140 192 -276 73 -201 -33 257 -198 31 400 -72 -86 -6
5393fJ28j6j7R2m0rk21L81k03M7j27K21l19N8K80k93n8Q3j06r1L65j33J6M2j43
5418f9J74l76L01P9l9j14N7r3J87l3j24J31j32K18j91M30n25K63j84N4n1J06j07
5441c8K21j30q1K50k71j65O0J44J62l4q2l2l2k8L1j06O2J93k44M50m56J86k47
5464a87K31L0k22J95j5k2L8j48J8N8j70j5n7K58m8Q0O7J09m47J63R5J91k72J51
5488H1O0k00J15k07L3l5L36l37J38n4J08r1K06q9o5p5K72m5k98j31M32k11o4J66
5512D5j51L98l93P2p0J97k1J89m21M15j58M6J1j70q5j44J99n4R0j35lK71Q5j68
5536D5op5J7j79J21P1n7N1k1k2K23k71l8K47j38p4M0J22P1n6P0j29j24K48l18
5561a82L2Q0Q7J17k99J64o2j28K27k15L57Q7j66J07ol87J88N7J4j81P5J54l32
$$ plain form
5393 -6 122 106 89 181 141 132 -89 292 89 136 9 230 -89 -31 249 -44 -102 -19 -125 -216 149 16 32 74 -69
5418 -69 105 -271 30 109 70 -44 13 -80 107 74 -50 81 -51 167 -24 406 -119 144 -40 14 -37 69 -38
5441 -38 183 53 -28 222 -49 -214 -154 -10 152 118 36 4 -28 -56 -25 -131 -69 124 -120 330 -126 60 -187
5464 -187 44 74 -148 47 32 10 48 -100 -82 -24 -194 -209 -266 -8 -56 24 91 200 -247 -84 11 202 -70 81
5488 81 141 -59 56 -151 -118 -153 183 -154 -16 -70 38 -53 153 64 -1 -76 196 151 -147 -278 154 -57 -121 45
5512 45 -106 292 -101 -29 -99 98 77 266 -155 260 102 148 159 -11 -96 -240 -41 -95 -5 -140 -143 128 213 45
5536 45 39 -36 -19 -198 -77 -6 -63 -12 -33 -55 168 -103 -141 106 -32 -106 -66 56 127 71 141 12 -112 136 -182
5561 -182 -150 -70 17 134 -165 -1 -63 -191 36 -179 178 265 99 206 200 -187 1 58 72 -109 -34 120 -212
5584b12O8J6n2L06k56K8p2K3K06j26KJ8L51j72l42K91j44k0J14J8J55l67K42l48
5608b73K95K0N6j63M3J27k02k1J59K11J3j45j16j73K09J74j57j69O2J16k20L08
5630A54k52K01j48J21p6J76l29J20q4J22K52k17J10k18j03L03P6k1j63O0J09r5
5652I8L4k71J67l67L14K7N0j29L3J00j51Q0O2m6j45K14P5l22k49N81k16J53j24
5675c2K8j19K47Ml40l6L04r9j52J80O6P4j18K3j48j38J81QJ2j68L92l24K10J15
5699A70k59n2p3M60m48L9K31n1JJ07j95K60j37k17l7L84k92K62J65r7j60j41P4
5722fJ48m1J03l76K23j64J45nL4j8k7j11Q7q5Q7k22N5K08P9j28Q2k60R9J11J33
5747A51j56j30K47m92N78k67L00m06J93L00k94J6Ll79N40k87K18l2K02j81j81
$$ plain form
5584 -212 -144 -128 -180 126 -130 -102 -174 -151 55 -71 -69 -51 300 128 -214 77 -67 -87 27 45 200 -167 75 -273
5608 -273 22 42 98 -65 -22 105 -97 -118 41 252 265 120 4 -169 40 214 57 -112 -50 66 -154 154
5630 154 -98 103 -45 76 0 176 -153 -33 -117 5 257 40 150 -68 -171 132 208 187 24 84 193 98
5652 98 132 -139 28 -339 -25 2 52 -77 -44 56 -95 -15 47 1 -144 70 145 -177 -426 155 -61 92 -32
5675 -32 -4 -123 124 128 -212 -248 56 -43 -195 -15 51 125 7 30 -118 -256 -75 -67 -55 -223 169 -155 55 170
5699 170 -89 -141 -214 246 -202 -163 68 17 18 125 -70 190 53 -164 -201 183 -109 153 318 221 61 -80 -6
5722 -6 142 101 204 -172 51 -113 32 27 61 43 16 -95 -8 -93 -6 -228 -173 35 114 -14 68 -192 -93 18 151
5747 151 -5 -135 112 -380 198 -69 231 -175 18 318 24 40 43 -336 204 -83 135 103 305 124 -57
5768e7M5j43R9J49j80K54J13l7k28k41K20J47j66j25R0oK1j6K89j72Rl33M87l55
5792a36M5P3J3k0L24l1k49k09K63j41J28j60L2j45N9K91l55j53L37J53J20k46
5814gj70L73k61L18k40J65L3k24R5l05K53K68n80K07N0k0R3j3N8j01q1K62J00
5837B73m37K54j48K71L3n23K72L2r3k40J69J90K61k04l41J8jM08k87j20K07P3
5859F7n2j36K49K51k50k74K25m8mrQ4j89J62P7l25J15K88k66J43k9J8l84L80j41
5883d8j07J11n4L7K45k03nr0J34K65l11j46L15k5k76J58l6j28J09j29K87n6o2
5906a5Q5q4j51K48j49lo2R1j92K88M7l09J77j35P2K57q1K20l99j07M57k85j21
5929a51k2J21M6L9J7n5J62l03K79l13P1M26k70j30K04j15j62J60r7J69j40P0J65
$$ plain form
5768 -57 -12 -155 -56 93 -87 167 280 243 15 -226 -6 141 -25 -150 -60 -66 -45 -61 228 56 65 -268 219 -136
5792 -136 -91 -18 -5 -25 299 268 19 -190 73 -68 60 -100 -68 -213 -154 137 -218 -371 -34 119 239 -7
5814 -7 -177 196 -65 253 13 178 211 -13 82 -223 30 298 -282 -75 -25 -45 48 35 93 -8 -89 173 273
5837 273 -164 90 -58 213 246 -277 -5 27 -66 -306 -137 53 314 110 -231 -213 -214 194 -93 -213 -6 67
5859 67 15 -121 128 379 129 -145 80 32 28 19 103 -86 76 153 -172 -57 231 -35 108 79 97 -287 93 -48
5883 -48 -155 -44 -98 -61 184 -19 -24 -114 20 285 -26 -172 143 118 -158 0 -36 -164 -55 -184 103 47 -15
5906 -15 70 -14 -165 83 -66 -69 -131 -40 -232 56 103 -206 -29 -164 -92 165 84 304 -95 -202 255 -30 -151
5929 -151 -173 -52 -6 33 50 -5 157 -146 133 -180 -109 317 47 -83 121 6 -156 4 -93 76 -64 6 171
5952A71l93K30j64M7K44k73M0R3J25k19K79l3k19J18J30l60P2J9J63p2k4m3J01
5975C2l3l49K43K6mn0%K19J41l73K72k65j81K98J6p1j22K61l41L28J6M1j74j97
5999b67J24Q5J23L1j78J32k79J71M2p0o3J83R4p7Kl82N23k42L16n8n08O2j8K90
6023C6l1r4J2O4Q7r2P2k16K84k62N11l19j02N3j63J25R8p0J04j52p0M92l48L4
6047E3p0k2k5l2M41l32l7O0M5l13L46K9k51K3j4J27L79m73K1L92k90j45j34K86
6071F4j27J71j85J29n8J45j21K22l55J19j41p5L28p9j9j0K6M53m80O7k06J42l6
6094b6P0j25O2O1k4N6p3k3j46r6K05K1rK8k26K32J85j23Rq0j37NJ78M4j33K06
6120A41j44J16l32K60n7k2J57O4j31J46m13J67O8n0M4K15j78k5K98j60k61J04
$$ plain form
5952 171 -222 8 -156 -109 135 -138 -98 -5 120 -99 180 147 -72 46 176 -184 -112 -93 70 -2 -26 -69 32
5975 32 -1 -350 -107 -81 -85 -135 -135 84 225 -148 124 -141 -322 -24 -8 -79 -201 60 -281 47 63 104 -70 -267
5999 -267 -143 -58 65 96 -82 50 -229 -58 -16 -86 -149 34 128 51 53 -329 194 -48 268 210 -298 -236 -254 36
6023 36 5 -89 -77 -13 74 -18 54 -162 122 -140 371 52 -50 3 -160 -35 63 -7 97 -55 -125 367 19 53
6047 53 -17 -39 -64 -96 345 13 -24 36 81 -232 114 143 -108 -85 -99 28 407 -66 -45 347 57 -88 -222 64
6071 64 -63 108 -77 52 -6 139 18 240 -115 4 -137 -212 116 37 18 8 34 487 7 74 -132 10 -26
6094 -26 44 -81 -19 42 18 74 1 -22 -168 -264 -59 -38 -47 -19 -245 -13 172 49 58 -22 -159 -154 24 68 -65 141
6120 141 -3 113 -219 41 -16 -38 119 183 52 198 -215 -48 20 -30 14 229 51 26 324 164 -97 7
6142GK16k56N0j86J93k02J5K08k21P6K03j94L8J65q2j69J97N6l80M05N4j26p7
6165a0q8K29r3l7J15k8j74J03K02o5k40L4J81j98J21M0j5K4k37J32j80K27j37
6188i4j44N42j09J8j00l65N4K37L6L0N8r0j76j48J52J13K3j70n6L8M82j92k59
6211a20J66ol05L58L2l2m3J97n8j4k20r5J79o2M8J02m1r8r4j00J28M31m31J33
6235E5r9K9L0M2j32J56j63J84j08j41K54l26p1O41m07m3K24j14L75n07j17J72
6257f6J82n2K8j53J71j6j13m1k1nK28j29k2j54L19Q8j50j20Q8j61J78P9m14K62
6281FK2J30k74P9J66%j30j41L83l37P0%K02k51M4j74l2K94J02j43K3L4l5j27l8
6306a27L20k56K46k93L39l69K76R2l92J67k01R8K20k89K08r6P9j95M02l12O7j20
$$ plain form
6142 7 223 -33 17 -169 24 -178 -163 45 -176 -100 103 -91 -53 112 30 -139 58 114 -266 139 193 67 -10
6165 -10 -98 131 38 1 116 88 -86 17 219 154 -86 -52 129 -69 52 92 77 101 -136 -4 -184 43 -94
6188 -94 -238 304 195 213 113 -252 -198 39 75 105 163 73 -103 -251 -99 14 37 -133 -189 -151 331 139 -120
6211 -120 46 40 -265 93 125 93 50 247 189 175 -45 -140 39 -23 25 127 86 -12 -106 -206 -78 353 -78 55
6235 55 -44 -15 15 57 -75 81 -82 102 -6 -147 107 -219 -290 351 -56 -99 125 11 386 -121 -238 -66
6257 -66 116 64 92 -61 110 94 -19 -60 -81 -86 142 13 -9 -163 156 244 94 -26 62 -99 79 158 -256 6
6281 6 28 158 -116 -37 129 129 -1 -142 241 -96 -26 -26 176 -75 -31 -205 -237 57 159 16 39 73 38 -89 -127
6306 -127 193 -63 183 -110 229 -140 136 228 -164 3 -198 -100 120 -169 39 -57 22 -173 229 -83 -16 -136
6328a36O0P9J88l24K23J0m5l3m1M1J08k09k6J51r3J98l02J66j61J01k9M8J75k79
6352a30K40r0j90J58j59K24r5K34j53J99l46j0O6p3P0J39K12m14KJ21J18j24J01
6375A00j72M0R8j91PK50l57J43J37l17O7J57k20L16j75J2L95l13J59l01J30K23
6397A88m0j31k10l8J1L60m6J7j86p1O0J36j05K57k63l93K75J64j88K89j20J59
6419A25j06m0j72K63K2k52K80k48M8J49j4m4k58K00q9J56nk63K97l20J23J88j8
6442B2p8J68k71M6Q8L8K8k02K36j9O0j64K92j72j67L54k11K6k66J70j04J2J06
6465hJ41l30K99L20m21J55j01l6o1K92m45M9k2M17l83O6K49j23k5j10K12j96M3
6488a8J23M8m05K57j51O2L74l98J35j09J26o6j51K01L0J6lj47O1j59LJ60K26k02
$$ plain form
6328 -136 -76 3 191 -133 90 100 55 22 -19 22 130 -79 -105 46 -47 151 -151 15 -146 -45 -74 -26 149 -130
6352 -130 110 20 -170 -12 -171 53 -42 192 39 238 -108 -118 -52 -125 -55 84 296 -118 -116 5 123 -1 100
6375 100 -72 -32 66 -125 -118 132 -225 -82 55 -262 -195 -38 -258 58 -117 -105 290 -23 136 -165 -35 188
6397 188 148 17 -193 -231 -220 140 94 111 -75 -146 -86 50 -55 202 -61 -454 -179 -15 -203 86 -34 125
6419 125 19 -21 -193 70 92 -160 120 -128 -80 69 55 11 -247 -47 -136 20 15 -248 49 -271 -148 40 22
6442 22 -56 112 -159 -113 -25 13 41 -161 75 56 116 -48 244 72 -95 259 48 74 -192 -22 -126 -114 -8
6465 -8 133 -197 102 422 1 156 55 19 -42 250 -195 -146 -168 249 -134 -68 181 58 33 -77 135 -61 -18
6488 -18 105 153 -252 5 -146 -84 290 -108 27 -82 44 -22 -173 28 58 74 71 -76 -15 -174 -171 -11 215 13
6512A3n5M1J47k61QR9Q2J23j73J13k43J62K05j95l4j35l1R6J85j78j05j7J10l3
6536g6N6J19k37L19o8j19j90K06j00K40k08l93L05J60j14K5N1k40L42o6Kk2j82
6559a90R9k48K38O6P9l29J32o4m1N8L88k28J52J47l9k82j14K96k30P6J69j31O4
6582F8k59o8M44j87o1N1K08k26j04k03L46k8J33l70K73O8k1o1l6l2J51j14QK94
6606B74l43l0k04K68o3j01L27l3j89K17l7k63L33j39p1m9N0J12k07J49Q1j17j57
6629a92Q5p9J89o0l8K82j11k80K73j32O1j66R9N6j44K25j16K60j35n5q6j90J97
6652e7K84n18L89j02j39K22j36N8J1J45n3l52N8J85j08M20l56N5kK6p9O7l8O0
6676D0J3M3l3k57J36lO0j65L40k3N5m43J09J9M13k37j82K79j31J71l74L18j89
$$ plain form
6512 13 -42 -1 146 -115 -107 -8 74 197 24 137 -106 56 261 66 32 -103 -134 -38 147 -31 -136 -153 -43 -76
6536 -76 -20 99 -138 181 113 -6 -196 10 -90 150 -58 -451 -146 14 -100 -75 -24 -264 78 12 14 -8 -190
6559 -190 -91 -339 -101 -35 44 -285 -153 -217 -258 -200 188 -40 112 259 220 -62 -176 120 -110 -34 135 4 68
6582 68 -191 -259 185 -2 -63 -12 196 -30 -134 -337 9 -19 114 -256 17 85 64 3 -33 -65 86 -28 -20 274
6606 274 -69 -99 -303 -35 -98 -199 128 95 -94 123 86 -177 156 17 -54 -103 -53 59 -148 1 82 -35 -192
6629 -192 -107 -186 3 -57 -95 187 76 -204 69 -63 -2 -168 -69 -13 -157 68 -48 212 77 22 -64 -254 -57
6652 -57 227 -291 98 -4 -143 79 -57 1 12 157 104 -248 -190 -5 -113 307 -49 6 4 30 -49 18 -20 40
6676 40 53 96 63 -194 -58 -61 -1 -166 174 151 206 -237 -128 -109 304 67 -115 164 33 204 -170 148 -41
6699d1K9J18k51O6j1l5O4K44k08J39j66J14J7j96j83J11M5J24J02o1j21R6n1j00
6723a55M43m20K44o0m0l8O9j25M3o5R9j38J06j51J92K05l13J01Q0q9K96j67j76
6746e9L05k06k4q3K54l51L76k52q1R5P4O6J21k54M4j55m2M67l77o4K86j27n5M
6770c8Qm6k9M11j16k01j54J15J66j41o7J98j19j17J63j02M5J5k32J48K48j5%j22
6794A8m7K72k59l5Jq9K82N1n04M02j26L2l2J7n9K24o7j58r6L26Mk29J21q7R6L4
6820I2r7O5k48Q7k7K0M7J14j03R3L5O7N0j20k48J02LR1n2M7k1j59L90k66P9o5
6846b4j02O8p9L19j93r6J62J82j74m31L44j23J66P2j3k56Q2L27r4k75J77j5K0
6869D4o3m2L33k80Q5q1K84k13k2o6J07j46K46m6p9p2Q6Q2j73J96k40K6Q2O1Rp1
$$ plain form
6699 -41 -12 106 -145 -79 -90 -125 -61 183 -25 114 -52 62 79 -117 -300 -189 -144 -20 82 21 -100 -4 -55 -155
6723 -155 288 -132 112 52 12 -26 43 -82 -39 -104 -5 -143 -37 -188 4 209 -104 -3 77 -12 284 117 -59
6746 -59 246 40 16 -67 187 -164 212 -40 -121 -26 48 114 235 -19 25 -130 -172 295 -82 -146 140 13 -42 -38
6770 -38 -30 -76 -105 306 190 -11 -165 -50 116 -25 -92 106 -13 -130 33 -69 -24 -9 -241 -93 155 140 140 18
6794 18 -29 243 -16 -51 -50 -139 143 194 -310 92 -34 -2 -34 -17 -76 148 81 -77 -173 153 157 -72 49 -38 58 92
6820 92 -5 60 -188 -101 -128 -108 -61 53 -50 43 78 145 195 75 -173 -71 -68 23 -29 18 -3 -162 228 -38 41 -24
6846 -24 -126 -58 -137 182 -11 -107 55 237 63 -368 -24 -147 19 91 78 -178 -96 231 137 -138 39 24 44
6869 44 -19 -61 272 -8 77 -4 280 67 45 -21 86 -60 186 140 61 -11 75 157 -16 180 -60 -34 48 109 118 47
6895D7J13m55L49j5Q8L7q8QJ21k87L9l79O08l16M54l21p7L17j88k06K67j87j4
6918h5j62K98Q9%j07J17m84K36J56l56M88l34q8K31J76l25R4P9j6K1J1j21J35
6941E3l22J28j15j10M05N1j99P7K66K8k07j31L66k71K5r1L45l94K20J58k54Pj81
6964a46K67q5R7j87JK42j31j82N1Ol1N20j05k83o6O5m5mj41K89j84K74k03j12
6988i3K12K5j4j61P4m2R1l7j19j42Q0J28j1J67j66lp1rK25m37J76J11J22Mj10
7013@J98m2M6m91M41m27J73Q0%r7J02j09K60q2P1N1k41Q9L3l4j77L64k95J37q0
7038c0p1J0Q6K65m18J01K51jO1j59j3km7M8k86k06L51o9J60j7j64L17k11N8p6
7063f2J31J9j1j48O6J40l15R4J80j13J40J06j92j80M0J20J01o7m5r0K33k06p0
$$ plain form
6895 47 160 -295 54 39 127 164 76 84 205 -82 -43 -422 186 -130 324 3 -74 243 55 -151 116 -71 -85
6918 -85 -247 51 140 140 33 150 -334 -98 58 -298 190 -144 -232 -1 175 -150 -56 23 7 28 39 -82 53
6941 53 -269 -141 -256 -366 39 90 -109 -32 234 262 55 -76 290 19 44 -47 298 -96 124 282 28 35 -146
6964 -146 121 36 133 -54 -53 189 58 -124 -73 -67 -98 422 317 34 -32 33 -12 -16 -157 132 -52 222 19 -93
6988 -93 119 144 130 -31 43 1 92 55 -64 -206 -126 2 -9 158 -8 -11 -82 -91 134 -303 -127 -16 106 110 0
7013 0 198 156 202 -289 152 -275 -102 -22 -22 -119 -17 -126 134 52 123 174 -67 22 55 21 -156 208 -87 50 -30
7038 -30 -101 -91 -5 260 -158 -57 194 193 254 95 82 80 33 81 -205 -411 -60 -129 31 14 -150 167 -44 14 -62
7063 -62 69 88 77 -71 -5 135 -180 -86 94 -19 121 227 35 -145 -105 15 116 49 4 -86 147 -59 -129
7086a29K75k14OK49q3j95Q5k81P84n13M0k8j16J97j52J85L7Pk20J49j35j2J32
7109F8l10L23k34K27jJ95k42k19N01j87q9j06r8j80K89Lk5J45k04K86j70p8Q2
7132b4J12l6l01K02o5K84j33J35l2l36R8K74m39K14J32j28K90k31j94L89m1j41
7154B9J35J88J3l03m8n4j59K95J37q9N4j37q2nK12k38j43J48J49m7j28j05J11
7177f7j99L53r3j62J37J05k35Q3o4J04K19n2j01k9K87j39Q3k38J25j08N7P8j78
7200c4N3l9J20M3k56K19K28m46q5K05k6j50J63j65J79j11L9k61L39n1J00k13K35
7223H6p1R8k35k4l0m0K45j7j24j12K41J09k24J30J20j28k34K79R0j72J60K1k13
7246d5j9K78j11m1j18K14j34k5J76N2l29j66K36J7P7J09j44l4q7K16Mk37%Qj63
$$ plain form
7086 -129 146 -68 -62 187 104 -91 -6 -287 497 -16 24 -4 -120 77 -75 110 147 154 -66 83 -52 -64 68
7109 68 -242 81 -153 74 73 268 26 -193 308 121 32 -74 -172 -352 -63 -60 -85 60 -144 142 -28 -106 -24
7132 -24 88 52 -249 -47 -112 172 39 174 142 -194 -96 178 -261 -47 85 -43 247 16 -178 211 170 29
7154 29 164 352 365 62 14 -40 -199 96 233 144 198 61 -21 -26 186 -52 -195 -47 102 55 -73 -178 -67
7177 -67 -266 87 -6 -168 -31 74 -161 -78 -142 -38 181 129 28 -1 286 147 230 -8 117 9 66 144 -34
7200 -34 19 -20 100 143 -113 106 334 -112 -197 8 -18 -168 -5 -170 9 -102 -63 -324 15 -36 64 -149 86
7223 86 15 113 -122 -146 -176 -216 29 12 -112 -224 17 126 -98 32 152 24 -210 69 159 -13 147 168 -45
7246 -45 -64 214 103 62 -56 158 24 -1 175 227 -102 -268 -32 -15 62 171 27 -7 -94 122 126 -111 -111 -103 -266
7271b66L83k45K52M7N8k23j54K71k62O8jj9J30r4K70m37L78q4j8R5l41N1L46j15
7295I0J04N2l90J46K44j97l98L87r7JJ10j2j28K67k30J58j96L0Q9K5m7k37J93
7318c6k91K08j30L04j81N3J12J14l8k96K18J7k49J34J49J01j34n3J20k0m6l2r5
7341g1q6n2L33k12J43l6on8k9J77j71R0j0q7m2K30k2R8k05j35L02l59J56M37n73
7366a88K12j45O5J20J05j09n7p1J04O0l11K20j53Q6n0J47n2J61j04J40j30K88
7388C38o51L02p0p5n5J86J64j19K03j81p4R2j0j71J36j21K31k76L36j57k5j6N0
7411C7o9J18Pm5J45k00J5K20n24K10m2J99j62K52j09J2k25J0K76Q7j82m3K08l35
7435a40L9K9P1j18JK78j79l7o2L62j10l63J19O6j65L35j22l2K90j8j63j00J4j01
$$ plain form
7271 -266 117 -128 124 171 229 6 -148 123 -139 -71 -72 -91 39 -55 215 -222 156 72 54 149 -192 -141 205 90
7295 90 194 246 -144 2 246 49 -349 38 -59 -58 52 40 -88 179 -51 107 -89 -59 30 55 8 -229 -36
7318 -36 -327 -119 -249 55 -126 -73 39 153 115 -181 37 54 -195 -61 88 189 55 2 122 102 56 24 -71
7341 -71 -157 -209 124 -88 55 19 13 -45 -74 103 -68 22 12 -75 -117 113 91 189 -16 -151 151 -208 -52 385 -188
7366 -188 24 -121 -56 64 169 60 3 -68 36 96 -215 5 -148 -62 -112 35 -17 144 40 180 50 338
7388 338 -313 -11 -81 -156 -211 -25 139 20 223 42 -32 60 50 -121 15 -106 125 -151 185 28 3 -13 37
7411 37 -32 86 93 48 193 -7 8 228 -296 -86 -128 71 -91 161 52 64 -161 -151 125 212 30 -13 195 -140
7435 -140 -101 -72 -1 -119 -118 160 -19 -56 -118 244 134 -229 -110 -44 -209 126 4 -28 262 244 81 -19 -5 -106
7459a06M04m14K02k27L89l58J7J70m4j75J87K0m1j9J69M8j75J8j19P7j4p3R4J77
7483B07n48J83J40J70l05J8J47o3NJ18j81K87j1N3p3L9k54K40J60l61J10l22J44
7506i7J2p6L44j29j34m0k17L66j80M2J08K02k57j11Q2K69j72k21M51m48J40J84
7528A18Mk21L2J98m94O36m10Q2J85kj07K21j92O0M2ll7j78K0K40j68j43J26j8
7552iK48m06M53j08k55J09Rl5j90J58k08K19K8o9J47K18l86k00K84j88K49m8j96
7575a76K86j7L7j97K73nj97k0j30K96l81K4J05L48j27j89J19k24K23k01J57J5
7597A9P2k71L10j49j42K83j10J71m21M77k18Q5K2M5l91R8K57k48J34L8N6k00l9
7620a22K95k83J93J64k30L12k06N0k20N1J09l20Q9J55K8k55O1N1p5J30k0j75K94
$$ plain form
7459 -106 298 -116 86 -141 248 -110 -93 77 33 -142 45 65 24 5 174 222 47 65 -54 23 9 -64 30 207
7483 207 -341 -158 -18 152 -153 -135 12 -51 -46 72 -109 178 167 220 147 186 -68 172 332 -29 81 -241 -97
7506 -97 -85 -161 183 54 -80 -120 -337 29 -151 -109 -1 201 -56 -167 -85 184 12 -209 242 -206 -66 118
7528 118 122 -99 -67 131 -363 273 -137 -55 130 128 21 242 50 110 152 149 112 -66 -46 194 26 -117 9 -9
7552 -9 239 -167 286 178 -77 32 41 6 -184 -26 -234 -15 13 -56 91 309 -77 -277 7 -181 68 20 -176
7575 -176 110 93 130 -67 206 201 4 -16 -146 150 -231 -207 -102 246 119 -70 49 -175 48 -153 4 19
7597 19 91 -180 130 -19 -161 122 12 183 -238 239 21 106 128 173 -218 -120 137 -111 23 61 117 -83 -122
7620 -122 173 -110 83 247 17 329 123 173 -47 4 113 -207 -118 37 65 -190 -129 -78 -153 -23 -43 -218 76
7643G6k49K47M1j31K0j61rL7J76j9R0j58K15k67J43J9J24j27j77J04j56L03l38
7666a97M2K77K5k13L5J98j63j78K90j5p7k6q9J09j83J47%l9J14J25N9k19J20j96
7690e4K2K53l46M93n23O3k8J27J96m07k2K93j15L6m7q1k8K35k5k12J59j64K75
7713A00r5p5J90m1j10l39L15q2j42M05M0l60M30j94J59k58J8j57R8J53j42Q1k3
7736b9J58k46N6j63J25k4j66K36L61k56j89j3J29j7R1j3M4m8k3R9K8k27J40L8
7760I1K5j88J26L4n3k89J58K0j16K22n9q2J51Lj80J43l39J58J76K61j19j92J55
7783A06j56r9K66j95l9K30k28K06j43J31K4l51N12m62J19P6M1j56J19K9K1L0q3
7806bQ7j6o8k0r4j92L51j84K4R5K9j1l8Q9j52k10M07k39l3L04n4l10K90J35j60
$$ plain form
7643 76 -173 74 115 -16 4 -157 -166 -129 47 28 118 -40 175 -92 51 70 194 67 -110 -6 -162 141 -197
7666 -197 -155 122 147 -66 -31 167 4 -174 116 101 24 -2 -91 18 -165 -18 -18 -57 57 182 241 22 142 -54
7690 -54 -32 221 -125 368 -155 -92 -120 7 203 -204 -226 67 -48 -12 -59 -140 -168 67 42 -170 -11 -175 100
7713 100 5 -70 120 79 -31 -370 -55 -137 -279 126 166 -194 236 42 201 -57 -39 -196 -98 55 -87 -6 -29
7736 -29 129 -117 -61 -224 -99 -123 -289 -53 308 52 -137 -150 -21 -38 53 40 84 36 13 112 140 -87 53 91
7760 91 116 -72 54 88 35 -254 -96 -76 -192 30 -29 -111 40 43 -137 6 -333 -175 1 262 143 -49 106
7783 106 -50 -149 117 -78 -117 113 -115 91 -52 79 103 -248 264 -198 -79 -3 38 -118 1 30 51 81 -2
7806 -2 85 69 1 -19 -113 -305 46 -138 -114 -19 10 -1 -39 50 -102 -312 95 -144 -177 127 73 -237 53 188 28
7831B8k51N6K01o0lj26J19K1%J17k08J27J31N3k17Jj06J82K74k77j68N6n6K02
7855I6p1n1J68j98O9j0M5j1j06L1N6J98l53j02M70l49qJ14j08l4K52k09K62l04
7879a53K20J55j84k05K27j6m6o5k56M37l23K92k09m2J61J37m3j74K63K3k83k01
7901b85M72j64JK82k10j40J7P9j03JR2k27k2j09J00JK52J49l38J50j78J20Q7j51
7925a24j63K22J1jN2L1m9L1p2l3Q7K59j48j70J48k39N0Q2J21M2J35r1k41n7K15
7950I8k10M6L17j37P6k89k2K14l55M38l36j2L71l73l9J27K2J79j76j5o8J80Q9
7973A25l62J93K73j19j67j12J02p8J72j46n2J78L2mp2P3O4j63n9L02j89J34j64
7996c9J18q4J50l53N53l33j30K49r7pj55J33l0N3k56L74l48N4J76p6J73k05P6
$$ plain form
7831 28 -223 -167 34 -26 -29 -155 -36 -15 -15 102 -106 21 152 205 -12 -11 -117 65 339 62 -106 -50 -106 96
7855 96 25 -26 142 -56 13 3 48 37 -69 -38 18 216 -137 -239 231 -118 -126 -12 -120 -154 98 -111 151 -153
7879 -153 67 222 38 -167 60 44 -2 -67 -323 114 -209 83 -126 -168 -7 130 87 -87 176 199 -84 -285
7901 -285 187 23 24 306 96 -44 -27 52 -51 -50 42 -185 -207 -316 -216 -215 37 186 -152 -2 -180 -60 27 -124
7925 -124 -287 -65 -54 -55 -3 28 -21 10 -62 -95 -8 251 103 -67 81 -158 -108 -26 95 137 272 181 -60 -117 98
7950 98 -112 -66 251 114 190 -99 -121 93 -262 176 -160 -172 199 -174 -213 -86 -64 115 -61 -76 -144 36 125
7973 125 -237 -44 229 110 -57 -169 -67 -145 27 -119 -171 7 39 35 -37 36 100 -63 -122 180 -9 125 -39
7996 -39 79 -5 145 -208 345 12 -118 131 34 27 -128 5 -25 28 -228 146 -202 -148 28 -48 125 -80 -4
8019dJ31j78j90L93j35j62O7J97j40l44M14p8k15K27J83L2j59k31l1M1K91k83
8041a74K51K3Mk76k9J85R1k7o0j2rJ30L0j55J40l03K7K41m23L16J63M6k15PK45
8066B16l14K80pk79R2J2K67k4j39PJ09j78L30j52j93k32L8J18j76L46k07Q9M9
8089E2J10j50K21m51K65o7R4L1l30J02j26K77j64L62L4q8k54qj0J74l04J98l88
8112d20J49J64J53J46j36j46j60N63J79l35k49j48Q7K48k51K68J01k40j27j2J04
8133f2M5n6j19L7J38j11J29k7j97R4J77j08J25Q7k05L57l11Q6k75P1K40j11j54
8156a50O6J38N5q1j99K58j76R9q4l0j45J88j17L05j81j13K87k5mJ95k8n00K13
8179b9k0q9M2K53m6j76K71k24l6N6l30N32
$$ plain form
8019 -4 127 -51 -241 152 17 -145 -78 119 -21 -365 49 -29 -244 -17 166 198 39 -192 -223 -182 109 -174
8041 -174 77 100 104 -172 -201 -16 75 48 -12 -24 -33 97 127 -28 112 -191 -164 77 -346 -30 133 179 -36 -29 216
8066 216 -98 182 175 -104 -12 0 267 243 104 111 220 42 372 220 27 -205 -167 -49 -225 121 -86 3 52
8089 52 162 12 233 -218 47 -20 74 105 -225 -123 -249 28 -136 226 260 172 -82 -90 -100 74 -230 -32 -420
8112 -420 -271 -107 46 192 56 -90 -250 313 492 157 -92 -240 -153 95 -156 112 213 -27 -154 -166 -62
8133 -62 -17 -73 -192 -155 -17 -128 1 -26 -223 -129 48 -60 65 152 -53 304 -7 79 -196 -125 115 4 -150
8156 -150 -84 54 109 28 -171 87 -89 10 -74 -104 -249 -61 -178 127 -54 -167 120 95 91 286 258 -242 -29
8179 -29 -49 -138 -96 157 111 -65 206 -18 -54 2 -328 204
8191B04
$$ Imaginary data points
##PAGE= N=2
##DATA TABLE= (X++(I..I)), XYDATA
0@%%%%%%%%%%%%%%Qj6J6j6J6k4L2l2M0m8N5o3P2q7J01j15J30j49J71j92K16k46
36a31K78l11L46l85M30m79N32n90O53p21P95q78R68j066J176j294J424j573J739
55I13j922K130k370K645k965L346l810M384n117O097p477R577j3198K1144p0199
70e6822P2395J46076j42526j99191k1420J86904J51219k7122j96679j39814O3423
81a63557J87664R7616o6186j63430q3891R2782J60662K0276j28485j20850J5738
92a51661J33721J17333l7623j57087r9955O6484J42791O2154p2071j13135k4008
103a33057Q6647Q3642j3094q7040p2102K4924J17126P6908o2821j20147m0033
114a39047O5348R7782L2613o7840q3470P282P6647N3184k0469p7806n2191M5754
$$ plain form
0 0 0 0 0 0 0 0 0 0 0 0 0 0 0 0 8 -8 8 -8 8 -16 16 -16 24 -24 31 -32 40 -47 54 -61 69 -80 91 -101 115 -131
36 -131 147 -164 182 -203 227 -252 280 -310 343 -378 417 -461 507 -559 617 -677 747 -826 913
55 913 -1009 1121 -1249 1396 -1569 1777 -2033 2351 -2766 3331 -4146 5431 -7767 13377 -56822
70 -56822 15573 161649 19123 -180068 -201488 -14584 136635 109513 -87166 -226980 -163557
81 -163557 24107 121723 55537 -107893 -191784 -99002 61660 81936 -46549 -167399 -151661
92 -151661 -17940 99393 61770 -95317 -195272 -128788 14003 76157 4086 -109049 -133057
103 -133057 -46410 37232 24138 -62902 -135004 -110080 7046 83954 21133 -99014 -139047
114 -139047 -73699 24083 56696 -11144 -94614 -87332 -10685 42499 22030 -55776 -107967 -62213
126f2213R2948L4699m5893p4401l2462M9073P5605P202n8894l9431K1626N3679
138B1538K9647l1577o2872j8497M7735O2975J7706m4870o1084q023N2916M5237
150E0831j0383m2259k4940J7176M6048K3598l4454m9836n373L8090M2053P458
162E8009l6119l7112O617L3629J8881j0194k8775j4985K6307L8700j869l7217
174A5872k9331K183L3229L4263m496l5143k1344Q343K3625J5564j2424k7999l426
187a084K6082K0205n282k3524k1729K362K7012J8425r108k0009j0460P280J7637
200B7807L518j9597j6019R220K0358J1002p233k3012j8072Q461K3293R664p647
213B1743j5392j0064Q440J4242l889j4196n452M977J1426R740p152j9873p411
$$ plain form
126 -62213 30735 65434 19541 -54860 -87322 -38249 37356 44558 -14336 -53767 -32141 21538
138 21538 51185 19608 -43264 -61761 -14026 48949 66655 21785 -39299 -47322 5594 50831
150 50831 40448 -1811 -26751 -9575 36473 60071 25617 -24219 -29592 8498 50551 58009
162 58009 21890 -15222 -8605 25024 43905 33711 4936 -10049 16258 54958 53089 15872
174 15872 -13459 -11276 21953 56216 51720 16577 -4767 3576 27201 42765 30341 2342 -1084
187 -1084 24998 45203 39921 16397 -5332 -2970 24042 42467 33359 13350 2890 10170 27807
200 27807 31325 11728 -4291 4929 25287 36289 29056 6044 -12028 -3567 19726 29390 21743
213 21743 6351 -3713 4727 18969 15080 884 -4568 409 11835 21575 14423 -5450 -12861
226a2861R172J0788M244o320j1411N38J0265K372q072r358n305N843J6306O771
240A2972j2361j4946m101M714R617M580n879n742J986L310L1l024p632m358Q699
255a2134J1277l35q020o498k895L499O871j222m853L51L196L396J875o077j0979
270b2548P29R751P033K170l090q073l805M244L086k71R83J76J520M401j300p800
286a2794l171L338M087M713L057l835m857R09K576J11r14j179M26O290M710l161
302C06m925k640k192L329Q028K258k974j631m78j261J47m23o80L761N099n24k201
319B999j789m234p77N546L478j031o32J79n44N37m74l474j10L155K511K384J211
336H935m110n258M85K405J049K041J586j276mo25l223j351J429Q55K959L472j822
$$ plain form
226 -12861 -3689 7099 11343 5023 -6388 -5850 4415 6787 -1285 -10643 -15948 -10105 6201 12972
240 12972 611 -14335 -18436 -13722 -4105 475 -5404 -11146 -9160 -5850 -5819 -8843 -16475 -20833 -12134
255 -12134 -857 -1192 -9212 -15710 -18605 -15106 -8235 -9457 -14310 -13959 -10763 -7367 -5492 -11569 -22548
270 -22548 -21819 -12068 -5035 -2865 -5955 -14028 -17833 -13589 -10503 -10774 -9791 -9615 -8095 -3694 -4994 -12794
286 -12794 -15965 -12627 -8540 -3827 -770 -4605 -9462 -8553 -5977 -5866 -6780 -7959 -7533 -1243 3467 306
302 306 -4619 -7259 -9451 -6122 1906 4164 1190 -441 -919 -2180 -2033 -2456 -3136 625 5724 5200 2999
319 2999 1210 -3024 -3801 1745 5223 4192 3560 3739 3195 3732 3258 -216 -326 2829 5340 7724 8935
336 8935 4825 -433 52 2457 3506 5547 7133 5857 5853 5228 2005 654 2083 2938 5897 9369 7547
353G547n094n63J335l3J051Q95o20L77J490p61j603j366k084N05M450J679j649
370E556q20n09k471n72J668J23R06J831J9j211j600k916o75L528K401j078L8j63
388D055l149k58J558j46j306J183J131K19L88j910k819P54P92k56J596J415j951
405A296q95L57j473j789J261J224J118J275j298l362m45K40j54J741J710j343
421e37j118O50q16j354L46K27k60J591Q29j455m2n26j718J37J917l74N5J635k11
440a024k399k51l71o09J739J894R6K3q13k513n60K307M3K6J577O20j723j18k45
459b301r07N11J085N60N46M83j102o35J224j436o32K107J397p98K25P84j977j018
477a884N76P48N88J662k92m66K3j367j178J634J276l83O30P67j351j180P05n12
$$ plain form
353 7547 2453 1890 3225 3192 4243 5138 4518 4895 6385 5624 4021 2655 571 1076 5526 7205 5556
370 5556 4736 4227 1756 1184 2852 2975 3881 5712 5731 4520 2920 4 -671 2857 5258 4180 4218 4055
388 4055 906 648 2206 2060 754 1937 3068 3287 3675 1765 -1054 -300 492 236 1832 3247 1296
405 1296 401 758 -715 -2504 -1243 -19 1099 2374 1076 -2286 -2731 -2491 -2645 -904 806 -537
421 -537 -1655 -1005 -1821 -3175 -2829 -2602 -2862 -1271 -442 -1897 -1939 -2465 -4183 -4046 -2129 -2503 -2448 -813 -1024
440 -1024 -3423 -3674 -4045 -4654 -2915 -1021 -925 -902 -1715 -4228 -4788 -2481 -2438 -2412 -835 -215 -1938 -2056 -2301
459 -2301 -3208 -2697 -1612 -1052 -506 -23 -1125 -1760 -536 -1972 -2604 -497 900 102 327 1111 -866 -1884
477 -1884 -1308 -560 28 1690 1398 932 955 -412 -1590 44 1320 937 1567 2334 983 -197 508 -4
495dK2J354j71L08R19n25j985j86M87o50R46J563j09o64Rj300j166P21M73M72
515E14J660j6j996p66J26n47R7J729K24n70R9k23j184j1l06k82J179Q63p85O48
535D53R7j881n80J250M4o04J701M35n60o97q01j141J164R88r7O43N75j473r95
554a479R62j85n77J192P69l51L28k03j163j10L50j25Q82P00l67kL41p53j132K74
574f49J142k19P45O31p70p88k18k71K39J337k64n88R59R9j505l76Q00l49N14M50
594I19Mn3k1r75k23J032n75m62J368P94r79m16k10o53j54R87L46k5k9m02k90J15
616I8m86l16J322P17j155K1N11j007o71Q76M28k23J82k03J01N63n31r26O38P01
636F40r04M77Q70p07j120P37k9J2L43nK17L08l53q12n9Q11o7R0R40o16p05J40
$$ plain form
495 -4 18 1372 1201 1509 2428 1903 -82 -268 219 -431 515 2078 1969 1305 1314 14 -1152 -431 42 514
515 514 2174 2158 162 -604 -478 -1025 -928 801 1025 455 554 331 -853 -864 -1170 -1452 -273 590 -195 453
535 453 550 -1331 -1911 -661 -617 -1221 480 915 355 -342 -1143 -2284 -1120 -132 -229 414 989 -484 -1479
554 -1479 -517 -702 -1279 -87 682 331 659 456 -707 -817 -467 -592 290 990 623 621 962 209 -923 -649
574 -649 493 274 1019 1650 880 92 -126 -397 -158 1179 915 327 1286 1385 -120 -496 304 -45 469 919
594 919 923 870 849 -126 -349 683 108 -354 1014 1808 829 413 203 -450 -604 383 729 704 675 273 -17 98
616 98 -388 -704 618 1335 180 201 712 -295 -966 -90 338 115 297 94 195 758 227 -699 -61 640
636 640 -264 213 1083 376 -744 -7 -36 -24 319 314 531 839 486 -326 -385 426 359 449 1389 773 68 208
658B08Q1p5R3M42n64N70J46m36k41N6o60r9J220K10p02J56r0o09J81o2j10K62
680b3M15k95j03j42o94l41J084L01o79P63l81n14l69L29m32OP71j44j06N19j012
701a047n18L90J24l82M81M65l13k18R0j065q0P95O1L72N00n29m58k78L61n25M66
722a308R29k56JK85p21l34L73l03L36Q67M2m73N23K02j156j24P44%J18Q15J79
743G39p30k58m02J1P94R6j6N67J66p97j54L15m89M51R68k14j19j15n65j7J69J
765D01j24Q06M9j21n6nn21m33K81P08LL14O7p29J30n17N8J80O72m53N39m2m98
788G09r23O53Q6J7M37J94k46k97J96p14l4L51j17L27N88j58q45j06k53m2J70O36
810F29p7K08L2n14k7J17m72J76Q49r7l67Q2j99q31L73M40R1J92pk22j48R5l89
$$ plain form
658 208 289 214 307 749 185 755 901 465 224 280 -380 -479 741 951 249 405 315 -294 -113 -175 -285 -23
680 -23 392 97 -6 -148 -842 -1183 -99 202 -477 286 -95 -609 -978 -649 -1081 -1075 -304 -448 -554 -35 -1047
701 -1047 -1565 -1175 -1051 -1433 -952 -487 -800 -1018 -928 -1993 -2073 -1278 -1217 -845 -345 -874 -1332 -1610 -1249 -1774 -1308
722 -1308 -379 -635 -634 -349 -1070 -1404 -1031 -1334 -998 -131 -89 -562 -39 163 -993 -1117 -373 -373 -255 560 739
743 739 9 -249 -651 -640 154 250 234 801 967 170 16 331 -158 293 1261 1047 928 813 248 231 400 401
765 401 277 1083 1132 1011 955 950 429 -4 277 985 988 1302 1369 640 770 253 311 491 1163 710 1249 1207 709
788 709 -214 439 525 542 979 1173 927 630 826 112 78 429 312 639 1227 1069 224 118 -135 -177 -7 629
810 629 552 760 792 278 251 368 -104 72 921 824 457 539 340 -491 -118 322 413 605 598 376 228 323 -66
833f6l33N55K98l98M64J9l00m72J06k99K24O36M9k57J70o39l36M9K25j3L21K30
855B33l54j07M8o42J66L3n3L06J85j98m01K84l42l12O53L72n44o3M25l72l24k6
877a033M7J23J41J86l92L3l37n47O10M27j41J5nN41j000n6J79J78J54L26l83K5
899i09K97q06L16N39l89m4Q58R2l85k77K74j79J44pK95L82rm00m65N00k02Q4O12
922C21K74k91p4J93n34M21j02J20K56j1P9j01J41m52l18P99M1J03J50j28l51r0
944D46k99R1L32N87j03j44J22k72l40J98j65L8L33K46o1m24K52o51M8L24j39L41
966G60J71j54j61k08j35k98J67L62J07Q2Qj81j88l98M5m3O45Q6m76R9j48m48N9
989b47J92M25j71J58L6j98k2n37ML53K35m35Q35p3o97j55p6Q9j00P21J29M6l08
$$ plain form
833 -66 -399 156 454 56 520 539 239 -233 -127 -426 -202 434 483 226 396 -243 -579 -530 -305 -318 3 233
855 233 -121 -228 -180 -822 -656 -623 -676 -370 -185 -383 -784 -500 -842 -1154 -501 -129 -673 -736 -311 -683 -1007 -1033
877 -1033 -986 -863 -722 -536 -928 -895 -1232 -1779 -1169 -742 -883 -868 -873 -332 -1332 -1388 -1209 -1031 -877 -551 -934 -909
899 -909 -612 -1418 -1102 -563 -952 -996 -138 -46 -431 -708 -434 -613 -469 -476 -181 201 192 -208 -673 -173 -375 -291 321
922 321 595 304 230 423 -111 310 208 328 584 573 652 551 692 240 -78 721 762 865 1015 887 536 446
944 446 147 238 570 1157 1054 910 1032 760 420 618 453 491 824 1070 1009 585 837 186 234 558 419 760
966 760 931 777 616 408 273 -25 142 504 611 693 701 520 332 -66 -21 -64 581 667 191 290 142 -306 -247
989 -247 -55 370 199 357 393 195 173 -364 -360 -7 228 -207 628 555 -142 -297 -373 -284 -384 337 466 512 204
1012B04k77p9k18p5L13J31M02l43J96k48j65n03N37K52k44M07l38p7k67J0O2r8
1034d18M84l4j17K54j28p19Q7K80l6l5L80j31q7m16O9l2RP7K74K58j25m93j47
1057g46J26m8J31J5j28M92n9l79J0J02j62k1L41K9j94r0K17j89P8l35M87L04n2
1080g1l2k56j99l30N0N42oq6M58l2m84J64o3K54pJ80J59kj48l86L75j10J47j27
1104a0K4L51j93K9j98j75M95j52K43L8m3L6j81k22K08q7K63J45J5K3j97J52l73
1127A91J78l8J41n9J37r0L9j07n36L80K0K03l44M02j1m13M7jK12K46l7j81N9j6
1151D22n36P8K62j40M3K47j4j54j01j77J36j93K70P2K31k60j99rO4kk02L88J6
1174B42j47j01l2k90L84j24K87j36J96L8j53j18m73K27o1O43K77m64j73j1J15
$$ plain form
1012 204 -73 -152 -370 -445 -132 -1 401 58 254 6 -159 -662 -125 127 -117 290 -48 -125 -392 -382 -320 -418
1034 -418 66 32 -85 169 41 -678 -591 -311 -347 -382 -2 -133 -220 -636 -567 -599 -590 -513 -239 19 -106 -599 -746
1057 -746 -620 -668 -537 -522 -650 -158 -217 -596 -586 -484 -646 -667 -326 -297 -491 -581 -364 -553 -475 -810 -323 -19 -71
1080 -71 -103 -359 -558 -888 -838 -296 -302 -388 70 38 -446 -282 -345 -91 -98 82 241 239 91 -295 80 -30 117 -10
1104 -10 14 365 172 201 3 -172 323 171 414 452 409 445 264 42 250 163 426 571 586 609 412 564 191
1127 191 369 331 472 413 550 460 499 392 -144 236 256 459 115 517 506 93 140 139 351 597 560 379 438 422
1151 422 -114 -36 226 86 129 376 362 208 107 -70 66 -127 143 215 446 186 -13 -22 42 40 -162 226 242
1174 242 95 -6 -38 -328 56 -68 219 83 279 317 164 46 -427 -200 -261 382 659 195 22 11 126
1195A26l00k1J68K59j94J57K32m19k20R2K96p1P4l2O6k36m4LJ05n5j17J15K79
1218B63J66p15M27l47l46K84M2L87l26K26m88LK56l86L93q0K65j80j50J14k24
1239d16Mj32J82L06l35K4p4j00k1j7K99m3r2J53L06m04l67j13L35J37L6o0J65
1262b27K86l07l21J25J76j1K77J3J15k53R6k18J23r3J31K76m6j17j21J73m39Q9
1284b73J69K11Q4pL8l3L5k72L35q3R3M48n43MJ79l71K5L33m44N49j80J14j9m77
1308h5L94R6k92K42K48l68m8r8J38j49j66K55J88K69k33k13k4jj08J77j29K09
1330C02J68l12j1j28L1j96M04pj27J03k56pR5O5k84K92j30J47k17J95j62r4o0
1353a89K46K33j45Q2j38j47P9j63nL31p0J07Q1k27j71J30k57J78j30L83m0j25
$$ plain form
1195 126 -174 -195 -27 232 38 195 427 8 -212 -120 176 105 179 147 213 -23 -67 -64 41 -14 -131 -16 263
1218 263 429 -286 141 -206 -552 -268 -226 161 -165 61 -427 -424 -168 -554 -161 -241 24 -156 -306 -192 -416
1239 -416 -412 -544 -362 -56 -391 -367 -441 -541 -562 -579 -280 -323 -415 -262 44 -360 -727 -840 -505 -368 -332 -392 -227
1262 -227 59 -248 -569 -444 -268 -279 -2 11 126 -127 -31 -249 -126 -219 -88 188 142 25 -96 77 -362 -273
1284 -273 -104 107 191 184 222 189 224 -48 287 204 297 745 202 206 385 14 39 372 -72 477 297 411 392 -85
1308 -85 309 405 113 355 603 235 187 89 227 78 -88 167 355 624 391 178 154 153 45 222 93 302
1330 302 470 158 147 19 50 -146 258 251 124 227 -29 -36 59 124 -160 132 2 149 -68 127 -35 -129 -189
1353 -189 57 290 145 227 89 -58 21 -142 -147 184 114 221 302 75 -96 34 -223 -45 -175 208 168 43
1375D3n2P9m9K8J76K4J56M5m76J82o4j17k08M28J71m53J15K62l59k09JJ97K26
1398A46l43J2P0K65k36J38k13p7j51M19M8j29n3j05m1j5j23N26j24k36J33l38
1420d27K24r8O2J68k57K91j2r6l64J9J72J49j63L45K45l50p9k18n3J44K86p5J03
1443A6J03l01J71k98M5n5L42n3l24K04J88j74J68j17J21p2M89l82p3K5J17J5k81
1466a26K23k6L86K2j66m74L37j12k80L08L57j85J26j19j30l1J01j62M15j87J63
1487D40l88J39m7n1p1P8J36j37J64L6k1j69j84L4M32l25K19P9m42K4J2K26j54
1510C0j0R6R3j65j07J02j67k17M86n7J49p2J63m28j59Q3M3J99oK12m95J52Kr0
1534a63j04K47M5J42m9l61K90k5L4l27K89K06l55j4j1J10L6j38K34J68j99J33
$$ plain form
1375 43 -9 70 21 49 225 249 405 450 -26 156 92 -25 -233 195 366 -87 28 290 -69 -278 -277 -80 146
1398 146 -197 -185 -115 150 -86 52 -161 -238 -389 30 78 -51 -104 -209 -250 -265 -388 138 14 -222 -89 -427
1420 -427 -203 -301 -239 -71 -328 -37 -49 -145 -509 -490 -318 -169 -332 13 258 -92 -171 -389 -442 -298 -12 -87 16
1443 16 119 -182 -11 -309 -264 -319 23 -30 -354 -150 38 -136 32 -85 36 -36 453 71 -2 23 140 155 -126
1466 -126 97 71 457 479 313 -161 176 64 -216 92 449 264 390 271 141 110 211 49 464 277 440
1487 440 52 191 144 93 22 100 236 99 263 299 278 109 -75 -41 391 66 285 364 -78 -54 -42 184 30
1510 30 20 116 209 44 -63 39 -128 -345 141 84 233 161 324 -104 -263 -180 -137 62 56 268 -227 -75 -73 -163
1534 -163 -267 -20 25 167 118 -243 47 22 56 -271 18 224 -131 -145 -156 -46 -10 -148 86 254 55 188
1556A88J6j73j71L45k12L6k21K68J56j00j57j19K84M5k43O0m3j62K09m7j51J89
1578cK3p4L4K22k17l2n2j30J25j63L99Ok09k7k4J43k11lJ37L7j53J87r9J9l42
1603d07K44K35k50O5p5J45j75j19j12K39J30NQ5L9r3m96L46k9K81k04ON74n10
1626g6J42%R1l30j69L49N6l5p1k11J66r0J55J31k83L90q7J33l04O8N9M6m7K3K62
1651C68l88O8o4J52r1p5J73j10K20k72o9L2j80M01O9j20J13j22o6j35pJ52j87
1674a38L80j96j8J51j88j22J67k13K47l5kJ22N3k66O5j46m6J43Q8k80M23m44J36
1697a19J44po7Q6n6r1l3J39j59J14k18M24j70l1k81L87j35j98K52j95J78J0M6
1720B0j99m8R1J4J99k06J62R4J0k87n4K27q4L3j05K80l63K72k24P5N0p8L7J88
$$ plain form
1556 188 204 31 -140 205 -7 29 -192 76 232 132 -25 -144 140 185 -58 2 -41 -203 6 -41 -192 -3
1578 -3 20 -54 -20 202 -15 -47 -99 -229 -104 -267 132 138 -71 -98 -122 21 -190 -193 -56 -19 -172 15 -84 -65 -407
1603 -407 -163 72 -178 -113 -188 -43 -218 -337 -449 -210 -80 -75 10 49 -44 -540 -194 -223 58 -146 -140 434 -76
1626 -76 66 66 157 -173 -342 7 63 28 -43 -254 -88 -178 -23 108 -175 215 128 261 -43 25 84 130 83 106 368
1651 368 -20 48 -16 136 45 -30 143 33 253 -19 -88 -56 -236 165 234 114 227 105 39 -96 -103 49 -138
1674 -138 242 46 28 179 -9 -131 36 -177 70 35 33 155 208 -58 7 -139 -185 -42 46 -234 189 -255 -119
1697 -119 25 18 -49 37 -19 -110 -143 -4 -163 -49 -267 157 -13 -44 -325 62 -73 -271 -19 -214 -36 -26 20
1720 20 -179 -227 -136 -122 77 -129 33 127 137 -150 -204 23 -61 -28 -133 147 -216 56 -168 -93 -43 -121 -84 104
1744A04po3K8K01n7j29k14J85K2K7q1P0J40L6k96J55j24o8K35p3L4r5j07j49K33
1769GK70k36PJ97j30k95K26p6J20k33J24j38R2ML9n4j51K22K86m67J72J19k43
1792a38P7k15M04O5J1l47K91j03l71K03j94J26K99j57K50J23k72P3l30J26j45
1813b24K06OJ36p4M8r0nK38k43O3L00l24j02j0K45k41N4j40K11R5j36k34M3J18
1837f0p2K80j91J95R8M3k64J32j06R2k62J81j05J46j28N8j22N7K5K6N6k2J31k60
1861g2j5k68J07K46J95q3j12J82l81R6j0P8j78K39k21l6K71K9n9J29l60K41q5
1884f7k07r8K78q4j49K56q2L26l84J93nN3k29J41r4L07M3j66J24j82p6L6q3K72
1908A23j77O4R2j40Q3r1l10L14K06L9j87K08k04O3k5o1J04P9qK73l96K19m63M2
$$ plain form
1744 104 97 34 62 263 206 77 -137 48 70 97 16 86 226 262 -34 121 -3 -71 164 91 125 30 -77 -226 7
1769 7 277 41 48 245 115 -180 46 -30 90 -143 -19 -157 -65 -61 -22 -76 -227 -5 281 -186 -14 105 -138
1792 -138 -61 -276 128 193 204 -143 148 45 -326 -123 -317 -191 108 -49 201 324 52 125 -205 -79 -224
1813 -224 -18 -12 124 50 98 8 3 241 -2 61 361 37 -65 -75 170 -71 -17 -157 54 149 13 -221 -178 -60
1837 -60 -132 148 -43 152 250 293 29 161 55 147 -115 66 -39 107 -21 37 -85 -28 -3 23 79 57 188 -72
1861 -72 -87 -355 -248 -2 193 110 -2 180 -201 -105 -115 -37 -215 24 -197 -233 38 67 8 137 -223 18 -67
1884 -67 -274 -372 -94 -178 -327 -71 -153 173 -211 -18 -23 30 -199 -58 -152 155 198 32 156 -26 -102 -66 -149 123
1908 123 -54 10 102 -38 45 -46 -356 -42 164 203 16 224 20 83 58 -3 101 180 172 445 49 268 -195 -153
1932a53K04K02k57K6K56k12J50p5l4J00j62j10L45j6r7j89J08K4j03J69o4ML41
1955D57k99p6j44k1K2J48r4P6p0r4J25j89L04j86J23n6K14n6n8J80m41K25j64
1978g4RQ9lL24l31p6R4L00l78L8J37k83L53N0k78q8Q0K9k2J97k61R4K00J41k87
2003E4l49M66l28M26n05M32k38J80l30K26O2J92j16J86l53m03M13N7M00n26K50
2024A96j80q6j02J99l38M2P6P7O4o5LK5p1K41k42K32j98q5j7J16J32k07l4K41
2048A9k97J45q9L68m42P5K3J43J95pl51J07n1Q9k57L21j30J59K49n45J27q9J57
2071h1J36k31M88l08J4k20J16o9J64K00l21Q0J43J1k83J55j51L9P8J59j71K06
2093A54P6k25J25k29O2J53j9p9KK57r7P4j16r9K53l60O7J55K16jk36n6rN8O3k47
$$ plain form
1932 -153 51 253 -4 22 278 66 216 141 107 207 45 -65 280 264 167 -22 86 110 7 176 112 116 457
1955 457 158 82 -62 -83 -61 87 -7 69 -1 -95 30 -159 145 -41 82 26 240 184 126 306 -135 90 -74
1978 -74 -65 24 21 345 14 -62 32 332 -46 -8 129 -154 199 249 -29 -117 -37 -8 -30 167 -94 0 200 341 54
2003 54 -295 171 -157 269 -236 196 -42 138 -192 34 96 288 172 358 5 -398 15 72 472 -54 196
2024 196 16 -70 -172 27 -311 -269 -193 -116 -52 -117 -114 -89 -160 81 -161 71 -127 -212 -229 -113 19 -188 -222 19
2048 19 -278 -133 -222 146 -296 -221 -198 -55 140 133 -218 -111 -162 -73 -330 -9 -139 20 269 -276 -149 -238 -81
2071 -81 55 -176 312 4 18 -202 -86 -155 9 209 -112 -32 111 122 -161 -6 -157 -118 -40 119 -52 154
2093 154 230 5 130 -99 -37 116 97 18 20 277 180 254 138 39 292 -68 -1 154 370 369 133 77 68 126 189 -58
2119e8L67K0k54q9K82q8j16O0o0pk6k86O29k18j84j04J29k53L04j24L8K13j33
2142D2jJ92j78M0K6l4k58L03L0j79n2J12K85l34q0L6k38K08l1J65j25o2K13r2
2166a2M0Lj95O3Q5P7j60k36L07Pl4M5J52l88N6L30j24q0R5k19N5Pj43J59N09j77
2192B22m95K74J26k58J85K02k60k76L10n6j43N12n58J35QJ36k68N6J75n5L7O4
2214G3P8J6k16J65l33M0r8K66K4O3r5k02J55j8Q2J25Q9j57j60K53j64l36K41m1
2238a50J19k28M16j47l59K68K41o0j62K0J19n0j34K59k30Jp0J73k13J16M9K94
2260B72n45K27K0j48j51K01p3K44N5j42k3L71j27k73J34N5j65K1J13k59K63k00
2282a30K51R0j3k69J6K60o0j73J30k46l6J15j60L61r7O0L5j77J15J57k15J2J41
$$ plain form
2119 -58 309 329 75 -14 268 180 64 124 64 57 31 -255 374 156 -28 -132 -3 -256 48 -76 -38 175 42
2142 42 41 233 55 95 121 87 -171 132 162 -17 -69 43 328 -6 -86 -50 -288 -80 -111 54 -71 -133 80 -12
2166 -12 28 31 -164 -101 -16 61 -99 -335 -28 -21 -55 -10 142 -246 -190 140 16 -64 31 -188 -133 -126 -269 -110 399 222
2192 222 -273 1 127 -131 54 256 -4 -280 30 -26 -169 343 -215 -80 -72 64 -204 -148 27 -28 9 73
2214 73 151 167 -49 116 -217 -177 -275 -9 15 78 -17 -219 -64 -82 0 125 214 57 -103 150 -14 -350 -109 -150
2238 -150 -31 -259 157 10 -349 -81 160 100 -62 -42 77 27 -107 152 -78 -77 -147 26 -187 -71 -22 272
2260 272 -273 -46 -26 -174 -325 -124 -197 47 102 -40 -63 308 181 -92 42 97 -68 -47 66 -193 70 -130
2282 -130 121 211 198 -71 -55 205 145 -28 102 -144 -180 -65 -225 136 39 99 134 -43 72 229 14 26 167
2305A67j35J13L2k2j70J46J42m63K69J73k89p5j6N8j3K86j43P0n5j63L12m02Q7
2328i1j34L79k33J6r9K17J46k04J83j61m2L47o88L11K55j10j74K75l97J65J17
2349G8j90Q0l8K66j47K1Lj28J16K3k06L52l09K51j68RJ02Q6k48K6j31M34k73r1
2373h2j98M33l58L96m2m32N06j95j7mj6N0J02k09jol7K12K0Q1j2k44J23o0J8o5
2399c7M25l69J64j31q3k3J91L9k33J58k18Q3P7K88m63j4J25o9K60k09j14J81J05
2422A33l3j94j68K19J37k9J82l24NJ51k36o3L23j99J73l06K83J6j64L08k59o6
2444a11K82j69m9K40j62p7J33k46j23L97k16J1l05K93J89mnk04L92L0r1l56L87
2467B36l04N3K30k09Nj49P1K08j44j07J00r1l11N55o3j22K30N7j93Mj79J38O4
$$ plain form
2305 167 32 145 177 155 -15 131 273 -190 79 252 -37 -112 -128 -70 -83 203 60 130 75 -88 224 -178 -91
2328 -91 -225 154 -79 -63 -162 55 201 -3 180 19 -23 324 -364 -53 202 92 -82 193 -204 -39 78
2349 78 -112 -32 -70 196 49 70 73 -55 61 84 -122 230 -79 172 4 13 115 201 -47 -21 -152 282 9 -82
2373 -82 -280 153 -205 191 149 -283 223 28 11 7 -9 41 143 -66 -67 -73 -110 102 122 203 191 -53 70 10 28 -37
2399 -37 388 19 183 52 -31 -54 137 176 -57 101 -117 -34 43 331 -132 -146 -21 -90 170 -39 -153 28 133
2422 133 100 -94 -262 -43 94 65 247 -77 -72 79 -157 -220 103 -96 77 -229 54 70 -94 214 -45 -111
2444 -111 171 2 -47 193 31 -46 87 -159 -282 115 -101 -90 -395 -102 87 83 78 -126 266 296 205 -151 236
2467 236 -68 -15 215 6 11 -138 -67 141 -3 -110 -10 -101 -412 143 80 -42 188 245 52 56 -123 15 79
2490G9l8q4q6J11p0K59m30L27M53m62j7J74J19k74k41J61J25n9k31J07j21J30
2512f8k13L18J26j48O9j74m9L7p0L17l61K12k4J03j64K65l13J98q4J45j08J02
2534A16r9l13K94K5K8J5l74K69N1N3j90J72J83k51L4p9j5R2K7j15L59j16j20M0
2558H6j3m2j65J64J9J76k75K01n2L3k12K60j50k46K49k65L45L0j69M0K00k22Q9
2581H1l3J70q2j88r8K28M4k54J62k5J77k08K89k37J78j46k42J51P0J19j00P3K0
2604A49l17L09j84J32j5J07j41L3P1j6j92K83k46j72J09J17J9j15P7j02O7R1M
2627F8M3j10J35j78j61M91l16p8J66M6J24k33K04l04J89rj09J03m6j25K86n2k11
2650g7j09kK93j29J92kl8p3r9j45K3J35j72K33n0J62k21J04j41J60j71Q2J01j93
$$ plain form
2490 79 41 -43 -129 -18 -88 171 -259 68 521 59 42 216 335 61 -180 -19 106 47 -184 -77 -198 -68
2512 -68 -281 37 163 15 84 -90 -139 -102 -172 145 -216 -4 -28 75 -89 176 -137 61 -23 122 14 116
2534 116 17 -296 -2 23 51 66 -308 -39 12 65 -125 47 230 -21 13 -66 -81 11 38 -77 282 166 46 86
2558 86 73 31 -134 30 49 225 -50 151 99 132 -80 180 30 -216 33 -232 113 143 -26 14 214 -8 81
2581 81 48 218 136 -52 -150 78 122 -132 30 5 182 -26 263 26 204 58 -184 -33 37 156 56 129 149
2604 149 -168 141 -43 89 74 181 40 73 144 128 -64 219 -27 -199 -90 27 46 -69 8 -94 -27 64 68
2627 68 111 1 136 -42 -203 288 -28 -106 60 106 230 -3 201 -103 86 77 -32 71 25 -100 186 134 -77
2650 -77 -186 -188 105 -24 168 166 128 55 -44 -189 -166 -31 -203 30 -20 142 -79 25 -116 44 -127 -45 56 -137
2674a37J72n5O4q4K48j88j11J41N7k60J12J3K09j11m11K91J03P3o6j92or8L26
2697I0K3j19r6O9J84q9k45l4J48J22l90J02J09O2j24J02Q9j12j41L40j77M32k91
2720E4J66l04J82n3J7p1J92k61J92K5k02P3J76k68M1KR7j25n0QK68k07j7O5m2
2745d2J39j76K92m22L08m02M50j91K5J4K3Rk02J73K17j83j10J77q9J34n6k37K28
2768G9nj94J82j11j23J1J15N5k28J80m4j8M7J42q4J8k49P0K4J14J5J73k32J6p7
2793a24M2K71j7j90P1j03j48L71l6j71K2J06K7l1l16L89k13K41j20k54j95K62
2815a16K09O2q2O9j4j03n1K10J0l7q5j1j5J76o4k37P8J42j41j35l8J02J44k74
2839b01J54J1p7J14j31K14k82L7K40n1L00l78L9j66J50j32R9O4M6r1Q1J04n6K8
$$ plain form
2674 -137 35 -20 44 -40 208 20 -91 50 107 -153 -41 -28 181 70 -341 -50 53 126 60 -132 -138 -236 90
2697 90 113 -6 -102 -33 151 62 -183 -217 -69 53 -337 -235 -126 -64 -188 -86 3 -109 -250 90 -87 345 54
2720 54 220 -84 98 45 62 -9 183 -78 114 139 -63 10 186 -82 -41 -39 58 -67 -117 -109 159 -48 -65 0 -42
2745 -42 97 -79 213 -209 99 -303 147 -44 -19 -5 18 27 -175 -2 215 32 -78 99 10 144 88 -149 79
2768 79 74 -120 62 -49 -172 -161 -46 9 -219 -39 -83 -101 -54 88 4 22 -227 -157 -133 -19 -4 169 -63 -47 -124
2793 -124 -82 189 172 -18 53 -50 -198 173 137 -34 -12 94 121 90 -226 163 -50 191 71 -183 -378 -116
2815 -116 93 155 73 142 128 25 -26 184 194 157 72 61 46 222 158 -79 -1 141 0 -135 -173 -71 73 -201
2839 -201 -47 -36 -113 1 -130 84 -198 -161 79 28 328 -50 -11 -177 -27 -159 -60 4 50 -41 40 144 88 116
2863A16k29L4J83lR8R5l15j2j02j18mO0J16L08l66J72J17j66J00q3o7J43q6J1
2887Bj38j83N89l46J97Q0n38L49n4l0J89j78lN7o1j76M3L17Q7l84j45M85o3K62
2911C58l55j63K61l1j82J03J55q8K29o79J87L8J58k36L14p0J41j73j03J30n2J20
2933F2J97k91J63j65J33r1k6J09k46K71R7j6k48Q9q3L23n20L48Q9k66K41k7l36
2956a93J03J89%M7l3%%k35M5J34j90J15J99J4k10r9n6j5K56j39J57j62j60M2K42
2981E1j57l8M16j69j57kj0M3Q2o5j72L62k58J87o2j28R8p4k39J42K64k8P1r8R5
3006A54k25J18P1l29L40k03L7M5J92r4p7j10J08Q3m00N01k69R2m6m7J40j65k9
3029a13J36Q8o1k12J14K86j24J49k92j02J29k5L6n3O3l7r4Q2q9J61o3P2j70J13
$$ plain form
2863 116 -113 -79 104 101 199 294 -21 -33 -135 -253 -257 -197 -81 227 -139 33 150 -16 84 1 -66 77 -9 2
2887 2 -136 -319 270 -76 121 201 -337 12 -42 -72 117 -61 -64 -7 -68 -244 -201 116 203 -181 -326 159 96 358
2911 358 3 -160 101 70 -112 -9 146 58 287 -392 -205 -167 -9 -245 69 -1 140 -33 -136 -6 -58 62
2933 62 259 -32 131 -34 99 8 -18 91 -155 116 213 197 -51 38 -45 278 -242 106 195 -71 170 143 -193
2956 -193 -90 99 99 146 113 113 113 -122 -77 57 -133 -18 181 195 -15 -114 -170 -185 71 -68 89 -73 -233 -191 51
2981 51 -106 -144 272 103 -54 -56 -66 -23 59 -6 -178 184 -74 113 51 -77 21 -53 -292 -150 114 86 157 59 154
3006 154 -71 47 118 -211 129 -74 -37 8 200 106 29 -81 27 110 -290 211 -58 34 -12 -59 81 -84 -113
3029 -113 23 111 50 -162 -48 238 114 263 -29 -131 -2 -27 9 -44 19 -18 -112 -30 -119 42 -21 51 -119 -6
3053fk13pJ05j77M04r8J57j28j6n2J84m49R3L0K36r6k58L08p0oJ31M7M1k58P5
3078b3kk5J57J4k00J44m69M91l08qJ87M91k67l60J82K5L21m54L4mp4L11l53J46
3102d4R1J16R9l55J52rj4j43J46j07o0K56j43j4M5j92O2R5o4r0K26m5L68m08K14
3127A82m15L42K8l1j48M6n5p2L45j46q4N6K16j78l3l7R1LK8m73L11L4J21J94l50
3152b5K03j08J46q4j1j05j00l3J53K80j65k27J61O0l3j01P3j28j92M31l22K11
3174H4j77L38j89M6r5M9m0j23n1P5O6J29k15M52m86j9k1K86J46j88k05l1J79N8
3198F8m6l65N22j00%j41J14k44J62N9j14J50l0p4Q4j52K3l4R3j29Q5L5L5j17P0
3223d6J39n8M6j62J62j58l1K82l89N44l27P3j46J98J73m86k1O4K15M3J03k53j90
$$ plain form
3053 -6 -219 -226 -121 -298 106 8 165 37 21 -31 153 -296 -203 -173 63 -33 -291 17 -53 -59 72 119 160 -98 -23
3078 -23 -25 -50 107 121 -79 65 -404 87 -221 -229 -42 449 182 -178 4 29 350 -104 -70 -74 -148 163 -190 -44
3102 -44 47 163 262 -93 59 50 36 -107 39 -68 -128 128 -15 -29 16 -176 -114 -19 -83 -173 53 8 376 -32 182
3127 182 -233 109 137 106 -42 4 -51 -123 222 76 -8 48 264 86 53 16 107 110 138 -335 -24 10 131 325 -25
3152 -25 178 70 216 132 121 16 -84 -117 36 316 151 -76 85 145 112 11 84 -44 -236 195 -127 84
3174 84 -93 245 56 102 7 56 16 -107 -158 -83 -17 112 -103 349 -137 -156 -177 109 255 67 -138 -169 10 68
3198 68 22 -343 179 79 79 -62 52 -192 -30 29 -85 65 35 -39 45 -107 -84 -118 -25 -154 -69 -34 1 -116 -46
3223 -46 93 35 81 -81 81 -77 -108 174 -215 329 2 75 -71 127 300 -186 -207 -143 72 115 218 -35 -225
3246b25J46QK0K88l35k78N49k59N0j06J09J89o9j81J09J22J21k02j35p3q4J28
3268a08p3J34l00L40m8j80k08L70J55MN4k10J60k90N2J56k45P4L11l20J62K8k4
3291fJ9J74j13qJ26j21q3r0J5JR9m2q5J06N2R6k11j80J55M9J49j93J52N4l60J71
3317g4q3P1J12r0J35J60Q1l93R0l51N79k00J37k89K21j3j25J79l06P0J1J87r7
3340A2J37Ok40O6k33J76L95p06N70l43k4K59j32j4Nn6j09J00O2L5K44j53P2j85
3364e6J66k62K67k68J04k0k5J12k1K3j67k3K46J43j52j96J64j05L0l1K96j87p0
3387c2j27J42K35J5l65l6R9N2L19k49n9K29k40J3k56M18k34Q2J89k19j31O6j5
3410a04L10j01j40j70K47Q0n0J81n08Q5J47J24j9O2p3L7n2k26K3K87k48K09j74
$$ plain form
3246 -225 -79 -71 -51 237 -98 -376 173 -86 -36 -142 -33 156 87 -94 15 137 258 56 -79 -152 -236 -108
3268 -108 -181 -47 -347 -7 -55 -235 -443 -73 82 86 140 -70 90 -200 -148 8 -237 -163 148 -172 -10 18 -6
3291 -6 13 187 74 66 192 71 -12 -102 -87 -86 13 -29 -114 -8 44 140 -71 -251 -96 -47 102 -91 61 115 -245 -74
3317 -74 -157 -86 26 -64 71 231 312 -81 9 -342 237 37 174 -115 106 93 -32 147 -159 -89 -78 109 12
3340 12 149 155 -85 -19 -252 -76 319 -387 183 -160 -184 75 -57 -71 -66 -122 -231 -131 -69 -34 210 57 129 -56
3364 -56 110 -152 115 -153 -49 -69 -94 18 -3 20 -147 -170 76 219 67 -129 35 -70 -40 -71 225 38 -32
3387 -32 -159 -17 218 233 -132 -168 -69 -17 302 53 -6 223 -17 -4 -260 158 -76 6 195 -24 -155 -89 -104
3410 -104 206 105 -35 -205 42 122 72 253 -255 -170 -23 101 82 144 71 108 56 -170 -147 140 -108 101 -73
3433g3M5M7J68k69R6K08k04o9J5j0k37M97k19J10m07N61J77n64K36J32l62J32
3455A0J91r8k29P4K19k87J94l32L56j5j44J28k8J39m46K97k6M2k54Q6p1K31j18
3478h1j3Q0J05J3P9j01J18k04%K4J71pl21J61j91K29J07q7r8J21j35p9K12M9m9
3503A03j07l0J20K64m98K16j7l53L31j11J69m35L32r0J61j8K1k16J30J78j22j4
3525A4N5j0R2k76M25n50L72l95J99N4K13k42J90j5l29J91j85J40j7OJ69m0j64
3548a03J81r0k19P9K53k99k3L86k39Q0N1J37l00M80m76J31j95K91k59J06Q7Km9
3571A2J93j84j33q3K65j19n6L16j00K3k26K41k56K09j55J98j10j16P1j37J88j00
3593e9N6j22J20j33K55j39l3JJ56J07K3l67j29L7O3K3J20K97p7l58K63k3k26P0
$$ plain form
3433 -73 -28 19 187 -82 14 222 18 -51 -36 -46 -283 214 -5 105 -302 259 436 -128 108 240 -122 10
3455 10 201 103 -126 -52 167 -120 74 -258 98 83 -61 67 39 178 -268 29 3 45 -209 -123 -194 37 -81
3478 -81 -94 -14 91 104 183 82 200 -4 -4 20 191 184 -137 24 -167 62 169 82 -16 105 -30 -109 103 152 103
3503 103 -4 -34 86 350 -148 68 51 -302 29 -82 87 -348 -16 -106 55 37 58 -158 -28 150 28 14
3525 14 69 59 151 -125 300 -250 122 -273 -74 -20 193 -49 141 126 -203 -12 -197 -57 -74 -68 101 61 -103
3548 -103 78 -12 -231 -152 101 -198 -221 165 -74 6 57 194 -106 374 -102 29 -166 125 -134 -28 59 61 12
3571 12 205 21 -112 -195 70 -49 -105 211 111 134 -92 149 -107 102 -53 145 35 -81 -10 -147 41 -59
3593 -59 -3 -125 -5 -138 117 -22 -55 -54 102 209 232 -135 -264 -227 -164 -141 -21 276 199 -159 104 81 -145 -75
3617g5K1r2J8J4K2o9J68K44k21m6NJ51j76k18L89m3q0J17j45K75K5k28k46J59
3641c1L0R7q3m1j25K59j47pj8L69k38r2K44l5l09K03J86k11k38K91n29O37r7l0
3665H5o1J63o0j70Q9R6k15O7%J03k71K92l24J91k1q5J58k65K23j59M2K4J95k85
3689a88L09l9O9k53K61j30K22j78j43r9J02L4K35k73J18l29L65l69K61k25K36
3710a4p9J37R7k43j0R4L5m1j1l3J34j30J65p9j60K43P9j37Q0l30l1K10K9J89k38
3735d4q1MK31j25J57j1k91N7N4m4J35Q7k17L77q3J75j61m42L36l7j68K05k03l4
3759a23J51k1J77n0j87j12l9J61r3J09j67J06qO5j69M03K7k75j31K90P9j00Q2
3782A75k26P1j13J23r3J35o2J53j69lJ42j54j19Q1o7J8K41k39kK22n6j75J84J90
$$ plain form
3617 -75 -54 -146 -128 -114 -92 -161 7 251 30 -16 -11 140 -36 -254 135 92 12 129 -16 259 284 56 -190 -31
3641 -31 -1 96 13 -28 -153 106 -41 -48 -66 303 65 -27 217 182 -127 76 262 51 -187 104 -425 212 115 85
3665 85 24 187 127 -43 46 142 -73 -6 -6 97 -174 118 -206 -15 -36 -121 37 -228 -5 -164 -122 -98 97 -188
3689 -188 121 82 151 -102 159 29 251 73 -70 -169 -67 -33 202 -71 47 -282 83 -286 -25 -250 -14
3710 -14 -93 44 141 -102 -112 -18 17 -24 -35 -68 66 -64 101 22 -138 105 184 47 127 -203 -234 -24 5 194 -44
3735 -44 -125 -121 110 -15 142 131 -160 -103 -49 -93 42 129 -88 289 206 381 220 -222 114 77 -91 114 -89 -123
3759 -123 28 7 184 134 -53 -165 -204 -43 -136 -27 -194 -88 -96 -31 -200 203 230 -45 -176 114 193 93 175
3782 175 -51 20 -93 30 -63 72 10 163 -6 -9 133 -21 -140 -59 -126 -108 133 -106 -108 114 58 -117 67 257
3806B57l20L1K21j36r5nk83L75j32K0K42k47M3J15j29j10P4J8Q5j20J25j02K82
3829B09k27n0J99k03J82J10q4k85K30N0k35K0J84q8oj6P1J33j29J9j36J50l45
3852b47J22oo6K68q2k09K47Q0j0k50M02m74K87j36J72J72k30p7j77L04k08K42
3874A24k05j89J81o5J38Q4J16o0k43O6J4j12J37Q1j25J52l49K09j0K2j61Q4K96
3897A85l31J76k5l00K72L25k82L7J84Mk57Q4j76J24j00K61j19j98J22L8j12l5
3919a23K41p1j04K16j19N8k96P2J46K2L4m0p9l3p1JL61j40J01k83J27J14J51j52
3943A33k22r2O6P7o0J99j61K47k53K36r4r2O4k39J53l9J16J85m55J98j0N7L0K00
3967B44l62J5K19j91J65q2J44J20j13j25q0J01p6J80l20K58K39m12K87k44J34
$$ plain form
3806 257 -63 -32 189 53 -42 -47 -330 45 -87 -67 175 -72 -29 86 -43 -153 -79 -61 24 -96 29 -73 209
3829 209 -18 -68 131 -72 110 220 136 -149 81 131 -104 -84 100 12 6 -10 61 194 65 84 -52 98 -247
3852 -247 -125 -131 -197 71 -11 -220 27 107 97 -153 249 -225 62 -74 98 270 40 -37 -214 90 -118 124
3874 124 -81 -270 -89 -154 -16 68 184 124 -119 -53 -39 -151 -14 67 -58 94 -255 -46 -56 -34 -195 -111 185
3897 185 -146 30 5 -295 -23 302 20 57 241 245 -12 72 -104 20 -80 181 62 -136 -14 24 -88 -123
3919 -123 118 47 -57 159 40 98 -198 -126 20 42 76 36 -43 -76 -147 -146 215 75 176 -107 20 134 285 133
3943 133 -89 -181 -115 -38 -98 101 -60 187 -66 170 76 -16 48 -191 -38 -77 39 224 -231 -33 -43 14 44 244
3967 244 -118 -103 116 -75 90 8 152 272 159 34 -46 55 -21 159 -161 97 336 -76 211 -33 101
3988A01l77K58k1rJ97l37J91K65k78J77n8j80R6O8j29J85k20M2J85k06J53j36
4010c3Q8jj29J74q3o9K46j44J6j31J63p6j83K77qn5L9j08m5J77k12J77j73Q6j07
4035a14M0q6J08L43m33K09K5r7o3lK02k89P8R3l12K68k16J30q4o8O76m62J21j70
4059a04K2J85l80K20J61k9p7l6J55O3J82m79N0r7K43N4j25j23J52K27k46k6L07
4082B99k64J42l00J18j71L52n9o1j19J31k9l95L04j28K37j28K84j33k17J1J53
4103B7n0mJ7J93j15J58l34O3K27K2j29O5j80PK47p6j57N5l07l5L45k21M6K23j18
4128c1j76L18M3k71J80k52K00j91l2J8K33k08P6o8J61k91R0M9K39P0j24J0n4m1
4152e2J17j41l0K10o9l02L84o5j59M2J21q3J39k4j99j22K58L6Q7J12l05r6J2R4
$$ plain form
3988 101 -276 -18 -39 -48 149 -188 3 268 -10 167 109 -71 25 93 -36 149 -71 -29 156 -50 103 -33
4010 -33 55 54 -75 99 16 -53 193 49 65 -66 97 21 -162 115 107 52 91 -17 -62 115 -97 80 -93 -7 -114
4035 -114 -74 -160 -52 291 -142 67 92 -5 -68 -71 131 -158 -80 13 -299 -31 -247 -117 -201 -269 407 -55 66 -104
4059 -104 -82 103 -277 -57 104 75 -2 -38 117 180 362 -117 -67 -164 79 133 8 -115 37 264 18 -8 299
4082 299 35 177 -123 -5 -176 176 117 56 -63 68 39 -356 -52 -180 57 -71 213 80 -137 -126 27
4103 27 -23 -27 -10 183 68 226 -108 -45 182 204 75 140 -40 -33 214 138 -19 36 -271 -306 39 -182 -136 87 -31
4128 -31 -207 111 154 -117 63 -189 11 -180 -212 -194 39 -169 -93 -161 0 -291 -201 -152 87 157 33 43 -11 -52
4152 -52 65 -76 -106 104 35 -267 117 52 -107 -65 56 -27 112 88 -111 -233 25 61 148 260 -45 -141 -129 -35
4176c5O6j32m5K16N7K9j32%J64l9l4j69n6K62M9j74k2R8q0M3K53k91Q1k89K89
4201A09lj94K7j05R4L36K10n01R0J62l79L4Q1N7n9J11j77J75k96M89k74K2kL05
4225C12j20m56K71j49K33l4L04l06j30J55q7j40K55l06J90K2j21J64N4JmJ6q8
4248C6L0k36L25k03J47q3q3K79m28m3J9O1K22o6M4L13j01j15o0k01Q3%k9O0J5
4273a4J91j46J07k38L60l98K30O3K04n24M7j20K42L7j82J87O0j20J73p1r2J1M6
4296E3J47j45k33J04P9k62J50r8K92k60M91l21R5k26L16j35n9L42m07p6K9l37
4318d61N18J2J00j86R3j65N1O3r3L41j88k43Q8R0n8l03L62O1j0j87p6l8M89j30
4342A30j28m4K5J59j73j03n3N5M1L19l37J16K59k54j11lJ46q7J66J64m18J99J76
$$ plain form
4176 -35 31 -101 -146 70 127 156 24 24 188 149 115 -54 -110 152 201 27 5 103 23 66 319 28 109 -180 109
4201 109 106 -88 -61 -166 -72 264 474 -27 63 225 -154 -120 -39 18 -41 70 -107 68 -228 261 -13 9 7 312
4225 312 192 -264 7 -142 91 57 361 55 -75 80 -7 -147 108 -198 -8 14 -107 57 111 112 108 124 36
4248 36 66 -170 155 -48 99 16 -67 212 -216 -259 -240 -179 43 -23 21 334 233 118 58 -143 -60 -60 -89 -29 -14
4273 -14 177 31 138 -100 260 -138 92 155 359 -165 -118 -238 4 41 -141 46 106 -14 159 88 -4 7 53
4296 53 200 55 -178 -74 5 -257 -107 -205 87 -173 318 -3 92 -134 182 47 -12 330 -77 -153 -124 -461
4318 -461 57 69 169 -17 76 -89 -38 25 -68 273 85 -158 -70 20 -38 -341 21 82 72 -115 -191 -229 260 130
4342 130 2 -42 -17 142 -31 -134 -187 -132 -91 228 -109 7 266 12 -99 -102 44 -43 123 287 -131 68 244
4365B44k11K3r1K91k57K62j69k46K64k57K44l19O0J86J14j08P4l19Q4n6K78L1
4387A22j76K2J93j84m13J69K93k45M5j04L96J14m00J16j08K12j11l0L0K6P5p7
4409c5n0L3k26J47J27k4R3p4k18K44k77J71K7K07k59J09o8K83l08Q9K8l1NM7L1
4434G1k8PL6j72J80l21J46J09qO0p1J42m17M57j44j47J06k7j45J18jl9L7J17J6
4459H2n3N4L9K10l73J46k66Q5K12j10N4L04k51j0l87J49K79m82N15j01k49J26
4481b7J87r3k38K07j59j79K60J44O7j39p6n7Q4K31j86r6M24k96j87J51L6q0l0
4504e2J50j12o9J6L12k87J24p9l30N71j94K16k34K80m16K51N6l46Q3J98qj05p4
4527d9P1N8l60L67j79l0J65L69m69J94k80K29n75L44J06j71M53r7k77K09l84L36
$$ plain form
4365 244 33 56 -35 256 -1 261 92 -154 110 -147 97 -222 -162 24 138 30 104 -215 -131 -187 91 122
4387 122 -54 -32 161 -23 -436 -267 26 -219 -174 -278 118 232 -168 -52 -160 52 -59 -89 -59 -33 42 -35
4409 -35 -85 -52 -278 -131 -4 -28 65 -9 -227 17 -260 -89 -62 145 -114 -5 -73 210 -98 -9 19 -12 -7 40 71
4434 71 43 50 86 -86 94 -227 -81 28 20 80 9 151 -266 191 47 -100 6 -21 -166 -48 -49 -88 -51 66 82
4459 82 29 83 122 332 -41 105 -161 -76 136 26 80 384 133 123 -264 -115 164 -318 197 96 -153 -27
4481 -27 160 67 -171 36 -123 -302 -42 102 169 30 -46 -103 -19 212 26 -70 354 58 -129 22 58 -22 -52
4504 -52 98 -14 -83 -67 245 -42 82 3 -327 244 50 266 32 312 -104 147 203 -143 -60 138 130 25 -49
4527 -49 22 80 -280 87 -92 -122 43 412 -57 137 -143 86 -489 -145 -39 -210 243 146 -131 78 -306 30
4549C0j80j4J97k24L01q2k3K49j6k15j49K69M3k29j9J51J34j62N0L7j41J59k59
4572i3J27j5P8J95n17M30l76M2j5j88L02Q6J06l89K27j91J39K93j06j64K2j32
4594a39M8o3J08k0J27m2K1J22k90K01k3J68j02l6j18K50l04r1K26k65J35L44l90
4617a33K05n4J45k07K80r3j05ml5R6k08K24q9l6k03K94j7j46J02J5%J77j65j00
4641e7J41M7k78P4O1M4J5K09l39J51j99m9L19j74m5J85j88j20qK74j0J7j88l9
4665a57J20J26p7J15l5k39N6J57L3k29L25l6n25L39N4j45o1J30K17m5l7Nk52J33
4689b8K19k40OJ29k11l5j21N97n30L76m2l15n9K39O6r0J56k08M0j5Km1K8j93K66
4714dL8l73N37l42R0P5pj84K30k52N6j8K90j4j3j76J09j90J61k36L76k75L64l29
$$ plain form
4549 30 -150 -164 33 -191 110 28 5 254 238 23 -126 143 186 -43 -62 89 223 61 111 148 7 166 -93
4572 -93 34 19 97 292 -225 205 -171 -129 -144 -332 -30 56 162 -227 0 -191 -52 241 135 -29 -7 -139
4594 -139 -91 -154 -46 -66 61 19 40 162 -128 73 50 218 116 80 -38 212 -92 -183 43 -222 -87 257 -133
4617 -133 72 18 163 -44 236 143 38 34 -1 95 -113 111 22 -14 -217 77 60 -86 16 31 31 208 43 -57
4641 -57 84 131 -147 -73 -12 32 47 256 -83 68 -131 -180 139 -35 -80 105 -83 -203 -211 63 53 70 -118 -157
4665 -157 -37 89 12 127 92 -147 -91 66 99 -130 195 159 -366 -27 27 -118 -179 -49 168 123 86 91 -161 -28
4689 -28 191 -49 -43 86 -125 -160 -281 316 -214 162 120 -195 -254 -15 51 -39 117 -91 -51 -66 -64 -105 -77 -270 -4
4714 -4 34 -339 198 -144 -54 21 14 -170 60 -192 -136 -154 136 122 109 -67 42 -148 13 -223 153 -122 242 -87
4738h7n6L07k14J73M8j28m9j2oPK1L3J3l26J07M92m27J17Pk46L05n6k85M14k79
4763a27Q1Q3j39r8Q5%L70o56M39o9j05J63j88J33P8j24j37L51p1O8k22J96k45
4786a34M5J16J36k66p6R8J1L7j12K88k70K05k82J23j60L73m15K65k05J86K66j08
4808A21j08J33k08j00J81J1J88l06J38j02k3Q4P0L4J72J21m05j62K27j3J32j38
4830D7j64O9pJ3O8k49K35j32K46R2j34N9lo9p2J14j39K21k79j8K04j49k3M6J64
4855A40l31M5N5P1k46M5K67lR7j94j8m8p9K35J7K13k27q9K64k04J66j72P9J98
4879B81l71K19k18L41o8l86K94K5m9k65J20q6K40J6n3k51p2K93J99l36J17l65
4901c75L73J9k81J67K24ok48Q6J60k98K30j4Q9p1k63L00J1k89J48K02j43J0J98
$$ plain form
4738 -87 -143 164 -50 123 171 43 -6 -18 -24 -17 4 37 50 -276 -169 323 -104 13 20 -226 79 23 -262 152 -127
4763 -127 -46 37 -102 -200 -115 -115 255 -401 38 -31 -136 27 -161 -28 50 -74 -211 140 69 137 -85 111 -134
4786 -134 -89 27 163 -103 -179 -81 -70 -33 -145 143 -127 78 -204 -81 -241 132 -283 -18 -223 -37 229 121
4808 121 13 146 -62 -162 19 30 218 -88 50 -52 -75 9 79 113 285 406 1 -161 66 53 185 47
4830 47 -117 -48 -55 -42 26 -223 12 -120 126 218 84 143 140 71 -1 113 -26 195 -84 -102 102 -47 -70 -24 140
4855 140 -191 -146 -91 -20 -266 -221 46 43 140 -54 -72 -120 -199 36 53 266 39 -50 214 10 176 4 83 281
4879 281 -90 129 -89 252 184 -202 92 117 68 -197 -77 -163 77 93 40 -211 -283 10 209 -127 -10 -375
4901 -375 -2 17 -264 -97 127 121 -127 -41 119 -179 51 37 126 55 -208 92 103 -186 -38 164 21 31 229
4924B29m33K19k4J39j4j1m9J26j49l3P5j77k9j9P8j82M03p4j68J04p2M7l06K86
4948c4J44k34J06p8P9J37j17K7k60J16j71N9J87K14k72J29o0J30n2J62j25o2j86
4971a61O7ro8K11k28L05p9J15j54nJ48r5k63K29j76L03k27j19M24r2k28K36m4
4994I0J69j35k42K23k08r4K20K64k82J21nk58j07L5J21J57l01J06j27K53k1J65
5016A44j40J40j74K27m22k6M05k37J63j07J97q5k8j12L72k32J5j73L61k81o0o2
5038a15j59L97j83j49L14n12K86P5m9K07j40j44K08k49K36M3jK62l67K43j00k58
5060a55J69P8k27J86R5L5j42k7r8J42nl49L02J9R8l3J86l37Q7J4j19L47k41q1
5084e6J64k1jK8J7k52K46J50j53N6j05mL7j53J45J84r7k30K2J58J39j72k01J36
$$ plain form
4924 229 -204 15 -9 130 116 105 56 182 33 0 75 -102 -131 -150 -72 -254 149 75 -93 11 -61 -14 -320 -34
4948 -34 110 -124 -18 -96 -17 120 3 30 -230 -114 -285 -226 -39 175 -97 32 -28 102 50 212 87 25 -161
4971 -161 -94 -103 -171 40 -188 117 38 153 -1 -6 142 47 -216 13 -163 140 -87 -206 218 126 -102 134 90
4994 90 259 124 -118 105 -103 -197 23 287 5 126 121 -137 -244 -209 -88 69 -232 -126 -253 0 -21 144
5016 144 4 144 -30 197 -225 -251 154 -83 80 -27 170 85 57 -55 317 85 100 -73 288 7 -53 -115
5038 -115 -274 123 -60 -209 105 -407 -121 -46 -95 112 -28 -172 36 -213 23 66 65 327 -40 203 103 -155
5060 -155 14 92 -135 51 146 181 39 12 -86 56 51 -298 4 23 121 88 274 -63 24 38 -81 266 25 -56
5084 -56 108 87 86 114 131 -121 125 275 122 178 73 69 106 -47 98 282 185 -45 -23 135 274 102 -99 37
5108C7j18k6Q5N7L31o28M19k71J85J04k42k13K93m0M4k61L24J55l05j12J89j6
5130iJ38j13L2k22K80j47j03K14p3J03j89J55q2j56L35r9J92k46j37J18j93J36
5152f6k4K78m30J68J62j25J45j57K17O6qq3j56K18j60N1Q2j30k14K39k01J3J00
5175a5P8K6j98L05j62Lj14J48J38m17R0J31m0R9J48J22l40n26O75ml32J50K76
5198B41k10k1J75l45j1J02LK26k63l2j4m3J93j8j44K64l62J71J91j42Q5q4L5k5
5222b8J43l1p2q1N2j5J26J42k92K24l18J06Q9j99J47P5j22J25k27J0J58o4P4J55
5246A77M9m55J3L56J00l23L53m3m07L12j92P2k90J34O0j18J90J9k73L68j91M1
5268d8K8p7kR6j49O5Q0J6M7j32P0M7Q8l5J01k11q7Q7p4J39j78l4J93rj4l28L70
$$ plain form
5108 37 -81 -107 -22 35 366 -262 157 -114 71 175 -67 -280 13 -27 17 -244 80 235 -70 -182 7 -9
5130 -9 129 16 48 -174 106 -41 -144 70 -3 100 -89 66 -16 -172 163 64 256 10 -127 -9 -202 -66
5152 -66 -90 188 -242 -74 88 -37 108 -49 168 234 226 143 -13 205 45 96 178 48 -166 73 -128 -115 -15
5175 -15 63 89 -109 196 34 37 -77 71 209 -208 -118 13 -27 72 220 342 2 -524 151 147 -185 -35 241
5198 241 31 10 185 -160 -171 -69 -66 160 -103 -135 -149 -192 1 -17 -161 103 -259 -88 103 -39 46 -38 -3 -28
5222 -28 115 84 12 -69 -17 -32 94 236 -56 168 -150 -44 45 -154 -7 68 -54 71 -156 -146 12 -52 22 177
5246 177 226 -229 -216 140 240 -83 270 227 -180 132 -60 12 -278 -144 -84 -202 -12 7 -266 102 -89 -48
5268 -48 -20 -97 -99 -3 -152 -87 -7 9 56 -76 -6 41 129 94 195 -16 -103 -16 -90 49 -129 -163 30 21 7 -321 49
5295D9M5j94J70J51k84R8k05K91k37J37J26l94M9J92O0M6j73K04j81j8J14l9k64
5318b57R1M06k7j40q3J15P5q4p3j21k3L13j07K41j26j46J12k97j00K1j2K15j44
5341a51J3J89j43L03k9l64K09r5J27q0J17k39P4J51p5Q8O3j65K03o6j95M8k45
5364b62L78L3j13K43j94k8k15K08j35K21k84J64l17J93J68kR5n6n4n7k3k8J03
5387C8O5l7l6j76Q1l4k9n4K49l8p8L6p1j64P4K50O0j69o1q5J90R4j41l03M21j68
5413h6L8J90N3k91j20K33p9JP9k7L62n6l85K75k02J07ll9j37j8J82r9O0j48l6
5438a46J34N5L0m2k37K40j14J3P0J32k24KJ85j04j36j1J41M3o1M0j52P8K7K97
5462B60k56j66K22j71J15j01J60j43p4p3L74n14J66J34Rj5K76R4k57r8J60N2k35
$$ plain form
5295 49 94 -100 70 221 -63 35 -170 121 -116 21 147 -247 -198 -6 54 100 -73 131 -50 -68 46 7 -257
5318 -257 -166 240 213 73 -10 105 180 96 23 -98 -121 192 85 326 200 54 166 -131 -231 -210 -222 -7 -151
5341 -151 -138 51 -92 211 182 -182 27 -68 59 -21 96 -143 -69 82 7 95 158 -7 196 130 -65 -17 -262
5364 -262 116 149 36 279 85 57 -158 50 -85 136 -148 16 -301 -108 60 58 153 97 43 -14 -37 -65 38
5387 38 103 66 30 -146 -65 -99 -128 -182 67 29 -49 -13 -84 -248 -174 76 136 -33 -94 -179 11 105 -36 -339 82 -86
5413 -86 -48 142 195 -96 -216 17 -62 -61 18 -9 353 297 -88 187 -15 92 89 50 -87 -105 77 -22 38 -110 -146
5438 -146 -12 43 73 31 -206 34 -80 -67 3 135 -89 -87 98 -6 -142 -153 -12 31 -30 10 -142 -64 -37 260
5462 260 4 -162 60 -111 4 -97 63 -80 -154 -227 147 -367 -201 -67 -58 -73 203 297 40 -58 102 154 -81
5485h1j16J75K6R2J51n17K1L19k99J04L02l14J49J13k01N7J17r5n3j5J7Q2K1j29
5509g4O8J03k0J7j9j4j10Q8j05J49J56j61k13M00m37K04o4j51K38M8m32K61Q2
5532A4L5k85L96j26j03K01k59J89k29J41J4k05L35j32J58m95L10J60K2k33L11
5553B19n28K80p4o6P5J17O7j79K40k47o7L98k11q5j24O7K62l71J8K02p6o5J43
5576ej39M5k29N0K11K9J14o1Q7j70J4R7p7L4O7J05j47J07j04J52j91m7m2K62l09
5601a47J55Q7j35j60J89J40k64l9J96j77J00N9j25M58k64L5n4q4J20o0J00J74
5623C04k18N9j29R8j69rM6j0J06l23L2Q0J87j96L11j53J5J38j8qk7j68K04j96
5647d4P6J88rj06k18j23K39j20K04j1j21J66m3j35L6n4J96J2j56j45K04k38K15
$$ plain form
5485 -81 -197 -22 4 96 247 -270 -249 70 -229 -125 177 -137 12 125 -76 -19 98 3 -50 -65 -48 34 55 -74
5509 -74 -6 97 77 94 75 61 -49 39 -66 83 239 78 -135 265 -172 32 -32 -183 55 103 -329 -68 14
5532 14 49 -236 160 34 -69 132 -127 62 -167 -26 -12 -217 118 -14 144 -351 -41 119 141 -92 219
5553 219 -309 -29 -103 -169 -94 23 90 -89 151 -96 -163 235 24 -61 -185 -118 144 -227 -209 -7 -83 -148 -5
5576 -5 -144 -99 -328 -278 -67 -38 76 15 102 -68 -54 43 -34 0 67 172 25 132 28 180 -11 -58 -100 162 -147
5601 -147 8 95 -40 -200 -11 129 -135 -174 22 -155 -55 4 -121 337 73 108 54 -30 90 30 130 304
5623 304 86 145 16 114 -55 -64 -18 -28 78 -245 -213 -133 54 -142 169 16 31 169 151 143 116 -52 152 -44
5647 -44 32 220 211 105 -113 -236 3 -117 87 76 -45 121 78 -57 -21 -75 121 133 -23 -168 36 -202 13
5670A3J75k98J86j47j8N8N9K75m43J44J13n1p3k03K08J47j35ll74L68qL3K04n33
5694c03J79K54M6J6L6l36m1M8J68L6J46l02J40R8j78P8k12j40K83R2j1ll23K80
5718E1j05L0k23P7N1J02J75r9l8L09j68l15P6L93l27j62J54q5K8K24m16N95l89
5741f2l75L10J43q7j5K8M1J70k59k45M83q0r8j68K94Pq5j02m8j36L64L3k4k18
5765a29k15M35j57j22J76N2N3j81J09j09J97j09P2j32n0N4j09K62l75K81K23m
5787B22k17P2q2n8K18l18J98m6j00O0l8k6K43j7KJ43l29m1L82k30r0K7j2K11l18
5812a44j12M35j98N5J60k73O7J07n3J13j85p5j28J15R5RM2J14j58l7J77k17L96
5835C05j42P8k32J23m07M44k11O6p9K21j01J30L3j62m70L25J29q6m3m2K38mj62
$$ plain form
5670 13 188 -110 76 -71 -89 -31 28 303 -140 4 117 66 -7 -210 -2 145 10 7 -367 1 -7 26 230 -303
5694 -303 -124 130 176 192 228 -108 -149 -101 67 103 249 -53 87 185 7 85 -127 -267 16 108 97 94 -229 51
5718 51 -54 -24 -247 -170 -119 -17 158 59 21 330 162 -153 -77 316 -11 -173 -19 -104 -76 148 -268 327 -62
5741 -62 -437 -127 16 -71 -86 -58 -17 153 -106 -351 132 52 -46 -214 80 87 2 -100 -148 -284 80 113 89 -129
5765 -129 -344 91 -66 -188 -12 40 93 -88 21 -88 109 0 72 -60 -110 -56 -165 97 -278 3 226 222
5787 222 5 77 -5 -63 155 -163 35 -11 -111 -51 -89 -115 128 111 113 256 -73 -114 268 38 -52 -25 -37 174 -144
5812 -144 -256 179 -19 36 196 -77 -10 97 44 157 -28 -103 -231 -116 -21 -12 30 144 -14 -51 126 -91 305
5835 305 163 241 9 132 -275 169 -42 24 -55 166 65 195 228 66 -404 -79 50 -36 -79 -121 117 113 -49
5858d9J87j59p5k9l7J82J66j69K1k03K17R8j64R8k03L92M9j57j50J9N8j54k6J80
5882I2m6l6K80m25J17q1L64m01K3J70n4R7q5J58j12J3k16J17L2j74K33l13K67
5905B0k4m70M36J63l19J13K26j22J9o0j21J28R9q5K17k71j34K66j68k5NJ21L8
5928E2j7R6J0m4j95K98ll6l61L31l05L44k63J2K18p6L3O0j67j07M3r3L02j88P8
5953B2K45j60j00Ml00L75n1N3Q6j32k8O5j30j12K39j60L82l85j08N9J29p3J59
5976G9o0l06K90j24K13j37k49N07k37J84J5j15mj27l3J71j27K98m93l4J87K08
5998A06J08m04m9N1M02k04M2K24l7k90K8J20j62mj83L19pL10k75k96j25L73k8
6021A9J35p4l5K7j16J80l14J41O7j26m8J83k3K23j75j29K43L0kk29l8J56k80K9
$$ plain form
5858 -49 138 -21 -96 -125 -162 20 186 17 38 -165 52 150 -14 84 -119 273 322 165 15 34 92 -62 -88 92
5882 92 46 10 290 -135 -18 -99 265 -136 -113 57 3 100 15 173 61 74 -142 -25 7 -167 66 -247 20
5905 20 -4 -474 -38 125 -194 -81 145 23 42 -18 -139 -11 88 3 220 -51 -185 81 -87 -112 -107 14 52
5928 52 35 131 141 97 -98 200 197 161 -200 131 -174 170 -93 -81 137 61 94 154 -13 -120 -77 -170 132 -56 22
5953 22 267 107 7 11 -289 86 35 88 174 42 14 79 -51 -163 76 -84 298 -87 -195 -136 -7 -80 79
5976 79 19 -287 3 -121 92 -45 -294 213 -24 160 175 60 56 -71 -104 67 -60 238 -255 -289 -102 106
5998 106 214 -190 -239 -188 214 10 52 276 239 -51 -23 97 -65 -69 -252 67 60 370 95 -201 -326 47 19
6021 19 154 80 45 72 -44 136 -178 -37 30 -96 -144 39 16 239 64 -65 178 208 206 -23 -61 95 -185 -156
6045a56J53J73j14mj7N7j96N2K59k1l73J6K49j77K03k24J21L5K58j71j71j09N
6068a52L39K09m81P4J62k50K01P6lk04J47k7j43K93n50K38j01K15M0j33J04J9
6090G3r9r5J67m4oQ9j75l1k61N79j36k7n7J26j54n5L2M34l58L02l86J1Q3j75K97
6115A34k73K41j74m6Q3K55l79P6Q2j88M46m90O6K40k60o6J21n2L66rk31j34J37
6138e5k32L75k75J50m4J82j26L3J22j41J53n60L75M6q7R5J29j51r6Mj5R6K66k64
6162b0k75L80L7N8j37j41J54j08j60K17MJ60j26k34K58j84J20j46n6p2J18N7J97
6185A01k67M56l39M9K17j59k2j55k4L25j02k33N2L54l01J20M4q7J76m23q7M52
6207A47p3p4L75n79O96m65l6K34r7r9l83K14q6J07L89k54J91m44K67j22M8N2J68
$$ plain form
6045 -156 -3 170 56 52 35 92 -104 -52 207 186 -187 -171 78 -99 104 -120 1 36 294 123 -48 -157 -152
6068 -152 187 396 -85 -11 151 -99 102 178 175 -29 118 91 -52 241 -309 -71 -172 43 83 -50 54 73
6090 73 -26 -121 46 2 -4 85 -90 -121 -382 197 61 34 -23 103 -51 -106 -74 360 2 304 -82 -71 12 -163 134
6115 134 -139 102 -72 -118 -35 220 -159 -83 -1 -189 257 -233 -167 73 -187 -253 -132 -184 182 173 -58 -192 -55
6138 -55 -287 88 -187 -37 -81 101 -25 8 130 -11 142 -418 -43 3 -84 11 140 -11 -107 -103 -118 -22 244 -20
6162 -20 -295 85 122 180 43 -98 56 -52 -212 5 9 169 43 -191 67 -117 3 -143 -199 -271 -153 -96 101
6185 101 -166 290 -49 0 217 58 36 -119 -143 182 80 -153 -101 253 -48 72 116 29 205 -218 -305 147
6207 147 74 0 375 -204 492 27 -9 225 128 29 -354 -140 -226 -119 270 16 207 -237 30 -92 -44 8 176
6230A76k36j02L00K0k64J33K94l3l27N4j7N3j16j4K24j6l64K68j21K6J53j31n0
6253i0L31k29j4j45M8O3J63n0j45m8J96j30k33L78k55J78k26K54N9j08l2J71k33
6276i7M6J34j9K9l34J76j70J7K90j45Mo1K42k06Q2n0p7l13M84J9n5j91J49n2j10
6301b08J42j73L85p6j25J96k90Q7J50pR1n8j35j36K73J22j2j91J51j58j9j29J62
6324D2K3r4M4p8J47l59M3L61k7J58p3m36K98j73J1R5J38l34K45K11l78L11n2j94
6348g1j92K52j08L49k78J3M8J30j08N9k68K21J68l65K74j04j06L25l02J72rj27
$$ plain form
6230 176 -60 -162 138 158 -106 27 321 288 -39 15 -2 51 -65 -79 145 129 -235 33 -88 -62 91 -40 -90
6253 -90 241 12 -2 -147 -99 -36 127 77 -68 -116 80 -50 -283 95 -160 18 -208 46 105 -3 -35 136 -97
6276 -97 -51 83 64 93 -241 -65 -235 -218 72 -73 -69 -130 112 -94 -12 -62 -139 -452 32 51 -4 -195 -46 -98 -208
6301 -208 -66 -239 146 70 -55 141 -149 -62 88 81 172 114 -21 -157 116 238 226 35 186 28 9 -120 42
6324 42 65 -29 15 -63 84 -275 -232 129 102 260 187 -249 49 -124 -113 -18 120 -214 31 242 -136 175 123 -71
6348 -71 -263 -11 -119 230 -48 -35 13 143 35 94 -174 47 215 -150 124 20 -86 239 -63 109 100 -27
$$ [...]
8191b5
##END NTUPLES=NMR FID
##END=
