##TITLE=1H_SR64_kW
 CDCl3, 8 sc, 
 7.06.2021
##JCAMPDX= 6.0         $$ Bruker NMR JCAMP-DX V2.0
##DATA TYPE= NMR FID
##DATA CLASS= NTUPLES
##ORIGIN= UXNMR, Bruker Analytische Messtechnik GmbH
##OWNER= root
$$ XWIN-NMR		Version 3.5
$$ Mon Jun  7 13:36:00 2021 Russian Standard Time (UT+4h)  she@DPX200
##.OBSERVE FREQUENCY= 200.131506
##.OBSERVE NUCLEUS= ^1H
##.DELAY= (6, 6)
##.ACQUISITION MODE= SIMULTANEOUS
##.ACQUISITION SCHEME= undefined
##.AVERAGES= 8
##.DIGITISER RES= 18
##SPECTROMETER/DATA SYSTEM= spect
##.PULSE SEQUENCE= zg30
##.SOLVENT NAME= CDCl3
##.SHIFT REFERENCE= (INTERNAL, CDCl3, 0, 15.7039)
##AUDIT TRAIL= $$ (NUMBER, WHEN, WHO, WHERE, WHAT)
$$ ##TITLE= Audit trail, XWIN-NMR		Version 3.5
$$ ##JCAMPDX= 5.01
$$ ##ORIGIN= Bruker BioSpin GmbH
$$ ##OWNER= she
$$ F:/spectra/data/she/nmr/H-F/1/audita.txt
$$ ##AUDIT TRAIL=  $$ (NUMBER, WHEN, WHO, WHERE, WHAT)
(   1,<2021-06-07 13:34:42.98 +0400>,<she>,<DPX200>,
      <created by zg, POWCHK disabled, PULCHK disabled
       configuration hash MD5:
       00 E9 B6 7A A2 85 ED C7 34 08 36 98 17 FE 4E 26
       data hash MD5: 16K
       B7 D3 6F 74 18 28 08 9F DC 54 E7 4C 2F 9C C2 62>)
$$ ##END=
$$ 
$$ hash MD5
$$ 90 34 04 91 03 4C CC 72 B3 90 82 00 C7 8C 24 F7
##$RELAX= 
##$RELAX= 
##$RELAX= 
##$RELAX= 
##$RELAX= 
##$RELAX= 
$$ Bruker specific parameters
$$ --------------------------
##$DU= <F:/spectra>
##$EXPNO= 1
##$NAME= <H-F>
##$PROCNO= 1
##$TYPE= <nmr>
##$USER= <she>
##$AMP= (0..31)
100 100 100 100 100 100 100 100 100 100 100 100 100 100 100 100 100 100 
100 100 100 100 100 100 100 100 100 100 100 100 100 100 
##$AQSEQ= 0
##$AQ_mod= 1
##$AUNM= <au_zg>
##$AUTOPOS= <>
##$BF1= 200.13
##$BF2= 200.13
##$BF3= 200.13
##$BF4= 200.13
##$BF5= 200.13
##$BF6= 200.13
##$BF7= 200.13
##$BF8= 200.13
##$BYTORDA= 1
##$CFDGTYP= 0
##$CFRGTYP= 5
##$CHEMSTR= <none>
##$CNST= (0..31)
1 1 145 1 1 1 1 1 1 1 1 1 1 1 1 1 1 1 1 1 1 1 1 1 1 1 1 1 1 1 1 1 
##$CPDPRG= <>
##$CPDPRG1= <>
##$CPDPRG2= <>
##$CPDPRG3= <>
##$CPDPRG4= <mlev>
##$CPDPRG5= <mlev>
##$CPDPRG6= <mlev>
##$CPDPRG7= <mlev>
##$CPDPRG8= <mlev>
##$CPDPRGB= <>
##$CPDPRGT= <>
##$D= (0..31)
0 1.2 0 0 0 0 0 0 0 0.06 0 0.03 0 0 0 0 0.0002 0 0 0 0 0 0 0 0 0 0 0 0 
0 0 0 
##$DATE= 1623058482
##$DBL= (0..7)
120 120 120 120 120 120 120 120 
##$DBP= (0..7)
150 150 150 150 150 150 150 150 
##$DBP07= 0
##$DBPNAM0= <>
##$DBPNAM1= <>
##$DBPNAM2= <>
##$DBPNAM3= <>
##$DBPNAM4= <>
##$DBPNAM5= <>
##$DBPNAM6= <>
##$DBPNAM7= <>
##$DBPOAL= (0..7)
0.5 0.5 0.5 0.5 0.5 0.5 0.5 0.5 
##$DBPOFFS= (0..7)
0 0 0 0 0 0 0 0 
##$DE= 6
##$DECBNUC= <off>
##$DECIM= 32
##$DECNUC= <off>
##$DECSTAT= 4
##$DIGMOD= 1
##$DIGTYP= 9
##$DL= (0..7)
0 120 120 120 120 120 120 120 
##$DP= (0..7)
150 150 150 150 150 150 150 150 
##$DP07= 0
##$DPNAME0= <>
##$DPNAME1= <>
##$DPNAME2= <>
##$DPNAME3= <>
##$DPNAME4= <>
##$DPNAME5= <>
##$DPNAME6= <>
##$DPNAME7= <>
##$DPOAL= (0..7)
0.5 0.5 0.5 0.5 0.5 0.5 0.5 0.5 
##$DPOFFS= (0..7)
0 0 0 0 0 0 0 0 
##$DQDMODE= 0
##$DR= 18
##$DS= 0
##$DSLIST= <SSSSSSSSSSSSSSS>
$$ [...]
##$SUBNAM2= <"">
##$SUBNAM3= <"">
##$SUBNAM4= <"">
##$SUBNAM5= <"">
##$SUBNAM6= <"">
##$SUBNAM7= <"">
##$SUBNAM8= <"">
##$SUBNAM9= <"">
##$SW= 20.0188882624521
##$SWIBOX= (0..15)
0 0 2 0 0 0 0 0 0 0 0 0 0 0 0 0 
##$SW_h= 4006.41025641026
##$TD= 16384
##$TD0= 1
##$TE= 0
##$TE2= 300
##$TE3= 300
##$TEG= 300
##$TL= (0..7)
0 120 120 120 120 120 120 120 
##$TP= (0..7)
150 150 150 150 150 150 150 150 
##$TP07= 0
##$TPNAME0= <>
##$TPNAME1= <>
##$TPNAME2= <>
##$TPNAME3= <>
##$TPNAME4= <>
##$TPNAME5= <>
##$TPNAME6= <>
##$TPNAME7= <>
##$TPOAL= (0..7)
0.5 0.5 0.5 0.5 0.5 0.5 0.5 0.5 
##$TPOFFS= (0..7)
0 0 0 0 0 0 0 0 
##$TUNHIN= 0
##$TUNHOUT= 0
##$TUNXOUT= 0
##$USERA1= <user>
##$USERA2= <user>
##$USERA3= <user>
##$USERA4= <user>
##$USERA5= <user>
##$V9= 5
##$VALIST= <valist>
##$VCLIST= <CCCCCCCCCCCCCCC>
##$VD= 0
##$VDLIST= <DDDDDDDDDDDDDDD>
##$VPLIST= <PPPPPPPPPPPPPPP>
##$VTLIST= <TTTTTTTTTTTTTTT>
##$WBST= 1024
##$WBSW= 4
##$XGAIN= (0..3)
0 0 0 0 
##$XL= 0
##$YL= 0
##$YMAX_a= 13179
##$YMIN_a= -12048
##$ZGOPTNS= <>
##$ZL1= 120
##$ZL2= 120
##$ZL3= 120
##$ZL4= 120
##$ABSF1= 10
##$ABSF2= 0
##$ABSG= 5
##$ABSL= 3
##$ALPHA= 0
##$AQORDER= 0
##$ASSFAC= 0
##$ASSFACI= 0
##$ASSFACX= 0
##$ASSWID= 0
##$AUNMP= <proc_1d>
##$AZFE= 0.1
##$AZFW= 0.1
##$BCFW= 1
##$BC_mod= 2
##$BYTORDP= 1
##$COROFFS= 0
##$CY= 11.3945322036743
##$DATMOD= 1
##$DC= 2
##$DFILT= <>
##$DTYPP= 0
##$F1P= 15.9154993809931
##$F2P= -4.1035820241983
##$FCOR= 0.5
##$FTSIZE= 0
##$FT_mod= 4
##$GAMMA= 1
##$GB= 0.15
##$INTBC= 1
##$INTSCL= 1
##$ISEN= 128
##$LB= 0.24
##$LEV0= 0
##$LPBIN= 0
##$MAXI= 10000
##$MC2= 0
##$MEAN= 0
##$ME_mod= 0
##$MI= 1.114404
##$NCOEF= 0
##$NC_proc= 0
##$NLEV= 6
##$NOISF1= 3.799351
##$NOISF2= 2.8
##$NSP= 1
##$NTH_PI= 0
##$NZP= 0
##$OFFSET= 15.70392
##$PC= 1
##$PHC0= -11391.21
##$PHC1= 5.801008
##$PH_mod= 1
##$PKNL= yes
##$PPARMOD= 0
##$PSCAL= 0
##$PSIGN= 0
##$REVERSE= no
##$SF= 200.130013532006
##$SI= 16384
##$SIGF1= 3
##$SIGF2= 2
##$SINO= 400
##$SIOLD= 16384
##$SREGLST= <1H.CDCl3>
##$SSB= 0
##$STSI= 0
##$STSR= 0
##$SW_p= 3612.71676300578
##$SYMM= 0
##$S_DEV= 0
##$TDeff= 0
##$TDoff= 0
##$TI= <>
##$TILT= no
##$TM1= 0
##$TM2= 0
##$TOPLEV= 0
##$USERP1= <user>
##$USERP2= <user>
##$USERP3= <user>
##$USERP4= <user>
##$USERP5= <user>
##$WDW= 1
##$XDIM= 8192
##$YMAX_p= 0
##$YMIN_p= 0
$$ End of Bruker specific parameters
$$ ---------------------------------
##NTUPLES= NMR FID
##VAR_NAME=  TIME,          FID/REAL,        FID/IMAG
##SYMBOL=    X,             R,               I
##VAR_TYPE=  INDEPENDENT,   DEPENDENT,       DEPENDENT
##VAR_FORM=  AFFN,          ASDF,            ASDF
##VAR_DIM=   8192,          8192,            8192
##UNITS=     SECONDS,       ARBITRARY UNITS, ARBITRARY UNITS
##FACTOR=    0.0002496,     1,               1
##FIRST=     0,             0,               0
##LAST=      2.0444736,     0,               0
##MIN=       0,             -12048,          0
##MAX=       2.0444736,     13179,           0
$$ Real data points
##PAGE= N=1
##DATA TABLE= (X++(R..R)), XYDATA
$$ plain form
0 0 0 0 0 0 0 0 0 0 0 0 0 0 0 0 0 0 0 0 0 0 0 0 0 0 0 0 0 -7 8 -8 8 -8 8 -8 8 -12 16 -16 16 -16 22 -24 24 -29 32 -33
46 -33 39 -41 47 -51 55 -62 69 -76 84 -93 101 -114 127 -144 163 -187 216 -255 310 -389 514 -757
68 -757 1377 -7125 -11574 -1991 2817 7581 4614 -4012 -12048 -9280 233 7958 6355 -277 -6217 -7530
84 -7530 -3867 3677 7626 3633 -4232 -7594 -4329 3214 8792 6619 -2437 -8887 -6271 2360 8827
99 8827 8726 2788 -4556 -7376 -2500 6000 9866 5250 -2089 -4492 -1184 3704 6864 6086 1041 -3786
115 -3786 -3198 1992 7072 7894 3530 -2555 -4745 -1196 5021 8649 6611 769 -3691 -3430 1253 6883
131 6883 8030 2771 -3142 -3306 1412 5852 6592 3345 -1552 -3974 -1293 4424 7501 4875 -742 -3932
147 -3932 -2422 1631 5168 5655 2419 -2138 -3487 -566 3329 4837 3115 -508 -3094 -2108 1692 4745
$$ packed form
0@%%%%%%%%%%%%%%%%%%%%%%%%%%%pJ5j6J6j6J6j6J6k0K8l2L2l2L8m6M8n3O1o5
46c3P2q0Q8r8J06j17J31j45J60j77J94k15K41k71L07l50M03m71N65o99R03j271
68g57K134q502m449R583M808M764k967q626q036K768R513P725j603o632n940j313
84g530L663P544L949l993p865l362L265P543N578k173r056o450K616Q631O467
99H827j01n938p344k820M876Q500L866m616p339k403L308M888L160p78n045m827
115c786N88N190N080Q22m364o085k190L549O217L628k038n842m460K61M683N630
131F883J147n259n913j64M718M440P40l247m897k422K681N717L077k626n617l190
147c932J510M053L537M87l236m557j349K921L895J508j722l623k586R86L800L053
$$ plain form
163 4745 4149 165 -3519 -3413 98 3796 4742 1933 -2668 -4606 -1992 2419 4390 2577 -1439 -3841
179 -3841 -2737 561 3150 2831 -259 -3332 -3359 -547 2282 2669 591 -2354 -3652 -2241 754 2684
195 2684 1850 -1253 -3768 -3386 -740 1788 2137 84 -2894 -4056 -2146 1010 2321 689 -2350 -3900
211 -3900 -2691 24 1742 1194 -1353 -3693 -3454 -789 1491 1416 -667 -2898 -3450 -1965 354 1508
227 1508 541 -1842 -3401 -2690 -488 1035 871 -664 -2531 -2966 -1365 793 1429 -23 -2130 -2972 -1748
244 -1748 396 1638 942 -1127 -2893 -2490 -201 1663 1502 -215 -1887 -2259 -957 868 1644 665 -1095
261 -1095 -1960 -1002 790 1579 954 -376 -1440 -1384 107 1746 1940 553 -1134 -1607 -494 1203 1977
278 1977 1446 77 -1169 -1004 614 1867 1611 252 -757 -733 420 1638 1868 823 -653 -1180 -127
$$ packed form
163D745n96l984l684J06L511L698R46k809m601j938K614M411J971j813m016k402
179c841J104L298K589l19l090l073k7K812K829L87k078k945j298J411K995J930
195B684q34l103k515L82K646K528L49k053k978j162J910L156J311j632l039j550
211c900J209K715J718n48k547k340K39K665K280p5k083k231n52J485K319J154
227A508r67k383j559P11K202J523j64j535j867m35J601K158O36j452k107q42J224
244a748K144J242o96k069j766M03K289J864j61j717j672l72J302J825P76r79j760
261a095q65R58J792P89o25j330j064N6J491J639J94j387j687m73J113J697P74
278A977n31j369j246J65J618J253k56j359j009K4J153J218K30j045j476n27J053
$$ plain form
295 -127 1505 2101 1357 70 -848 -752 446 1676 1723 701 -444 -601 171 1140 1380 808 -116 -681 -212
314 -212 1036 1740 1126 -113 -869 -682 319 1404 1605 712 -522 -977 -274 845 1287 736 -90 -552
332 -552 -382 430 1123 872 -129 -804 -600 292 1104 1073 348 -526 -1003 -489 556 1225 758 -165 -672 -563
352 -563 15 654 736 110 -561 -621 -12 736 757 79 -593 -753 -412 331 959 696 -276 -888 -738 -40 537
373 537 587 143 -461 -678 -407 254 586 78 -586 -690 -361 151 458 309 -319 -872 -856 -218 473 476 -131 -603
395 -603 -739 -536 -79 346 180 -455 -787 -530 -50 217 22 -380 -649 -688 -376 191 368 -123 -681 -793 -404
416 -404 -8 224 133 -299 -684 -630 -157 288 225 -236 -570 -477 -193 90 265 68 -384 -600 -262 172 351 124
438 124 -236 -408 -341 -62 313 432 83 -383 -384 -33 249 365 258 -44 -300 -190 178 478 366 -17 -213
$$ packed form
295a27J632N96p44j287r18R6J198J230M7j022j145j57P72R69K40n72r24n65M69
314b12J248P04o14j239p56J87J001J085K01q93j234m55P03J119M42n51q26m62
332e52J70Q12O93k51j001o75K04Q92Q12l1p25q74m77N14J045O69m67r23n07J09
352e63N78O39Q2o26o71o0O09P48K1o78o72j60L41P43O28k63r72o12J50O98N77
373E37N0m44o04k17K71O61L32n08o64j04L29N12L07j49o28n53J6O38O91Lo07m72
395f03j36K03M57M25j66o35l32K57M80K67j95m02k69l9L12N67J77m91n58j12L89
416d04L96K32r1m32l85N4M73M45o3m61l34R3K84K83J75j97m52k16L38M34J79k27
438A24l60j72O7K79L75J19l49m66jL51K82J16j07l02k56J10L68L00j12l83j96
$$ plain form
459 -213 -69 196 327 407 220 -189 -280 42 445 501 248 -39 -163 -40 99 360 411 147 -188 -119 155 251
481 251 207 104 -54 -130 -36 232 389 204 -164 -310 -111 116 260 296 133 -227 -310 -53 208 192 55 -119
503 -119 -164 -72 54 149 107 -146 -324 -117 178 206 73 -48 -211 -290 -171 126 273 117 -141 -219 -87 14 44
526 44 81 78 -113 -176 64 218 143 -63 -184 -159 48 172 247 192 -77 -243 -122 162 233 128 74 -2 -46 -3 144
551 144 127 29 -89 -58 149 197 154 55 -20 -127 -146 132 306 208 30 -95 -100 -38 49 116 126 -12 -136 -56 139 106
577 106 -71 -133 -99 -33 64 135 140 -84 -246 -234 2 120 53 -38 -52 -112 -168 -49 57 5 -131 -97 -74 31 24 -18 -56
604 -56 -115 -207 -48 126 140 -40 -116 -118 -138 -39 102 97 -9 -124 -73 56 81 -7 -52 -37 -11 -19 130 172 54 -131 -91
631 -91 44 101 125 93 57 4 -64 -17 143 140 23 -22 14 33 54 113 87 -13 -81 -26 97 147 63 -39 -30 -73 -35 67
$$ packed form
459b13J44K65J31Q0j87m09r1L22M03N6k53k87j24J23J39K61N1k64l35O9K74R6
481B51m4j03j58p6R4K68J57j85l68j46J99K27J44L6j63l60q3K57K61j6j37j74
503a19m5R2J26R5m2k53j78K07K95K8j33j21j63p9J19K97J47j56k58p8J32J01L0
526D4L7lj91o3K40J54p5k06j21K5K07J24P5n5k69j66J21K84P1j05n4p6m4M3J47
551A44j7r8j18L1K07M8m3r9p5j07j9K78J74r8j78j25nO2Q7O7J0j38j24Q0J95l3
577A06j77o2L4O6R7P1Nk24j62J2K36J18o7r1j4o0n6J19J06n2j36L4K3J05pm2l8
604e6n9r2J59J74J4j80p6kk0R9J41nj06j15N1J29K5q8m5J5K6qJ49M2j18j85M0
631i1J35N7K4l2l6n3o8M7J60lj17m5L6J9K1N9k6j00o8N5J23N0q4j02Rm3L8J02
$$ plain form
659 67 108 11 -118 -72 -22 39 47 -38 -68 -103 -90 -44 34 16 -132 -153 -80 -73 -38 -12 -29 -110 -166 -134 -22 12 -92 -134 -121 -157
689 -157 -84 -24 59 -59 -192 -160 -54 -22 -23 -38 -84 -72 -117 -58 41 -2 -104 -99 15 27 7 44 -18 -71 -116 -27 80 106
717 106 0 -7 26 -18 -46 34 104 20 -46 3 116 99 59 36 5 -5 29 118 172 121 -29 -26 34 67 61 107 114 61 1 43 85
748 85 57 32 -3 45 70 91 68 96 12 -107 -33 62 104 79 42 -16 -34 -48 -7 74 53 -22 -95 33 58 -34 -5 -14 -65 -65 9
779 9 113 85 -55 -111 -43 -28 -24 -22 64 46 -51 -76 0 -17 -8 -46 15 30 25 45 61 34 -59 -47 26 101 80 48 68 -8 -43 -21
811 -21 52 73 33 -4 66 53 35 7 50 41 -7 21 67 99 26 -28 -10 -23 -17 16 93 65 -34 -65 -22 21 2 -16 21 10 -26 1
843 1 21 -11 -55 -91 -51 -4 -24 -27 20 -21 -101 -115 -21 16 -70 -51 -29 -63 -75 -82 -33 -74 -132 -100 -13 2 -88 -95 -57 -111 -100 -37 -2
876 -2 -25 -42 -93 -52 -23 -44 -69 -16 -38 -87 -45 -16 18 -46 -30 -2 -19 7 43 62 30 7 -38 15 61 5 -2 40 12 20 22 57 45
$$ packed form
659F7M1r7j29M6N0O1Qq5l0l5J3M6P8j8j48k1P3PL5K6j7q1n6L2J12L4j04m2J3l6
689a57P3O0Q3j18j33L2J06L2jj5m6J2m5N9R9m3j02NJ14J2k0L7o2n3m5Q9J07K6
717A06j06pL3m4k8Q0P0q4o6M9J13j7m0k3l1j0L4Q9N4n1j50LO0L3oM6Pn3o0M2M2
748H5k8k5l5M8K5K1k3K8q4j19P4R5M2k5l7n8j8j4M1Q1k1p5p3J28K5r2K9rn1%P4
779IJ04k8j40n6O8J5MKQ6j8r7k5P6j7Rl8O1J5nK0J6k7r3J2P3P5k1l2K0p6l5K2
811b1P3K1m0l7P0j3j8k8M3rm8K8M6L2p3n4J8j3OL3P7k8r9l1M3M3j9j8L7j1l6K7
843AK0l2m4l6M0M7k0lM7m1q0j4R4L7q6J9K2l4j2pM9m1n8L2Q7J5r0pL8n4J1O3L5
876bk3j7n1M1K9k1k5N3k2m9M2K9L4o4J6K8j7K6L6J9l2k3m5N3M6n6pM2k8QKL5j2
$$ plain form
909 45 4 19 32 73 50 27 39 25 -10 -15 38 78 52 -1 38 51 -17 14 30 8 7 -22 62 62 19 -33 -9 14 -31 -10 45 17
941 17 -57 -38 -33 33 -17 -29 8 4 -20 -35 29 24 -40 -60 -10 0 11 -8 36 24 -54 -53 -16 7 -47 -22 25 -2 -28 -17 29 16 -14
974 -14 8 -8 47 12 -1 17 -9 -10 7 70 92 34 32 28 27 6 27 36 83 63 34 86 84 22 -17 9 29 64 55 84 82 17 4 29 41
1009 41 47 41 60 68 10 -33 30 65 -2 -3 51 37 35 -5 7 -7 -55 -27 2 21 28 -35 -19 -41 -79 -46 -38 -8 -25 -39 5 22 -38 -74
1043 -74 -35 -3 -57 -73 33 -14 -66 -73 -57 -50 -30 -32 2 -34 -29 -58 -51 -28 -46 -29 1 12 -35 -43 -14 -6 -12 -29 -12 -9 23 11 17 11 -21
1078 -21 -40 -34 40 0 -7 48 30 -9 10 16 15 7 -5 49 32 20 -12 9 19 13 -28 21 43 0 -17 18 10 -2 -5 -11 34 31 35 -1 9 -21
1114 -21 -78 1 11 -23 -5 1 23 -30 -33 -3 -10 -16 -27 30 11 -40 -25 6 -14 -5 -29 11 14 -14 -4 -20 -15 -37 -15 24 41 17 -39 15
1148 15 33 -11 -35 14 10 14 18 14 41 16 -2 16 38 14 18 61 66 45 4 37 54 40 37 64 76 43 31 49 52 11 11 70 63 18 19 71
$$ packed form
909D5m1J5J3M1k3k3J2j4l5nN3M0k6n3L9J3o8L1J6k2jk9Q4%m3n2K4K3m5K1N5k8
941A7p4J9NO6n0j2L7mk4j5O4no4k0N0J0J1j9M4j2p8JL7K3n4K5M7k7k6J1M6j3l0
974a4K2j6N5l5j3J8k6jJ7O3K2n8kmjk1K1RM7k0k9N2ko2l9K6K0L5rK9ko5j3K5J2
1009D1OoJ9Qn8m3O3L5o7jN4j4km0J2j4m8K8K9J9Po3J6k2l8L3QL0j7j4M4J7o0l6
1043g4L9L2n4j6J06m7n2pJ6PK0kL4l6Nk9PK3j8J7L0J1m7qK9Qoj7J7LL2j2Ool2
1078b1j9OP4m0pN5j8l9J9Ojqj2N4j7j2l2K1J0om1M9K2m3j7L5qj2loM5lMl6J0l0
1114b1n7P9J0l4J8OK2n3lL0poj1N7j9n1J5L1k0Rk4M0Lk8J0j6Nk2K2L9J7k4n6N4
1148A5J8m4k4M9mMMmK7k5j8J8K2k4MM3Nk1m1L3J7j4lK7J2l3j2J8Lm1%N9pm5JN2
$$ plain form
1184 71 51 -1 22 22 38 73 45 42 39 33 -8 27 40 21 26 16 43 0 4 33 14 -6 -10 15 28 -11 -32 -28 -2 -38 -46 4 13 -30 -32 -26
1220 -26 -6 -29 -30 -7 4 -14 -23 -13 22 -44 -53 -7 -8 -14 -21 -32 14 -46 -50 -30 -25 -32 -71 -8 -16 -31 -33 -6 -4 -43 4 11 36 1 -2 1 -25 13
1258 13 -8 -13 37 11 1 -1 10 -9 -34 13 26 5 19 27 27 -3 -35 -6 21 8 23 19 39 -8 -17 -15 -1 -6 -10 -2 43 2 -21 -3 1 -9
1294 -9 -14 18 11 -6 -32 -19 -16 -7 -33 -32 20 0 -32 -22 -8 -42 -23 -21 2 -22 -42 -8 16 -24 -24 -3 -5 -9 -47 -8 52 -11 -21 -10 -3 -6
1330 -6 -22 0 7 -1 -6 -13 10 6 0 2 35 25 10 30 51 8 2 37 -3 32 40 11 36 38 56 13 39 37 2 61 79 38 -6 48 52 0 17
1367 17 6 66 42 30 18 53 6 0 30 23 37 26 4 35 33 24 -1 22 16 33 -6 34 14 -20 -1 5 -1 4 12 7 6 -20 18 -4 13 -37
1403 -37 7 25 12 -32 -36 -11 -21 -27 -11 18 38 -7 9 33 -16 -32 -1 24 14 3 29 -9 15 -15 -11 32 -10 -15 21 29 22 2 -6 4
1437 4 -5 -3 -5 39 16 -18 -8 33 -15 -22 4 51 21 15 -4 16 -1 -27 31 24 13 -5 -10 6 7 -13 11 -8 15 9 6 -3 4 -2 -35 6 -16
$$ packed form
1184G1k0n2K3%J6L5k8llom1L5J3j9Nj0K7m3MK9j9k0mK5J3l9k1MK6l6qN0Rm3kO
1220b6K0k3jK3J1j8rJ0L5o6rM6jopj1M6o0mK0Npl9O3qj5kK7Kl9M7PK5l5lLk6L8
1258A3k1nN0k6j0kJ1j9k5M7J3k1J4Q%l0l2K9K7j3J5mK0m7rKJ4nmQM5m1k3J8Mj0
1294inL2pj7k6J3LRk6JN2k0l2J0J4l4J9KK3k4k0L4K4m0%K1kml8L9O0o3j0J1Pl
1330fj6K2PqnpK3moKL3j0j5K0K1m3oL5m0L5Qk9K5KJ8m3K6kl5N9J8m1m4N4Mn2J7
1367A7j1O0k4j2j2L5m7oL0pJ4j1k2L1krk5K3oJ7l9M0k0l4J9OoNQnjk6L8k2J7n0
1403c7M4J8j3m4mK5j0oJ6K9K0m5J6K4m9j6L1K5j0j1K6l8K4l0MM3m2nL6Qpk0qJ0
1437DrKkM4k3l4J0M1m8pK6M7l0oj9K0j7k6N8pj1j8nJ6Jk0K4j9K3olrPol3M1k2
$$ plain form
1474 -16 -23 0 -21 -43 -23 -34 -40 -33 -40 -30 -15 -18 -40 -30 5 -57 -40 -43 -2 -14 -59 -12 -13 -12 -41 -20 -58 -22 -17 -18 -17 -42 -19 -31 9 -15
1510 -15 6 1 25 -10 0 -12 -13 -4 -14 -9 37 24 19 -29 14 -6 -15 23 24 9 -2 -9 35 25 2 3 21 7 11 28 28 9 10 9 16 39 28
1547 28 1 19 39 16 12 12 33 9 45 25 24 0 -4 26 11 -20 4 19 16 2 24 11 16 -11 4 12 17 -9 20 34 1 -2 12 -3 -6
1582 -6 -1 9 8 14 -16 -26 -1 28 11 5 7 -9 -21 -35 1 -7 12 -2 23 31 3 -3 -3 4 -4 -3 24 39 10 11 20 25 -2 10 47 29 27 30 29 33
1622 33 1 44 49 18 29 -15 14 23 42 2 24 -7 -8 -16 1 36 -6 10 23 -6 11 -18 22 10 -3 19 -19 -4 -3 -12 15 -32 -8
1655 -8 3 13 16 -34 -18 14 4 -13 -16 -17 -20 -47 -7 -22 -8 -33 -21 -5 -11 -46 -25 0 -9 -35 -34 -37 -10 -17 -1 -30 -28 -32 -49 -5 -34 -21
1691 -21 -6 -4 -9 -20 -48 -39 -2 -25 -9 2 -4 -10 -16 19 -6 -23 -18 -6 -3 -5 13 -1 -9 -18 18 23 28 8 7 11 -2 10 3 -1 17 1 15 6 -6
1730 -6 -2 -27 20 14 -6 19 6 15 -8 -21 -12 -9 -6 -24 7 14 -2 3 -15 13 -19 -11 7 37 34 -8 12 -3 -38 -10 -4 8 5 10 -18 -38 -28
$$ packed form
1474a6pK3k1k2K0j1oPpJ0J5lk2J0L5o2J7lM1j2m5M7jJk9K1l8L6NjJk5K3j2M0k4
1510a5K1nK4l5J0j2jRj0NM6j3nm8M3k0rL8Jj5j1pM4j0k3JJ8j4MJ7%j9JjPK3j1
1547B8k7J8K0k3m%K1k4L6k0jk4mL0j5l1K4J5lj4K2j3Nk7J5QNk6K9J4l3lJ4j5l
1582fNJ0jOl0j0K5K9j7oKj6j2j4L6qJ9j4K5Qk8o%PqJK7J5k9JRNk7J2L7j8kLjM
1622C3l2M3Nl1J1m4K9RJ9m0K2l1jqJ7L5m2J6J3k9J7k9M0j2j3K2l8J5JrK7m7K4
1655hJ1J0Ln0J6L2j0j7ljlk7M0j5J4k5J2J6ol5K1K5rk6JlK7pJ6k9Kmj7M4k9J3
1691b1J5Knj1k8RL7k3J6J1oooL5k5j7NJ2LkJ8j4qrL6NNk0jMj3J2pmJ8j6J4rj2
1730fMk5M7ok0K5j3Rk3j3RLLj8L1Pj6Nj8K8l2QJ8L0lm2K0j5l5K8OJ2lNk8k0J0
$$ plain form
1767 -28 -41 17 -3 -3 -3 9 2 7 -24 5 -26 -11 -23 23 -3 -2 -18 12 30 -3 -19 9 28 9 0 21 -8 -14 0 36 27 43 43 16 17
1802 17 42 12 24 36 17 36 34 31 14 45 34 6 17 13 12 17 -23 3 15 7 6 -14 26 12 -32 10 -9 -6 11 -4 33 25 -20 -13 17
1837 17 3 14 -6 -3 -10 -18 1 -1 -25 -45 -22 -16 4 -7 -3 2 -16 -16 -18 -22 -11 -13 -16 11 -11 -14 -24 -5 -3 -25 -8 -14 -14 -31 -23 -31 -11 -7 -4 -11 -11
1878 -11 -18 -29 0 -36 8 -11 10 14 -29 -3 21 -10 -3 -19 11 27 20 -2 33 8 -5 12 1 17 -15 -6 -8 1 -5 9 33 1 -10 -3 -16
1913 -16 37 -10 4 -4 -18 -11 6 -2 -3 5 -22 -12 -4 -13 26 1 -23 -13 -8 -22 -4 -18 -13 -22 -3 10 -2 7 -6 -7 -36 -4 9 -17 -10 -28 -1
1950 -1 -8 -14 -23 7 -11 18 -31 -2 -19 -7 -23 20 11 -2 0 23 -4 0 17 -8 2 -2 4 3 51 16 -11 20 7 -7 11 30 13 2 11 38
1986 38 27 12 21 7 24 10 7 55 14 32 27 31 5 23 57 39 18 -13 19 43 36 17 7 15 -3 23 -3 11 27 5 7 4 -8 -4 -6
2021 -6 30 -1 14 18 -23 -31 -18 17 13 -2 -17 -7 8 0 19 5 21 13 10 -19 21 32 -16 6 4 -21 2 8 5 -12 -20 8 -6 -14 2 17
$$ packed form
1767b8j3N8k0%%J2pNl1K9l1J5j2M6k6Jj6L0J8l3j6K8J9j9rK1k9oJ4L6rJ6%k7J
1802A7K5l0J2J2j9J9klj7L1j1k8J1mjNm0K6J2qjk0M0j4m4M2j9LJ7j5L7qm5PL0
1837A7j4J1k0LpqJ9kk4k0K3OK0j1MNj8%kmJ1klK7k2lj0J9Kk2J7o%j7QqK0MLp%
1878a1pj1K9l6M4j9K1Mm3K6K4l1Pj6L0J6pk2L5k5j3J7j1J6l2RkRoJ4K4l2j1Pj3
1913a6N3m7J4qj4PJ7qjQk7J0QrL9k5k4J0Nj4J8j4NrJ9J3j2Rj3jk9L2J3k6Pj8K7
1950aporL0j8K9m9K9j7J2j6M3rj3KK3k7MJ7k5J0mOjM8l5k7L1j3j4J8J9j7j1RK7
1986C8j1j5Rj4J7j4lM8m1J8nMk6J8L4j8k1l1L2K4pj9j0Qj8K6k6J4J6k2Klj2Mk
2021fL6l1J5Mm1qJ3L5mj5j5J0J5qJ9j4J6qlk9M0J1m8K2kk5K3Olj7qK8j4qJ6J5
$$ plain form
2057 17 -30 15 -21 18 1 -15 -22 7 9 4 -6 14 -2 9 18 6 -3 4 5 2 31 -9 -5 15 16 38 12 13 6 23 8 1 9 25 0 -4 11 -5
2095 -5 5 -6 40 -2 5 -4 4 -2 -22 -10 -20 10 5 -37 -31 -7 -12 16 -33 -21 -31 1 19 6 7 -15 -4 -4 -21 -42 -2 -33 -25 -39 -31 0
2131 0 -28 -44 -27 -9 -6 1 -10 7 -9 7 -17 10 -3 -5 -7 -2 24 -13 11 -1 -45 -35 22 13 -5 35 -2 -3 10 3 -11 36 21 10 22
2166 22 21 6 -24 51 -10 10 3 18 13 32 4 7 8 11 11 22 2 1 23 -10 -2 2 -3 22 7 18 28 14 31 -6 6 22 36 1 -9 2
2202 2 11 1 -4 8 8 7 -9 0 6 -15 -6 2 12 -42 -21 22 -24 10 -13 11 9 -6 9 -16 -9 -12 -3 22 -10 -10 -8 19 10 2 21 6 5 9 -7 -3
2242 -3 0 16 -4 9 0 21 20 -9 -6 -6 2 34 2 -15 19 11 -9 -4 33 0 -9 7 -14 8 12 17 2 10 26 2 13 22 -1 -24 -5 -13 1 4
2280 4 -2 12 -1 3 -21 19 -11 -7 -2 -20 7 -1 -25 0 1 -18 -4 -19 1 -32 -11 -3 -26 -17 -37 -43 -35 -2 -2 5 -10 -7 -23 -6 -12 -16 11 -9
2318 -9 18 -1 1 -23 5 17 -31 11 -11 5 5 0 -37 -1 -5 -14 14 -7 -21 -9 7 -29 -4 0 -19 10 -5 -5 1 15 -9 14 9 -27 0
$$ packed form
2057A7m7M5l6L9j7j6pK9Knj0K0j6J1Rj2rPJlK9m0MK0JK2k6JpJ7j5pQJ6k5mJ5j6
2095eJ0j1M6m2PrQok0J2j0L0nm2OK4nK8m9J2j0L2J8j3Jk2J1%j7k1M0l1Qj4QL1
2131@k8j6J7J8LPj1J7j6J6k4K7j3kkNK6l7K4j2m4J0N7rj8M0l7jJ3pj4M7j5j1J2
2166B2jj5l0P5o1K0pJ5nJ9k8LJL%J1k0jK2l3QMnK5j5J1J0j4J7l7J2J6J4l5j0J1
2202BRj0nJ2%jj6ROk1RQJ0n4K1M3m6L4k3K4kj5J5k5PlRK5l2%KK7rqJ9j5jMj6M
2242cLJ6k0J3rK1jk9L%QL2l2j7L4qk0NL7l3rJ6k1K2MNj5QJ6k4J1Rk3k3J9qJ4L
2280DoJ4j3Mk4M0l0MNj8K7qk4K5Jj9J4j5K0l3K1Qk3Rk0oQL3%Pj5Lj6J7omK7k0
2318iK7j9Kk4K8J2m8M2k2J6%nl7L6mrK8k1j4J2J6l6K5Mj9K9j5%OJ4k4K3nl6K7
$$ plain form
2353 0 12 11 0 10 -12 -22 -14 -1 20 48 -2 -10 44 14 -14 -9 -8 11 -38 3 44 -13 -1 19 5 5 13 12 -12 -2 4 44 17 4 5 23
2389 23 -3 -13 10 -7 -3 -53 -14 -17 -16 -11 -11 14 -4 7 -6 -4 -9 13 -3 -29 5 -20 -2 -12 -17 -15 11 -7 11 24 4 -15 13 8 7 3
2425 3 21 29 3 17 19 9 17 -16 0 4 -12 31 -3 16 0 -16 -17 28 -18 29 14 5 -6 24 7 -2 18 13 23 10 -14 -3 40 7 10
2460 10 6 -5 -12 12 10 -7 -20 16 4 14 9 -17 -18 -2 21 -4 -7 17 9 33 -7 2 8 -18 -7 5 2 -25 -5 -15 -23 -13 -24 -5 -15 -21
2496 -21 15 -5 2 -18 -17 -4 -3 -20 -16 11 1 -4 -4 -1 -1 29 11 -7 5 15 -4 18 11 10 15 22 -3 10 15 7 23 -29 15 23 15 2 0 5 13 1
2536 1 -28 -13 22 -11 -2 -10 -22 42 -5 -10 7 -8 22 -1 24 -9 -15 -25 -16 18 4 14 29 5 15 -11 20 -13 -5 -7 -14 26 3 17 31
2571 31 -21 -16 6 -12 22 -1 16 -17 9 -29 -12 10 -5 9 -18 -15 11 13 -1 -11 -11 -7 -20 20 -13 -19 -6 9 1 -3 -8 -6 -15 -22 14 1
2607 1 9 -39 -1 -3 42 9 3 -11 42 -4 7 10 -7 21 2 6 -2 -1 17 -2 -18 2 -27 14 0 13 -14 31 -2 1 21 5 -8 7 5
$$ packed form
2353@J2jj1J0k2j0QJ3K1K8n0qN4l0k8NJJ9m9M1M1n7J2K0j4%Qjk4J0OM0k7j3JJ8
2389B3k6j0K3j7Mn0L9lJN%K5j8J1j3KnK2j6k6L4k5J8j0nKK6j8J8J3k0j9K8njm
2425CJ8Qk6J4Kj0Ql3J6Mj6M3l4J9j6j6jM5m6M7j5rj1L0j7rK0nJ0j3k4J1M3l3L
2460A0mj1pK4kj7j3L6j2J0nk6jJ6K3k5lK4qK4m0ROk6J1J2lk7K0j0qJ0j1J9j0o
2496b1L6k0Pk0JJ3Jj7MK7j0n%L%L0j8j8J2J0j9K2pjNPk5J3NqJ6n2M4Qqj3kNQj2
2536Ak9J5L5l3Rqj2O4m7nJ7j5L0k3K5l3oj0RL4j4J0J5k4J0k6L1l3QkpM0k3J4J4
2571C1n2NK2j8L4k3J7l3K6l8J7K2j5J4k7LK6Kj4j0%Mj3M0l3oJ3J5qmnKrpL6j3
2607AQm8L8kM5l3oj4N3m6J1Lj7K8j9MqJJ8j9j6K0k9M1j4J3k7M5l3LK0j6j3J5k
$$ plain form
2642 5 4 -1 8 -28 -20 38 0 -27 32 13 -4 -22 -7 -4 15 17 -7 -5 15 -7 12 -8 -6 -28 27 -16 -3 23 7 6 -24 10 -9 19 -13
2677 -13 -1 -28 -12 -15 -10 9 -11 -46 -16 -6 -16 -22 14 -36 -2 15 -22 -8 -23 -1 -16 7 14 -7 2 25 -12 14 16 10 -9 20 12 8 -2
2712 -2 -39 10 -13 27 -12 -6 23 4 18 6 -11 23 -15 25 -10 -9 6 12 4 6 -38 -11 -31 3 7 -7 14 -16 4 -13 -7 -22 -39 -14
2746 -14 -14 -9 -4 -7 -14 -10 17 1 -25 0 12 2 7 5 -7 14 23 2 13 6 14 -29 -31 -13 -6 -18 20 4 15 0 4 30 -11 16 -39 13 8 -2
2784 -2 -8 24 10 -20 15 -9 -10 -26 -6 -18 -5 14 -1 3 -29 9 -6 -3 21 0 37 -27 -2 -5 22 -17 29 -17 -20 2 25 22 6 41
2818 41 8 9 -17 14 13 19 -9 0 9 36 -6 1 0 6 3 34 7 -23 10 -1 16 -3 -20 -18 -9 -4 8 1 10 -1 2 -15 7 -6 -21 10 -1 -1
2856 -1 11 10 17 8 -21 -1 -9 17 -5 12 -6 7 -4 -3 7 25 -11 6 -4 0 -28 21 -11 11 -11 -44 -44 -50 15 -19 14 23 -28 -11 0
2891 0 -15 38 28 -5 5 10 -11 -23 6 22 -24 22 49 -4 12 51 54 46 10 -27 20 -7 25 -20 -15 -8 -12 4 -12 -18 18 2 2 -30 -10
$$ packed form
2642EjnRl6QN8l8k7N9j9j7j8J5LJ9Kk4KK0k2J9k0Kk2N5m3J3K6j6jl0L4j9K8l2
2677a3J2k7J6lNJ9k0l5L0J0j0oL6n0L4J7l7J4j5K2j5K3Pk1RK3l7K6Koj9K9qmj0
2712bl7M9k3M0l9OK9j9J4j2j7L4l8M0l5JJ5OqKm4K7k0L4Mj4K1l0K0j7Oj5j7K5
2746a4%NNlpMK7j6k6K5J2j0Nkj2K1Rk1J1pQm3kJ8Pj2L8j6J1j5MK6m1K7n5N2nj0
2784boL2j4l0L5k4jj6K0j2J3J9j5Ml2L8j5LK4k1L7o4K5lK7l9M6m6lK2K3lj6L5
2818D1l3Jk6L1jOk8RRK7m2PjOlL1k7l0L3j1J7j9j7KRNJ2pRj1Lj7K2j3j5L1j1%
2856aJ2jPrk9K0qK6k2J7j8J3j1JJ0J8l6J7j0Mk8M9l2K2k2l3%oO5l4L3Rn1J7J1
2891@j5N3j0l3J0Nk1j2K9J6m6M6K7n3J6L9Lql6l7M7k7L2m5NPmJ6j6oL6j6%l2K0
$$ plain form
2926 -10 10 -67 -4 -11 -2 26 -1 3 -27 -11 -19 -1 26 -22 -13 -12 12 -8 -33 7 -36 18 -38 -15 0 35 50 -7 -25 -32 6 56 -2 -23
2960 -23 44 18 -5 -26 -15 2 -41 -8 22 -20 36 -3 18 9 -33 0 -36 5 26 -6 51 18 21 36 -42 19 49 39 16 -29 -16
2991 -16 1 9 38 16 27 -8 -24 6 -38 -1 -10 22 -21 -3 -1 -42 23 55 47 18 42 3 22 -12 -1 3 -19 -26 57 -7 -23 26 1
3024 1 -2 1 32 -34 16 -28 54 26 21 6 -7 -44 -11 9 -26 25 -11 5 3 7 5 -49 -16 -1 20 17 6 6 -20 -3 33 9 2 63 -14
3059 -14 0 6 -20 24 -8 1 13 8 -2 -18 25 -7 19 24 18 12 4 -37 -7 -21 8 24 -16 -33 -20 -41 64 -1 -53 -2 -25 -2 13
3092 13 7 -20 32 43 -1 -8 15 10 -12 1 25 23 22 -38 12 31 -13 2 -17 -3 -4 -17 -1 -18 1 -2 -15 -34 15 14 18 13 -9 -52 17
3127 17 61 -13 -9 5 66 34 -14 8 -24 -17 6 7 12 -7 -16 11 9 -9 32 10 -28 -19 -6 22 38 -23 42 -5 11 21 0 -9 -13 14 20
3162 20 -20 17 -27 -8 24 -37 -1 21 63 6 21 9 -37 -20 36 0 12 27 12 2 19 4 40 20 -4 -1 28 18 29 32 -8
$$ packed form
2926a0K0p7O3pRK8k7Ml0J6qJ8K7m8RJK4k0k5M0m3N4n6K3J5L5J5n7j8pL8N0n8k1
2960b3O7k6k3k1J1J7m3L3L0m2N6l9K1rm2L3l6M1K1l2N7l3LJ5p8O1L0j0k3m5J3
2991a6J7QK9k2J1l5j6L0m4L7rL2m3J8Km1O5L2qk9K4l9J9l4J1Mk2pQ3o4j6M9k5
3024AlLL1o6N0m4Q2k8nj5j3l7L3K0l5N1l6J6kMkn4L3J5K1lj1%k6J7L6k4pO1p7
3059a4J4Ok6M4l2RJ2nj0j6M3l2K6Nooqm1L0j4K9J6m0j7J3k1J05o5n2N1k3K3J5
3092A3ok7N2J1m4pK3nk2J3K4kjo0N0J9m4J5j9J4jj3J6j7J9lj3j9M9jMnk2m3O9
3127A7M4p4MJ4O1l2m8K2l2PK3JNj9rK7kj8M1k2l8RJ3K8J6o1O5m7J6J0k1rmK7O
3162B0m0L7m4J9L2o1L6K2M2n7J5j2m6J7N6l6J2J5j5j0J7j5L6k0k4LK9j0J1Lm0
$$ plain form
3193 -8 10 -6 -2 34 47 -19 -8 -13 11 20 -27 -53 -4 -2 6 30 -5 -30 -8 5 1 -13 -8 31 -12 -31 11 17 5 -25 -11 5 -4 -11 9 22
3229 22 45 -12 20 18 -14 -5 25 -15 -8 27 11 15 15 9 15 7 -14 8 3 41 9 31 17 11 -4 11 -23 15 -29 -13 13 -7 -15 -11 -6 7 20
3266 20 20 -1 5 2 -5 6 -15 8 -34 -9 13 -12 -18 35 35 69 -13 2 20 41 14 -2 38 7 -9 -4 -3 -5 1 6 -12 1 18 -70 -17 2
3302 2 16 17 -12 0 11 -9 -11 20 23 1 -20 9 11 -9 20 26 -10 13 -27 14 -4 19 -6 17 4 -13 5 -12 8 10 14 12 16 18 -17 11
3338 11 23 -24 7 -26 -24 3 -44 35 -4 -7 -15 -3 39 27 -30 -24 -25 2 -16 -4 -42 6 21 0 -39 -27 16 35 -12 -34 41 8 12
3371 12 -42 -47 23 -12 16 -3 -65 -8 -18 15 -12 13 -11 14 19 2 25 -9 13 -10 21 -9 6 0 -38 8 -3 -4 -12 30 -39 12 66
3404 66 5 38 -22 -38 -22 -15 -13 30 -3 -16 53 29 11 7 -18 81 10 -4 39 43 -26 46 14 11 -11 -42 18 -10 -16 32 -13 -2 18
3437 18 0 42 17 -65 -16 -48 10 -19 -24 2 11 -4 -21 -8 10 43 18 39 -20 -19 36 6 12 2 10 18 -2 68 -27 24 -11 3 5 0
$$ packed form
3193hJ8j6ML6J3o6J1nK4Rm7k6M9KQK4l5k5K2J3mj4NL9m3j9M2Oj2l0J4J6rpK0J3
3229B2K3n7L2kl2RL0m0PL5j6M%oOqk1K2nL8l2K2j4oj5J5l4L8m4J6K6k0qMNJ3J3
3266B0%k1OlpJ1k1K3m2K5K2k5oN3%L4q2J5J8K1k7j6M0l1j6NJkONj8J3J7q8N3J9
3302BJ4Jk9J2J1k0kL1Lk2k1K9Kk0K9Ol6K3m0M1j8K3k5K3j3j7J8j7K0KMkMKl5K8
3338A1J2m7L1l3KK7m7P9l9lqJ2M2j2n7OjK7j8J2l8M8J5k1l9J2M3J9m7k2P5l3M
3371A2n4nP0l5K8j9o2N7j0L3k7K5k4K5Nj7K3l4K2k3L1l0J5ol8M6j1jqM2o9N1N4
3404F6o1L3o0j6J6PKM3l3j3O9k4j8mk5R9p1j4M3Mo9P2l2lk2l1O0k8oM8m5J1K0
3437A8j8M2k5q2M9l2N8k9nK6Rj5j7J3J8L3k5K1n9JN5l0Oj0QQk0P0r5N1l5J4Kn
$$ plain form
3471 0 35 7 4 22 28 -22 -14 2 -12 -10 -23 31 -9 4 80 -9 -6 -13 -24 -2 -56 -15 -17 60 46 31 -60 48 25 48 -33 37 2 30
3505 30 23 -14 31 -55 -36 48 -1 -5 -1 -93 10 -5 12 -25 33 24 32 111 51 -83 17 -8 17 -1 38 -85 -33 47 35 -25 -46
3536 -46 -57 -41 54 57 32 -19 -64 7 76 -18 14 -55 -65 -33 -9 15 8 127 -61 -36 -8 22 38 -11 2 61 -85 8 14 -66
3566 -66 44 43 -69 45 -18 -34 -8 -48 -45 -35 78 20 116 -59 23 30 -56 121 49 42 -56 -60 -3 9 -7 -46 -44 -81 10 -88
3596 -88 38 8 48 3 15 9 -16 63 -4 -18 -3 22 0 -54 45 115 -14 6 2 5 -47 29 27 -43 95 33 12 -23 -44 -24 -65
3627 -65 58 -49 -5 49 -24 -19 135 32 14 -37 -37 4 -52 21 -22 71 -59 47 -42 -17 36 35 19 45 -16 -12 133 49 12
3656 12 -79 -75 30 79 -17 65 -11 -41 -40 26 9 13 53 34 3 24 4 -47 -23 25 11 11 -48 -19 -7 -14 -11 14 10 -33 -18 31 10
3689 10 45 -13 25 38 43 -4 -19 30 23 9 0 0 12 3 24 -16 -2 -34 21 -16 -12 5 48 18 15 32 -18 -32 8 26 12 -14 34 52
$$ packed form
3471@L5k8lJ8On0QJ6j4Kj3N4m0J3P6q9Lpj1K2n4M1kP7j4j5r1J08k3K3q1P0l5K8
3505C0pl7M5q6J9Q4m9mMr2J03j5J7l7N8rQP9o0j34J00k5K5j8L9j23N2Q0j2o0k1
3536d6j1J6R5Lk5n1m5P1O9r4L2o9j0L2K4K4pJ19j88K5K8L0J6m9J3N9j46R3Oq0
3566f6J10jj12J14o3j6K6m0LJ0J13n8R6j75Q2Pq6J77p2pr8mN7J2j6l9Kl7R1r8
3596h8J26l0M0m5J2ok5P9o7j4J5K5k2n4R9P0j29K0mLn2P6kp0J38o2k1l5k1K0m1
3627f5J23j07M4N4p3NJ54j03j8n1%M1n6P3m3R3j30J06q9K5N3jj6K6o1MJ45q4l7
3656A2r1MJ05M9r6Q2p6l0JO6j7MM0j9l1K1k0n1K4M8j4%n9K9J2pLK5mm3J5M9k1
3689A0L5n8L8J3Nm7j5M9pj4r%J2rK1m0J4l2N5l7MJ7M3l0lJ7n0j4M0J8j4k6M8J8
$$ plain form
3723 52 8 -5 -11 37 -36 38 7 1 8 65 -2 -27 -8 -27 -45 -46 -17 -13 22 -20 21 20 -26 -5 -11 55 -1 38 -32 -1 -30 14 -22 -4
3757 -4 6 -20 9 -37 -25 25 -22 42 10 6 -10 -16 20 29 14 -32 -13 4 30 -31 -8 15 -6 -16 -48 -56 4 -13 1 -7 -28 -25 13 -1
3791 -1 36 -20 4 38 -7 6 21 -1 48 7 34 -32 -16 -37 5 24 6 -47 -13 60 -18 -5 9 7 98 -49 17 22 20 -91 -34
3822 -34 20 -31 10 -29 -11 -24 22 13 3 0 32 8 -30 2 6 -12 53 13 2 -6 15 -6 -3 6 38 27 -6 -5 13 20 9 -16 22 43
3856 43 -9 16 -23 22 -12 -11 13 28 4 -21 10 8 11 -5 9 3 14 20 39 50 -19 20 -22 4 11 19 14 -34 -4 -24 -40 39 -59 18
3890 18 -17 6 70 -13 -76 24 -18 22 66 6 17 95 7 -58 38 -99 31 108 26 12 -28 22 -1 -26 51 10 -52 49
3918 49 -56 -75 38 9 44 -2 14 -1 43 -36 31 -41 -17 -26 -69 -32 -19 -25 20 -65 38 21 28 -3 3 -79 -2 -8 26 48 61
3949 61 -21 -28 77 3 30 33 14 44 -7 -15 2 -36 14 -41 -30 -38 26 47 -14 -10 -4 -15 7 -14 -13 -39 -26 -1 -26 -16 77 -2 -72
$$ packed form
3723E2m4j3oM8p3P4l1oPN7o7k5J9j9j8jK9ML5m2M1jm6K1oO6n6L9p0L1k9M4l6J8
3757dJ0k6K9m6J2N0m7O4l2mj6oL6Rj5m6J9J7K6o1K3K3k1j0l2qO0j7J4qk1LL8j4
3791aL7n6K4L4m5J3J5k2M9m1K7o6J6k1M2J9j8n3L4P3p8J3J4kR1j47O6Nkj11N7
3822c4N4n1M1l9J8j3M6rj0lL2k4l8L2Mj8O5m0j1qK1k1LRL2j1l3JJ8Pj1k5L8K1
3856D3n2K5l9M5l4JK4J5k4k5L1kLj6J4oJ1OJ9J1o9L9m2K6PQnm8L0k0j6P9r8P7
3890A8l5K3O4q3o3J00m2M0M4o0J1P8q8o5R6j37J30P7q2j4m0N0k3k5P7m1o2J01
3918D9j05j9J13k9L5m6J6j5M4p9O7p2K4rm3L7J3oM5q5J03j7Pl1Oq2P7oL4K2J3
3949F1q2pJ05p4K7Lj9L0n1qJ7l8N0n5J1qO4K1o1MOj1K2k1Jk6J3K5k5J0R3p9p0
$$ plain form
3982 -72 -33 51 66 14 -36 -1 -46 89 28 -31 18 17 29 -9 7 -1 11 13 -36 67 5 -48 38 47 -5 39 -46 -36 -1 -63 -60 -50
4014 -50 14 3 -61 38 12 -8 0 9 -17 -17 -8 -1 48 30 -56 -7 35 21 -19 -31 -38 -10 0 -6 2 -43 12 -1 -22 0 47 -32 83 -27
4048 -27 -3 -9 4 -8 11 -107 -51 -13 21 -27 4 6 22 -9 -63 -88 -25 -33 -25 -7 4 -1 -30 27 22 -35 -3 -7 26 77 10 25 0
4081 0 26 8 34 -12 -50 37 -15 49 14 -12 55 58 4 3 58 16 70 -30 19 -23 17 68 13 -16 31 -12 10 0 18 14 -5 11
4113 11 32 -21 3 -9 -20 2 -21 -20 -7 -28 1 -8 1 15 10 2 -18 11 -1 -5 -40 13 25 12 29 6 1 4 18 0 16 11 1 20 50
4148 50 21 6 6 23 -13 9 15 8 -6 3 5 0 12 3 -17 -1 -4 0 10 22 2 -5 6 -19 20 -4 -17 11 20 9 -1 15 3 1 9 18 29
4185 29 29 -4 30 -3 -3 5 25 15 21 7 -17 -6 13 4 -10 11 -13 4 -14 -5 5 -1 -21 -15 -1 2 3 -16 -2 -16 -33 9 -4 7 -24
4220 -24 -20 -5 -30 -30 3 -19 -15 4 9 21 -13 2 5 32 -16 -4 -12 17 -3 44 24 22 12 -24 -11 -2 -21 20 -10 9 11 8 -12 -2 11
$$ packed form
3982g2L9Q4J5n2n0L5m5J35o1n9M9jJ2l8J6qJ2Km9J03o2n3Q6Rn2M4q5J0L5o2LJ0
4014e0O4j1o4R9k6k0QRk6%RPM9j8q6M9M2j4m0j2pK8J0oQm5N5j3k1K2M7p9J15j10
4048b7K4oJ3j2J9j18N6L8L4m8L1KJ6l1n4k5O3qQJ8J1nk9N7nn7L2mL3N1o7J5k5
4081@K6j8K6m6l8Q7n2O4l5k6O7Ln4jN5m2N4j00M9m2M0N1n5k9M7m3K2j0J8mj9J6
4113A1K1n3K4j2j1K2k3JJ3k1K9rRJ4nqk0K9j2ml5N3J2j3J7k3nLJ4j8J6nj0J9L0
4148E0k9j5%J7l6K2Opj4RKnJ2rk0J6lMJ0J2k0pJ1k5L9k4j3K8Rj1j0J6j2kQRJ1
4185B9%l3L4l3%QK0j0Oj4k4J1J9rj4K1k4J7j8RJ0ok0OJ4LJj9J4j4j7M2j3J1l1
4220b4MJ5k5%L3k2MJ9NJ2l4J5LK7m8J2qK9k0M7k0kj0l6J3Rj9M1l0J9Klk0J0J3
$$ plain form
4255 11 6 31 10 -17 15 10 2 1 -1 4 -3 -2 -13 14 -15 21 -6 12 5 3 -7 -21 10 27 5 -15 -28 35 -15 10 -10 13 21 23 -9 12
4291 12 -11 23 18 -31 9 -16 4 2 -9 -2 29 5 -21 18 10 -1 -1 12 8 -7 1 8 -21 -10 14 -9 -17 -9 -1 2 5 5 -3 4 -8 8 23 3
4329 3 -7 -8 0 -13 -1 9 7 -3 34 42 -4 6 -4 2 8 17 22 0 23 28 23 11 -5 3 0 39 -26 -18 -14 6 -3 19 -23 -3 35 7 -19 14
4367 14 -11 -17 -5 -17 41 -8 -13 22 -8 12 0 -20 23 20 -11 12 6 40 -26 -7 17 3 -16 -11 15 13 -7 -3 44 8 18 -27 27 -9
4401 -9 -6 -5 -20 -17 -50 10 -19 7 -7 -5 -27 12 33 -22 11 8 -7 29 -10 1 -29 -16 -14 0 26 8 -4 38 3 14 11 33 26 6 24
4436 24 33 6 -15 18 -12 -16 -4 -2 -5 -6 1 31 -10 18 -14 -6 13 -5 3 -6 9 -8 -18 -22 -9 -20 -4 -7 -24 1 51 -53 11 -21 3
4471 3 15 5 43 -14 -3 -26 -16 -5 1 3 6 3 10 18 10 -35 9 -26 5 -10 11 -11 -16 9 -9 -5 -13 1 19 19 12 2 11 -3 -33 19 22 -8
4509 -8 -22 19 5 9 -9 9 -12 1 -4 -9 -24 15 -1 -1 -7 2 9 25 30 13 46 40 11 -2 35 7 -6 24 -4 5 6 -11 -4 -19 18 9 -11
$$ packed form
4255A1nK5k1k7L2nqjkNpJj1K7k9L6k7J8pkj0j4L1J7k2k0j3O3n0K5k0K3QKl2K1
4291A2k3L4nm9M0k5K0kj1PL1k4k6L9qj1%J3mj5QPk9J1K4k3qQQLL%qPj2J6J5k0
4329Cj0jQj3J2J0kj0L7Qm6J0j0OORNk2K3Nnj2j6QlL9o5QMK0rK2m2K0L8k8k6L3
4367A4k5oJ2j2N8m9nL5l0K0j2k0M3ll1K3oL4o6J9K4j4j9NK6kk0MM7l6J0m5N4l6
4401iLJj5Ll3O0k9K6j4Kk2L9K1n5L3lj5L6l9J1l0J3KJ4K6j8j2M2l5J1lK2pk0J8
4436B4Rk7k1L3l0mJ2KljPL0m1K8l2QJ9j8QrJ5j7j0mJ3j1J6lj7K5N0j04O4l2K4
4471CJ2j0L8n7J1k3J0J1OKLlPQqm5M4l5L1j5K1k2nK5j8MqJ4J8%pj0Rj4l0N2Ll0
4509hj4M1j4Mj8J8k1J3nnj5L9j6%oRPJ6Nj7L3ok9j3L7k8j3L0k8RJj7Pj5L7rk0
$$ plain form
4546 -11 6 -19 -5 -26 20 27 -10 -15 -9 -4 -8 -11 -26 -7 2 2 24 12 -4 -11 -1 -17 7 -32 -2 14 1 13 -28 -5 2 29 30 -2 12 8
4582 8 -5 -3 4 15 -7 6 -8 -6 12 34 16 -25 -25 14 18 9 -3 4 -21 10 23 -31 -30 26 0 -24 10 -1 -34 -32 -10 22 23 -3 -12 -4 18
4619 18 6 -5 6 -40 -2 15 26 -36 0 32 12 -13 -7 -4 -16 -8 14 30 22 -37 -29 -32 12 -1 -4 -31 -16 -2 -15 31 5 -13 -62 1
4653 1 -15 14 -2 28 43 25 -4 3 6 5 -53 63 44 81 -10 41 -43 13 -2 -18 -11 -67 4 13 52 -24 -18 11 -25 -9 3 -21 -32
4686 -32 6 27 9 -1 50 10 14 -35 3 45 -71 3 -1 -29 -34 -7 2 57 23 -13 -30 31 -21 11 -36 -11 13 22 39 -19 11 30
4718 30 78 -17 -25 47 -17 36 -7 38 -40 4 13 13 59 -66 31 -6 -51 8 -28 44 -14 11 -14 -14 -31 39 31 -46 6 -76 -21 17
4750 17 113 3 -3 -33 29 -14 -68 -23 -19 -9 -5 6 28 -20 45 23 23 -36 40 -50 46 75 15 24 1 3 35 4 2 -36 3 7 -20 6
4784 6 -12 -15 19 -6 46 -14 -16 -50 44 24 -14 37 74 -42 19 4 31 0 6 5 22 -7 -42 9 32 52 18 -2 31 17 -22 -24 19
$$ packed form
4546a1J7k5J4k1M6Pl7nONmlj5J9R%K2j2j6pJ0j6K4l9L0J6j3J2m1K3PK7Jl2J4m
4582Hj3KPJ1k2J3j4KJ8K2j8m1%L9Mrj2Pk5L1J3n4JN6k6k4L4j1l3KK2L2Jk6rQK2
4619A8j2j1J1m6L8J7J1o2L6L2k0k5OLj2QK2J6qn9QlM4j3lk7J5J4j3M6k6j8m9O3
4653Aj6K9j6L0J5j8k9PLjn8J16j9L7r1N1q4N6j5j6Pn6P1RL9p6OK9l6J6J2k4j1
4686c2L8K1j8j0N1m0Mm9L8M2j16P4mk8nK7RN5l4l6j7O1n2L2m7K5K4RJ7n8L0J9
4718C0M8r5qP2o4N3m3M5p8M4R%M6j25R7l7m5N9l6P2n8K5k5%j7P0qp7N2q2N5L8
4750A7R6j10ol0O2m3n4M5MJ0MJ1K2m8O5k2%n9P6r0R6K9o0Rk3KL2l1kl8L9Mk7K6
4784Fj8lL4k5N2o0kl4R4k0l8N1L7j16O1j5K7l1OjJ7k9l5N1K3K0l4k0L3j4l9kM3
$$ plain form
4817 19 56 -33 17 1 -10 14 -11 3 25 -11 18 -23 29 22 -41 27 -21 32 -47 36 66 -15 18 -37 -21 -1 -24 -34 11 -1 0
4848 0 20 -3 40 89 35 -14 27 41 28 15 -38 31 -34 12 -9 2 14 24 20 6 37 9 -21 -4 8 7 20 2 13 -24 8 -30
4880 -30 6 11 -26 -17 1 -3 -8 32 -5 18 19 18 -15 -2 -11 -22 10 -13 -25 10 -53 23 42 -26 70 -29 4 -29 10 13 23 15 25 -16 11
4915 11 24 6 -68 0 -17 25 16 -3 -16 0 40 6 -14 -18 -17 28 -40 -56 -38 -41 -1 12 -24 -32 -55 13 -30 15 -41 -24 -34 -19 14
4948 14 13 22 50 88 5 -28 -17 40 -1 57 49 13 -29 31 30 24 9 30 -7 40 51 -36 -5 -32 -39 -82 3 7 -17 6 24 37 -36 -44
4982 -44 47 -13 47 -9 24 21 28 -7 41 -13 -15 21 47 47 3 -15 77 -19 -38 120 -15 -9 8 -19 -4 40 -20 41 33 -25 -5 2 74
5015 74 75 19 -19 -13 39 6 -8 -75 -36 13 -34 -5 31 53 -30 -11 38 -3 -47 -52 -2 -51 -32 -33 -32 -38 33 46 -4 29 -140 16
5047 16 54 -24 24 5 -26 -108 34 -68 -84 -83 8 4 155 41 86 114 -20 -11 21 -22 51 -86 60 35 13 -79 32 47
$$ packed form
4817A9L7q9N0j6j1K4k5J4K2l6K9m1N2po3O8m8N3p9Q3L0q1L3n5J6K0k3j0M5j2J
4848@K0k3M3M9n4m9M1J4j3j3n3O9o5M6k1J1J2J0mj4L1k8l0J7J2jJ3j8J1l7L2l8
4880c0L6Nl7RJ8mnM0l7K3Jjl3J3rj1L2k3j2L5o3P6J9o8R6r9L3l3L9LJ0qJ0m1K7
4915A1J3j8p4O8j7M2rj9j3J6M0l4k0mJM5o8j6J8lM0J3l6qk3O8m3M5n6J7j0J5L3
4948A4jRK8L8q3l3J1N7m1N8ql6m2O0joj5K1l7M7J1q7L1k7pm3Q5Mk4K3J8J3p3q
4982d4R1o0O0n6L3lPl5M8n4kL6K6%m4j8R2r6j9J58j35OJ7k7J5M4o0O1qn8K0PP2
5015G4Jn6l8ON2l3j4o7L9M9m7K9L6K2q3J9M9m1m4nN0m9J9jJoP1J3n0L3j69J56
5047A6L8p8M8j9l1q2J42j02j6JR1mJ51j14M5K8j34RL2m3P3j37J46k5k2r2J11J5
$$ plain form
5075 47 -56 -3 -20 42 22 47 -64 -29 -29 19 -39 -2 16 76 86 -5 -40 -46 33 11 -10 78 48 -30 7 54 -45 46 0 -35
5105 -35 73 -43 6 -13 82 -60 6 34 18 24 0 4 31 -10 -16 137 56 -1 61 -16 33 26 -57 -8 -8 15 -24 11 -78 54
5135 54 30 -77 -34 24 7 -13 -27 34 35 12 59 143 -58 34 68 -7 -44 3 -1 -33 79 -36 57 -65 -83 54 -10 1
5163 1 -71 -16 65 -36 -3 33 8 -76 -64 -12 61 -42 34 -29 -18 -110 -102 -12 -49 -16 77 -20 -151 43 -51 24 100 -67 -95
5192 -95 56 -35 4 63 25 12 -174 33 -16 -11 -38 -30 -82 -17 2 -95 -7 55 57 52 -96 -8 39 28 37 -3 69 12 60 15 2
5223 2 -6 20 124 20 -15 9 -34 -3 -102 -29 -60 29 88 -38 66 -29 -32 0 2 -33 -6 99 20 11 -132 15 -17 72 145
5252 145 -40 34 -93 -7 -82 13 52 -21 -29 11 90 46 -31 -1 -30 -22 -25 -12 -6 12 12 10 -52 -27 -69 29 31 -14 -23 69 -16 -90 59
5285 59 -76 2 41 63 0 18 -4 32 73 107 16 0 29 30 3 119 -38 9 117 10 53 38 67 140 15 -43 -17 98
$$ packed form
5075D7j03N3j7O2k0K5j11L5%M8n8L7J8O0J0r1l5oP9k2k1Q8l0p8L7M7r9R1m6l5
5105c5J08j16M9j9R5j42O6K8j6Ok4MK7m1oJ53q1n7O2p7M9pq3M9%K3l9L5q9J32
5135E4k4j07M3N8j7k0j4O1Jk3M7Q4k01R2L4p5l7M7ml2J12j15R3j22j8J37o4J1
5163Ap2N5Q1j01L3L6k5q4J2N2P3j03P6o3J1r2QR0l7L3R3r7j31J94r4P5P6j67k8
5192i5J51r1L9N9l8j3j86K07m9Nk7Qn2O5J9r7Q8O2Knj48Q8M7j1Rm0P2n7M8m5j3
5223BqK6J04j04l5K4m3L1r9P3l1Q9N9j26J04r5lL2Kl5K7J05p9rj43J47l2Q9P3
5252A45j85P4j27Q6p5R5L9p3qM0P9m4p7L0k9QlJ3OJ8%ko2K5m2R8Km5rR2q5p4J49
5285E9j35P8L9K2o3J8k2L6M1L4r1j6K9Jk7J16j57M7J08j07M3j5K9P3j25n8K6J15
$$ plain form
5313 98 15 -23 14 -45 -7 65 -46 -42 78 114 55 -27 -39 11 -26 25 71 31 -68 -36 20 0 13 -22 19 -40 -65 86 26
5342 26 16 41 -1 -32 -68 -42 -27 -89 53 20 -28 -69 -89 22 42 -69 -22 29 11 -21 5 -75 -102 69 -55 -178 13
5369 13 4 -1 86 12 56 8 -11 -62 10 -132 -8 -32 -44 105 85 -62 9 46 -20 -58 42 -46 10 0 -77 119 61 -13
5397 -13 41 7 -44 93 -38 51 8 -17 -54 -137 56 -115 17 -99 -98 62 17 9 -11 -13 33 32 70 -56 -29 -74 4 -80
5425 -80 14 34 46 63 -58 67 -21 -17 20 -9 -52 7 16 -20 -138 34 46 -103 -70 -11 76 -102 1 11 9 56 -159 -98
5453 -98 -100 26 -61 95 43 52 -21 -90 15 -62 -65 64 60 -16 23 33 -125 79 -8 -97 57 2 -2 -24 -124 -48 -57 73 -82
5482 -82 -20 -81 79 -16 -2 48 61 106 -18 95 65 -18 117 35 46 -15 15 -79 71 31 -28 15 -130 74 40 -34 0
5509 0 -82 116 90 4 -84 -37 -102 -81 21 -35 36 -56 -7 99 1 29 -38 -125 44 32 64 88 106 9 -59 12 29 -12 57
$$ packed form
5313I8q3l8L7n9L8P2j11MJ20L6n9q2j2N0l7N1M6m0r9L2N6k0J3l5M1n9k5J51o0
5342B6j0K5m2l1l6K6J5o2J42l3m8m1k0J11K0j11M7N1j8l2K6q0k7J71j24j23J91
5369A3rnQ7p4M4m8j9n1P2j42J24k4j2J49k0j47P1L7o6l8J00q8N6j0p7J96n8p4
5397a3N4l4n1J37j31Q9m3k5l7q3J93j71J32j16JJ60m5qk0kM6jL8j26K7m5P8q4
5425h0R4K0J2J7j21J25q8ML7k9m3N9Rl6j18J72J2j49L3N9Q7j78J03J0kM7k15O1
5453i8kJ26q7J56n2Rp3o9J05p7lJ29mp6L9J0j58K04q7q9J54n5mk2j00P6rJ30j55
5482h2O2o1J60r5J4N0J3M5j24J13l0q3J35q2J1o1L0r4J50m0n9M3j45K04l4p4L4
5509@q2J98k6q6q8M7o5K1J02n6P1r2M9J06r8K8o7q7J69j2L2K4J8r7o8P1J7m1O9
$$ plain form
5538 57 49 -53 35 16 -70 -27 108 8 -76 54 -54 50 -66 -54 -55 30 -88 -65 -107 -53 41 -45 -39 -43 -116 26 26 89
5566 89 187 -84 8 -8 -32 -34 71 31 59 50 17 169 -53 -35 11 78 0 24 39 -16 -50 -50 -40 93 2 33 -17 -34 -88
5595 -88 -47 50 -74 21 80 25 18 125 -53 -28 -23 52 -52 37 -7 25 34 -10 -15 -84 19 48 72 0 10 31 64 128 -58
5624 -58 10 -10 12 -72 68 -38 7 115 -33 115 59 -52 8 -14 19 -23 1 -48 -2 -56 87 -65 86 34 -37 -36
5650 -36 43 -97 22 -39 54 8 24 60 15 -47 -51 55 1 11 -32 -82 10 1 27 62 46 10 20 37 102 -6 -15 55 9 87
5680 87 -10 -56 -9 -59 -15 -12 -1 -24 21 10 -33 -73 65 -112 -15 38 -152 -87 -23 -8 46 -13 -70 -135 52 -17 -18 -14 20 5
5710 5 100 -52 -100 -72 4 32 -40 64 9 -65 -153 128 87 -1 93 86 29 90 17 -72 -13 48 37 -66 24 59 -26 13 -54
5739 -54 -57 30 119 -28 -58 36 -104 34 68 12 24 7 57 46 68 -48 -20 2 54 36 -42 49 77 155 2 -110 0
$$ packed form
5538E7qj02Q8j9q6M3J35j00q4J30j08J04j16J2jQ5j18K3m2N4R4q6Omp3J42%O3
5566H9R8k71R2j6k4kJ05m0K8rl3J52k22J8M6O7p8K4J5n5l4%J0J33r1L1n0j7n4
5595h8M1R7j24R5N9n5pJ07j78K5NP5j04Q9m4L2Rm4no9J03K9K4p2J0K1L3O4j86
5624e8O8k0K2q4J40j06M5J08j48J48n6j11O0k2L3m2K4m9M6n4J43j52J51n2p1J
5650c6P9j40J19o1R3m6J6L6m5o2mJ06n4J0m3n0R2rK6L5j6l6J0J7O5j08rP0m6P8
5680H7r7m6M7n0M4LJ1k3M5j1m3m0J38j77R7N3j90O5O4J5N4n9n7o5J87o9jML4j5
5710ER5j52m8K8P6K8p2J04n5p4q8K81m1q8R4pn7O1p3q9N9O1j1j03R0L5q5L9o7
5739e4lQ7Q9j47l0R4j40J38L4n6J2j7N0j1K2j16K8K2N2j8p8R1K8P8j53j12J10
$$ plain form
5766 0 52 -108 -76 15 -10 37 35 86 76 82 -7 131 -33 -7 -46 -167 6 17 34 -34 18 20 0 93 44 -37 27 5 19 36
5796 36 -26 -117 67 -45 58 -45 30 -96 44 -111 -58 -2 -59 -48 21 22 10 -118 -83 -71 -37 -55 -31 37 -141 68
5822 68 -11 -5 10 59 14 -106 -18 -6 -130 32 11 -33 41 10 55 -49 -21 30 -161 183 -76 115 -130 -105 -35 -41 -4
5849 -4 89 -76 81 92 47 22 -16 25 -68 33 -198 128 -192 -217 113 -52 -113 39 -10 -4 54 -106 54 -7 -164
5874 -164 -4 4 113 -16 -104 61 46 -29 -60 51 17 -4 32 -76 -5 19 14 -32 55 -16 -6 -5 -63 22 57 -17 22 127
5902 127 98 -116 -36 107 99 -58 6 -96 3 51 -15 53 -56 94 -57 30 -52 -47 22 -52 14 39 -20 57 46 13 19 55
5930 55 45 34 -116 43 -51 -21 76 50 -32 -24 -129 38 100 -20 136 78 37 96 14 -10 -80 33 -52 73 13 59 23
5957 23 -38 2 -96 94 58 -50 5 -39 -58 -39 -15 -11 -53 86 -46 7 61 -16 48 -112 -99 23 99 0 72 27 63 -2
$$ packed form
5766@N2j60L2R1k5M7kN1j0Oq9J38j64K6l9j21J73J1J7o8N2Kk0R3m9q1O4k2J4J7
5796C6o2r1J84j12J03j03P5j26J40j55N3N6n7J1O9Jj2j28L5J2L4j8K4O8j78K09
5822F8p9OJ5M9m5j20Q8J2j24J62k1m4P4l1M5j04K8N1j91L44k59J91k45K5P0oL7
5849dR3j65J57J1m5k5l8M1r3J01k31L26l20k5L30j65o1J52m9ON8j60J60o1j57
5874a64J60QJ09j29q8J65j5p5l1J11l4k1L6j08P1K4nm6Q7p1J0Jn8Q5L5p4L9J05
5902A27k9k14Q0J43qj57O4j02R9M8o6O8j09J50j51Q7q2NO9p4O6K5n9P7j1l3OL6
5930E5j0j1j50J59r4L0R7k6q2Qj05J67O2j20J56n8m1N9q2k4p0J13q5J25o0M6l6
5957B3o1M0r8J90l6j08N5m4j9J9K4Mm2J39j32N3N4p7O4j60J3J22P6r9P2m5L6o5
$$ plain form
5985 -2 -1 -32 73 -45 -163 -72 -174 90 -42 -42 72 42 0 -17 13 -74 10 -65 -62 -90 123 -71 -27 144 -15 43 -60
6012 -60 71 -37 60 -67 -43 116 50 75 28 37 86 34 81 -1 -28 75 76 -12 -28 107 18 39 67 41 -61 -7 13 -23
6040 -23 -39 -101 39 -28 0 28 -107 -66 117 2 -17 11 74 -4 -9 3 22 -88 41 35 14 -7 48 -55 23 -68 104
6067 104 44 45 73 -22 -112 -133 -10 70 3 -84 75 -11 -21 -36 18 -31 -24 -41 -44 45 116 64 -2 142 53 -98 67 -98
6095 -98 -69 52 -71 -52 96 -50 117 -72 -54 -34 -28 55 -20 77 110 54 -30 -83 -23 -13 -40 -62 55 29 -72 81
6121 81 -63 -25 -20 29 -10 0 27 -10 99 -39 77 -23 -80 25 -9 -82 35 5 20 -28 -22 95 23 -70 123 17
6147 17 9 126 -13 -29 -36 103 -101 -75 49 46 -104 68 31 47 47 5 41 -47 -22 24 8 -16 32 -54 -6 -13 62 -38 -68
6176 -68 -30 -88 148 -8 62 -13 -48 73 24 83 18 -68 51 -90 -47 -61 70 29 88 26 -42 -8 -58 3 109 22 -122
$$ packed form
5985bJl1J05j18j18R1j02K64j32%J14l0m2j7L0q7Q4p5Lk8K13j94M4J71j59N8j03
6012f0J31j08R7j27K4J59o6K5m7RM9n2M7q2k7J03Jq8j6J35q9K1K8k6j02N4K0l6
6040b3j6o2J40o7K8K8j35M1J83j15j9K8O3p8nJ2J9j10J29ok1k1N5j03P8r1J72
6067A04o0JK8r5r0k1J23Q0o7q7J59q6j0j5N4m9Pj7lQ9P1n2o6J44q9j51J65j65
6095i8K9J21j23J9J48j46J67j89J8K0OQ3p5R7L3n6q4n3O0J0k7k2J17k6j01J53
6121H1j44L8NM9l9J0K7l7J09j38J16j00n7J05l4p3J17l0J5m8OJ17p2r3J93j06
6147A7qJ17j39j6pJ39k04K6J24lj50J72l7J6%m2L6q8K5M6j6k4M8q6M8pP5j00l0
6176f8L8n8K36j56P0p5l5J21m9N9o5q6J19j41M3j4J31m1N9o2o8L4n0O1J06q7j44
$$ plain form
6203 -122 75 108 37 104 16 16 -5 70 43 -84 -18 30 -17 32 -64 25 -1 -96 -55 68 86 -122 -122 5 22 119 21 2
6231 2 -46 5 10 33 -41 -92 58 -31 59 -45 108 -16 -16 -33 -130 102 -2 57 9 46 -10 -130 36 52 -2 86 25 10
6259 10 41 89 -30 -44 166 8 -74 -63 18 117 -82 33 -115 124 -39 56 15 -88 59 14 106 -39 -25 30 -49
6284 -49 -63 -61 -29 74 -17 74 50 -32 -1 17 57 70 -134 -76 32 -7 -39 23 -28 25 87 56 95 0 62 0 66 58 87 -19
6314 -19 8 -11 -4 -45 29 -10 22 50 -41 115 89 -9 -29 -45 33 -56 -26 52 1 26 -23 52 -41 -62 3 -17 19 40 -25 33
6344 33 7 15 -7 -42 -13 -3 -10 -64 18 -69 53 12 61 -46 -2 -7 -34 74 52 -19 -41 -67 -126 3 -41 -19 -13 89 -100
6373 -100 -34 61 -149 45 -15 36 -25 -3 -19 -85 -61 60 -64 66 65 21 -127 89 89 -34 22 -21 -107 -60 -148 -5
6399 -5 -2 -25 -63 -22 12 -188 52 -74 -29 -31 -41 47 -50 -48 -27 124 82 -43 -29 18 72 80 -51 -147 -26 30 5 -60 28
$$ packed form
6203a22J97L3p1O7q8%k1P5k7j27O6M8m7M9r6Q9k6r5M1J23J8k08%J27J7R7r8j9
6231Bm8N1NK3p4n1J50q9R0j04J53j24%j7r7K32j04N9m8L7n6j20J66J6n4Q8o1j5
6259A0L1M8j19j4K10j58q2J1Q1R9j99J15j48K39j63R5m1j03J47m5R2j45J4N5p9
6284d9j4KL2J03r1R1k4q2L1J8M0J3k04N8J08l9l2O2n1N3O2l1L9r5O2o2O6qK9j06
6314a9K7j9Pm1P4l9L2K8r1J56k6r8k0j6P8q9L0P8n1K5m9P5r3k1O5k0L6K1o5N8
6344C3k6Qk2l5K9J0pn4Q2q7J22m1M9j07M4nk7J08k2p1k2k6n9J29m4K2OJ02j89
6373a00O6R5k10J94o0N1o1K2j6o6K4J21j24J30jm4j48K16%j23N6m3q6M7q8J43
6399eLk3l8M1L4k00K40j26M5kj0Q8r7KK1J51m2j25J4M7N4Qj31r6J21N6k5o5Q8
$$ plain form
6428 28 -39 2 95 -14 100 37 -134 -36 52 34 63 11 -56 59 -48 -14 7 79 41 44 -91 -40 88 73 4 -30 -32 -55
6456 -55 77 63 -74 27 -24 -70 45 -39 25 -74 14 127 81 58 -36 -25 -103 -43 9 -48 -57 -60 -22 -108 60 75 -99 11
6484 11 179 -53 35 22 -78 -28 -74 53 67 42 38 -30 34 35 11 -39 8 36 -31 -145 -62 -30 -49 -66 -97 8 -94 5
6512 5 -51 -23 -96 0 -1 -59 -41 -58 49 -39 -59 46 61 74 -44 -35 -8 55 49 -140 -16 28 32 -31 -15 -168 -5 107 29
6541 29 80 -2 59 -11 -61 41 -8 -124 -48 145 -5 -43 -19 40 11 42 -7 17 62 15 -88 -32 32 12 47 26 102 -14
6569 -14 15 -26 19 0 78 24 146 8 7 40 27 -6 21 29 -60 71 18 80 23 2 -86 -39 -27 -60 101 13 5 -38 -59 -15
6599 -15 86 10 38 29 10 -54 -16 55 -20 -82 -57 -27 -14 38 -38 -92 -15 28 -130 3 64 -38 7 31 -37 -13 -11 -36 42
6628 42 1 -25 -7 -84 -51 -38 -22 52 91 14 -20 -1 -37 18 -50 -18 43 113 -56 -1 27 49 9 -7 19 26 20 45 11 36 67
$$ packed form
6428B8o7M1R3j09J14o3j71R8Q8j8K9n2o7J15j07L4K1P2l8Lj35N1J28j5o9l4kk3
6456e5J32j4j37J01n1m6J15q4O4r9Q8J13m6k3r4J1p8O0N2n7rlL8q6J68J5j74J10
6484A1J68k32Q8j3j00N0m6J27J4k5mo8O4Jk4n0M7K8o7j14Q3L2j9j7l1J05j02R9
6512En6K8p3R6jn8J8j7J07q8k0J05J5J3j18RK7O3oj89J24M4Mo3J6j53J63J12p8
6541B9N1q2O1p0n0J02m9j16P6J93j50l8K4N9k9L1m9K4M5m7j03N6O4k0L5k1P6j16
6569a4K9m1M5j9P8n4J22j38jL3j3l3K7Qq9J31n3O2n7k1q8M7J2l3J61q8qm3k1M4
6599a5J01p6K8rj9o4L8P1p5o2K5L0J3N2p6n4P7M3j58J33O1j02M5K4o8K4Kk5P8
6628D2m1k6J8p7L3J3J6P4L9p7l4J9l6N5o8L2O1P0j69N5K8K2m0j6K6PoK5l4K5L1
$$ plain form
6659 67 -51 10 46 -25 53 56 77 48 30 93 -36 -25 -26 -7 14 13 59 12 26 14 1 -14 -28 27 82 47 4 -49 21 -14 21
6690 21 42 31 39 -24 101 -21 -10 -14 -56 38 66 -31 52 -50 28 90 28 -30 -79 -6 42 59 53 15 73 -34 32 9 -60 23
6720 23 -7 -1 32 113 -33 -18 76 47 -30 68 -4 -50 42 -22 20 83 -49 -35 -19 -34 -72 29 56 30 75 6 17 -8 5
6749 5 48 -6 6 -48 -77 -18 -30 2 -10 -83 -87 61 36 33 85 -59 -157 13 -4 8 26 33 -4 -11 38 -55 75 124 8 37
6779 37 101 10 40 53 33 -26 8 -16 48 53 26 -22 24 7 -47 -2 11 -10 42 -96 9 -23 -65 -35 1 96 -6 -2 60 -42
6809 -42 -22 39 -45 -10 32 6 42 16 23 55 -49 -98 22 3 9 32 63 -51 23 30 -95 -26 -3 27 23 -11 13 17 -58 6 32
6840 32 -19 84 -32 4 8 -59 -29 -88 -6 23 -38 -11 26 17 -11 45 33 3 10 -58 27 30 63 73 -21 52 -28 19 107 10 -3
6871 -3 -42 12 15 -11 -12 -40 63 5 8 17 1 29 7 -10 -28 65 -13 -12 -45 61 56 5 32 -20 -76 56 25 -15 -64 -8 -6 -24 -21
$$ packed form
6659F7j18O1L6p1P8LK1k9j8O3j29J1jJ9K1jM6m7J4j2j3j5j4N5N5l5m3n3P0l5L5
6690B1K1j1Qo3J25j22J1mm2R4K8r7Q3j02P8O2o2n8m9P3M8J7ol8N8j07O6k3o9Q3
6720B3l0OL3Q1j46J5R4k9p7R8p2m6R2o4M2O3j32J4J6j5l8J01K7k6M5o9J1k5J3
6749EM3n4J2n4k9N9j2L2j2p3mJ48k5lN2j44r8J70j7J2J8Pl7pM9r3J30M9j16K9
6779C7O4r1L0J3k0n9L4k4O4Nk7m8M6j7n4M5J3k1N2j38J05l2m2L0L6R5j02MO2j02
6809d2K0O1q4L5M2k6L6k6PL2j04m9J20j9OK3L1j14P4Pj25O9K3L0ml4K4Mp5O4K6
6840C2n1J03j16L6Mo7L0n9Q2K9o1K7L7rk8N6j2l0Po8Q5LL3J0r4P3q0M7Q8r7j3
6871cl9N4Lk6jk8J03n8LRj6K8k2j7j8R3p8Jl3J06nn1K7n2n6J32l1m0m9N6Kj8L
$$ plain form
6904 -21 -32 2 25 30 -21 -47 -5 53 30 9 -12 -5 33 9 49 -42 -41 47 14 8 16 110 -52 30 -1 -75 24 40 -6 -22 -52 -104
6936 -104 -76 111 -50 -17 -8 7 51 -59 -31 -8 -76 40 28 -147 -28 -30 24 -45 -18 61 -44 62 -19 69 18 -62 43
6963 43 20 61 113 35 58 58 -40 -82 -13 -47 -28 53 65 -26 14 56 -2 -48 8 30 -12 36 -20 -49 -14 -20 -129 -2 -96 0
6993 0 -42 11 -7 -85 -78 23 51 5 -4 41 29 88 148 -72 14 -68 33 121 -158 58 57 128 51 37 -15 56 -62 -25 8
7022 8 -29 125 114 -106 2 62 -8 106 16 -29 -72 -40 -74 -41 -192 57 -2 -49 -43 -80 121 -8 -2 -32 -22 59 14 93
7050 93 -53 -11 -48 -72 -49 -10 -9 -97 34 58 13 106 -33 -25 -38 -12 29 125 58 -23 30 -22 -51 -14 5 -49 -47 -37 20 -62
7080 -62 5 -3 -28 -10 -39 42 -53 10 45 -37 68 46 -7 50 -69 85 59 33 -16 39 -62 -63 29 33 -49 -39 -124 -49 13 -92
7110 -92 34 -37 -27 -59 -71 -19 -28 -5 -23 3 -19 -36 51 43 -71 107 -65 -18 116 -89 -9 -54 -74 7 -104 8 -4
$$ packed form
6904b1j1L4K3Nn1k6M2N8k3k1k1PL8k4M0r1JQ8l3oQR4j62Q2l1p4R9J6m6j6l0n2
6936a04K8J87j61L3RJ5M4j10K8K3o8J16j2j75J19kN4o9K7P9j05J06q1Q8n1q0J05
6963D3k3M1N2p8K3%r8m2O9l4J9Q1J2r1M0M2n8m6N6K2m2M8n6k9L5oj09J27r4R6
6993@m2N3j8p8PJ01K8m6rM5j2N9O0k20Q6q2J01Q8k79K16jP1p7j4n2P1j18L7L3
7022Hl7J54j1k20J08O0p0J14r0m5m3L2l4L3j51K49n9m7Ol7K01j29Ol0J0Q1m5P9
7050I3j46M2l7k4K3L9Jq8J31K4m5R3j39Qj3K6M1R6o7q1N3n2k9L7J9n4KJ0N7q2
7080f2O7qk5J8k9Q1r5O3L5q2J05k2n3N7j19J54k6k6m9N5j01jR2Mq2J0q5P5O2j05
7110i2J26p1J0l2j2N2rK3j8K6k2j7Q7qj14J78j72M7J34k05Q0m5k0Q1j11J12j2
$$ plain form
7137 -4 -16 10 6 -84 -9 34 7 -11 13 -57 -30 38 -18 -71 16 28 153 64 -15 -40 -2 -90 23 -103 13 63 52 -18 -38
7166 -38 14 -56 31 -65 47 -93 2 -76 -102 -30 5 139 -37 -52 20 7 13 -24 -44 73 -46 -71 -30 -167 59 58 37
7193 37 -37 -23 107 90 -73 105 28 -35 -99 -12 72 9 -54 -108 26 28 29 4 -121 120 10 20 85 -31 -79 19 -92
7220 -92 56 -25 6 -13 -9 -65 31 57 29 -12 -59 52 -29 -55 17 -2 47 -9 37 63 -36 29 -10 -28 -12 43 41 8 -36 12
7250 12 -63 20 17 -2 -73 -39 26 49 -12 -75 -8 83 -65 40 14 160 40 -59 35 -15 -38 49 21 55 -50 -41 -19 -79 2
7279 2 51 -129 -26 -62 -33 -10 -55 -28 -46 -31 32 23 9 91 -25 4 16 51 -16 -38 -51 16 23 28 60 -64 -53 16 -62 -37
7309 -37 60 -85 -51 14 22 7 -45 -31 97 80 -9 34 5 6 49 -36 20 93 -60 -9 35 -56 -84 -12 -52 -1 10 85 -44
7338 -44 22 -84 25 -30 4 -28 18 37 8 -25 -4 53 98 22 95 63 16 -2 24 36 26 117 119 39 -27 -26 53 37 48 48 -27
$$ packed form
7137dj2K6mr0P5M3k7j8K4p0K7O8n6n3Q7J2J25q9p9k5L8q8J13j26J16N0j1p0k0
7166c8N2p0Q7r6J12j40R5p8k6P2L5J34j76j5P2j3Ol7k0J17j19k5M1j37K26jk1
7193C7p4J4J30j7j63J78p7o3o4Q7Q4o3o3n4J34KJk5j25K41j10J0O5j16m8R8j11
7220i2J48q1L1j9Mn6R6K6k8m1m7J11q1k6P2j9M9n6M6K6r9O5l9j8J6N5kl3m4M8
7250A2p5Q3lj9p1L4O5K3o1o3O7R1j48J05k6J46j20r9R4n0k3Q7k8L4j05RK2o0Q1
7279BM9j80J03l6K9K3m5K7j8J5O3rj4Q2j16K9J2L5o7k2j3O7PNL2j24J1O9p8K5
7309c7R7j45L4O5Qj5n2J4J28j7q9M3k9JM3q5N6P3j53N1M4r1k8P2m0N1J1P5j29
7338d4O6j06J09n5L4l2M6J9k9l3K1N7M5p6P3l2m7j8K6J2j0R1Kq0o6JP9j6J1%p5
$$ plain form
7369 -27 -76 -52 -20 104 2 17 34 79 6 53 17 28 65 75 -48 -57 4 -75 48 154 -68 -25 97 86 -25 -43 44
7396 44 -24 31 66 -13 20 -9 47 -40 141 83 96 -112 8 38 36 -3 -40 13 44 -79 -91 -2 38 -5 -21 136 37 67
7424 67 70 -46 -18 43 -124 -4 -36 91 10 -71 35 -61 206 -69 -67 -20 156 40 57 -25 -45 59 46 -78 -21 -1
7450 -1 11 107 4 88 27 19 -111 22 -44 -79 45 -102 95 -89 -57 -61 -13 -21 15 -1 -3 -107 59 -61 -19 -20 -55 30
7478 30 85 107 56 -21 -21 -6 -77 39 -4 38 2 -9 -75 31 0 -14 -14 -60 -70 39 0 -25 -22 25 -12 -7 -24 -22 -14 38 -8 -75
7510 -75 -23 -67 -41 -58 54 62 52 -29 -61 8 64 15 -76 -25 24 -49 67 15 -16 -5 69 -37 -26 48 -3 -37 -16 121 20
7539 20 84 137 -66 17 33 -22 -6 -11 42 -112 -19 22 -3 120 26 -2 74 93 -26 18 -117 4 15 14 -24 -18 28 0 -136
7568 -136 13 32 52 49 0 -37 -15 -26 16 -5 1 34 15 13 41 -42 -5 19 -10 -30 36 26 -2 -17 -5 9 25 13 15 23 3 5
$$ packed form
7369b7m9K4L2J24j02J5J7M5p3M7l6J1L7J0j23rO1p9J23J06k22M3J22j1j11j8Q7
7396D4o8N5L5p9L3k9N6q7J81n8J3k08J20L0kl9l7N3L1j23j2Q9M0m3j6J57r9L0
7424F7Lj16K8O1j67J20l2J27q1q1J06r6K67k75KM7J76j16J7q2k0J04j3j24N7K0
7450aJ2R6j03Q4o1qj30J33o6l5J24j47J97j84L2mM8qL6j6kj04J66j20M2jl5Q5
7478C0N5K2n1p7%J5p1J16m3M2l6j1o6J06l1j4%m6j0J09l9k5LM7l7Nj7KQN2m6o7
7510g5N2m4K6j7J12Qj0q1l2O9N6m9r1N1M9p3J16n2l1J1P4j06J1P4n1l4K1J37j01
7539B0O4N3k03Q3J6n5J6nN3j54R3M1k5J23r4k8P6J9j19M4j35J21J1jl8OM6k8j36
7568a36J49J9K0lm9l7K2j1M2k1OL3j9kK8q3L7K4k9k0O6j0k8j5J2J4J6j2KQk0K
$$ plain form
7600 5 24 -6 8 8 -11 -6 -18 12 25 -2 7 -15 7 1 -17 20 -11 25 8 -11 -2 -11 -14 14 10 -24 4 7 33 2 -6 3 0 32 15 25 24
7637 24 1 33 2 -37 31 27 -8 22 3 13 2 2 5 6 29 6 -29 20 35 -16 -15 1 0 17 11 -36 -33 32 26 7 13 -2 3 4 24 4
7673 4 13 -36 15 -33 19 -3 -1 -4 -3 1 4 27 16 -1 15 10 3 -1 0 -5 -17 12 -8 28 -2 -22 -3 19 -20 8 24 -19 7 -29 9 -9
7709 -9 -26 11 35 -6 -7 6 -1 -11 -5 -11 0 -6 -2 3 17 21 -4 -25 25 25 15 0 -10 35 -1 10 18 6 16 -11 -4 -10 5 -1 28 2 4 -21
7747 -21 -18 -12 14 18 -15 13 9 -3 -1 -5 -10 -4 22 -7 2 18 29 1 2 18 12 13 -8 7 -3 21 13 24 22 29 40 -11 6 28 6 26 -5 -10
7785 -10 23 -18 -9 24 1 15 -2 -16 9 22 -12 14 -14 -21 -2 -8 -7 -17 -7 -7 -8 -26 -10 4 -22 8 -13 -16 -17 -4 10 0 4 -5 -19
7820 -19 -2 9 24 -1 11 1 -7 -1 18 -14 -15 32 11 -12 -9 22 -22 4 13 1 -25 -19 2 2 10 9 -21 -12 21 7 -16 -27 15 5 -9
7855 -9 -15 7 -12 -3 4 15 -4 0 -5 -2 0 12 0 14 2 5 15 31 -3 17 31 10 19 -3 19 1 -10 21 -19 -5 10 10 14 6 -20 10 -5
$$ packed form
7600EJ9l0J4%j9Nj2L0J3k7Rk2K2oj8L7l1L6j7j9RrlK8ml4K8LK6l1qRlL2j7J0j
7637B4k3L2l1l9O8ml5L0j9J0j1%LJK3k3l5M9J5n1JJ6jJ7om7LO5oj9Oj5NJK0k0
7673DRm9N1m8N2k2KlJMLK3j1j7J6npmJnj2K9k0L6l0k0J9K2l9K8J6m3K6l6L8j8
7709ij7L7K4m1jJ3pj0OoJ1oMNJ4Mk5k1N0%j0j5j0M5l6J1Qj2J0k7PoJ5oK9k6Kk5
7747b1LOK6Ml3K8mj2KmnOK6k9RJ6J1k8JJ6oJk1J5j0K4qJ1kPJ1n1J7K2k2K0l1n
7785a0L3m1RL3k3J4j7j4K5J3l4K6k8pJ9oJj0J0%jj8J6J4k6L0k1ljJ3J4j0Mrj4
7820a9J7J1J5k5J2j0qOJ9l2jM7k1k3LL1m4K6Rj2k6OK1%Qjl0RL3j4k3j1M2j0j4
7855ioK2j9RPJ1j9MnLKJ2j2J4j2LJ0J6l4K0J4k1Rk2K2j8j1L1m0J4J5%Mqk6L0j5
$$ plain form
7892 -5 -1 -6 -19 3 13 -8 -9 -7 20 1 14 -15 -1 -29 6 31 8 10 28 8 -5 0 -10 13 -15 11 5 26 4 19 32 2 8 22 10
7927 10 39 -2 8 24 2 -21 23 -6 -1 60 -4 -11 20 11 15 3 3 10 35 -25 -15 -5 0 -3 -5 -4 -7 2 -8 13 -15 16 -10 30 15 -2
7963 -2 15 -3 6 2 4 24 1 9 9 40 16 -2 0 15 9 26 11 4 31 16 16 12 -12 -7 4 -16 3 -11 17 -28 -3 -21 18 -5 -3 7 25
8000 25 -8 -9 17 -2 -10 3 2 -3 31 15 19 -23 -25 1 29 19 12 1 38 -3 2 -5 -17 -7 13 29 8 -3 5 11 9 -4 11 37 10 19 14
8037 14 1 -4 17 -4 17 -4 12 -4 -26 11 19 20 -27 10 9 57 3 35 11 -3 -6 0 -15 19 2 -31 11 14 -6 13 -1 34 23 32
8071 32 8 1 12 -8 -24 4 24 14 -24 -18 -22 -34 -25 -31 -2 21 31 -28 1 3 0 -18 -3 -9 -16 -14 9 -32 46 -7 -20 4 -26 1 -2 -10
8107 -10 -7 4 27 4 -28 12 24 7 31 0 -55 0 14 -14 20 -28 -1 17 17 31 -15 -9 -9 -24 -20 -7 19 -16 4 44 -6 -27 -7
8140 -7 -1 -28 -7 27 -5 -35 41 -7 40 -22 -10 -2 9 -43 30 24 25 27 46 -9 28 -4 -28 23 22 8 0 12 7 16 16 26 44 17 33 10
$$ packed form
7892eMnj3K2J0k1jKK7j9J3k9J4k8L5K5k3KJ8k0j3Nj0K3k8K6oK1k2J5J3l0OJ4j2
7927A0K9m1J0J6k2k3M4k9NO1o4pL1rMj2%PK5o0J0J0NlkJlRj0K1k8L1k6M0j5j7
7963bJ7j8RmKK0k3Q%L1k4j8KJ5oJ7j5pK7j5%mk4NJ1k0J9j4K8m5K5j8L9k3KJ0J8
8000B5l3jK6j9qJ3jnL4j6Mm2kK6K8j0pj1L7m1Npj2J0K0J6k1j1QOkj3J5K6k7Rn
8037A4j3nK1k1K1k1J6j6k2L7QJm7L7jM8n4L2k4j4lOj5L4j7l3M2Lk0J9j4L5j1R
8071C2k4pJ1k0j6K8K0j0l8Omj2RoK9K3J0n9K9Klj8J5opKK3m1P8n3j3K4l0K7lq
8107a0LJ1K3k3l2M0J2j7K4l1n5N5J4k8L4m8K7J8%J4m6O%j5MJ3K6l5K0M0n0k1K0
8140gOk7K1L4l2l0P6m8M7o2J2QJ1n2P3oJKJ9n5L7l2k4N1jj4qJ2nR%J0J8k7J6k3
$$ plain form
8176 10 49 -7 0 -26 -30 -6 -8 -4 5 -1 26 65 -1 6 16
$$ packed form
8176A0L9n6Pk6mK4kMRoK7L9o6PJ0
8191A6
$$ Imaginary data points
##PAGE= N=2
##DATA TABLE= (X++(I..I)), XYDATA
$$ plain form
0 0 0 0 0 0 0 0 0 0 0 0 0 0 0 0 0 0 0 0 0 0 0 0 0 0 0 0 0 8 -8 8 -8 8 -8 8 -8 12 -16 16 -16 16 -20 24 -24 28 -32 34
46 34 -40 42 -47 52 -56 60 -68 76 -84 92 -101 116 -127 143 -164 186 -217 257 -310 389 -512 751
68 751 -1342 6145 6998 -7393 -6932 2159 11011 9810 3747 -3390 -5088 -734 8267 13179 8435 -2677
84 -2677 -7810 -3093 6060 11619 10297 2307 -5111 -5219 1358 7678 9466 6105 79 -4120 -1724 5231
100 5231 9360 6224 -433 -4252 -2551 2653 7762 8925 3782 -4392 -7129 -1352 6561 9174 5341
115 5341 -1662 -6129 -3969 2518 6941 5620 104 -4615 -4247 743 5508 5665 764 -4839 -5445 -933
131 -933 3742 5092 2935 -1778 -5945 -5291 64 4728 4333 -140 -4416 -5196 -2450 1769 3974 1778
147 1778 -3362 -6232 -3652 1534 4025 2040 -2442 -5910 -5231 -524 3750 3454 -843 -5130 -5784 -2537
$$ packed form
0@%%%%%%%%%%%%%%%%%%%%%%%%%%%Qj6J6j6J6j6J6j6K0k8L2l2L2l6M4m8N2o0O6
46C4p4Q2q9R9j08J16j28J44j60J76j93K17k43K70l07L50m03M74n67O99r01J263
68G51k093P487Q53j4391M61R091Q852j201o063p137j698M354R001M912m744j1112
84b677n133M717R153N559j322p990p418j08O577O320J788l361o026m199K396O955
100E231M129l136o657l819J701N204N109J163n143q174k737N777P913K613l833
115E341p003m467K160O487M423j321n516m719L68M990M765J57m901n603o06M512
131i33M675J350k157m713m167O54N355M664l95m473m276p80K746M219K205k196
147A778n140k870K580N186K491j985m482l468O79M707M274k96m297m287o54L247
$$ plain form
163 -2537 1503 2913 830 -3020 -5294 -3682 131 2250 1089 -1876 -4308 -4294 -1549 1640 2294 -162
179 -162 -3754 -5130 -2880 856 2686 1263 -2113 -4770 -4215 -720 2407 2179 -965 -4018 -4180 -1507
195 -1507 1571 2172 104 -2860 -4083 -2313 924 2445 947 -1874 -3421 -2745 -262 1987 2010 -136
211 -136 -2618 -3214 -1284 1473 2345 931 -1317 -2773 -2142 359 2452 2042 -334 -2403 -2218 46 2256
228 2256 2421 598 -1602 -2330 -719 1991 3066 1569 -840 -1986 -1124 1054 2688 2358 557 -1251
244 -1251 -1343 325 2178 2470 1154 -384 -986 -197 1557 2727 1992 84 -1206 -687 1138 2656 2553
261 2553 976 -685 -1282 -52 2055 2914 1664 -223 -1002 -271 1255 2198 1781 362 -829 -659 798
278 798 2229 1949 433 -842 -937 -1 1421 2161 1412 -250 -1257 -833 595 1614 1419 344 -673
$$ packed form
163b537M040J410k083l850k274J612L813K119j161k965k432J4K745L189O54k456
179a62l592j376K250L736J830j423l376k657N55L495L127k28l144l053j62K673
195a507L078O01k068k964j223J770L237J521j498k821j547O76K483K249K3k146
211a36k482n96J930K757Q72j414k248j456O31K501K093m10k376k069J85K264K210
228B256J65j823k200p28J611K710J075j497k409j146Q62K178J634l30j801j808
244a251r2J668J853K92j316j538o02P89J754J170p35j908j290N19J825J518j03
261B553j577j661n97J230K107Q59j250j887p79P31J526R43m17j419j191J70J457
278G98J431k80j516j275r5R36J422P40p49j662j007M24J428J019j95j075j017
$$ plain form
295 -673 -940 -118 1137 1446 382 -897 -1114 -280 871 1443 800 -614 -1528 -1206 231 1373 1196 -49
313 -49 -1043 -1201 -562 485 1010 365 -747 -1173 -607 364 773 292 -640 -1177 -954 -108 915 928 -143 -1248
333 -1248 -1344 -625 306 837 460 -486 -1158 -962 -135 599 413 -435 -936 -780 -175 442 609 -108 -1065 -1253
353 -1253 -508 447 759 281 -563 -1094 -973 -306 457 569 -156 -897 -827 -276 150 288 -81 -677 -933 -510
373 -510 215 597 150 -644 -1017 -718 -159 367 512 24 -785 -986 -419 215 376 42 -443 -635 -431 -27
393 -27 392 305 -336 -818 -553 100 448 405 23 -522 -697 -347 311 610 319 -275 -516 -247 136 364 402 112
415 112 -368 -376 115 530 506 141 -235 -284 -25 351 598 562 6 -394 -160 347 592 517 221 -83 -217 39
437 39 466 677 389 -72 -203 95 427 484 399 143 -197 -129 277 601 476 115 -164 -118 110 342 465 354
$$ packed form
295f73k67Q22J255L09j064j279k17Q34J151N72o43j414r14L22J437J142j77j245
313d9r94j58O39J047N25o45j112m26N66R71M09m81r32n37K23Q46J023J3j071j105
333a248r6P19R31N31l77r46o72J96Q27P34j86q48n01J56O05O17J67p17r57j88
353a253P45R55L12m78q44n31J21O67P63J12p25p41P0N51M26J38l69n96k56M23
373e10P25L82m47p94l73K99N59N26J45m88q09k01N67O34J61l34m85j92K04M04
393b7M19q7o41m82K65O53L48m3l82n45j75L50O58K99k91n94k41K69L83K28L8k90
415A12m80qM91M15k4l65l76m9K59L76K47l6n56m00K34N07K45p5k96l04j34K56
437C9M27K11k88m61j31K98L32N7q5k56l40O8M06L24j25l61k79M6K28K32J23j11
$$ plain form
459 354 -30 -311 -153 249 368 230 59 -149 -171 1 256 324 94 -262 -306 14 273 225 99 -150 -380 -319
481 -319 89 352 178 -133 -329 -261 -81 84 144 82 -169 -314 -79 159 112 -86 -158 -247 -181 45 249 232 -59
504 -59 -319 -287 -39 169 177 120 -32 -249 -207 59 228 77 -121 -147 -38 116 175 133 -5 -192 -244 28 339 261
528 261 31 -110 -125 -111 43 182 226 75 -123 -98 80 158 84 -54 -41 -43 2 153 261 22 -194 -228 -117 122
552 122 217 160 1 -185 -267 -86 145 98 -100 -123 -45 -69 -21 44 7 -195 -232 -106 109 142 -40 -169 -189 -194 -160 28
578 28 174 27 -170 -174 -87 -13 -23 -44 -22 -76 -114 5 161 84 -154 -207 -79 33 92 152 48 -83 -183 -67 102
603 102 157 46 -42 -33 4 -24 89 125 -29 -70 -2 130 120 110 34 -10 -71 -78 74 185 136 -34 -71 -12 50 2 90 55
631 55 -47 -86 -16 113 110 -26 -89 -48 26 13 79 83 -51 -149 -93 4 58 11 -37 -83 -76 -63 -60 37 -12 -134 -152 -62 -23 -27 2
$$ packed form
459C54l84k81J58M02J19j38j71k08k2J72K55O8k30l56m4L20K59m8j26k49k30O1
481c19M08K63j74l11j96O8J80J65O0o2k51j45K35K38m7j98p2q9O6K26K04j7k91
504e9k60L2K48K08Qn7j52k17M2K66J69j51j98k6J09J54N9m2j38j87n2K72L11p8
528B61k30j41j5J4J54J39M4j51j98K5J78P8p4j38J3kM5J51J08k39k16l4J11K39
552A22R5n7j59j86q2J81K31m7j98k3P8k4M8O5l7k02l7J26K15L3j82j29k0nL4J88
578B8J46j47j97mQ7P4j0k1K2n4l8J19J56p7k38n3J28J12N9O0j04j31j00J16J69
603A02N5j11q8RL7k8J13L6j54m1O8J32j0j0p6m4o1pJ52J11m9j70l7N9O2m8Q8l5
631E5j02l9P0J29lj36o3M1P4j3O6Mj34r8N6R7N4m7m8m6PJ3LR7m9j22j8R0L9mK9
$$ plain form
662 2 -48 -145 -155 -71 19 40 -75 -132 -98 -70 -33 20 30 -83 -173 -88 65 83 4 -52 -64 -65 -19 18 101 55 -83 -55 72
691 72 72 26 50 57 -20 0 64 151 140 14 -4 32 80 64 115 182 39 -51 7 109 110 71 47 56 54 56 108 122 72 -77 -7 108
723 108 161 88 111 54 5 -30 23 116 99 -4 -8 43 26 -24 1 52 -9 -59 11 98 68 -6 -64 -74 -34 4 42 60 32 -74
753 -74 -126 -6 -24 -59 -32 -15 -35 -56 -45 -1 -33 -108 -95 -51 45 25 3 19 -18 -103 -91 46 68 -4 -13 -4 4 -27 0 10 -1
784 -1 -34 -29 73 90 3 -35 -23 -53 -14 54 104 92 7 -61 -15 19 27 11 57 41 -17 -13 37 33 -54 -46 -15 -20 13 27 34 -22 -80 -130
818 -130 -2 67 20 5 12 -42 -81 -27 -27 -19 -51 -57 -20 -2 -46 -64 -87 -83 -126 -37 20 1 -88 -80 -49 -81 -71 -48 -39 8 -83 -55 -51 -24
852 -24 -73 -72 -10 -42 -32 -1 18 9 -87 -60 -19 7 -4 1 18 11 -23 -10 56 61 8 -13 45 62 61 25 60 49 9 19 96 112 31 49
886 49 88 31 17 45 83 60 28 33 66 72 21 57 55 36 10 11 94 103 -11 8 39 39 25 25 39 32 -21 3 47 47 9 -27 16 43 -33
$$ packed form
662Bn0r7j0Q4R0K1j15n7L4K8L7N3J0j13r0Q5J53J8p9n6j2jM6L7Q3m6j38K8J27
691G2%m6K4Pp7K0O4Q7j1j26j8L6M8j6N1O7j43r0N8J02Jl9k4RkKN2J4n0j49P0J15
723A08N3p3K3n7m9l5N3R3j7j03mN1j7n0K5N1o1n0P0Q7l0p4n8j0M0L8L8J8k8j06
753g4n2J20j8l5K7J7k0k1J1M4l2p5J3M4R6k0k2J6l7q5J2J37K2p2rRQl1K7J0j1
784al3NJ02J7q7l8J2l0L9O8N0j2q5o8M6L4Qj6M6j6n8MN0mq7QL1nL3J4Pn6n8n0
818a30J28O9m7j5Pn4l9N4%Ql2oL7J8m4j8k3Mm3Q9N7j9q9QL1l2J0K3RM7r1K8MK7
852b4m9JO2l2J0L1J9rr6K7M1K6j1NJ7pl4J3O6Nn3k1N8J7jl6L5j1m0J0P7J6q1J8
886D9L9n7j4K8L8k3l2NL3On1L6kj9k6JQ3Rj14J9L1%j4%J4pn3K4M4%l8l6M3K7p6
$$ plain form
921 -33 11 36 16 -61 -61 13 -13 31 -41 2 -32 -43 -44 9 -1 -42 -17 39 18 -17 -41 -39 -29 -48 -39 26 69 -1 -70 -35 -21 -58 -15
954 -15 43 50 0 -25 -1 22 13 -24 15 64 29 -5 62 61 3 -19 3 48 42 54 39 24 -31 -14 4 65 25 9 54 66 25 -22 33
987 33 13 -37 -4 38 28 47 19 -14 -12 -30 -63 -3 39 -4 -45 -3 -56 -60 -77 -16 -23 -59 -42 -41 -30 -56 -87 -54 -30 -42 -22 -5 -30
1020 -30 -85 -89 -63 -69 -46 -34 -36 -33 -65 -52 -15 -3 -86 -91 16 25 -27 -2 -13 -45 -71 -70 3 9 -32 -30 -15 5 -55 -46 14 -15 -36 -15 32
1055 32 46 -19 -26 -29 12 -10 5 48 88 0 -10 44 30 29 10 34 51 27 13 36 27 -11 11 32 28 42 18 55 44 9 -14 -15 57
1088 57 21 7 26 26 -18 -26 19 1 -1 -22 26 17 -22 -23 -4 -10 -45 -33 22 45 1 -15 -27 -1 2 -18 19 5 -2 -2 12 27 -13 -25 3
1123 3 29 -4 18 27 42 -10 -17 -1 10 -10 28 33 46 -6 -11 18 52 1 -34 19 20 19 13 42 42 13 -4 39 45 38 44 2 37 12 -9 25
1159 25 35 31 35 61 51 28 1 10 44 2 17 18 22 15 -13 2 4 16 -4 18 15 -3 -19 -16 8 -35 -38 -31 -35 -16 -63 -22 -24 -55 -76 -43 -26
$$ packed form
921c3M4K5k0p7%P4k6M4p2M3l4j1jN3j0m1K5N6k1l5k4KJ0j9RO5M3p0o9L5J4l7M3
954a5N8Pn0k5K4K3rl7L9M9l5l4O7jn8k2K2M5oJ2j5j5n5J7J8O1m0j6M5J2m1m7N5
987C3k0n0L3M2j0J9k8l3Kj8l3O0M2m3m1M2n3mj7O1pl6J7JJ1k6l1L3K4j2K0J7k5
1020c0n5mK6oK3J2kLl2J3L7J2q3nJ07Rn2K5j1l2k6JP3Om1KJ5K0o0RO0k9k1K1M7
1055C2J4o5plM1k2J5M3M0q8j0N4j4jj9K4J7k4j4K3rl8K2K1mJ4k4L7j1l5k3jP2
1088E7l6j4J9%m4qM5j8kk1M8rl9jJ9ol5J2N5K3m4j6j2K6Lk0L7j4p%J4J5m0j2K8
1123CK6l3K2RJ5n2pJ6J1k0L8NJ3n2nK9L4n1l5N3JjoK9%k9j7M3OpOm2L5k5k1L4
1159B5J0mMK6j0k3k7RL4m2J5JMpk8J5KJ2k0K2lj8j6LK4m3lPmJ9m7M1kl1k1L3J7
$$ plain form
1196 -26 -46 -68 -4 -31 -77 -75 -53 -34 -35 -58 -29 -20 -28 -50 -54 -23 -58 -34 -14 -21 -14 -23 -17 -19 -54 -39 -3 26 -25 -42 -4 -15 -8 -41 -2 7
1232 7 27 -10 11 29 -16 -24 -1 31 11 -14 40 55 -6 -26 -5 33 -29 38 23 35 6 -14 4 12 0 -3 30 60 46 -9 13 15 14
1265 14 -6 6 55 0 -3 -13 11 -14 -22 11 14 -4 -23 29 6 -18 -38 -21 1 3 -39 -1 5 -11 -31 -25 -5 -56 8 -5 6 1 -36 -21
1299 -21 22 -49 -31 -17 16 0 -13 -5 19 -15 -4 12 25 36 6 2 -3 2 -2 32 38 34 22 12 23 35 -6 22 50 23 19 4 32 43
1333 43 16 15 27 28 12 42 54 8 13 49 30 28 28 33 61 41 3 26 27 31 3 -1 23 14 0 56 26 -8 20 15 27 -16 -7 22 18 3 -30
1370 -30 -15 10 6 -59 -9 18 -34 -54 -11 -9 -50 -69 -44 -20 -12 -54 -24 -1 -1 -46 -29 -37 -23 -44 -39 17 -19 -26 -37 13 -7 -10 15 11 -26
1405 -26 -22 -7 5 -24 -15 -2 12 2 -11 9 20 14 -21 17 32 16 1 21 -2 -37 -35 -7 5 7 21 -4 24 -8 -16 -16 -15 -8 1 5 10 2 -15
1442 -15 -6 -3 -15 -19 -12 22 -17 -30 -4 10 -14 0 5 13 -3 -35 -23 -5 -50 -61 -38 -29 -11 -5 -24 -19 -35 -48 -21 -6 -19 -28 -23 -19 -31 -26 -21
$$ packed form
1196b6k0k2O4k7m6KK2J9jk3K9Rqk2mL1l5K4K0pPrOkl5J5L6K9n1j7L8j1Pl3L9R
1232GK0l7K1J8m5qK3L2k0k5N4J5o1k0K1L8o2O7j5J2k9k0J8Qj2lL3L0j4n5K2Kj
1265A4k0J2M9n5lj0K4k5qL3Lj8j9N2k3k4k0J7K2Km2L8Oj6k0OK0n1O4j3J1nl7J5
1299b1M3p1J8J4L3j6j3QK4l4J1J6J3J1l0mnNmL4Omj2j0J1J2m1K8K8k7mj5K8J1
1333D3k7jJ2Jj6L0J2m6NL6j9k%NK8k0l8K3JMk8mK4rj4N6l0l4K8nJ2m3RK9mj5l3
1370c0J5K5mo5N0K7n2k0M3Km1j9K5K4Qm2L0K3%m5J7qJ4k1NN6l6pj1N0k0lK5ml7
1405b6MJ5J2k9RJ3J4j0j3K0J1ol5L8J5j6j5K0k3l5KK8J2KJ4k5K8l2q%JPRMNqj7
1442a5RLj2mPL4l9j3K6J4k4J4NQj6l2J2J8m5j1K3RJ8Oj9Nj6j3K7J5j3rNMj2NN
$$ plain form
1479 -21 -4 -38 -9 -24 6 -23 -17 -28 -15 -15 -22 -19 -4 23 -14 23 1 -18 -14 11 26 52 0 8 35 27 -8 -12 24 2 20 41 27 43
1513 43 -4 -2 22 23 23 28 28 30 18 1 5 41 16 17 36 19 31 14 20 3 -20 0 31 -7 17 -1 13 7 -9 -1 24 8 26 42 12 20
1549 20 -37 1 5 -22 -15 8 29 21 -35 -21 -29 12 -8 -7 0 -20 -19 -32 2 4 -19 -22 3 1 -10 -13 -18 -49 -30 1 1 22 20 0 2 16 10 -34
1587 -34 10 -12 -7 -16 19 -3 -7 16 8 25 -15 -8 10 2 -11 -9 10 35 -11 -11 16 27 15 27 6 5 -13 -1 17 -24 -27 -3 -37 -15 -26
1622 -26 -11 5 16 5 -4 -16 -4 -25 -24 -19 -19 -2 -16 7 0 -25 -7 -21 -18 -9 -29 -9 -3 -38 -45 -13 -45 -24 9 -6 2 -30 -38 -3 -19 -35
1658 -35 -61 -17 -26 -24 -20 -12 19 -41 -9 -3 -3 -30 -3 4 -26 -35 -12 -21 -10 -15 -24 5 32 18 -15 22 -8 13 -9 29 43 21 8 17 -12 -1
1694 -1 16 15 34 21 1 42 14 16 19 15 -11 1 -1 32 30 52 1 2 6 17 32 18 10 17 -1 -6 -20 9 22 29 3 -1 -30 11 -4 -9 -26 17
1732 17 -4 8 20 11 19 -23 20 35 6 51 -6 36 5 -29 3 12 9 -11 14 -3 3 1 -14 6 -8 -9 5 2 42 -10 13 3 0 22 40
$$ packed form
1479b1J7l4K9j5L0k9Oj1J3%pLJ5K7l7L7k2j9MK5J5K6n2QK7ql5mL6k2J8K1j4J6
1513D3m7KK4J%N%Kj2j7ML6k5JJ9j7J2j7Oj7k3K0L1l8K4j8J4oj6QK5j6J8J6l0Q
1549B0n7L8Mk7PK3K1qn6J4qM1k0JPk0Jj3L4Kk3lK5kj1lnl1J9L1%K1kk0KJ4om4
1587c4M4k2NrL5k2mK3qJ7m0PJ8qj3KJ9K5m6%K7J1j2J2k1jj8J2J8m1lK4l4K2j1
1622b6J5J6J1j1rj2J2k1JN%J7j4K3pk5J8j4LRk0K0Ol5pL2l2K1L3j5Ql2qL5j6j6
1658c5k6M4rKMQL1o0L2O%k7K7Pl0rK3rJ1nrK9K7j4l3L7l0K1k2L8J4k2j3Rk9J1
1694aJ7jJ9j3k0M1k8KLmk6J2kL3kK2n1JMJ1J5j4qPj8nj4K9J3Pk6mk9M1j5nj7M3
1732A7k1J2J2rQm2M3J5k9M5n7M2l1l4L2Rlk0K5j7Okj5K0j4jJ4lM0n2K3j0lK2J8
$$ plain form
1767 40 6 31 20 19 11 -6 -2 -18 20 27 14 9 30 23 14 -7 23 17 4 17 5 39 27 -17 10 27 7 12 14 36 30 0 -2 -5 -12 -3 33 2
1805 2 15 -13 1 -16 -11 -17 -1 17 -5 -7 -11 -22 -16 -15 -8 -30 -18 -20 -25 -8 -33 -8 -29 -23 -13 -36 -23 -25 -20 -32 -11 -6 -42 -15 -8 22 -32 -17
1843 -17 -8 -22 -17 -17 13 -5 -6 7 15 -2 -16 -17 -13 4 0 11 -7 -12 -20 -25 -20 10 24 -13 0 22 -10 -13 8 7 -4 5 -33 26 11 -6 27 15
1881 15 2 -23 27 34 6 12 10 33 17 -7 30 29 1 10 5 2 8 6 -5 11 6 19 2 -11 -7 -16 -4 -20 -17 -26 18 5 -39 19 9 25 -35
1918 -35 -20 14 -14 10 -24 -13 -5 5 -16 -11 17 14 -1 14 18 -7 19 2 6 9 5 12 43 3 -5 17 28 -9 8 25 25 57 9 5 19 43
1954 43 -11 32 27 14 27 0 22 40 17 32 47 21 4 13 33 8 7 6 48 21 30 21 6 10 8 1 53 12 24 21 4 13 8 27 24 6 -31
1991 -31 -5 22 0 8 4 6 -40 -3 -2 -15 -15 -32 -18 -11 -14 -43 -30 -16 -13 -24 -25 -6 -6 -18 -32 -23 -34 -9 4 17 -44 -34 -32 -26 -15 1 15
2028 15 25 -9 2 36 9 9 -21 -1 25 -8 10 -23 37 -10 -20 -26 -14 -5 -8 14 -1 9 -36 -14 2 12 -22 12 0 -4 -14 17 21
$$ packed form
1767D0l4K5j1jqj7Mj6L8Pj3nK1prk1L0oj3J3j2L4j2m4K7J7k0NKK2ol0klpRL6l1
1805BJ3k8J4j7NoJ6J8k2kmj1OJPk2J2knJ7k5K5k1OJ0k3J3kNj2K1Nl6K7PL0n4J5
1843a7Rj4N%L0j8jJ3Qj7j4jMJ7mJ1j8nqnNL0J4l7J3K2l2lK1jj1Rl8N9j5j7L3j2
1881A5j3k5N0Pk8OkK3j6k4L7jk8RnlOkj1J6nJ3j7j3MrJ2j6LrM4j3m4N8j0J6o0
1918c5J5L4k8K4l4J1QJ0k1NK8lj5J5Mk5K6j7MLmPL1m0qK2J1l7J7J7%L2m8mJ4K4
1954D3n4M3nj3J3k7K2J8k3J5J5k6j7RK0k5jjM2k7Rrj5MkpN2m1J2lj7RnJ9lj8l7
1991c1K6K7k2QmKm6L7Jj3%j7J4Plk9J3J4Lj1jJ9%j2j4Rj1K5J3J3o1J0KOJ1J6J4
2028A5J0l4J1L4k7%l0K0K6l3J8l3O0m7j0oJ2RlK2j5J0m5K2J6J0l4L4j2mj0L1M
$$ plain form
2061 21 -6 11 -13 -5 1 15 -5 7 -13 2 6 15 4 24 8 26 -11 5 -3 5 9 1 -29 -24 -8 16 0 13 0 -11 -10 22 -8 -24 -1
2096 -1 -9 -15 5 -9 1 -20 -35 -4 -20 -17 -29 8 20 8 -32 -18 28 -2 -1 21 -6 -11 28 18 32 3 15 1 5 8 17 38 19 -8 16
2131 16 37 16 6 26 51 -6 -6 21 -2 18 12 15 29 21 15 19 -4 -17 -1 -4 6 20 -10 25 -10 19 13 5 33 24 8 11 4 19 9 10 35
2168 35 6 6 -12 -3 16 10 16 -5 2 13 10 15 20 17 -20 -12 -12 -6 5 -4 0 20 8 -14 16 0 -12 -8 21 8 -10 -1 -6 15 -26 -17 -21 -3 -28 -8
2208 -8 4 12 -14 -25 -13 4 6 -1 -3 -6 13 -3 0 -17 -6 -1 20 6 -13 23 15 8 -3 7 41 -25 -8 7 15 6 13 20 -25 -4 -14 14 -3
2245 -3 4 -4 9 13 -5 -14 0 -9 -19 5 -14 -18 2 -6 0 -7 15 -18 -21 -16 -6 2 -17 18 8 5 -9 -13 -35 -17 -3 -9 2 2 -26 -12 -37 -19 -16
2284 -16 -22 -11 14 -14 -1 -24 -31 14 0 5 -33 -15 -15 -1 -8 -9 -15 -21 -26 -7 1 -7 -25 -3 -1 8 -17 -16 6 23 -5 20 19 41 20 10 46 0
2322 0 10 -11 25 -6 19 15 -11 15 12 8 25 20 -6 -2 13 -9 -25 -1 13 6 1 27 -17 7 27 23 -8 5 6 1 22 3 -23 5 12 -3
$$ packed form
2061B1k7J7k4QOJ4k0J2k0J5MRj1K0j6J8l7J6qQMql0NJ6K4j6J3j3j1JL2l0j6K3
2096aqoK0j4J0k1j5L1j6Lj2L7J2j2m0J4M6l0JK2k7nL9j0J4k9J2j4MLRK1j9k7K4
2131A6K1k1j0K0K5n7%K7k3K0oLJ4qoMk3j3J6lJ0J4l0L5l5K9oqK8rj6LpJ5j0JK5
2168C5k9%j8RJ9oOk1PJ1lNNll7Q%OJ1rMK0j2k2L0j6j2MK9j3j8RnK1m1RmJ8k5K0
2208hJ2Qk6j1J2J7KpklJ9j6Lj7J1NK1j4j9L6qpj1J0L4o6J7J5QrPPm5K1j0K8j7
2245cPqJ3Mj8rJ4rj0K4j9mK0qOpK2l3lNJ0Qj9L5j0lj4mk2J8J4oJ1%k8J4k5J8L
2284a6oJ1K5k8J3k3pM5j4Nl8J8%J4pjoonJ9Qqj8K2KRk5JK2J7k8K5jK2k1j0L6m6
2322@J0k1L6l1K5mk6K6lmJ7nk6MJ5k2j6K4J4pnK6m4K4K0ml1J3JnK1j9k6K8Pj5
$$ plain form
2358 -3 12 -18 8 1 5 -4 -11 -13 26 5 12 -3 0 -22 -9 -8 24 9 51 0 -13 13 -9 -28 6 -17 -21 18 -2 -6 -11 -11 -28 -36 -23 6 -29
2395 -29 12 -1 -19 -30 -5 11 6 -23 3 12 -2 5 21 -5 27 11 7 -7 16 -10 2 3 39 30 35 -1 1 14 -8 -4 13 -7 9 -17 27
2430 27 -24 -31 4 9 -31 -6 9 -3 -8 -10 14 -7 -26 -22 -6 -10 -23 -35 -26 -27 -18 -13 -10 3 16 13 -16 16 6 -1 24 15 2 -25 -11 -21 5
2467 5 -30 -27 -20 -8 -22 2 -11 -23 -30 -13 -18 -16 -19 8 10 -37 -31 -7 22 -20 8 -20 -1 23 -15 -9 15 -21 7 9 -5 15 -21 -20 -18 17 30
2504 30 13 -15 -5 11 -5 6 16 2 3 -16 21 5 -5 6 -12 -1 -5 3 -28 30 8 18 -23 -3 -12 -17 0 -19 10 0 -11 -7 30
2537 30 2 -21 -6 -18 12 -6 -4 11 -9 9 -37 2 16 -1 7 0 -10 -12 7 -27 27 -1 7 1 25 -8 -18 -20 4 4 1 27 10 16 -29
2572 -29 47 -11 18 11 -20 5 -21 -9 1 -11 -17 -24 15 -6 -7 -1 3 -18 14 -31 3 20 13 -4 5 0 -16 8 -1 13 -9 6 -8 22 39
2607 39 -20 -4 9 -20 27 -14 11 5 19 2 -24 14 16 10 -6 4 -7 -23 -8 -5 4 -5 15 2 -15 -12 7 19 -35 10 -5 -23 6 -17
$$ packed form
2358cJ5l0K6pMrpkL9k1Pj5Lk2J3JL2j5M2n1j3K6k2j9L4k3mL9k0mn%j7qJ3K9l5
2395b9M1j3j8j1K5J6nk9K6Rj4PJ6k6L2j6mj4K3k6J2JL6rNl6KJ3k2MJ7k0J6k6M4
2430B7n1pL5Nm0K5J5j2nkK4k1j9MJ6mj3j2RjRNLJ3J3lk9L2j0pK5rj3k7J4j0K6
2467El5LPJ2j4K4j3j2pJ7nKlK7Km7OK4K9m2K8k8J9K4l8OK4l6K8Kj4K0l6JKL5J3
2504C0j7k8J0J6j6J1J0j4Jj9L7j6j0J1j8J1mQl1N8k2J0m1K0rnJ7j9K9j0j1ML7
2537C0k8k3J5j2L0j8KJ5k0J8m6L9J4j7Qpj0kJ9l4N4k8QoK4l3j0kK4%lK6j7Om5
2572b9P6n8K9pl1K5k6J2J0j2opL9k1jOMk1L2m5L4J7pj7Rnj6K4rJ4k2J5j4L0J7
2607C9n9J6J3k9M7m1K5oJ4j7k6L8Koj6J0j1j6J5LRrK0j3j7LJ9J2n4M5j5j8K9k3
$$ plain form
2641 -17 19 -6 -17 -14 20 21 1 -5 -16 -22 -2 14 0 5 15 -12 19 6 -12 -20 0 -6 -9 3 23 3 5 7 -7 -11 -4 11 -2 -19 27 -24
2677 -24 1 -4 -6 12 9 4 -13 5 -25 6 18 15 -4 6 24 9 -4 5 24 2 -10 14 15 3 21 -4 26 20 -6 13 19 36 -2 -1 -10 -10
2713 -10 -19 -31 6 6 -4 -8 -12 15 -11 -22 6 16 -16 11 11 -2 11 -14 -3 -15 -18 -4 7 -24 -15 33 -17 -8 0 -20 -13 40 4 -2 8 22
2749 22 -6 -20 28 27 17 0 4 18 11 17 -17 -21 -37 16 -1 -7 -20 -1 -63 -37 34 2 11 1 5 -18 18 5 20 8 -13 -6 30 63 -19
2784 -19 -11 -18 -1 15 29 6 9 9 -17 16 -4 22 -2 38 17 0 15 -19 36 14 16 -12 27 38 29 6 -14 -23 -15 -1 -7 9 -8 1 -8 -13
2820 -13 -18 -10 1 -9 -3 2 12 -23 -28 4 -5 3 31 -16 3 27 3 13 -14 26 9 28 -5 -29 31 9 -2 5 -2 27 -26 5 5 25 22 20
2856 20 -6 -6 12 12 16 -1 23 3 -21 -11 -4 2 -30 14 -12 6 5 6 44 -11 -2 17 -4 -29 -45 -10 -14 6 11 12 10 -9 13 -19 -3 37
2892 37 10 34 -50 25 3 -12 8 -1 -6 -57 18 13 -17 -37 -15 14 -20 15 -40 -23 49 -18 -6 -33 -25 14 10 -10 47 -16 -2 17 -10
$$ packed form
2641a7L6k5j1LL4Jk0oj1oK0J6j4NJ0k7L1j3j8qK0olJ2K0k0KKj4mPJ5j3j7M6n1
2677b4K5nkJ8lnj7J8l0L1J2lj9J0J8j5j3RJ9k2j2K4Jj2J8k5L0ok6J9OJ7l8Jr%
2713a0rj2L7%j0mmK7k6j1K8J0l2K7%j3J3k5J1j2lJ4J1l1RM8n0RQk0PN3l6oJ0J4
2749B2k8j4M8jj0j7MJ4pOl4mj6N3j7oj3J9o2K6P1l2Rj0Mk3L6j3J5j2k1PL6L3q2
2784a9QpJ7J6J4k3L%k6L3k0K6k4M0k1j7J5l4N5k2Kk8L9J1rk3k0rQJ4oJ6j7Rrn
2820a3nQJ1j0ONJ0l5nL2rQK8m7J9K4k4J0k7M0j7J9l3k4O0k2j1PpK9n3L1%K0lk
2856B0k6%J8%Mj7K4k0k4J0POl2M4k6J8jJL8n5RJ9k1k5j6L5mK0NJkj9K2l2J6M0
2892C7k7K4q4P5k2j5K0rnn1P5nl0k0K2K9l4L5n5J7P2o7J2k7QL9mk0N7o3J4J9k7
$$ plain form
2925 -10 -45 0 -38 -3 11 -41 -2 1 6 -9 26 -2 32 3 13 33 28 14 -13 -3 55 -6 18 16 61 16 6 55 -22 -21 -75 -4 -88
2958 -88 19 5 -13 21 8 18 -37 47 21 -18 13 -61 55 29 11 -12 -11 11 -43 -23 19 -41 -18 -21 4 -19 -81 -20 27 10
2988 10 -22 21 -16 -39 11 38 29 1 26 -8 -22 24 -4 35 -66 -48 -4 -18 28 -31 25 -10 -8 -20 2 -21 38 -15 -31 -16 11
3019 11 20 -39 30 0 -13 -55 14 21 -19 10 17 -9 -6 22 18 -5 -12 1 0 -4 5 19 4 4 -10 -22 17 -5 -21 37 -6 -34 -4 49 16
3054 16 8 -13 -3 18 0 29 -23 14 -27 33 -4 17 33 16 -41 4 -42 -22 46 14 -7 1 5 25 -15 -17 18 20 20 -18 -21 -29 -17 8
3088 8 -22 7 -14 3 -11 -19 -1 22 8 -10 10 -24 15 -27 23 0 -4 -20 2 -4 -1 -18 8 -3 -3 -30 -18 -28 -64 -2 6 -29 -12 -62
3122 -62 12 -4 -24 17 -9 -8 43 11 -30 -21 -1 3 12 37 10 -3 -24 19 -1 -4 -5 -30 19 11 22 10 5 -32 -2 37 -1 -12 -20 -12 -26
3157 -26 -5 -13 -10 -30 -1 9 2 16 6 22 -27 -49 -43 -24 -16 8 35 7 26 -21 -8 8 9 33 30 0 16 12 -1 9 -25 5 -18 -27 -7
$$ packed form
2925a0l5M5l8L5J4n2L9LNj5L5k8L4k9J0K0nj4k7J0N8o1K4kM5m5j0M9p7Jn4P1q4
2958h8J07j4j8L4j3J0n5Q4k6l9L1p4J16k6j8k3JK2n4K0M2o0K3lK5k3o2O1M7j7
2988A0l2M3l7k3N0K7rk8K5l4j4M6k8L9j01J8M4j4M6n9N6l5Kj2K2k3N9n3j6J5K7
3019A1Rn9O9l0j3m2O9Pm0K9Pk6LK8mk3pJ3jmRJ4j5%j4j2L9k2j6N8m3k8L0N3l3
3054A6qk1J0K1j8K9n2L7m1O0l7K1J6j7n7M5m6K0O8l2k1QMK0m0kL5K%l8lqJ2K5
3088Hl0K9k1J7j4qJ8K3j4j8K0l4L9m2N0k3mj6K2oLj7K6j1%k7J2j0l6O2Ql5J7n0
3122f2P4j6k0M1k6JN1l2m1RK0MRK5k7j3k1M3k0ljk5M9qJ1j2nl7L0L9l8j1qQj4
3157b6K1qLk0K9J0pJ4j0J6m9k2OJ9QK4K7k8J9m7J3J6JK4ll0J6mj3J0l4L0k3rK0
$$ plain form
3192 -7 7 4 17 -8 -25 15 -11 52 -31 -12 -25 -23 4 13 -20 7 20 -8 1 -27 18 26 31 -19 -26 25 -6 -18 -8 -6 -4 3 -12 26 20 28 46
3229 46 43 -11 17 29 17 1 -7 4 16 -15 -23 23 23 0 -31 10 -7 -23 -1 11 12 1 -13 -6 -17 -1 1 -16 1 -33 -16 38 -14 10
3263 10 -13 41 10 -33 -4 -4 11 -11 20 -2 9 -15 2 16 -24 -4 22 -23 -20 -19 38 8 12 16 12 19 10 2 -43 -1 8 -13 -24 22 -27
3298 -27 -12 0 -5 -9 -17 -24 27 -2 9 18 15 -2 18 17 0 13 -5 10 5 21 -3 41 61 -17 19 57 -15 31 4 2 34 2 43 31 -3
3333 -3 1 7 -5 9 10 7 33 16 1 43 46 47 -22 -6 -17 0 -19 22 22 4 -16 0 28 -16 31 55 -45 6 59 -2 17 -11 0 3
3367 3 12 -5 -23 -14 18 -5 -21 2 32 -18 9 6 -37 4 -10 -8 10 -17 27 28 -9 -22 -21 9 -23 -21 -16 13 -5 1 -21 2 6 -21 16 -39
3403 -39 6 36 31 2 28 8 -13 19 -2 16 1 36 -7 -13 3 38 6 23 26 2 -28 14 47 -13 -23 55 7 9 -6 -31 36 -7
3435 -7 23 -13 22 -6 -6 -34 -10 -25 -9 -18 19 0 13 10 -23 9 -3 31 34 40 17 26 42 55 -18 -6 6 15 5 19 22 -2 25 33 42 72
$$ packed form
3192gJ4lJ3k5j7M0k6O3q3J9j3KK7Rl3K7J3k8Rk8M5QNn0pN1l1j2J0KKPj5L8oQJ8
3229D6ln4K8J2j2j6qJ1J2l1qM6%k3l1M1j7j6K2J2Jj1j4Pj1J6Kj7J7l4J7N4n2K4
3263A0k3N4l1m3K9%J5k2L1k2J1k4J7J4m0K0K6m5LJN7l0MMmPrqm5M2Rk1j1M6m9
3298b7J5J2nmqpN1k9J1Rlj7K0jj7J3j8J5nJ6k4M4K0p8L6L8p2M6k7kL2l2M1j2l4
3333cMOj2J4JlK6j7j5M2LJo9J6j1J7j9M1%j8k0J6K8m4M7K4j00N1N3o1J9k8J1L
3367CRj7j8RL2k3j6K3L0n0K7lm3M1j4KJ8k7M4Jl7j3JL0l2KNK9j8Ok2K3Mk7L7n5
3403c9M5L0nk9K6k0k1L2k1J8j5L5m3oJ6L5l2J7Lk4l0M2L3o0j0P8m8Kj5k5O7m3
3435gL0l6L5k8%k8K4j5J6rL7j9J3ll3L2j2L4LOk3RJ6J3p3J2J2Rj0J4Lk4K7QRL0
$$ plain form
3471 72 -12 35 29 27 33 -64 -25 4 23 43 -44 3 -12 22 26 -21 -47 -19 72 13 8 10 48 16 -92 15 37 -34 -18 73 9 22
3503 22 -24 5 2 41 -16 9 -46 16 50 57 -10 40 8 95 21 25 55 -42 63 14 79 -16 61 2 68 -9 -5 84 -41 58 60 -3
3535 -3 88 -20 -95 11 76 22 -24 -23 -76 -48 101 -7 -17 -22 50 11 -9 -13 -44 52 8 -55 2 1 -50 102 7 16 9 71 -70
3566 -70 43 -22 -30 44 16 50 -100 -55 -31 -38 36 21 2 99 -73 0 57 29 -10 40 15 -11 -35 6 26 9 45 36 11 -18
3596 -18 -19 -22 -1 -76 73 -23 11 3 75 -33 -12 44 42 -52 95 -9 39 -15 -1 2 -24 -46 -12 18 -45 -7 64 41 -23 41 35
3627 35 -2 10 4 2 25 26 -42 -9 -36 -20 40 13 -54 -14 33 0 -15 -8 -12 -19 -10 -24 12 41 19 -16 -8 5 9 2 40 41 21 -24 53 -17
3663 -17 9 -28 -36 3 24 37 3 -15 11 -9 -67 25 -46 -44 14 34 -5 10 -19 -7 -58 16 -14 -13 43 19 46 12 -7 -1 -17 -25 37
3696 37 3 10 -11 37 -7 -1 4 33 -17 34 7 39 54 11 1 -44 4 -28 17 11 16 10 19 8 33 57 25 12 11 -41 56 -32 30 -26
$$ packed form
3471G2q4M7okOr7L9K9J9K0q7M7j5L4Mm7k6K8R1n9nKL8l2j08J07K2p1J6R1o4J3
3503B2m6K9lL9n7K5n5O2L4Po7N0l2Q7p4ML0r7J05m9O5r5P7n9O6p7MQ9j25R9Ko3
3535cR1j08p5J06O5n4m6Jn3K8J49j08j0nP2l9k0ml1R6m4o3N7jn1J52r5RpO2j41
3566g0J13o5qP4k8L4j50M5K4pP4j5j9R7j72P3N7k8l9N0k5k6k4M1K0j7L6rk5k9
3596a8jlK1p5J49r6L4qP2j08K1N6kr4J47j04M8n4J4Lk6k2L4L0o3L8P1k3o4O4o
3627C5l7J2okK3Jo8L3k7J6O0k7o7M0M7l3j5PmpRj4L6K9k2l5QJ3MpL8Jk0m5P7p0
3663a7K6l7qL9K1J3l4j8K6k0n8R2p1KN8K0l9J5k9J2n1P4l0JN6k4K7l4j9Oj6qO2
3696C7l4Pk1M8m4ONK9n0N1k7L2J5m3j0m5M8l2M5oNoRj1K5K4l2j3jn2R7q8O2n6
$$ plain form
3730 -26 6 -65 -29 13 -5 7 31 -13 18 33 26 96 -7 77 70 37 34 18 -4 -14 12 32 25 49 23 -11 -3 28 -18 -37 4 18
3762 18 51 -20 15 4 43 43 -28 24 -3 14 -14 -44 19 -6 30 -12 16 -14 -3 -5 10 -28 -8 8 83 -9 1 23 12 -6 22
3793 22 33 62 -10 -17 10 -3 12 -6 20 -63 26 -23 -3 -3 0 -47 -22 21 19 33 -37 4 1 -3 -64 27 -33 -7 -76 35 -2 10 15
3826 15 14 -2 -9 23 18 -12 -6 -33 -27 86 -27 24 -32 -6 24 -7 36 21 -6 0 -4 35 8 6 -37 55 6 -26 14 21 -16 16 -14 -19
3860 -19 23 3 -45 -10 -6 -3 3 35 27 -29 42 8 49 15 -14 -23 1 55 -5 -30 60 -7 -27 -24 -11 25 59 38 29 -9 -4 34 -3 49
3894 49 -1 68 43 -24 -18 84 48 9 18 52 60 -12 11 46 31 -17 -15 54 -9 -24 -45 -80 15 -34 4 -38 4 -39 21 5 -3 48
3926 48 -43 73 -86 27 0 -51 6 -87 78 2 18 11 61 12 25 -35 3 32 -29 -18 23 -83 -12 29 -54 31 85 0
3954 0 6 -46 12 9 -59 34 77 -35 -20 -25 10 -9 -9 41 21 -20 -17 55 59 -28 62 2 -14 -1 -45 37 3 48 -47 16 17 -70 -2 4
$$ packed form
3730b6L2p1L6M2j8J2K4m4L1J5pP0j03Q4pl3lj6k2j0K6K0pK4k6l4QL1m6j9M1J4
3762A8L3p1L5j1L9%p1N2k7J7k8l0O3k5L6m2K8l0J1kJ5l8K0J6P5r2J0K2j1j8K8
3793B2J1K9p2pK7j3J5j8K6q3Q9m9K0%Lm7K5M3kJ4p0M1lmo1R1o0K6o9J11l7J2N
3826A5jj6pL2nl0Ok7OJ13j13N1n6K6L0l1M3j5k7OmL9k7km3R2m9l2M0Pl7L2l0n
3860a9M2k0m8L5MLOL2qn6P1l4M1l4k9rK4N4o0k5R0o7k0LJ3L6L4k1rl8NL8l7N2
3894D9n0O9k5o7OJ02l6l9RL4Qp2K3L5j5m8KO9o3j5k1l5R5m9L8m2M2m3O0j6qN1
3926D8r1J16j59J13k7n1N7r3J65p6J6pN0m9J3o0L8K9o1J1M1j06P1M1q3Q5N4q5
3954@On2N8lo8R3M3j12J5nL5j9%N0k0m1LP2Mq7R0o0j6J3m4Q2l4M5r5O3Jq7O8O
$$ plain form
3988 4 21 -5 -10 6 38 18 1 25 -41 -18 27 11 -10 -22 -2 -9 -2 4 -23 101 -5 13 -24 -44 14 20 -7 -74 -84 -28 -9 29
4020 29 13 -16 17 -1 16 20 8 38 -10 14 1 -9 47 -56 35 12 75 27 -9 60 -14 22 29 8 49 3 5 -43 -17 45 -16
4051 -16 -11 -26 15 17 -14 48 -26 -18 112 1 60 -53 33 21 -46 -1 -39 -75 26 -88 50 -31 -17 -10 -18 19 -26 27 -25 4
4081 4 31 15 34 5 1 88 -49 33 -39 48 -32 -6 -15 27 86 -2 21 68 6 -20 1 5 7 40 19 1 13 15 -17 9 34 -45 44
4114 44 -32 17 -5 -49 -20 6 47 2 28 -21 -3 10 22 -24 -21 29 27 -20 0 -20 16 -2 18 31 18 19 -2 34 3 27 10 1
4146 1 26 -14 7 16 -9 -4 4 -13 -14 -8 -35 3 3 -21 -14 -5 14 -20 0 -17 -3 -12 -20 18 12 -3 -3 5 -7 8 -5 8 -3 -12 -18 6 7 5 9 -3
4186 -3 7 22 -5 -19 -7 -29 -2 -1 16 -21 -13 -5 8 11 2 -12 13 11 3 -6 -8 -6 -17 7 -12 -14 -25 11 20 7 2 -2 -25 13 -14 -3 1 6 21
4225 21 8 5 25 14 7 -11 25 20 8 15 14 -5 18 5 11 23 16 14 5 34 24 -6 11 -19 -25 6 10 7 35 -3 16 -17 -19 2 -7 -9 -27 6
$$ packed form
3988DJ7k6nJ6L2k0j7K4o6K3M5j6k1j2K0pPOk7J24j06J8l7k0N8Ok7o7j0N6J9L8
4020B9j6k9L3j8J7Mj2L0m8K4j3j0N6j03R1k3O3m8l6O9p4L6Pk1M1m6Km8K6O2o1
4051a6Nj5M1Kl1O2p4QJ30j11N9j13Q6j2o7M5l8l6J01j14J38q1J4PqL7m5N3n2K9
4081DK7j6J9k9mQ7j37Q2p2Q7q0K6rM2N9q8K3M7o2k6K1MKL3k1j8J2Kl2K6K5p9Q9
4114D4p6M9k2m4K9K6M1m5K6m9J8J3J2m6LN0km7K0k0L6j8K0J3j3Jk1L6l1K4j7r
4146AK5m0K1Rk5NQj7jOk7L8%k4PRJ9l4K0j7J4rqL8oj5%Qj2J5j3J3j1roK4JkMj2
4186cJ0J5k7j4J2k2K7JJ7l7QQJ3Lrj4K5kqrkKj1K4j9kj1L6Rj3nmk3L8k7J1MNJ5
4225B1j3lK0j1pj8L6nj2Pjj9K3j3OJ2pkrK9j0l0J7l0oL1MlK8l8J9l3kK1rkj8L3
$$ plain form
4263 6 2 -41 -18 20 3 -16 21 9 1 8 7 28 19 7 11 14 -14 -5 27 38 -16 18 10 -14 4 -4 -2 9 11 -3 -38 -15 -21 0 -6 -2 13 4 14
4302 14 -17 -25 1 -6 -26 18 -26 8 -16 -8 -22 -11 -6 -18 10 7 27 3 15 35 10 6 2 -2 19 0 -15 5 -15 1 14 28 4 8 8
4337 8 -31 -23 -11 3 1 -23 5 -10 27 -9 26 -46 15 -18 -14 -10 -7 -6 -2 13 -19 3 7 -31 -5 10 -16 19 15 7 -8 -15 4 7 -6 9 -6
4374 -6 -19 -36 11 -26 19 11 -5 17 2 20 4 -2 0 -7 -11 16 -10 -5 -15 -10 8 14 6 5 4 -21 -13 -46 4 11 -36 -12 -22 -21 17 12 3 10 30
4413 30 -17 11 12 -16 12 -2 18 8 -28 -15 14 13 -10 -29 3 8 -13 9 3 5 -14 -24 12 -2 11 -5 -5 -7 -12 -16 16 7 -13 1 3 4
4449 4 -13 -18 -19 -15 6 -44 8 26 18 -18 22 4 -3 40 -8 20 3 3 -12 52 -11 1 0 14 -3 -15 5 5 21 -10 16 -15 23 32 -24
4484 -24 14 20 -2 -5 3 10 3 -7 -8 8 -2 10 7 -13 -9 -8 -6 8 -13 -4 16 -8 11 5 4 25 35 23 -11 1 -11 5 15 12 6 -10 4 13
4522 13 -14 14 23 -34 14 0 -28 4 -21 -2 0 19 19 -4 7 -3 -32 -11 -61 -8 -10 11 -10 21 -14 -6 17 23 23 -3 -6 -18 -36 2
$$ packed form
4263Fmm3K3L8j7j9L7j2qPjK1rj2MLk8RL2J1n4L4qk4J8qKJ1Kj4l5K3oK1oMJ5rJ0
4302A4l1qK6pk0M4m4L4k4Qj4J1Nj2K8lK0k4J2K0k5mmmK1j9j5K0k0J6J3J4k4M%
4337Hl9QJ2J4kk4K8j5L7l6L5p2O1l3MMLJMJ5l2K2Ml8K6J5k6L5mqj5pJ9Lj3J5j5
4374fj3j7M7l7M5qj6K2j5J8j6oKpmK7k6Nj0NJ8Oqjjk5Ql3N0Pm7K4j0JL8nrPK0
4413C0m7K8Jk8K8j4K0j0l6J3K9jk3j9L2Nk1K2oKj9j0L6j4J3j6%knmL2rk0J4KJ
4449Dj7njMK1n0N2J8ql6M0j8pM3m8K8j7%j5O4o3J2jJ4j7j2K0%J6l1K6l1L8Rn6
4484b4L8Ok2lQPpj0jJ6j0J2lk0MJKJ4k1RK0k4J9ojK1J0j2l4J2j2J6J0loj6J4R
4522A3k7K8Rn7M8j4k8L2k5J9KJ9%k3J1j0k9K1n0N3kK1k1L1l5QK3O%k6lj2j8L8
$$ plain form
4556 2 11 -4 -4 -18 35 -1 -4 5 -18 6 2 28 4 8 29 20 29 26 7 23 6 -9 39 -3 -17 -5 -1 -28 9 4 7 2 -8 -2 7 -19 -14 29 -25
4595 -25 12 -29 -13 -19 6 11 15 -7 20 10 2 -7 -4 -2 -14 6 -48 13 -15 -30 -21 3 -15 10 18 -45 30 -5 31 12 48 -38 -8 36 -3
4630 -3 30 31 1 -27 20 31 8 -19 9 18 -4 10 -17 -1 4 -7 30 -9 13 14 3 28 -38 49 5 34 23 25 -8 16 0 48 -64
4663 -64 -13 -22 4 -79 21 43 42 -44 -17 16 -45 -2 28 -18 19 17 -4 0 -2 76 50 39 -25 14 -9 6 -33 -44 -16 -38 -31 -17 39
4696 39 -29 -35 -4 23 -34 10 -10 -31 -46 25 23 -47 28 6 -29 4 7 25 19 9 28 39 -14 -21 53 45 -9 2 41 37 -12 -16 -5 -24
4730 -24 0 -12 -46 53 37 11 -3 19 10 1 -40 5 33 41 -34 -30 4 -35 -4 -35 -69 -15 19 18 29 3 43 39 -23 -20 8 11 12 -44 26
4765 26 43 -17 -12 1 -11 1 -11 10 40 -23 1 -31 -25 7 -42 1 30 -40 -30 -4 13 4 -16 11 -8 -20 -6 -74 -14 -45 14 22
4797 22 21 -20 -7 -1 -33 -49 -10 -7 -22 -12 -11 27 -2 18 68 2 34 -37 -68 16 -24 -16 26 -17 -13 -17 4 -22 4 -2 -14 -10 -12 13 3
$$ packed form
4556BRj5%j4N3l6lRk3K4mK6k4MK1rRlj9J6j7j5M8m2j4J2Mk7L7nLnj0ORk6NM3n4
4595b5L7m1J6oK5NMk2K7j0qrLKj2K0n4O1k8j5RK4j8K5Qo3P5l5L6j9L6q6L0M4l9
4630cL3Jl0k8M7J1k3k7K8Rk2J4k7J6Nj1L7l9K2Jj1K5o6Q7m4K9j1Kl3K4j6M8j12
4663f4N1rK6q3J00K2jq6K7L3o1M3L0m6L7kk1MkP8k6j1o4L9k3J5l9j1K8k2PJ4N6
4696C9o8oL1K7n7M4k0k1j5P1kp0P5k2l5L3LJ8oj0J9J1n3pP4qn4J1L9mm9mJ1j9
4730b4K4j2l4R9j6k6j4K2rrm1M5K8Qp5ML4l9L1l1l4N4L4jJ1k6M0mo2LK8LJn6P0
4765B6J7o0NJ3j2J2j2K1L0o3K4l2OL2m9M3K9p0J0K6J7rk0K7j9j2J4o8O0l1N9Q
4797B2jm1J3Ol2j6L9Lj5J0JL8k9K0N0o6L2p1l1Q4m0QM2m3MmK1k6K6oj2MkK5j0
$$ plain form
4832 3 -6 8 33 -31 10 25 31 6 17 3 -23 0 3 43 24 -26 27 -20 -25 20 1 2 -1 -6 22 2 18 27 1 37 1 1 -6 27 -14 -9
4868 -9 29 19 15 9 -13 -17 -36 16 -19 -5 9 4 30 11 33 -5 3 19 -11 -27 -29 25 -2 26 12 1 33 -5 -42 33 18 10 42 -12
4902 -12 -11 -39 35 0 -48 34 -26 -7 -5 57 2 35 -54 26 -7 1 -24 -9 -3 -13 3 97 -23 -5 6 -1 -55 -12 16 -50 -20 -13 -35
4935 -35 -30 -32 77 -36 17 42 2 10 58 20 1 29 20 11 -76 -7 -39 4 42 16 28 -64 49 -24 -10 -59 -43 8 -34 -18 1
4966 1 67 17 -42 -70 31 -27 41 48 -8 -12 -10 -4 -19 18 11 -24 24 2 -24 36 17 -37 59 2 61 -4 -20 16 45 28 8 11 -50
4999 -50 -2 -43 -40 -38 -11 36 54 53 30 33 -23 -43 18 -38 90 23 41 59 50 -27 -48 63 -35 19 37 -27 -11 -43 -18 -31 33 8
5031 8 31 -65 17 90 19 -82 9 16 70 21 40 55 7 9 10 30 -69 25 -32 -94 88 -39 -51 -53 -38 33 -46 24 -53 20 36
5062 36 78 -46 -33 -13 -20 -17 6 -14 0 -20 57 -31 -91 19 95 -35 27 13 -63 15 -22 19 42 -6 101 -102 -43 110
$$ packed form
4832CrJ4K5o4M1J5Ok5J1j4k6K3LM0j9n0N3m7nM5j9JlnK8k0J6Rk6L6l6%pL3m1N
4868iL8j0mok2mj9N2l5J4J4nK6j9K2l8QJ6l0j6kN4k7K8j4j1L2l8l7P5j5qL2n4
4902a2Jk8P4l5m8Q2o0J9KO2n5L3q9Q0l3Qk5J5Oj0J6R4j20J8J1pn4M3K8o6L0Pk2
4935c5NkJ09j13N3K5m0QM8l8j9K8rrq7O9l2M3L8k6J2r2J13p3J4m9J6N1m2J6J9
4966AO6n0n9k8J01n8O8Pn6mKOj5L7pl5M8k2k6O0j9n4R6n7N9o5j6L6K9j7k0Lo1
4999e0M8m1LKK7M7J8jk3Ln6k0O1n6J28o7J8J8rp7k1J11r8N4J8o4J6l2K5j3O4k5
5031HK3r6Q2P3p1j01R1PN4m9J9J5m8KJK0r9R4n7o2J82j27j2kJ5P1p9P0p7P3J6
5062C6M2j24J3K0pLK3k0J4k0P7q8o0J10P6j30O2j4p6P8l7M1K3m8J07k03N9J53
$$ plain form
5090 110 23 2 -53 55 26 -51 91 -35 45 1 0 -44 53 8 -73 82 -99 -7 40 -31 -5 58 -1 24 66 1 -35 -4
5118 -4 -3 0 17 31 49 19 60 1 15 38 -100 -71 16 -78 74 -18 9 -31 39 31 -51 -20 61 21 -39 8 83 41 -65 -19 -83
5149 -83 30 2 -19 27 87 -5 28 -36 30 -79 25 75 -35 -34 56 -6 24 24 -69 -16 68 15 17 10 -65 41 37 -65 30 -36
5179 -36 -62 8 -17 9 -62 31 46 -6 109 28 -52 40 26 61 -87 54 -43 2 -89 85 -106 -73 17 -66 64 -1 11
5206 11 3 35 68 62 44 -30 94 95 -28 70 -35 43 61 13 -64 -43 -54 26 -20 -4 56 -51 8 -19 92 10 83 68 45
5235 45 27 15 -95 -34 -10 -5 -20 -25 -92 -33 47 77 18 62 53 108 -62 -44 60 -88 83 35 -31 -68 8 28 25 -54 -5 -40
5265 -40 38 55 -18 22 40 32 -16 83 -3 -14 -89 -64 71 12 24 -7 -60 7 -23 69 -37 -11 -72 -25 0 29 59 30 89 17
5295 17 -34 29 22 0 -18 27 4 14 26 51 -20 -2 67 6 22 42 9 11 -35 45 -14 -28 -11 -68 3 -6 -7 94 42 -28 -35 -61
$$ packed form
5090A10q7k1n5J08k9p7J42j26Q0m4jm4R7m5q1J55j81R2M7p1K6O3n9K5M2o5l6L1
5118dJLJ7J4J8l0M1n9J4K3j38K9Q7r4J52r2K7m0P0qq2L1Q1m0o0M7P5m2j06M6o4
5149h3J13k8k1M6O0r2L3o4O6j09J04N0j10JR0o2L0%r3N3Q4n3Kpp5J06mj02R5o6
5179c6k6P0k5K6p1R3J5n2J15q1q0R2j4L5j48J41r7M5r1J74j91L3R0q3J30o5J2
5206A1qL2L3oj8p4J24Jj23R8j05P8J8m8p7K1j1Q0m6J6O0j07N9k7J11q2P3j5k3
5235D5j8j2j10O1K4Nj5no7N9Q0L0n9M4rN5j70J8J04j48J71m8o6l7P6K0lp9M9l5
5265d0P8J7p3M0J8qm8R9q6j1p5K5J35n9J2l1n3O7l0R2j06K6o1M7K5K9L0k9N9p2
5295A7n1O3pk2j8M5k3J0J2K5p1J8O9o1J6K0l3Km6Q0n9j4J7n7P1rjJ01n2p0pk6
$$ plain form
5327 -61 -67 54 52 50 94 10 80 -19 -92 -51 44 42 9 23 -13 52 -23 -49 -10 -6 -91 -35 19 21 -4 45 6 -21 15 47 -16 -22 56
5360 56 44 107 14 41 10 -82 -35 -12 35 -88 -48 -21 66 -6 12 57 -37 -37 7 21 -18 68 -28 -11 -19 40 97 -21 68 -11
5390 -11 -43 -6 49 -27 109 -2 5 5 -4 -29 -48 32 28 40 72 30 35 -30 20 84 61 -28 -38 12 6 30 -34 -100 45 34 80 -25
5422 -25 -23 -19 -35 22 -1 11 -26 63 70 3 45 -38 93 148 -55 -1 97 14 -93 -24 -61 -95 37 44 64 -26 36 12 -46 26
5452 26 31 -39 17 22 6 41 -99 35 106 -67 58 -110 -83 -29 -19 19 -4 0 -12 61 39 105 -132 112 91 11 -27 -30 165
5481 165 -92 -83 -30 -11 90 -28 -69 16 37 -13 -5 -29 16 49 -29 17 13 123 48 -48 -63 9 2 -86 -56 -51 -5 56 -98 -72
5511 -72 157 -78 9 -69 -170 67 -9 -65 -4 -36 -104 -57 29 -12 -16 84 -113 -3 1 -3 -12 23 10 50 -24 50 41 56 113
5540 113 -14 -36 -21 38 -75 -52 16 -25 77 81 -5 33 -14 -9 -34 -86 2 -58 18 -79 -7 -90 97 -6 -54 53 -140
$$ packed form
5327f1oJ21kkM4q4P0r9p3M1R5kl3J4l6O5p5k6L9Mq5N6N4Kk5M9l9k7L6L2o3oP8
5360E6j2O3r3K7l1r2M7K3M7j23M0K7Q7p2J8M5r4%M4J4l9Q6r6J7qN9N7j18Q9p9
5390a1l2L7N5p6J36j11P%rk5j9Q0mJ2L2m2No5N0O4k3q9j0N0oK4o4o6J45j1M6j05
5422b5KMj6N7k3J2l7Q9Po7M2q3J31N5k03N4R8q3j07O9l7l4J32PK0r0O2k4n8P2
5452B6Np0N6Nj6L5j40J34P1j73J25j68K7N4J0L8k3Mj2P3k2O6k37K44k1q0l8lJ95
5481A65k57RN3J9J01j18m1Q5K1n0Qk4M5L3p8M6mJ10p5r6j5P2pq8L0NM6O1j54K6
5511g2K29k35Q7p8j01K37p6n6O1l2o8M7Q6m1mJ00j97J10MmrL5j3M0p4P4rJ5N7
5540A13j27k2J5N9j13K3O8m1J02Mq6L8m7Nk5n2Q8o0P6r7P2q3J87j03m8J07j93
$$ plain form
5567 -140 34 -51 9 -58 102 89 18 10 -38 -28 -51 -109 -41 -41 -101 -75 -29 -15 37 0 38 29 20 -9 -97 1 5 -60 0 -33 -8
5598 -8 -3 67 -47 -61 45 -120 -12 29 -22 29 -55 1 -86 -29 28 -135 89 -57 -10 -22 19 44 -35 5 -6 -33 43 -3
5626 -3 9 28 69 -1 -35 -15 -18 -25 32 33 81 49 12 26 53 21 -40 -10 -19 33 -7 -19 -29 21 -11 -11 -50 2 28 16 33 -17 50
5659 50 60 -14 -27 7 -51 12 16 -23 -33 17 -40 105 -78 46 30 -45 98 0 -40 -16 -39 60 -4 31 -58 69 100 35
5687 35 -9 -67 -10 -110 55 -51 -35 76 32 46 -60 -45 120 -41 39 -8 16 -88 25 74 37 35 -14 -30 96 1
5713 1 0 45 -68 70 0 -26 23 104 -109 -91 4 -15 8 -41 17 -34 212 27 -64 10 37 47 -64 49 37 51 -35 12
5741 12 -97 6 31 -21 -1 -38 127 -45 -40 50 130 19 39 96 -7 -13 128 -13 -37 -112 -7 58 1 -59 51 73
5767 73 6 33 4 -57 51 -27 48 -11 7 17 -15 11 -25 35 29 20 12 53 -87 -19 43 24 -30 -92 30 11 -36 32 1 44
$$ packed form
5567a40J74q5O0o7J60j3p1qm8J0k3n8O8%o0K6M6J4N2l7L8rrk9q8R8Mo5O0l3K5
5598hNP0j14j4J06j65J08M1n1N1q4N6q7N7N7j63K24j46M7j2M1K5p9M0j1k7P6m6
5626cJ2J9M1p0l4K0lpN7JM8l2l7J4K7l2o1L0rN2m0j2j0N0l2%l9N2K6j2J7n0O7
5659E0J0p4j3L4n8O3Ml9j0N0n7J45j83J24j6p5J43r8m0K4k3R9o4L5q9J27L1o5
5687C5m4n8N7j00J65j06J6J11m4J4j06J5J65j61Q0m7K4j04J13M9l7km9j6J26r5
5713AjM5j13J38p0k6M9Q1k13J8R5j9K3m9N8n1K46j85r1P4K7J0j11J13j2J4q6M7
5741A2j09J03K5n2K0l7J65j72NR0Q0j11K0N7j03oJ41j41k4p5J05O5n7o0J10K2
5767G3o7K7k9o1J08p8P5n9J8J0l2K6l6O0orqM1j40O8O2j9n4o2J22j9m7O8l1M3
$$ plain form
5797 44 29 10 22 40 -16 19 -50 -32 -14 148 -23 53 -52 182 13 -99 112 24 9 -14 97 -42 -74 97 -16
5822 -16 -51 -4 69 36 27 97 -13 44 -95 -11 -15 117 23 -53 -53 -25 63 -58 -86 54 52 25 -93 20 -80 -67 -11 -54
5850 -54 -43 -82 -2 -36 -78 10 31 -23 -7 8 5 4 -50 -78 -57 98 0 -11 133 -76 111 -111 135 115 -24 4 -70 77
5878 77 -48 28 40 -68 12 -101 59 -34 57 -81 100 -209 29 -145 26 21 85 -57 92 -34 12 42 79 135
5902 135 46 68 21 23 26 89 95 -16 25 -115 -128 -4 18 -55 -47 -164 -70 -97 -123 136 -214 -23 111 -150 6 -54 -28
5929 -28 157 7 -46 61 11 89 4 13 67 23 69 -25 46 -135 -68 83 12 138 -89 -50 -62 46 -10 56 -3 -82 -183
5956 -183 -11 -37 -54 10 70 -27 46 61 -56 37 -18 8 -59 -110 -126 53 -137 28 25 -110 -21 -78 -52 44 -27 111 -89
5983 -89 -41 -73 -182 -33 65 -53 16 6 -78 2 29 -22 -36 14 -108 8 62 -52 64 -127 -35 -69 -38 -31 -82 -74 -83 -45
$$ packed form
5797D4j5j9J2J8n6L5o9J8J8J62j71P6j05K34j69j12K11q8j5k3J11j39l2J71j13
5822a6l5M7P3l3rP0j10N7j39Q4mJ32r4p6%K8Q8j21k8J40kk7j18J13j00J3N6m3
5850e4J1l9Q0l4m2Q8K1n4J6J5ljn4k8K1J55r8j1J44k09J87k22K46k0j39K8p4J47
5878G7j25P6J2j08Q0j13J60r3R1j38J81l09K38j74J71nO4j42J49j26M6L0L7N6
5902A35q9K2m7KLO3Oj11M1j40j3J24K2p3Qj17R4k7k6K59l50J91J34k61J56o0K6
5929b8J85j50n3J07n0P8q5RN4m4M6r4P1j81O7J51p1J26k27L9j2J08n6O6n9p9j01
5956a83J72k6j7O4O0r7P3J5j17R3n5K6o7n1j6J79j90J65lj35Q9n7K6R6p1J38k00
5983h9M8l2j09J49R8j18O9j0q4Q0K7n1j4N0j22J16N4j14J16j91R2l4L1Pn1QrL8
$$ plain form
6011 -45 35 -48 63 48 4 35 -72 84 -107 -7 -82 -48 82 153 51 -4 -78 79 -55 -14 -24 1 25 -50 51
6036 51 -3 49 87 -5 -16 -7 28 79 -23 -87 -3 36 -72 91 -49 14 61 -42 -6 79 -3 3 -49 2 43 -15 5 3 -6 -32
6066 -32 -10 25 -80 -7 -24 48 47 -60 -31 -119 56 69 46 -8 -105 -69 29 -104 15 6 46 175 14 65 35 69 -1 -36
6094 -36 52 -87 25 -30 59 -35 59 -15 -35 21 1 -16 28 -126 -48 -55 11 -21 -112 -38 -51 -25 65 59 14 -82 127 46 -52
6123 -52 15 -8 74 -45 29 -66 -14 146 -46 43 58 -108 13 13 -118 19 17 22 -52 50 75 73 24 -7 -95 -46 -49 20 -55
6152 -55 22 -45 94 -54 -57 -18 -38 -56 12 -74 -12 -67 -74 81 -204 -8 41 5 -31 -69 -63 -66 -73 -29 104 119 -97 -70 -3
6181 -3 3 -12 -94 36 7 -1 -2 -70 -9 4 -27 -75 -24 -31 -55 51 59 29 -221 -76 -71 62 -98 -7 -8 -56 -57 -50 -30 -4 -15 88
6213 88 108 -189 -37 -29 129 19 -18 49 -42 -47 36 -16 85 -21 -15 77 9 -40 -156 87 71 25 55 5 -13 -116 73
$$ packed form
6011d5Q0q3J11j5m4L1j07J56j91J00p5L4J30P1j02n5p4J57j34M1j0K5K4p5J01
6036E1n4N2L8r2j1RL5N1j02o4Q4L9j08J63j40O3M7j03L6Q5q2On2N1M1n8K0krk6
6066c2K2L5j05P3j7P2jj07K9q8J75J3k3n4r7L6R8j33J19rM0J29j61N1l0L4p0l5
6094c6Q8j39J12n5Q9r4R4p4k0N6k0j7M4j54P8pO6l2r1P4j3K6R0om5r6K09q1r8
6123e2O7k3Q2j19P4r5N2J60j92Q9J5j66J21%j31J37kNp4J02K5km9l1q8M9lO9p5
6152e5P7o7J39j48lL9k0j8O8q6O2n5pJ55k85J96M9l6l6l8OlpM4J33J5k16K7O7
6181cOj5q2J30k9qjo8O1J3l1m8N1pk4J06Ql0k50J45NJ33j60R1jm8jPK0K6j1J03
6213H8K0k97J52QJ58j10l7O7r1nQ3n2J01j06OR2o8m9j16K43j6m6L0n0j8j03J89
$$ plain form
6240 73 3 -10 14 16 68 76 19 -59 -15 -26 75 -56 87 -49 33 -98 3 15 -172 -23 63 91 -24 188 -24 -20
6266 -20 -49 -77 -119 -3 -60 100 -60 31 -20 5 58 0 -78 28 -50 42 -34 71 4 15 -41 61 36 64 62 -89 12
6293 12 46 46 -18 -46 -30 14 49 -36 -51 -36 -19 82 -57 -11 47 28 9 -22 -26 -27 -84 -49 -27 3 26 58 67 0 -50 32 -60
6324 -60 52 -20 -26 23 -16 -20 15 45 106 4 14 64 35 -17 -46 -5 -7 38 -7 -40 -4 57 -52 11 -11 42 28 -16 83 -20
6354 -20 -27 -4 -101 -92 -14 29 -83 54 14 -101 -34 23 13 -29 14 -50 -15 101 24 -82 42 -93 -91 25 48 68 -26 85
6382 85 -68 40 144 66 12 56 -130 3 21 7 -132 -14 78 184 31 -24 38 -139 -70 -5 7 -48 -14 46 -68
6407 -68 -13 -60 -169 -36 -6 -5 16 14 -29 30 21 -10 1 -70 -70 -125 -4 21 25 -28 -38 34 -25 -77 13 51 44 0 -30 113 22
6438 22 -42 33 36 120 -114 14 -31 -28 -3 52 42 -75 69 -22 17 -148 -58 -47 -64 116 22 -113 58 153 -20 129
$$ packed form
6240G3p0j3K4KN2Qn7p8M4j1J01j31J43j36Q2j31J01J2j87J49Q6K8j15K12k12M
6266b0k9k8m2J16n7J60j60R1n1K5N3n8p8J06p8R2p6J05o7J1n6J02k5K8kj51J01
6293A2L4%o4k8J6M4L5q5j5J5J7J01j39M6N8j9j9l1mjn7L5K2L0K3L2Ro7n0Q2r2
6324f0J12p2oM9l9mL5L0O1j02J0N0k9n2k9M1kM5m5l3L6O1j09O3k2N3j4m4R9j03
6354b0pK3r7RP8M3j12J37m0j15O7N7j0m2M3o4L5J16p7j06J24j35KJ16K3K0r4J11
6382H5j53J08J04p8n4M4j86J33J8j4j39J18R2J06j53n5O2j77O9O5J2n5L4O0j14
6407f8N5m7j09J33L0JK1km3N9rl1J1p1%n5J21K5Mn3j0P2n9n2R0L8pm4l0J43r1
6438B2o4P5LQ4k34J28m5LK5N5j0j17J44r1L9j65R0J1j7J80r4j35J71R5j73J49
$$ plain form
6464 129 -36 80 -68 -79 108 24 -22 22 -16 -18 -78 -5 -96 -51 -125 -43 91 3 -45 6 -64 44 33 106 10 32 46
6491 46 55 -102 139 123 -25 -96 32 53 -62 57 30 -7 22 10 16 -22 14 26 -39 9 -43 -39 -7 16 74 53 29 -117
6519 -117 42 -106 62 39 74 60 88 37 -4 87 -39 70 -7 2 -4 61 -102 -48 50 63 -37 73 91 54 -57 27
6545 27 -93 -86 0 37 -28 -64 30 -85 65 -22 9 -67 72 72 55 -38 -55 -16 -37 38 -12 -70 -17 10 14 141 18 3 20
6574 20 66 -15 -61 -22 -85 32 29 38 -16 15 59 39 66 37 12 6 24 43 -36 3 22 29 -100 -40 -42 -10 -53 -52 42 -54 -13 31
6606 31 43 28 -59 -23 -34 -19 -42 26 -44 -33 31 -11 6 -23 -82 -69 41 -9 -42 12 -22 102 -56 44 50 -51 -73 -35
6634 -35 -40 -29 -31 41 -29 7 67 -35 19 39 -2 13 -14 -29 -24 15 -34 32 7 14 37 58 -25 35 19 -52 18 -33 47 12 19 -81
6666 -81 40 -5 -37 -6 39 4 6 25 -74 -5 25 58 -20 -16 -1 -67 -20 -1 -65 -40 -19 57 -23 -13 21 62 49 41 137 -45 -88
$$ packed form
6464A29j65J16j48j1J87q4m6M4l8ko0P3r1M5p4Q2J34q8m8N1p0J08j1P3r6K2J4
6491D6Rj57K41j6j48p1J28K1j15J19k7l7K9j2Ol8L6J2o5M8n2ML2K3N8k1k4j46
6519a17J59j48J68k3L5j4K8n1m1R1j26J09p7RoO5j63N4R8J3j00J10J8l7j11Q4
6545B7j20PQ6L7o5l6R4j15J50q7L1p6J39%j7r3j7L9k1P5n0n8N3K7MJ27j23j5J7
6574B0M6q1m6L9o3J17lRn4L1M4k0K7k9k5oJ8J9p9L9J9Pj29O0kL2m3JR4r6M1M4
6606C1J2j5q7L6j1J5k3O8p0J1O4m2J7k9n9J3J10n0l3N4l4J24j58J00Oj01k2L8
6634c5nJ1kP2p0L6O0j02N4K0m1J5k7j5NL9m9O6k5PK3K1q3O0j6p1P0n1Q0l5Pj00
6666h1J21m5l2L1M5l5KJ9r9O9L0L3p8MJ5o6M7J9o4K5K1P6q0J0L4M1j3qR6j82m3
$$ plain form
6697 -88 26 55 -8 -29 -32 51 13 39 13 -105 -59 -16 -4 -11 -14 26 12 8 -50 36 -44 36 64 78 -25 -5 -27 34 22 -38 47
6728 47 50 98 23 -45 -22 9 -3 107 47 26 -39 -1 -41 -30 -69 43 36 -20 -15 -2 90 16 52 -68 -31 24 18 81 -25 -9
6758 -9 41 -29 12 89 16 -53 7 -19 7 28 -9 87 63 73 -41 -8 -37 38 18 -99 -5 -2 59 84 -14 -74 51 -11 20 14
6788 14 -10 46 -49 -52 19 -55 100 53 -8 36 -63 41 0 -48 -6 -54 16 -15 -45 10 6 42 -8 -26 -21 -119 8 -68 -55 -36
6818 -36 38 -6 35 -6 15 41 4 -27 31 -2 -49 6 7 39 11 -4 -22 21 -27 94 -27 14 22 -4 3 -5 16 -5 -14 69 2 -43
6850 -43 39 -24 -25 47 -28 7 -29 34 -51 63 17 -55 29 42 -1 2 -8 1 -1 -43 5 -29 -34 -128 61 -23 21 75 -4 99 117
6881 117 -101 32 21 -17 46 4 58 -35 -30 5 -25 -8 -94 -62 -34 -28 -19 18 7 34 54 85 -39 19 79 -47 25 51 -47
6910 -47 70 -29 57 -39 65 -7 57 -25 -1 27 9 -16 -43 49 -23 33 4 49 -40 3 -2 -44 -10 66 -47 5 6 -39 3 43
$$ packed form
6697h8J14K9o3k1lQ3l8K6k6j18M6M3J2plM0j4mn8Q6q0Q0K8J4j03K0k2O1j2o0Q5
6728D7LM8p5o8K3L1j2J10o0k1o5L8m0J1l9J12pn6NJ3R2p4L6j20L7N5oO3j06J6
6758iN0p0M1P7p3o9O0k6K6K1l7R6k4J0j14L3k9P5k0j17R4LO1K5r8o0J25o2L1o
6788A4k4N6r5lP1p4J55m7o1M4r9J04m1m8M2m8P0l1l0N5mL6n0j8Nr8J27p6J3J9
6818c6P4m4M1m1K1K6l7l1N8l3m7N5JL2k8j5j8M3m8J21j21M1Qk6PqK1k1rQ3o7m5
6850d3Q2o3jP2p5L5l6O3q5J14m6p2Q4J3m3Lj0Rkm2M8l4nr4J89q4M4N4p9J03J8
6881A17k18J33j1l8O3m2N4r3NL5l0J7q6L2K8ORL7j1K7K0L1j24N8O0j26P2K6r8
6910d7J17r9Q6r6J04p2O4q2K4K8j8k5k7R2p2N6k9M5q9M3nm2L4P6j13N2Jm5M2M0
$$ plain form
6940 43 -42 40 -25 -69 13 68 21 43 6 69 -3 -24 12 46 5 16 56 -14 -8 34 17 -99 -15 21 -78 37 17 -5 -8 23
6970 23 -13 -52 15 88 28 40 -59 -64 -27 -89 -19 -31 -41 -27 92 78 -35 83 -49 69 12 22 22 -48 -47 122 -75 134
6998 134 -17 3 26 61 22 -4 90 17 19 26 7 -9 -60 -68 4 -24 -17 -95 17 -7 25 -38 -78 36 41 9 76 24 50 63 -63
7029 -63 147 85 -67 81 -94 -40 -70 74 -61 100 -116 -62 -48 48 -13 74 -39 116 40 13 -45 29 62 -45 -3
7054 -3 37 -26 6 -41 -13 -26 7 33 -43 -45 73 -10 -132 -73 -28 102 145 -169 2 -34 -75 20 6 -22 52 62 -41 6
7082 6 -128 -30 83 57 -35 22 23 -63 106 75 140 -73 152 -94 62 42 -109 9 -29 -176 95 146 38 33 -89
7107 -89 6 -55 17 23 -4 -66 -13 17 -85 41 41 31 -20 -107 54 -37 40 -115 -69 -98 24 63 109 88 197 31 -44 -35
7135 -35 -102 45 -54 31 57 -72 -52 145 27 103 44 137 23 -12 -8 100 -4 -77 28 -61 88 12 67 -50 46 -22
$$ packed form
6940D3q5Q2o5m4Q2N5m7K2l7O3p2k1L6L4m1J1M0p0OM2j7j16Q4L6r9J15k0k2lL1
6970B3l6l9O7P3o0J2r9nL7o2P0j2j0J4J19j4j13J18j32J18n7J0%p0JJ69j97K09
6998A34j51K0K3L5l9k6R4p3KPj9j6n1qP2k8Pp8J12k4L2o3m0J14Nl2O7n2K6J3j26
7029f3K10o2j52J48j75N4l0J44j35J61k16N4J4R6o1Q7j13J55p6k7n8P4L3j07M2
7054cM0o3L2m7K8j3L3K6p6kJ18q3j22N9M5J30M3l14J71l6m1R5j4k8P4J0j03M7
7082Fj34R8J13k6r2N7Jq6J69l1O5k13K25k46J56k0j51J18l8j47K71N1j08nj22
7107h9R5o1P2Ok7o2N3L0j02J26%j0n1q7J61r1P7j55M6k9J22L9M6k1J09j66p5R
7135c5o7J47r9Q5K6j29K0J97j18P6n9R3j14l5MJ08j04p3J05q9J49p6N5j17R6o8
$$ plain form
7161 -22 -21 73 -117 29 30 -43 -28 -10 -10 -2 33 48 72 0 16 80 108 61 10 -24 24 -31 18 -25 148 48 3 95 -56 40
7191 40 -2 -46 -7 33 7 87 -52 133 1 33 67 -21 53 30 -111 28 -24 -13 -25 -4 13 45 42 -63 10 -7 -59 -9
7219 -9 48 -23 84 24 40 -41 6 31 -88 10 -79 41 -87 77 -52 -77 -13 -36 15 97 54 -9 49 80 1 -56 -52 -20
7247 -20 33 -55 16 -16 30 55 -99 -103 119 -59 75 -37 -32 3 42 -10 -12 32 9 -34 70 50 -90 -73 -33 -24 25 60 179
7276 179 -68 68 9 83 69 46 22 117 -99 -82 -8 5 -133 115 -93 -41 40 -73 3 45 51 10 -39 -123 -130 -8 23
7303 23 -47 -31 57 63 -71 -50 -38 -93 -83 12 72 110 -89 -27 -15 -11 18 -27 -69 52 -16 -18 43 -3 106 -37 36 41 15 85
7333 85 23 43 -38 -25 13 16 47 78 82 6 -12 -27 145 -2 -26 75 -37 -33 72 -2 108 21 -18 -16 55 69 -13 24 -6
7362 -6 74 80 24 89 -21 25 -32 24 94 9 49 35 -32 -26 17 21 43 -19 48 41 -17 -43 5 10 94 13 -120 -46 -71 -95 97 -43
$$ packed form
7161b2JR4j90J46Jp3J5J8%QL5J5K4p2J6O4K8m7n1l4M8n5M9m3J73j00m5R2j51R6
7191D0m2m4L9M0k6Q0j39J85j32L2L4q8P4k3j41J39n2J1j2K1J7L2lj05P3j7n2N0
7219iN7p1J07o0J6q1M7K5j19R8q9J20j28J64j29k5O4k3N1Q2m3o3N8L1p9n7ML2
7247b0N3q8P1l2M6K5j54mK22j78J34j12NL5L9n2kM4k3m3J04k0j40J7M0RM9L5J19
7276A79k47J36n9P4j4k3k4R5k16J7P4J3j38K48k08N2Q1j13P6M2Om1m9q4pJ22L1
7303B3p0J6Q8Oj34K1J2n5J0R5O0L8j99O2J2MK9m5m2J21o8kO1m6J09j43P3Nk6P0
7333H5o2K0q1J3L8LL1L1Mp6j8j5J72j47k4J01j12MJ05p4J10q7l9KP1J4q2L7l0
7362fQ0On6O5j10M6n7N6P0q5M0j4o7OM3MK2o2O7pn8k6M8NQ4q1j33P4k5k4J92j40
$$ plain form
7394 -43 87 88 48 8 -63 -49 -29 -70 -54 0 71 -25 -41 -66 -60 39 -70 -45 39 5 37 49 -15 32 -31 40 -91 -104 20
7423 20 -38 -96 -24 -102 -87 -42 65 -64 7 -70 -75 5 99 18 102 126 15 -27 -7 28 -60 -87 -38 10 -49 28 -39 -50 -42 -32
7453 -32 -32 -95 -13 -61 -13 7 -107 131 -93 -93 72 27 29 -57 -29 0 24 30 107 -44 5 46 -6 -38 91 15 23 -3 36 -70
7483 -70 -17 -61 -23 -51 25 44 -5 -13 45 41 -112 70 -25 7 25 16 -80 42 9 -57 -24 -32 3 -33 -57 76 -75 16 102 96
7513 96 -8 -20 -12 -99 64 55 2 -42 31 33 82 -2 14 18 -15 -31 -8 10 48 40 71 38 8 -6 -24 16 -32 -38 85 -23 -97
7544 -97 -8 110 39 5 52 3 37 -35 54 71 -39 -37 -13 9 -50 13 10 42 -56 24 15 34 -38 -13 8 2 6 -25 89 -2 -14
7575 -14 -8 16 7 9 64 31 -17 0 22 14 -9 11 29 2 27 13 -19 -20 22 -18 -6 4 -20 17 -18 -1 -27 -25 3 -24 2 1 8 -2
7609 -2 35 4 7 37 30 -18 -3 35 0 0 2 20 -9 28 15 -8 -5 -10 -6 -11 19 -28 -3 4 -42 18 12 20 -5 -3 5 3 15 5 -16 -13 -8 -2 -12
$$ packed form
7394d3J30Jm0m0p1J4K0m1J6N4P1r6j6k5OR9j09K5Q4l4L2J2o4M7o3P1j31j3J24
7423B0n8n8P2p8J5M5J07j29P1p7nQ0R4q1Q4K4j11m2K0L5q8k7M9M8n9P7o7j1QJ0
7453c2%o3Q2m8M8K0j14K38k24%J65m5Kq6K8K9K4OP7j51M9M1n2l2J29p6Qk6L9j06
7483g0N3m4L8k8P6J9m9qN8mj53J82r5L2J8rr6J22l3o6L3qL5l6k4J33j51R1Q6o
7513I6j04j2Qq7J63rn3m4P3KM9q4J6Ml3j6K3J8L8qL1l3l0j4j8M0m8oJ23j08p4
7544i7Q9J18p1l4M7m9L4p2Q9J7j10KK4K2n9O3lL2r8Q0rJ9p2K5K1oMl1J14r1j2
7575a4OK4rKN5l3m8J7K2qk3K0J8k7K5j4l2jM2m0J2J0k4L7l5J7k6KK8k7K6jPj0
7609bL7l1LL0pm8J5L8l5%KJ8k9L7j3k3LnMnL0m7K5Pm6O0oQk5KQkJ2j0k1LNOj0
$$ plain form
7648 -12 1 -27 0 1 25 4 11 -4 6 -16 3 -22 -6 14 6 3 -16 -9 8 29 -18 13 5 -21 6 17 -31 -11 7 -17 5 -5 1 -5
7682 -5 -18 10 11 -2 18 1 -1 14 1 20 5 11 -4 3 -2 14 15 -32 -31 21 -9 -2 -16 -8 -8 -12 13 -8 -4 16 2 -12 4 -18 5 -9 5
7719 5 -14 0 4 23 -15 10 -7 19 13 -2 -2 5 14 3 9 4 -6 -3 -1 -5 3 -9 15 -8 9 -18 9 28 3 -4 22 17 9 -11 -12 -30 -2 17
7757 17 -34 -23 -12 -12 -17 15 -9 25 2 -36 -9 23 22 -3 30 37 -3 12 23 -8 28 4 0 -2 2 0 -10 -4 16 -7 -23 -2 4 20 3
7792 3 10 -21 -4 -21 4 31 -5 -3 -4 -3 12 -1 -11 7 -12 1 28 15 19 12 21 3 15 -14 -20 10 13 7 -17 -8 14 19 -6 -4 -21 4 -7
7829 -7 -25 18 3 2 -7 -32 10 -11 4 5 -1 6 -4 14 -7 -10 -24 -12 36 -11 3 7 18 3 32 -1 -1 -4 28 12 -1 -25 10 12 36 -15
7865 -15 -5 -2 3 0 7 -11 8 12 10 -3 8 -9 17 -3 -17 13 30 20 -1 22 20 -6 -15 -8 -14 -18 11 13 -4 2 18 16 6 4 4 -7 18 -11
7903 -11 6 21 17 12 42 17 3 19 3 1 14 24 27 29 21 15 2 -2 0 29 7 5 -28 1 -15 12 0 1 4 20 11 -6 -2 -11 33 -12 -7 -22
$$ packed form
7648a2J3k8K7JK4k1Pj5J0k2J9k5J6K0qlj9PJ7K1m7L1qk6K7J1m8K0J8k4K2j0Oo
7682ej3K8Jj3K0j7kJ5j3J9j5Oj5PnJ6Jm7JN2l0Pj4Q%mK5k1MK0j4j4J6k2K3j4J4
7719Ej9J4MJ9l8K5j7K6oj5%PRj1Onj0LKmQj2K4k3J7k7K7J9k5pK6nqk0jj8K8J9
7757A7n1J1J1%nL2k4L4k3l8K7L2jk5L3Pm0J5J1l1L6k4mkMkj0OK0k3j6K1OJ6j7
7792CPl1J7j7K5K7l6KjJJ5j3j0J8j9J3K7j3MpRj8J2k9oL0Lok4RK2Nk5Kj7K5j1
7829gj8M3j5jrk5M2k1J5JoPj0J8k1lj4J2M8m7J4MJ1j5K9l3%lL2j6j3k4L5KK4n1
7865a5J0LNlPj8J9Mkj3J1j7K6k0j4L0J7j0k1K3kk6rPomK9Kj7OJ6kj0k%j1K5k9
7903a1J7J5mnL0k5j4J6j6kJ3J0LKqoj3mKK9k2kl3K9j6K7j2JLJ6rj7MrM4m5Nj5
$$ plain form
7941 -22 8 5 0 -4 -11 8 7 0 -2 -8 0 17 8 -28 -13 19 18 29 30 11 -2 5 15 42 -12 -5 27 -20 -3 -3 9 17 -16 -10 -8 11 -1 12 -16
7980 -16 -3 30 3 -2 -9 24 3 24 -1 -10 -8 11 -18 -12 23 32 -7 -5 4 -1 14 0 14 -24 -5 -12 12 -28 -16 28 0 -24 20 11 -5 -16
8016 -16 14 14 38 -3 -1 10 -12 -15 -28 -12 2 0 4 -8 17 23 -11 32 -9 13 -9 -16 0 17 0 -20 8 -30 3 -5 31 18 -12 -22
8050 -22 3 -3 -11 24 14 18 -27 27 11 5 -40 -24 1 16 1 46 -7 30 15 6 8 6 -6 -55 29 22 -28 7 -17 3 -22 8 3 28 37
$$ packed form
7941b2L0lnmpJ9jpkoQJ7rl6J5L2jJ1Jj9j3PJ0K7n4PL2m7J7%J2Ql3OKJ9j2J3k8
7980a6J3L3k7npL3k1K1k5rKJ9k9OL5Rl9KRnJ5j4J4l8J9pK4m0J2M4k8k4M4rj6j1
8016a6L0%K4m1KJ1k2lj3J6J4kMj2K5Ol4M3m1K2k2pJ6J7j7k0K8l8L3qL6j3l0j0
8050b2K5oqL5j0Mm5N4j6om5J6K5J5j5M5n3L7j5rKkj2m9Q4pn0L5k4K0k5L0nK5R
$$ [...]
8191b3
##END NTUPLES=NMR FID
##END=
