##TITLE=1H_SR63_k
 D2O, 8 sc, 
 2.06.2021
##JCAMPDX= 6.0         $$ Bruker NMR JCAMP-DX V2.0
##DATA TYPE= NMR FID
##DATA CLASS= NTUPLES
##ORIGIN= UXNMR, Bruker Analytische Messtechnik GmbH
##OWNER= root
$$ XWIN-NMR		Version 3.5
$$ Wed Jun  2 12:37:23 2021 Russian Standard Time (UT+4h)  she@DPX200
##.OBSERVE FREQUENCY= 200.131506
##.OBSERVE NUCLEUS= ^1H
##.DELAY= (6, 6)
##.ACQUISITION MODE= SIMULTANEOUS
##.ACQUISITION SCHEME= undefined
##.AVERAGES= 8
##.DIGITISER RES= 18
##SPECTROMETER/DATA SYSTEM= spect
##.PULSE SEQUENCE= zg30
##.SOLVENT NAME= D2O
##.SHIFT REFERENCE= (INTERNAL, D2O, 0, 15.7039)
##AUDIT TRAIL= $$ (NUMBER, WHEN, WHO, WHERE, WHAT)
$$ ##TITLE= Audit trail, XWIN-NMR		Version 3.5
$$ ##JCAMPDX= 5.01
$$ ##ORIGIN= Bruker BioSpin GmbH
$$ ##OWNER= she
$$ F:/spectra/data/she/nmr/H-F/1/audita.txt
$$ ##AUDIT TRAIL=  $$ (NUMBER, WHEN, WHO, WHERE, WHAT)
(   1,<2021-06-02 12:36:28.09 +0400>,<she>,<DPX200>,
      <created by zg, POWCHK disabled, PULCHK disabled
       configuration hash MD5:
       00 E9 B6 7A A2 85 ED C7 34 08 36 98 17 FE 4E 26
       data hash MD5: 16K
       5A 70 4B C7 EA AC 76 39 4D C8 72 D9 71 B4 94 CE>)
$$ ##END=
$$ 
$$ hash MD5
$$ ED 17 DC 14 83 43 D3 0D 39 94 FF AF 88 CE 12 65
##$RELAX= 
##$RELAX= 
##$RELAX= 
##$RELAX= 
##$RELAX= 
##$RELAX= 
$$ Bruker specific parameters
$$ --------------------------
##$DU= <F:/spectra>
##$EXPNO= 1
##$NAME= <H-F>
##$PROCNO= 1
##$TYPE= <nmr>
##$USER= <she>
##$AMP= (0..31)
100 100 100 100 100 100 100 100 100 100 100 100 100 100 100 100 100 100 
100 100 100 100 100 100 100 100 100 100 100 100 100 100 
##$AQSEQ= 0
##$AQ_mod= 1
##$AUNM= <au_zg>
##$AUTOPOS= <>
##$BF1= 200.13
##$BF2= 200.13
##$BF3= 200.13
##$BF4= 200.13
##$BF5= 200.13
##$BF6= 200.13
##$BF7= 200.13
##$BF8= 200.13
##$BYTORDA= 1
##$CFDGTYP= 0
##$CFRGTYP= 5
##$CHEMSTR= <none>
##$CNST= (0..31)
1 1 145 1 1 1 1 1 1 1 1 1 1 1 1 1 1 1 1 1 1 1 1 1 1 1 1 1 1 1 1 1 
##$CPDPRG= <>
##$CPDPRG1= <>
##$CPDPRG2= <>
##$CPDPRG3= <>
##$CPDPRG4= <mlev>
##$CPDPRG5= <mlev>
##$CPDPRG6= <mlev>
##$CPDPRG7= <mlev>
##$CPDPRG8= <mlev>
##$CPDPRGB= <>
##$CPDPRGT= <>
##$D= (0..31)
0 1.2 0 0 0 0 0 0 0 0.06 0 0.03 0 0 0 0 0.0002 0 0 0 0 0 0 0 0 0 0 0 0 
0 0 0 
##$DATE= 1622622987
##$DBL= (0..7)
120 120 120 120 120 120 120 120 
##$DBP= (0..7)
150 150 150 150 150 150 150 150 
##$DBP07= 0
##$DBPNAM0= <>
##$DBPNAM1= <>
##$DBPNAM2= <>
##$DBPNAM3= <>
##$DBPNAM4= <>
##$DBPNAM5= <>
##$DBPNAM6= <>
##$DBPNAM7= <>
##$DBPOAL= (0..7)
0.5 0.5 0.5 0.5 0.5 0.5 0.5 0.5 
##$DBPOFFS= (0..7)
0 0 0 0 0 0 0 0 
##$DE= 6
##$DECBNUC= <off>
##$DECIM= 32
##$DECNUC= <off>
##$DECSTAT= 4
##$DIGMOD= 1
##$DIGTYP= 9
##$DL= (0..7)
0 120 120 120 120 120 120 120 
##$DP= (0..7)
150 150 150 150 150 150 150 150 
##$DP07= 0
##$DPNAME0= <>
##$DPNAME1= <>
##$DPNAME2= <>
##$DPNAME3= <>
##$DPNAME4= <>
##$DPNAME5= <>
##$DPNAME6= <>
##$DPNAME7= <>
##$DPOAL= (0..7)
0.5 0.5 0.5 0.5 0.5 0.5 0.5 0.5 
##$DPOFFS= (0..7)
0 0 0 0 0 0 0 0 
##$DQDMODE= 0
##$DR= 18
##$DS= 0
##$DSLIST= <SSSSSSSSSSSSSSS>
##$DSPFIRM= 0
$$ [...]
##$SUBNAM2= <"">
##$SUBNAM3= <"">
##$SUBNAM4= <"">
##$SUBNAM5= <"">
##$SUBNAM6= <"">
##$SUBNAM7= <"">
##$SUBNAM8= <"">
##$SUBNAM9= <"">
##$SW= 16.9725357007746
##$SWIBOX= (0..15)
0 0 2 0 0 0 0 0 0 0 0 0 0 0 0 0 
##$SW_h= 3396.73913043478
##$TD= 16384
##$TD0= 1
##$TE= 0
##$TE2= 300
##$TE3= 300
##$TEG= 300
##$TL= (0..7)
0 120 120 120 120 120 120 120 
##$TP= (0..7)
150 150 150 150 150 150 150 150 
##$TP07= 0
##$TPNAME0= <>
##$TPNAME1= <>
##$TPNAME2= <>
##$TPNAME3= <>
##$TPNAME4= <>
##$TPNAME5= <>
##$TPNAME6= <>
##$TPNAME7= <>
##$TPOAL= (0..7)
0.5 0.5 0.5 0.5 0.5 0.5 0.5 0.5 
##$TPOFFS= (0..7)
0 0 0 0 0 0 0 0 
##$TUNHIN= 0
##$TUNHOUT= 0
##$TUNXOUT= 0
##$USERA1= <user>
##$USERA2= <user>
##$USERA3= <user>
##$USERA4= <user>
##$USERA5= <user>
##$V9= 5
##$VALIST= <valist>
##$VCLIST= <CCCCCCCCCCCCCCC>
##$VD= 0
##$VDLIST= <DDDDDDDDDDDDDDD>
##$VPLIST= <PPPPPPPPPPPPPPP>
##$VTLIST= <TTTTTTTTTTTTTTT>
##$WBST= 1024
##$WBSW= 4
##$XGAIN= (0..3)
0 0 0 0 
##$XL= 0
##$YL= 0
##$YMAX_a= 195531
##$YMIN_a= -185439
##$ZGOPTNS= <>
##$ZL1= 120
##$ZL2= 120
##$ZL3= 120
##$ZL4= 120
##$ABSF1= 10
##$ABSF2= 0
##$ABSG= 5
##$ABSL= 3
##$ALPHA= 0
##$AQORDER= 0
##$ASSFAC= 0
##$ASSFACI= 0
##$ASSFACX= 0
##$ASSWID= 0
##$AUNMP= <proc_1d>
##$AZFE= 0.1
##$AZFW= 0.1
##$BCFW= 1
##$BC_mod= 2
##$BYTORDP= 1
##$COROFFS= 0
##$CY= 11.3945322036743
##$DATMOD= 1
##$DC= 2
##$DFILT= <>
##$DTYPP= 0
##$F1P= 15.9154993809931
##$F2P= -4.1035820241983
##$FCOR= 0.5
##$FTSIZE= 0
##$FT_mod= 4
##$GAMMA= 1
##$GB= 0.15
##$INTBC= 1
##$INTSCL= 1
##$ISEN= 128
##$LB= 0.24
##$LEV0= 0
##$LPBIN= 0
##$MAXI= 10000
##$MC2= 0
##$MEAN= 0
##$ME_mod= 0
##$MI= 1.114404
##$NCOEF= 0
##$NC_proc= 0
##$NLEV= 6
##$NOISF1= 3.799351
##$NOISF2= 2.8
##$NSP= 1
##$NTH_PI= 0
##$NZP= 0
##$OFFSET= 15.70392
##$PC= 1
##$PHC0= -11491.88
##$PHC1= 18.00099
##$PH_mod= 1
##$PKNL= yes
##$PPARMOD= 0
##$PSCAL= 0
##$PSIGN= 0
##$REVERSE= no
##$SF= 200.130013532006
##$SI= 16384
##$SIGF1= 3
##$SIGF2= 2
##$SINO= 400
##$SIOLD= 16384
##$SREGLST= <1H.CDCl3>
##$SSB= 0
##$STSI= 0
##$STSR= 0
##$SW_p= 3612.71676300578
##$SYMM= 0
##$S_DEV= 0
##$TDeff= 0
##$TDoff= 0
##$TI= <>
##$TILT= no
##$TM1= 0
##$TM2= 0
##$TOPLEV= 0
##$USERP1= <user>
##$USERP2= <user>
##$USERP3= <user>
##$USERP4= <user>
##$USERP5= <user>
##$WDW= 1
##$XDIM= 8192
##$YMAX_p= 0
##$YMIN_p= 0
$$ End of Bruker specific parameters
$$ ---------------------------------
##NTUPLES= NMR FID
##VAR_NAME=  TIME,          FID/REAL,        FID/IMAG
##SYMBOL=    X,             R,               I
##VAR_TYPE=  INDEPENDENT,   DEPENDENT,       DEPENDENT
##VAR_FORM=  AFFN,          ASDF,            ASDF
##VAR_DIM=   8192,          8192,            8192
##UNITS=     SECONDS,       ARBITRARY UNITS, ARBITRARY UNITS
##FACTOR=    0.0002944,     1,               1
##FIRST=     0,             0,               0
##LAST=      2.4114304,     0,               0
##MIN=       0,             -185439,         0
##MAX=       2.4114304,     195531,          0
$$ Real data points
##PAGE= N=1
##DATA TABLE= (X++(R..R)), XYDATA
0 0 0 0 0 0 0 0 0 0 0 0 0 0 0 0 -6 8 -8 8 -8 11 -15 17 -19 23 -29 32 -37 42 -50 57 -65 74 -84 96 -107 121
36 121 -136 152 -169 189 -210 234 -259 285 -317 351 -386 427 -470 518 -570 629 -692 765 -845
55 -845 935 -1042 1161 -1298 1464 -1665 1911 -2226 2639 -3211 4063 -5459 8160 -15350 78118
70 78118 195531 49044 -116302 -185439 -65363 109838 188404 83208 -93565 -183881 -94118
81 -94118 82711 184255 107517 -66840 -178271 -117320 52391 172621 126624 -37535 -166364
92 -166364 -135754 21161 156852 141000 -8842 -149973 -148373 -8767 137595 150591 20145
103 20145 -129458 -155795 -35841 116474 155668 46700 -106045 -157316 -59650 93447 156305
114 156305 70940 -80629 -153821 -80566 68866 152311 91208 -54864 -146794 -97694 43566
125 43566 143401 107775 -28906 -135728 -112237 17849 131052 119368 -4008 -122095 -123094
136 -123094 -7115 114574 127097 19369 -106014 -130095 -31354 95780 130809 41243 -87516
147 -87516 -132721 -52666 75860 130743 60662 -67068 -130867 -70939 54956 126966 77720
158 77720 -45483 -125006 -85712 33784 120338 91822 -23346 -115516 -97449 12849 110284
169 110284 102825 -1615 -103165 -105898 -7912 97444 110345 19110 -88851 -111174 -27408
180 -27408 82120 113686 38072 -72736 -113545 -45786 64835 113828 54802 -55469 -112597
191 -112597 -62480 46449 110420 69189 -37366 -108501 -76451 27373 103998 80978 -18918
202 -18918 -101139 -87205 8568 95328 90454 -185 -90633 -94962 -9348 84008 97042 17881
214 17881 -77814 -99544 -26622 71015 100775 35105 -63089 -100996 -42359 56246 101453 50744
226 50744 -47268 -99918 -56682 40199 98805 63836 -31094 -95659 -68873 23410 93174 74841
238 74841 -14614 -89334 -78835 6510 85028 82757 1751 -80504 -85996 -10030 74873 88116
250 88116 17660 -69745 -90466 -25843 62499 91049 32448 -56612 -91843 -40459 49238 91056
262 91056 46331 -42286 -90644 -52709 34849 89062 58342 -27368 -86685 -63576 19716 84132
274 84132 68479 -11826 -80378 -72147 4549 76959 75979 3347 -71821 -78453 -10465 67357 81186
287 81186 17999 -61622 -82527 -24472 56332 83381 31457 -50127 -83814 -37869 43648 83286
299 83286 43584 -37214 -82351 -49641 30055 80705 54187 -23410 -78888 -59446 15942 75762
311 75762 63153 -9396 -72915 -67193 2179 68985 70069 4535 -64975 -72584 -11466 60399 74678
324 74678 18089 -55311 -75887 -24252 50292 76722 30519 -44308 -76468 -35790 38640 76365
336 76365 41403 -32190 -75003 -46237 26493 73845 50932 -19800 -71488 -55087 13583 69132
348 69132 58697 -7179 -66077 -61865 864 62518 64568 5210 -58778 -67101 -11564 54290 68338
361 68338 17310 -50363 -69958 -23283 44837 69814 28363 -40112 -70110 -33584 34590 69412
373 69412 38371 -29087 -68396 -42804 22978 67111 46847 -17418 -65430 -50695 12327 62320
385 62320 53356 -5785 -58822 -55391 -22 56061 58766 5521 -52431 -60951 -10925 49535 63004
398 63004 16865 -45159 -64294 -22392 40867 65304 27622 -35884 -65378 -32522 31181 64823
410 64823 36653 -26122 -63833 -41035 20722 62479 44587 -15289 -60802 -48262 10070 58203
422 58203 51178 -4753 -55933 -53746 -845 52752 55796 6060 -49352 -57723 -11148 45649 59114
435 59114 16360 -41547 -59696 -21135 37501 60329 25944 -32981 -60085 -30231 28426 60130
447 60130 34193 -23624 -58708 -38006 18830 57647 41632 -13855 -55932 -44538 8956 53819
459 53819 47638 -4027 -51292 -49883 -1164 48325 51498 5776 -45466 -53314 -11101 41798 54409
472 54409 15110 -38028 -55396 -20014 34174 55475 23923 -30200 -55553 -28176 25736 55053
484 55053 31852 -21356 -54186 -35236 16954 53145 38440 -12257 -51182 -41383 8011 49670
496 49670 44063 -3221 -46985 -46145 -1353 44781 48039 6045 -41578 -49291 -10140 38572 50348
509 50348 14441 -35065 -50975 -18500 31518 51234 22377 -27608 -51344 -26128 23541 51035
521 51035 29474 -19594 -50066 -32981 15303 48672 35805 -11306 -47535 -38529 6815 45592
533 45592 40823 -2776 -43471 -42886 -1441 41236 44556 5800 -38318 -45728 -9693 35517 46843
546 46843 13894 -32125 -47375 -17449 29010 47764 21173 -25117 -47356 -24479 21417 47140
558 47140 28062 -17390 -46174 -30757 13709 45116 33593 -9665 -43686 -36121 6096 41834
570 41834 38149 -1958 -40118 -40176 -2192 37728 41474 5948 -35322 -42734 -9827 32204 43470
583 43470 12957 -29576 -43992 -16709 26396 44390 20222 -23211 -43953 -23105 19563 43790
595 43790 26173 -15971 -42572 -28818 12543 42127 31371 -8681 -40481 -33336 5226 39065
607 39065 35513 -1517 -36809 -37034 -2000 34774 38663 5801 -32288 -39488 -9110 29786 40316
620 40316 12086 -27244 -40893 -15769 24032 40850 18600 -21464 -41063 -21572 17909 40307
632 40307 23956 -14874 -39810 -26747 11356 38305 28859 -8136 -37415 -31109 4634 35922
644 35922 32776 -1454 -34112 -34470 -1960 32280 35426 5443 -29489 -36297 -8372 27604 37441
657 37441 11350 -24950 -37648 -14419 22458 37979 17251 -19417 -37758 -19677 16935 37239
669 37239 22514 -13692 -36875 -24707 10544 35476 26740 -7771 -34981 -28715 4107 32793
681 32793 30405 -1706 -31438 -31919 -1661 29759 32921 4867 -27748 -33618 -7876 25615 34557
694 34557 10856 -23519 -35102 -13263 20840 35311 16218 -18131 -34989 -18476 15438 34551
706 34551 20964 -12529 -33973 -23077 10064 33520 24795 -7086 -32103 -25799 4038 30262
718 30262 27764 -1313 -29296 -29688 -1657 27227 29999 4192 -26093 -30920 -7470 23187 31584
731 31584 9877 -21450 -33233 -12505 18826 32258 15046 -17122 -32615 -17660 14769 32471
743 32471 19714 -11652 -31507 -21351 8690 30742 23713 -6596 -29931 -25040 3572 29091
755 29091 26327 -914 -27628 -27702 -1785 25731 29012 4404 -23971 -29498 -7123 22420 30524
768 30524 9647 -20418 -31037 -11847 17579 30428 14355 -15816 -30613 -16654 13324 30215
780 30215 18273 -10577 -29327 -20510 7956 28932 22280 -6117 -28458 -23758 3155 26966 25275
793 25275 -658 -25915 -26304 -1938 24748 27106 4335 -22530 -27789 -6538 20828 28541 9285
806 9285 -18932 -28561 -11316 16955 28786 13629 -14209 -28498 -15717 12569 28393 17373
818 17373 -10258 -27768 -19361 7543 27207 20956 -5643 -26248 -22214 3265 25298 23135 -732
831 -732 -24148 -24482 -1949 22444 25323 4461 -20798 -25428 -6282 19745 26787 8273 -17796
844 -17796 -26831 -10619 16239 26980 12411 -13547 -27067 -13973 11822 26526 16086 -9990
856 -9990 -26099 -18063 7973 25729 19402 -5090 -24763 -20500 3310 23738 22052 -917 -22287
869 -22287 -22659 -992 21373 23364 3757 -20547 -24334 -5585 18377 24756 7705 -17071 -25194
882 -25194 -9875 14994 25471 11202 -13340 -25480 -13287 11321 24845 15118 -9372 -25097
894 -25097 -16394 7359 24236 18092 -5470 -23341 -18768 3378 22447 20096 -735 -21206 -21441
907 -21441 -1119 20690 22358 3373 -18657 -22542 -4954 17513 23599 6838 -15825 -23868 -9202
920 -9202 14325 23785 11070 -12123 -23804 -12715 10614 23780 14093 -8630 -23573 -15604 6887
933 6887 22979 17069 -5056 -22409 -18214 2620 21338 19377 -858 -20306 -20467 -800 19470
946 19470 21651 2999 -18137 -22008 -4969 16461 22652 6848 -15078 -22837 -8585 13569 23064
959 23064 10263 -12139 -22990 -12107 10026 22859 13540 -8300 -22504 -15138 6582 21931
971 21931 16437 -4971 -21302 -17293 2902 20341 18455 -1158 -19673 -19408 -913 18648 20239
984 20239 2901 -17242 -20811 -4643 15836 21251 6387 -14385 -21624 -8037 12673 21687 9845
997 9845 -11389 -21615 -11401 9588 21613 12942 -7942 -21129 -14199 6125 20800 15340 -4259
1010 -4259 -19929 -16616 2522 19182 17665 -853 -18419 -18367 -763 17445 19078 2872 -16185
1023 -16185 -19507 -4270 14667 20164 6178 -13751 -20531 -7402 12293 20284 9256 -11028 -20322
1036 -20322 -10550 9348 20083 11893 -7534 -19767 -13025 5495 18919 14174 -4428 -18798 -15326
1049 -15326 2652 17673 15792 -1282 -17269 -17437 -1204 15712 17839 2399 -15098 -18305 -4197
1062 -4197 13814 18324 6008 -12442 -19122 -7442 11549 18917 8715 -9932 -19089 -9846 8659
1075 8659 19101 11673 -7099 -18526 -12719 5269 18253 13721 -4024 -17684 -14767 2219 17029
1088 17029 15784 -596 -16359 -16475 -966 15291 17074 2283 -14661 -17607 -4019 13366 18214
1101 18214 5418 -12178 -17949 -6843 10732 18257 8386 -9304 -18128 -9874 7965 18067 11077
1114 11077 -6433 -18059 -11772 4889 17229 13139 -3355 -16743 -14166 2052 16230 14997 -477
1127 -477 -15384 -15741 -972 14505 16395 2662 -13387 -16703 -4148 12127 17140 5579 -10948
1140 -10948 -17427 -6773 10159 17407 7909 -8683 -17241 -9377 7458 17150 10451 -6033 -16782
1153 -16782 -11666 4452 16312 12570 -3244 -16065 -13537 1646 15170 14310 -484 -14896 -14791
1166 -14791 -1274 13542 15777 2709 -12585 -15501 -3775 11594 16320 5436 -10263 -16300 -6607
1179 -6607 9508 16648 7846 -8253 -16591 -9141 7016 16598 10206 -5768 -16013 -11204 4012
1192 4012 15557 12210 -3044 -14943 -12940 1696 14413 13770 -63 -13785 -14271 -1219 12880
1205 12880 14611 2503 -12102 -14991 -3853 10878 15399 5102 -9742 -15586 -6463 8781 15580
1218 15580 7572 -7757 -15617 -8719 6507 15775 9815 -4927 -15020 -10360 4164 14773 11539
1231 11539 -2674 -14272 -12205 1247 13572 12989 107 -13046 -13541 -1286 12213 13867 2639
1244 2639 -11088 -14586 -3793 10289 14759 4923 -9441 -14552 -5925 8193 14480 7499 -7127
1257 -7127 -14379 -8218 5593 14360 8945 -4834 -14123 -10005 3314 13717 11014 -2624 -13475
1270 -13475 -11369 1079 12796 12571 37 -12013 -13223 -1140 11656 13444 2459 -10443 -13261
1283 -13261 -3823 9959 13756 4623 -8523 -13876 -5806 7719 13928 6956 -6199 -13825 -8016 5299
1297 5299 13561 8871 -4305 -13412 -9589 3568 13123 10492 -2312 -12695 -11272 575 11854
1310 11854 11572 45 -11278 -12332 -1495 10621 12187 2232 -10020 -12889 -3766 8882 12796
1323 12796 4656 -8169 -13251 -5414 7470 12923 6701 -6025 -12755 -7483 4973 12770 8556 -4038
1337 -4038 -12374 -8962 2770 11978 9941 -1395 -11815 -10363 1124 11126 11035 492 -10360 -11623
1351 -11623 -1548 9988 12048 2439 -9334 -12305 -3643 8321 12155 4416 -7676 -12256 -5498
1364 -5498 6786 12399 6385 -5519 -12603 -7180 4669 12072 7986 -3666 -11971 -8389 2636 11455
1378 11455 9364 -1342 -11028 -9807 595 10633 10494 453 -10191 -10835 -1412 9420 11187 2386
1392 2386 -8640 -11450 -3470 7850 11494 4400 -7020 -11567 -5210 6281 11937 6001 -5364 -11753
1406 -11753 -7042 4234 11381 7630 -3568 -11236 -8339 2499 10435 9025 -1199 -10338 -9302 441
1420 441 9830 9624 526 -9312 -10260 -1423 8738 10753 2818 -8044 -10727 -3481 7401 11127 4139
1435 4139 -6638 -10810 -5187 5433 10574 5753 -4469 -10727 -7147 3914 10783 6898 -2652 -10020
1449 -10020 -7675 2044 9733 8451 -1240 -9644 -9194 -148 9112 9479 949 -8414 -9412 -1666 8090
1464 8090 10019 2327 -7469 -10118 -3343 6569 10618 4191 -6059 -10599 -5119 4878 10553 5818 -4438
1479 -4438 -10334 -6125 3672 9850 7044 -2525 -9947 -7592 1753 9080 8020 -1007 -8944 -8484 102
1494 102 8363 8872 825 -8138 -8985 -1360 7489 9339 2327 -6871 -9717 -3250 6175 9756 4095 -5563
1510 -5563 -9812 -4667 4710 9630 5495 -3931 -9648 -6098 3118 9389 6803 -2160 -9097 -7311 1378
1525 1378 8799 7529 -449 -8479 -8139 -45 8044 8266 793 -7376 -8743 -1844 6946 9173 2666
1540 2666 -6374 -9200 -3315 5634 9392 4021 -5194 -9222 -4666 4534 9036 5112 -3663 -8819 -6126
1555 -6126 3042 8514 6659 -2174 -8697 -6884 1373 8380 7285 -620 -7786 -7843 -51 7624 8285 959
1571 959 -6695 -8131 -1551 6374 8481 2480 -5552 -8529 -3189 5209 9054 3788 -4821 -8858 -4396
1586 -4396 3997 8330 4838 -2941 -8560 -5605 2655 7731 6200 -1489 -7411 -6691 1154 7276 6635
1601 6635 -412 -7272 -7329 -147 7384 7748 1653 -5727 -7433 -1811 5912 8306 2229 -5538 -8093 -3321
1617 -3321 5128 7996 3713 -4233 -7964 -4519 2861 8024 4434 -3106 -7729 -5084 2225 7430 5848
1632 5848 -1506 -7506 -6020 642 7373 6760 -205 -6590 -7044 -127 6564 7063 1178 -6289 -8100 -1858
1648 -1858 5370 7880 2527 -5035 -8109 -2929 4613 7807 3649 -3919 -7646 -4091 3438 7507 4784
1663 4784 -2571 -7453 -5275 2233 7395 5742 -1381 -6970 -5949 1010 6797 6285 -56 -6561 -6715
1678 -6715 -400 5958 7183 1216 -5526 -7130 -1878 5286 7213 2630 -4615 -7390 -2898 4257 7291
1693 7291 3522 -3491 -7294 -4047 3185 7158 4487 -2525 -7019 -4948 1999 7064 5474 -1152 -6536
1708 -6536 -5759 623 6339 6050 -229 -5997 -6165 -689 5696 6414 1317 -5203 -6692 -1738 4532 6541
1724 6541 2446 -4115 -6825 -2805 3793 6826 3454 -3244 -6918 -3954 2614 6601 4302 -2123 -6666
1739 -6666 -4553 1517 6368 4913 -1047 -6120 -5418 405 5852 5920 148 -5443 -5868 -816 5164 6046
1755 6046 1207 -4799 -6141 -1714 4206 6157 2353 -3948 -6373 -2789 3347 6349 3274 -3044 -6155
1770 -6155 -3687 2558 6244 4014 -1919 -5902 -4384 1497 5899 4843 -904 -5651 -5069 378 5353
1785 5353 5309 142 -4898 -5632 -591 4827 5726 1117 -4572 -5682 -1796 3974 5784 2448 -3483 -6166
1801 -6166 -2576 3403 5788 3042 -2909 -5866 -3295 2319 5657 3782 -1071 -5303 -3876 1149 5518
1816 5518 4809 -1043 -5431 -4595 739 5428 5270 126 -4451 -5461 -832 4257 5232 1145 -3792 -5535
1832 -5535 -1387 3776 5833 2206 -3490 -5260 -2373 2716 5452 2747 -2643 -4990 -3519 1411 5558
1847 5558 3232 -985 -4962 -4030 1359 4824 4416 -270 -4514 -4432 -109 5147 4631 638 -3711 -3584
1863 -3584 -463 3981 4991 1282 -3687 -5214 -1499 3454 5472 2424 -1999 -5053 -2315 2191 4884
1878 4884 2505 -2278 -4927 -2977 1253 4293 3837 -1636 -4412 -3864 1164 4782 4742 -1005 -5137 -3491
1894 -3491 367 4493 4408 -341 -3584 -4824 -962 3495 5222 1562 -3796 -4623 -2308 2704 4498 1722
1910 1722 -2722 -5032 -2039 1718 5048 2874 -2154 -3633 -3451 2006 4884 3485 -1778 -4237 -3456
1925 -3456 751 3822 3585 -113 -4070 -3765 -427 4331 5225 -327 -4249 -5236 -676 3983 4607 1692
1941 1692 -3611 -4465 -1084 3474 3922 1846 -3049 -3696 -1856 1463 4825 2974 -1699 -4478 -2701 1785
1957 1785 3839 2975 -1565 -3415 -3874 803 4644 3677 -692 -4055 -3668 202 3640 3773 861 -3555
1973 -3555 -3835 -663 2792 4122 2012 -3317 -4780 -2078 2740 3996 1953 -2256 -3763 -2801 1834
1988 1834 4543 2503 -1660 -4046 -2125 1787 3952 2699 -763 -4566 -2842 991 4139 3390 247
2003 247 -3176 -3441 -92 2853 3388 802 -2816 -4134 -51 2051 4060 1028 -2744 -4327 -1103 1189
2019 1189 4188 1631 -2225 -3508 -1517 1643 3802 2545 -1047 -4073 -3175 828 3678 2515 -373
2034 -373 -3519 -2597 586 3648 3003 -448 -2525 -3714 290 3640 3235 361 -2633 -3339 -1183 2632
2050 2632 3343 1082 -1824 -3481 -1162 1822 3998 1278 -1694 -3790 -1588 1607 3679 2393 -1088
2065 -1088 -3686 -1791 746 3956 2116 -818 -3118 -2254 -498 2595 3530 -154 -2689 -3240 -793 2869
2081 2869 2859 519 -2305 -3682 -761 2175 3973 833 -1845 -3383 -1441 2086 3910 1752 -1655
2096 -1655 -3097 -2344 1609 2684 2436 -686 -3392 -2480 145 3664 2990 -844 -3021 -2623 271 3255
2112 3255 3229 301 -2736 -3190 -666 3598 3674 582 -2240 -3779 -774 2363 2611 659 -1712 -3201
2128 -3201 -1928 1846 3350 2349 -1226 -3906 -1874 1037 3835 1664 -1443 -3158 -2763 851 3474
2143 3474 2318 525 -3216 -2826 154 3071 3353 260 -2306 -2811 197 2678 2865 1177 -1798 -3474
2159 -3474 -809 2526 3104 1351 -1512 -3000 -1001 1209 3482 1792 -980 -2607 -1960 1313 3298
2174 3298 1974 -583 -2806 -2046 386 3127 2552 -242 -2712 -2663 -181 3000 2629 480 -2498 -2763
2190 -2763 -1317 2789 2940 601 -2056 -2638 -546 1615 2712 1470 -1304 -2804 -1441 1433 3477
2205 3477 1468 -812 -2918 -1834 955 2886 1987 -376 -2602 -2294 364 2892 2266 -610 -2647 -2105
2221 -2105 462 2402 2478 363 -2530 -2259 -906 1845 3138 593 -1895 -3005 -828 1737 2668 1341
2237 1341 -1334 -2903 -1361 1125 3161 2126 -978 -2718 -2153 526 2259 1843 -930 -2643 -2381 529
2253 529 2682 2492 466 -2204 -2541 -384 2346 2347 819 -2035 -2401 -783 1343 2590 847 -1207 -2614
2270 -2614 -1107 1577 2598 1600 -1109 -2530 -1647 993 2368 1768 -582 -2632 -2471 747 2908 2062
2286 2062 -298 -2494 -2191 147 2153 1952 -91 -2215 -2283 -399 2066 2642 458 -1929 -2367 -1065
2302 -1065 1903 3153 1050 -1889 -2538 -1534 1195 2767 1588 -983 -2709 -1741 884 2600 1789 -681
2318 -681 -2228 -1745 422 2438 2189 56 -2462 -2096 -79 2045 2385 187 -1965 -2146 -488 1785
2334 1785 2703 438 -1789 -2354 -927 1553 2599 981 -1398 -2549 -1472 1074 2628 1582 -1054
2349 -1054 -2529 -1658 697 2437 1722 -481 -2162 -2073 355 2198 2127 10 -2270 -2173 -229 1838 2433
2366 2433 423 -1932 -2426 -687 1697 2445 850 -1603 -2336 -987 1427 2370 1089 -1106 -2322 -1448
2382 -1448 836 2336 1540 -726 -2273 -1652 489 2277 1836 -394 -2182 -1941 195 1987 1952 -46
2398 -46 -2006 -2071 -395 1836 2176 197 -1686 -2526 -732 1464 2284 901 -1549 -2261 -1137 1279 2277
2415 2277 1094 -1015 -2360 -1317 789 2381 1515 -712 -2414 -1753 440 2141 1749 -185 -1931 -1892
2431 -1892 65 1984 1888 118 -1821 -2146 -300 1728 2058 646 -1373 -2372 -723 1384 2287 914
2447 914 -1323 -2147 -1146 1045 2168 1363 -697 -2111 -1442 689 2092 1763 -445 -2061 -1758 242
2463 242 2047 1911 -36 -1871 -1975 32 1770 1926 335 -1596 -2095 -440 1477 2098 615 -1189
2479 -1189 -2157 -796 1043 2231 930 -1417 -2077 -1112 945 2093 1125 -710 -2061 -1417 623 1959
2495 1959 1639 -217 -1938 -1697 159 1836 1679 68 -1891 -1966 94 1871 1996 164 -1741 -2045 -754
2512 -754 1281 2163 812 -1373 -1698 -593 1331 2127 894 -839 -1917 -1295 750 2045 1394 -518
2528 -518 -1868 -1516 516 1991 1264 40 -1751 -1343 95 992 1530 61 -1836 -1959 -182 1579 1723
2545 1723 173 -1458 -1964 -410 1589 1747 1393 -944 -1928 -938 1190 1701 1277 -940 -1711 -896 578
2562 578 1801 1418 -306 -1654 -1779 70 1392 1463 -106 -1528 -1626 18 1389 1677 244 -1284 -1759
2579 -1759 -682 1477 1537 553 -1392 -1917 -1030 994 1972 364 -917 -1796 -1206 834 1608 1234 -851
2596 -851 -1667 -1106 634 1721 1359 -475 -1465 -1418 234 1546 1272 -45 -1399 -1587 -60 1561 1849
2613 1849 40 -1507 -1266 -324 1256 1577 280 -1076 -1388 -378 1068 1378 828 -681 -1557 -1074 738
2630 738 1508 1122 -546 -1630 -856 582 1729 419 -188 -1074 -1221 73 1463 1798 30 -1700 -2103
2647 -2103 -65 1399 1708 -79 -1347 -1515 -588 1224 1815 686 -971 -1698 -602 648 1826 1323
2663 1323 -963 -1569 -1161 600 1611 1276 -391 -1410 -1177 137 1579 1182 -226 -1536 -1448 156 1233
2680 1233 1582 206 -1145 -1516 -396 1023 1501 627 -1046 -1356 -761 734 1655 641 -862 -1587 -751
2697 -751 665 1422 959 -485 -1430 -741 533 1385 1321 -332 -1507 -984 265 1378 1353 5 -1326 -1376
2715 -1376 -122 1220 1361 330 -908 -1407 -355 1004 1249 338 -969 -1556 -710 868 1544 592 -777
2732 -777 -1459 -978 645 1396 801 -513 -1319 -952 285 1503 1073 -65 -1291 -1140 58 1313 1176
2749 1176 92 -1126 -1400 -175 1056 1140 537 -975 -1203 -444 973 1458 589 -857 -1374 -694 687
2766 687 1405 867 -548 -1430 -894 535 1342 1043 -477 -1370 -1005 287 1113 1172 131 -1064 -1105 -190 1289
2785 1289 1323 51 -1067 -1227 -457 1148 1358 224 -754 -1317 -457 832 1294 419 -597 -1335 -698 452
2803 452 1270 829 -470 -1189 -762 366 1324 871 -190 -1012 -904 81 1148 966 -50 -1171 -1067 -51
2821 -51 886 993 215 -878 -1340 -269 904 1107 505 -798 -1198 -556 729 1191 643 -719 -1330 -688
2839 -688 426 1277 878 -201 -1160 -825 365 1164 970 -102 -1056 -1254 32 1153 982 -2 -1070 -1118
2857 -1118 -124 999 1287 185 -918 -1116 -393 718 1170 480 -709 -1206 -547 584 1147 507 -584
2874 -584 -1072 -822 389 1076 983 -214 -1138 -848 243 1006 946 -131 -981 -1126 -41 1146 1293 43
2892 43 -940 -975 -310 903 1399 178 -774 -1087 -441 841 1009 482 -508 -1140 -714 465 1230 783 -291
2911 -291 -884 -829 142 963 976 -256 -893 -950 147 1025 931 -104 -1050 -1010 -62 737 1069 219 -1033 -1073 -285
2932 -285 923 949 370 -820 -1154 -406 675 1053 587 -586 -1281 -617 443 1070 630 -314 -1148 -733 275
2951 275 969 748 -174 -1089 -830 80 1006 1001 175 -1003 -1103 -177 904 963 276 -798 -1023 -370 616 1074
2971 1074 331 -561 -1078 -480 559 1123 679 -604 -1137 -548 280 1167 864 -396 -967 -660 167 1066 861
2990 861 -182 -942 -903 -147 930 990 155 -745 -1005 -268 723 1027 292 -622 -1256 -394 674 1086 622 -617
3010 -617 -973 -663 397 974 684 -333 -960 -606 294 1011 606 -44 -832 -874 285 1050 934 29 -853
3029 -853 -894 -151 834 1065 319 -797 -966 -207 562 863 185 -655 -1007 -446 698 1173 652 -442 -1019
3048 -1019 -433 188 865 718 -383 -929 -820 297 834 672 13 -1052 -773 207 804 823 -68 -848 -821
3067 -821 -246 800 849 163 -758 -934 -178 594 811 310 -402 -949 -408 558 1111 595 -386 -1002 -717 393
3087 393 1094 541 -90 -859 -914 84 884 847 -8 -998 -803 105 652 923 225 -797 -939 -124 644 979
3107 979 288 -774 -917 -441 573 824 513 -618 -1010 -360 298 911 447 -535 -943 -600 156 978 587
3126 587 -117 -878 -540 169 855 891 85 -692 -937 -60 642 748 135 -601 -1095 -204 721 883 331 -604
3146 -604 -878 -546 412 727 417 -583 -881 -524 364 840 699 -78 -709 -633 256 1023 764 3 -1381 -1017
3166 -1017 -326 524 781 96 -761 -743 -36 563 909 148 -611 -734 -257 575 931 435 -636 -789 -439 519
3186 519 778 202 -472 -1068 -274 404 563 472 -354 -366 -628 136 997 353 -135 -804 -544 -88 848 972 138
3207 138 -698 -519 -119 720 755 178 -650 -1063 -173 585 848 475 -400 -924 -258 552 934 509 -384 -901
3227 -901 -622 236 785 580 -209 -742 -487 33 812 563 -192 -650 -728 13 846 778 -125 -636 -658 -230 878
3248 878 718 324 -500 -663 -116 495 756 338 -505 -702 -547 310 716 413 -178 -856 -602 317 703 568
3268 568 -340 -725 -428 -31 713 693 -235 -773 -739 -154 730 726 86 -683 -669 -517 494 753 203 -512 -528 -189
3290 -189 370 818 344 -498 -715 -515 360 796 598 -173 -926 -732 111 806 519 -167 -724 -609 106 574
3310 574 626 30 -734 -729 -13 581 661 164 -667 -645 -189 484 805 386 -491 -777 -181 475 915 428 -382 -777
3332 -777 -527 324 750 368 -198 -721 -631 45 751 523 -261 -776 -814 36 582 598 -9 -469 -712 -180 721
3353 721 713 175 -545 -526 -231 703 572 669 -383 -866 -125 399 717 397 -256 -506 -558 170 930 368 -386
3374 -386 -838 -708 381 739 590 -80 -903 -971 205 712 713 448 -761 -572 -218 351 567 -164 -532 -863
3394 -863 -460 353 837 883 -287 -314 -897 302 637 644 -893 -1127 -508 181 1015 299 -268 -1214 -1182 -541 707
3415 707 471 -35 -763 -1210 -304 1049 1159 118 -944 -819 316 942 672 240 216 -483 -483 186 370 338
3435 338 -442 -831 -1086 395 1135 262 -211 -1160 -835 224 882 446 -32 -1199 -739 -16 706 551 -85
3454 -85 -600 -523 -526 608 411 -355 -1020 -351 -208 711 900 -68 -559 -694 -373 482 169 429 -710 -1088 -1163
3475 -1163 462 509 411 -453 -615 -834 192 627 718 48 -671 -844 117 901 932 -21 -661 -1005 102 693
3495 693 832 6 -1026 -1028 -785 263 1122 -171 -703 -485 -312 28 754 488 122 -691 -775 699 307 258
3515 258 129 -656 -113 94 515 200 -264 -487 -641 381 517 390 68 -672 -918 -219 606 532 584 -626
3535 -626 -857 -212 70 825 582 -603 -462 58 588 262 469 -756 -951 -760 -21 968 148 -340 -772
3554 -772 -374 546 944 724 -328 -209 -29 -7 927 913 -87 -675 -315 -57 583 1307 446 -850 -927 -166
3574 -166 413 694 34 -401 -301 -543 451 1172 671 -463 -691 -1083 283 174 346 -792 -1159 -1126 -34
3593 -34 941 815 244 -697 -724 -222 537 321 -26 -705 -628 -360 1045 287 89 -146 -518 -267 1015 99
3613 99 297 -446 -692 -419 -30 946 596 -345 -1287 -473 149 944 475 -207 -625 -414 358 674 778 -343
3633 -343 -730 -419 70 1113 853 198 -867 -1054 -168 650 953 90 -478 -454 -448 278 1291 353 -378 -727
3653 -727 -641 479 957 577 -535 -535 -713 977 792 620 -196 -887 -792 -16 949 348 95 -1046 -432 -26
3673 -26 931 588 103 -705 -733 2 813 380 723 -329 -1139 -144 1157 1036 -23 -155 -1065 -147 397 210
3693 210 789 -98 -941 -375 467 924 820 108 -600 -861 346 1070 1009 -317 -823 -853 88 629 827 -120
3713 -120 -879 -778 -332 751 832 84 -642 -854 -161 547 1046 103 -457 -962 -399 494 871 644 -246 -781
3733 -781 -479 301 781 778 -195 -870 -636 68 903 688 -145 -873 -712 -27 810 864 -80 -675 -719 -57 683
3754 683 833 113 -588 -952 -282 630 916 250 -528 -987 -276 496 814 372 -634 -978 -564 172 961 746
3774 746 -159 -744 -485 191 627 827 -37 -723 -714 49 859 844 44 -748 -715 -30 795 997 192 -397 -700
3795 -700 -323 666 927 287 -503 -753 -304 201 714 446 -425 -872 -641 211 764 330 -418 -845 -484 123
3815 123 820 1099 -135 -713 -562 25 603 791 162 -611 -764 -365 677 1187 83 -616 -683 -292 366
3834 366 903 665 -532 -1217 -464 538 552 586 -531 -1398 -1102 -139 993 576 -27 -990 -792 123 491
3853 491 757 -43 -869 -578 27 902 858 67 -775 -842 -391 558 794 214 -682 -800 -420 491 998 369 -390
3874 -390 -1002 -537 312 968 432 -568 -700 -681 165 963 707 -243 -864 -657 403 709 818 -282 -786
3893 -786 -704 -158 686 747 155 -774 -758 -225 751 812 222 -572 -961 -303 634 813 463 -686 -941 -397 184
3914 184 848 581 -399 -907 -739 371 939 529 -152 -889 -673 -22 644 805 -58 -657 -951 -254 905
3933 905 730 -89 -567 -1099 -282 524 706 314 -732 -992 -457 499 1136 258 -388 -772 -687 525 1087 325
3953 325 -443 -366 -1028 -77 918 245 -297 -633 -45 414 1086 518 -223 -965 -1060 -126 578 560 -255 -662 -1176
3974 -1176 -503 1018 1048 230 -437 -1002 -418 527 571 593 -123 -584 -671 225 1094 448 -36 -320 -708 404
3994 404 667 1018 23 -591 -657 22 1113 932 339 -527 -612 176 713 763 203 -464 -1354 -540 506 853
4014 853 261 -673 -713 -83 225 620 300 -392 -592 -485 269 767 496 -76 -852 -615 327 767 599 -223
4034 -223 -918 -745 -37 839 892 212 -771 -1005 -147 670 630 280 -689 -1045 -432 529 804 249 -356 -889 -480
4055 -480 479 726 568 -434 -956 -551 307 853 538 -235 -760 -658 -1 687 778 -210 -707 -648 72 630
4075 630 940 53 -835 -828 -84 534 753 112 -400 -721 -492 338 894 146 -580 -666 -90 525 992 633 -577
4096 -577 -1076 -698 -144 598 435 -211 -807 -245 -257 475 599 -234 -564 -731 -313 592 844 167 -708 -492
4116 -492 -276 591 997 -64 -582 -756 -371 323 992 132 -733 -818 -1026 667 566 186 4 -823 -297 266
4136 266 455 533 -181 -204 -868 -543 871 924 309 -521 -613 -283 219 524 116 -287 -645 -302 644 930 -303
4157 -303 -770 -131 -531 287 546 143 -246 -816 -591 -58 670 287 -369 -940 -309 -239 841 505 -475 -916
4177 -916 -553 465 645 63 712 -377 -1031 158 540 659 276 -91 -872 -312 512 830 404 -390 -619
4196 -619 -74 606 503 217 -82 -32 -530 81 760 442 -222 -464 -278 124 726 136 -104 -501 -757 -35
4216 -35 1029 439 -30 -428 -751 -33 434 984 463 -515 -623 -545 257 673 118 -395 -753 -545 167 1011
4236 1011 550 -141 -331 -762 73 733 252 -36 -1084 -527 210 627 420 -635 -1120 -726 115 932 581
4255 581 100 -1193 -741 26 -114 730 655 -156 -367 -940 522 89 -159 -542 -912 -217 493 678 669 -948
4275 -948 -1308 -460 337 332 780 63 -467 -98 -60 233 244 172 -543 -1062 200 297 475 -291 148 -1155 -244
4296 -244 719 107 -35 -430 -689 42 542 815 528 -525 -796 -51 714 497 214 35 -701 -233 250 980
4316 980 383 75 -300 -631 676 497 697 282 -695 -1015 -382 872 616 -16 -278 -777 -195 232 847
4335 847 67 -396 -461 143 376 787 466 -96 -355 -347 156 662 288 -193 -822 -437 229 403 523 61 -550
4356 -550 -285 173 507 334 -98 -443 -418 -60 398 431 -21 -581 -618 -90 410 418 65 -495 -777 -253 130 576
4378 576 443 -307 -465 -401 79 590 486 -228 -514 -306 146 491 376 -100 -557 -457 30 632 448 41
4398 41 -498 -384 120 531 579 157 -423 -461 -32 477 645 1 -362 -467 -261 425 588 264 -197 -685 -223
4419 -223 249 517 356 -137 -468 -396 75 544 432 39 -479 -400 110 538 442 -16 -262 -450 -120 355 540
4440 540 97 -364 -565 -162 274 662 91 -359 -517 -102 289 389 383 -92 -470 -140 348 471 214 -163 -527
4461 -527 -675 110 422 401 27 -531 -392 -266 318 310 11 -486 -546 -323 257 435 100 -350 -480 -127 217
4482 217 413 143 -207 -514 -146 159 327 336 -264 -223 -130 122 344 319 -76 -381 -338 1 434 456 22 -267
4504 -267 -170 67 275 593 172 -347 -479 -173 336 79 471 -444 -418 -294 190 464 -79 -6 -443 246 22
4525 22 184 677 -783 -699 -680 420 582 844 163 -608 -420 323 736 189 -211 -258 -542 -140 231 227 49
4546 49 -680 -221 51 52 422 199 -681 -85 -544 372 242 188 64 -386 -302 87 485 297 -178 -296 -284 -5
4568 -5 395 295 -258 -449 -410 -135 355 362 8 -246 -410 -256 548 787 279 -344 -212 -14 -113 397 -169 -212
4590 -212 -105 -132 309 525 197 -528 -553 -137 317 489 -54 -119 -73 -472 176 100 97 -36 -327 -234 -20 388 169
4613 169 -69 -4 -498 -118 474 93 -46 -233 -140 -253 27 675 -66 -83 -633 -152 117 157 660 254 -481
4634 -481 142 -83 -314 174 64 -12 -115 -463 68 -254 -116 -282 -376 341 52 21 55 -302 -366 -370 216 261 324
4657 324 -241 -708 131 -140 75 -96 -40 -353 -92 353 436 16 -229 -302 -405 -300 248 465 271 -457 -8
4678 -8 343 165 380 109 359 -73 -140 367 98 -326 -280 -561 176 487 297 43 0 -323 -378 212 344 -220
4700 -220 -36 -181 -200 382 -111 462 -249 -332 -49 149 191 189 -98 -211 -376 26 201 178 -7 -130 -176 -283
4722 -283 264 332 24 -175 -448 -113 173 340 88 -102 -175 48 127 164 66 -158 -119 -267 32 216 177 -134
4744 -134 -428 -92 -2 189 38 52 -198 -239 -10 54 364 216 11 -222 -128 357 182 -78 -82 -228 64 124 248
4767 248 137 -171 -208 -32 -77 85 83 -114 -104 -217 88 349 198 -6 -212 -289 -38 125 98 81 -92 -185 67
4790 67 136 163 5 121 -36 -208 172 114 103 108 -170 -79 194 178 173 92 -189 -148 -4 153 -6 94 -142 -195 -70
4815 -70 -6 -14 122 -67 -176 75 123 249 154 -121 -294 -69 167 145 -75 -90 -167 -61 -59 197 -105 -197 5 -118
4839 -118 -36 313 44 -117 -115 -133 17 -54 308 -147 -208 -27 -76 130 163 -88 -225 -68 -37 -17 166 143 -13 -9
4863 -9 5 108 94 51 -61 -145 37 105 147 35 -22 -57 -219 258 7 233 9 -126 17 94 -27 35 -111 83
4887 83 -115 -104 127 221 113 -31 -241 -48 110 -109 181 -141 -254 3 -14 -121 -105 79 -92 -162 85 118
4909 118 77 91 -23 -8 -34 8 122 -89 197 -151 73 7 20 72 -89 -71 -63 -100 351 -63 -61 -195 -117 -102 226
4934 226 115 -142 -86 176 -30 -215 1 -109 -187 -76 26 79 128 138 7 4 -104 40 51 131 -93 -105 78
4957 78 68 261 88 -5 -262 3 -109 90 -37 -9 -129 218 83 102 117 -120 -58 -255 -140 -75 124 -13 11
4980 11 -27 -56 211 287 -6 -9 -140 -120 96 53 -47 131 -74 -168 -29 1 55 -266 4 -223 128 -36 -50 44
5004 44 16 -76 -42 -122 -118 -3 -43 136 15 41 27 -20 -85 33 26 -52 134 17 -33 -38 -21 56 28 106 103 129 -68 -21 26
5033 26 224 -47 -65 -226 -60 38 -64 16 120 -164 120 198 134 8 196 4 7 -15 -15 6 -18 9 -296 -133 118
5058 118 -34 76 -18 -170 -10 32 -177 238 -100 -107 61 137 115 63 113 -1 121 -22 -39 116 -27 -132 -229
5081 -229 -65 157 66 123 -201 -181 -101 -3 70 51 -73 -241 -55 20 252 -10 -25 -66 -105 184 -17 45 23 -226
5105 -226 -102 47 111 -53 -34 58 -95 15 82 146 111 49 45 -106 218 150 40 -67 -87 38 128 65 177 99 -149
5130 -149 48 -25 118 138 -59 -118 -160 75 96 137 -48 -242 -258 -5 76 123 15 -301 -61 200 -50 101 -42
5153 -42 -23 -366 -172 -27 38 64 -8 -87 149 122 198 109 139 -147 -224 173 10 207 20 -99 -153 -104 215 61
5177 61 0 -53 -196 -141 194 142 145 -57 -74 -119 215 158 79 -70 -224 -74 197 141 86 -132 -368 1 210 135 161
5202 161 -124 -188 -111 116 239 199 -108 -75 -438 128 189 240 -78 -118 -234 -68 130 94 58 -71 -6 38 48 36
5226 36 403 -242 -189 -234 311 379 197 -196 -166 -158 217 169 151 42 -289 -117 87 292 171 209 -399 -105 96
5249 96 154 7 72 -76 -73 67 40 207 24 -147 -215 -88 40 282 90 -38 -192 -28 73 262 217 49 -239
5272 -239 -288 169 291 310 230 -390 -114 1 151 216 121 -234 -189 -210 400 70 -85 -499 -493 -55 278 306 159
5295 159 -12 -44 -28 124 318 -113 57 -182 23 134 373 373 180 -96 -460 288 925 1095 -94 -194 -346
5316 -346 -58 612 239 343 -315 -164 150 336 323 363 -182 -173 -167 264 179 219 -322 -254 -84 130 257 198 3
5339 3 -311 -254 246 214 315 18 -193 -92 -150 452 146 15 -176 -319 122 302 420 81 -207 -332 -148 227
5361 227 287 126 -439 -311 -37 258 317 232 -64 -266 -296 73 305 216 -138 -80 -210 195 273 184 -253 -454 -120
5384 -120 -168 236 436 81 -114 -392 -110 242 223 46 -118 -372 -139 203 374 121 -214 -340 -194 212 241
5405 241 196 -245 -291 -212 9 229 112 55 -322 -180 184 297 227 -162 -422 -228 -33 277 372 -117 -380 -451
5427 -451 -100 413 273 -169 -314 -373 -120 466 336 11 -211 -474 -19 309 415 334 -99 -341 -225 191 314
5448 314 279 -131 -345 -385 82 335 292 -182 -354 -363 -78 413 325 -42 -223 -423 -35 188 331 108 -399 -301
5470 -301 -8 405 286 269 -432 -355 -189 329 362 239 -318 -537 -98 506 374 87 -260 -432 -315 152 547
5491 547 352 32 -428 -400 28 396 444 139 -369 -513 -154 391 494 106 -268 -325 -113 179 198 266 -265 -461
5513 -461 -266 295 468 210 -208 -406 -397 293 263 214 -244 -291 -160 171 401 278 -221 -554 -402 -49 511 326
5535 326 -56 -231 -461 26 506 555 -52 -353 -290 0 345 507 164 -101 -411 -187 238 435 310 -65 -336
5556 -336 -394 301 495 323 -50 -537 -414 -87 391 368 29 -530 -445 -16 540 280 -40 -309 -556 -2 426
5577 426 279 -47 -285 -408 -68 389 456 267 -277 -453 -199 316 578 140 -91 -606 -233 353 392 516 -101
5598 -101 -605 -237 138 474 314 4 -324 -318 -72 559 509 99 -597 -251 40 436 342 37 -326 -672 177
5619 177 147 553 -69 -372 -558 56 383 414 233 -270 -334 -8 -42 330 335 87 -542 -194 196 671 239 -189
5641 -189 -647 -282 200 367 415 -169 -358 -196 10 105 487 29 -302 -534 -51 436 418 32 -182 -290 -267
5662 -267 62 403 39 -238 -622 -261 229 649 186 -10 -264 -417 134 525 321 -133 -394 -364 5 419
5682 419 552 -146 -516 -529 65 304 438 104 -512 -566 -6 625 589 192 -245 -581 -286 385 348 362 -206 -381
5704 -381 -198 217 481 420 -148 -478 -400 136 451 411 -24 -465 -440 20 464 555 -57 -451 -359 -73 433 395
5726 395 154 -522 -558 86 395 586 115 -554 -444 -326 193 650 173 -147 -663 -262 399 281 103 -139
5746 -139 -550 -50 218 455 499 -195 -594 -581 -42 554 399 64 -478 -483 -57 649 693 171 -437 -337 -310 421
5768 421 703 -4 -255 -610 -76 316 496 442 -349 -537 -384 200 648 430 -150 -438 -327 71 525 377
5788 377 -46 -603 -540 69 589 482 -80 -568 -420 -146 457 562 307 -267 -579 -164 513 393 64 -395
5808 -395 -665 -295 125 494 110 -203 -622 -159 288 524 494 -289 -638 -448 223 562 478 -105 -546 -464 220
5829 220 711 808 9 -329 -731 105 133 668 276 -447 -605 -297 111 585 87 -526 -545 113 401 438 172
5850 172 -384 -293 -387 351 -65 796 -232 -674 -209 66 488 458 -304 -436 -343 1 427 224 -168 -558 -189
5871 -189 -264 239 757 -146 -254 -887 57 360 810 276 -566 -337 -109 512 251 -234 118 -323 -749 -197
5891 -197 782 -11 -381 -821 -345 502 765 612 619 -361 -918 -419 579 823 -42 -1054 -493 -127 589 320
5911 320 123 -234 -885 -501 482 1007 263 -66 -435 -343 42 793 266 -666 -763 -285 518 434 189 -54 -715
5932 -715 -381 -40 339 598 -371 -489 -212 49 387 518 112 -543 -530 -138 490 342 109 -499 -563 -170 476
5953 476 273 207 -342 -862 -110 162 738 239 -61 -475 -529 164 531 445 -246 -662 -428 -15 602 426 -245
5974 -245 -526 -460 113 522 418 -17 -431 -531 -192 480 481 -25 -414 -653 -285 446 593 299 -487 -739 -357
5995 -357 316 544 253 -336 -671 -348 171 586 549 -265 -358 -584 -3 620 -446 -17 -635 -151 -550 245
6015 245 678 449 -493 -123 -217 1 852 142 -302 -722 -329 420 230 53 -284 -446 -322 450 552 347
6035 347 -243 -561 -494 279 537 423 17 -509 -454 166 379 576 -177 -365 -469 14 482 509 35 -464 -560
6056 -560 -115 321 433 276 -212 -657 -253 588 672 206 -491 -640 -181 357 498 336 -199 -555 -456 322 501
6077 501 554 -72 -469 -430 201 473 389 116 -600 -489 32 449 307 -13 -192 -532 -36 457 545 232 -549
6098 -549 -568 -327 431 659 366 -279 -694 -342 383 573 384 -126 -553 -560 179 602 424 -135 -497 -446 165
6119 165 725 499 -101 -441 -299 8 479 590 109 -522 -573 -58 353 633 237 -494 -525 -196 331 582 248
6140 248 -272 -809 -350 155 570 382 -169 -526 -357 326 608 527 -145 -555 -376 115 400 301 -162 -439 -326
6161 -326 -34 523 665 60 -435 -459 -186 459 680 200 -218 -708 -321 504 665 -77 -131 -561 -155 300 558
6182 558 394 -341 -737 -247 276 579 488 -241 -508 -576 -20 416 423 98 -485 -512 140 616 456 217 -411 -519
6204 -519 -30 351 595 114 -451 -585 -220 413 640 281 -305 -679 -86 280 534 400 -238 -450 -370 154
6224 154 471 397 -291 -670 -335 97 438 684 -4 -507 -424 -44 368 472 152 -478 -491 -94 386 595 175
6245 175 -454 -711 -210 381 554 283 -313 -591 -355 310 486 307 -352 -614 -386 271 496 379 -75 -573
6265 -573 -568 234 606 364 -31 -683 -397 93 242 460 151 -501 -499 -94 576 672 -23 -490 -743 -59 700 478
6287 478 430 -488 -433 -84 188 778 9 -181 -670 -250 394 1110 639 -267 -603 -407 -202 389 1112 -435
6307 -435 -705 -725 -144 620 180 121 -491 -445 -294 667 48 -131 -598 -585 19 561 402 462 -589 -850 -271
6328 -271 566 651 376 -256 -513 -522 145 722 552 -181 -914 -783 424 618 407 -251 -283 -548 441 434 437 -163
6350 -163 -538 -439 -253 -84 715 109 -593 -402 -71 426 825 350 -197 -759 -797 294 354 662 -216 -871 -119
6371 -119 411 943 62 418 36 -258 146 48 545 77 -635 -393 -16 652 427 204 -502 -702 -6 192
6391 192 752 -58 -503 -634 -356 475 561 140 -638 -671 -228 294 712 357 -359 -582 -226 118 538 360 -80
6412 -80 -383 -655 2 625 304 162 -541 -393 125 753 599 79 -468 -603 -279 624 803 462 -458 -797
6432 -797 -25 393 420 379 106 -513 -183 256 564 631 -338 -792 -344 180 738 144 -28 -767 -298 159 443
6453 443 357 -11 -305 -507 -22 394 381 104 -438 -615 -229 191 579 348 -406 -486 -229 331 480 264 -401
6474 -401 -399 -281 257 347 247 -239 -413 -429 185 555 495 -134 -483 -440 108 638 432 -26 -444 -463 -152 540
6496 540 513 120 -465 -578 -180 438 681 353 -338 -728 -274 352 520 149 -431 -657 -219 180 405 355 -234
6517 -234 -413 -437 -53 620 469 -140 -553 -481 17 572 382 -90 -441 -418 -130 603 621 243 -553 -367 -80
6538 -80 627 674 96 -300 -505 -85 268 607 264 -382 -382 -249 32 540 381 -207 -620 -348 325 637 404
6559 404 -65 -693 -356 62 541 263 -154 -493 -329 -47 175 689 198 -487 -612 -68 314 637 67 -298
6579 -298 -411 -326 185 535 89 -249 -607 -172 268 728 391 -28 -505 -468 281 629 451 -22 -498 -416 91
6600 91 430 471 -92 -529 -554 36 356 526 -63 -467 -400 -75 265 651 169 -398 -558 -273 208 516 273
6621 273 -387 -586 -330 330 360 361 -257 -458 -153 142 590 496 -96 -538 -481 23 425 670 42 -463 -405 -176
6643 -176 552 311 245 -448 -492 -37 358 541 220 -286 -496 -85 438 567 396 -408 -461 -316 428 449 444 -339
6665 -339 -529 -386 30 436 157 51 -730 -683 57 485 417 -19 -527 -207 7 548 519 151 -718 -591 -82
6686 -82 399 430 95 -246 -657 -427 99 369 136 -442 -355 -310 145 590 424 -181 -390 -519 258 511 310
6707 310 -47 -502 -344 41 435 485 -50 -630 -615 -63 359 517 94 -228 -325 -122 491 522 147 -489 -464 -338
6729 -338 170 746 330 -396 -455 -283 371 668 463 -250 -475 -311 271 256 597 -383 -681 -103 217 599 284
6750 284 -112 -319 -253 224 87 632 61 -674 -619 -3 548 621 372 -256 -664 -23 343 221 -426 -380 -438 -946
6772 -946 -294 285 103 -77 -912 -344 397 -337 546 -93 -566 -444 357 543 81 -254 -844 -648 270 612
6792 612 305 377 -693 -412 -134 320 471 384 -859 -902 -276 450 534 -190 95 -315 -444 334 559 112 -195
6813 -195 -660 -775 373 457 161 -1018 -340 -115 -559 880 30 199 -285 -336 259 486 535 -96 -511 -417
6833 -417 -115 530 675 129 -594 -677 -458 272 459 177 -175 -691 -2 226 290 294 -356 -353 -385 -12 726 376
6855 376 -70 -551 -475 -72 236 419 52 -438 -678 294 277 567 46 -239 -258 -447 102 706 -245 -38 -799
6876 -799 -336 -240 329 532 -547 -266 -436 457 630 401 -395 -541 -275 12 541 414 -313 -545 -367 -138
6896 -138 411 425 1 -316 -189 -19 493 588 -7 -384 -669 -6 616 400 206 -152 -546 -84 221 530 99
6917 99 -184 -478 -260 355 543 433 -319 -630 -273 90 584 360 -106 -446 -437 -71 530 297 -220 -660 -394
6938 -394 -95 589 401 165 -645 -408 -263 302 378 -72 -300 -480 -307 384 238 -231 -504 -690 -194 -77
6958 -77 450 112 -260 -465 -473 174 433 296 115 -164 -500 690 713 407 -552 -108 -618 -158 242 264 -128
6979 -128 -685 26 -176 461 733 73 -245 -490 17 434 446 -186 78 -813 113 661 512 443 -307 -571 -405
7000 -405 232 282 383 -133 -519 -482 106 493 273 -81 -429 -610 56 419 454 145 -442 -416 -108 169 499
7021 499 123 -243 -500 -138 363 524 119 -224 -633 -350 253 584 164 -332 -637 -370 57 331 365 -72
7041 -72 -567 -376 175 572 436 116 -419 -291 -44 336 528 62 -320 -495 25 492 410 12 -473 -357 -207
7062 -207 220 615 396 -248 -349 -231 332 487 135 -167 -416 -112 109 604 230 -86 -469 -372 -45 385
7082 385 217 33 -495 -328 161 303 396 -218 -494 -595 -265 433 510 183 -463 -427 -204 256 496 130 -283
7103 -283 -661 -334 417 424 180 -258 -524 -408 245 441 348 85 -684 -372 -47 518 521 58 -271 -393 178 518
7125 518 548 -6 -620 -287 20 244 415 171 -459 -665 -237 205 535 142 -466 -435 -288 281 465 339 -164
7146 -164 -544 -400 97 516 384 -304 -674 -464 233 376 369 -76 -411 -407 78 336 348 100 -237 -462 -146 263
7168 263 612 138 -422 -315 -135 237 628 147 -450 -456 -361 174 474 248 -347 -499 -194 212 590 399 -252
7189 -252 -444 -331 61 493 394 -120 -497 -275 114 605 513 -23 -327 -314 12 442 286 273 -340 -433 -221 206
7211 206 374 -30 -537 -420 -146 344 219 158 -346 -429 -403 207 455 189 -112 -193 -294 101 433 621 -54
7232 -54 -474 -618 9 334 476 158 -410 -432 29 243 265 107 -461 -490 -82 591 287 229 -189 -503 -164 430
7254 430 372 221 -148 -592 -261 427 499 215 -181 -415 -356 194 372 377 -80 -348 -451 228 412 427 -57 -544
7276 -544 -442 -93 463 403 153 -346 -418 -163 452 433 -15 -302 -561 -387 53 248 178 -274 -524 -315 208
7297 208 399 386 -238 -292 -275 166 381 334 -41 -474 -246 56 662 443 -59 -370 -418 39 236 412 79 -384
7319 -384 -469 -155 373 534 134 -301 -572 -128 371 259 168 -155 -408 -204 138 502 283 -223 -530 -489 355
7340 355 485 484 -77 -408 -208 -69 450 362 -13 -408 -309 -213 459 573 156 -466 -627 -98 170 225 193 -278
7362 -278 -605 -170 226 381 348 -231 -668 -395 53 578 613 -185 -209 -303 227 540 461 71 -751 -356 -245 179
7384 179 491 15 -324 13 -272 538 439 89 -423 -1025 291 166 674 52 -320 -638 5 68 491 523 -145
7405 -145 -275 -49 270 1059 76 -226 -685 -3 230 272 513 -386 245 -356 -366 399 439 642 -187 -465 -361
7426 -361 73 426 128 -10 -1232 -472 769 566 -224 -459 -471 160 478 403 304 -354 -356 -968 263 648 94
7447 94 -102 -752 55 70 269 261 239 -611 -80 -327 305 758 -202 -488 -674 -373 570 581 174 -173 -308 -260
7469 -260 -434 245 304 -477 -502 -537 -14 190 -21 -524 -398 -187 -711 -70 676 -458 -713 41 376 258 868
7490 868 -180 -475 -373 227 -290 267 -312 -995 -397 -284 908 -7 -403 -644 205 -376 206 600 159
7509 159 -306 -736 -515 20 612 -79 -172 -168 -269 217 696 472 -268 -602 -91 67 568 624 -684 -247 -400
7530 -400 -391 297 278 -206 -415 -424 -370 490 506 -91 -123 -755 -489 404 670 335 -43 -319 -141 152 384 380 -218
7553 -218 -414 -319 211 362 290 -65 -422 -302 84 433 280 -97 -362 -381 -163 584 270 -37 -251 -329 -157
7574 -157 344 366 157 -309 -471 -107 276 504 416 -450 -559 -3 301 425 264 -281 -613 -376 128 509 285
7595 285 -69 -341 -458 -70 396 405 83 -385 -302 137 312 509 101 -374 -469 -166 373 592 48 -330 -471
7616 -471 -100 301 525 217 -6 -365 -213 254 310 167 -347 -325 -330 218 558 209 -176 -453 -296 31 394
7637 394 250 -20 -308 -211 -14 401 486 -50 -395 -522 -110 243 421 66 -381 -402 -111 355 560 218 -313
7658 -313 -498 -84 -23 384 122 -115 -432 -137 270 550 233 -214 -517 -480 161 387 371 -129 -290 -481 48
7679 48 456 222 178 -344 -557 -191 284 247 143 -413 -409 -411 291 343 280 -202 -545 264 290 643 15 -290 -293 39
7703 39 203 350 -236 -311 -286 -311 232 -18 208 -77 -421 -494 -59 385 389 202 -279 -421 -36 96 416 297
7725 297 -235 -423 -294 252 236 128 -40 -342 -305 120 632 314 -223 -209 -81 46 501 435 -216 -227 -437 184
7747 184 38 724 -111 70 -473 -15 113 -30 49 -551 -538 -160 372 40 -648 73 -296 -320 8 44 207
7768 207 -354 -730 -449 212 322 450 -163 -468 -489 222 364 410 -287 -483 -293 266 224 176 -35 -329 -179
7789 -179 -9 169 512 108 -341 -232 -182 225 186 329 -376 -507 -77 342 435 320 -258 -511 -101 212 400
7810 400 235 -82 -350 -219 67 482 262 -45 -371 -314 40 239 393 -197 -319 -285 7 147 385 -211 -356
7831 -356 -412 -189 406 310 282 -128 -274 -12 231 764 75 -14 -485 -275 351 480 -5 94 -328 132 250 42
7853 42 223 153 -78 -122 30 386 391 -353 -355 -560 337 766 374 121 -170 -559 536 597 741 105 -301 -281 -519
7876 -519 436 383 365 -257 -90 -197 238 306 145 -80 -503 -231 10 266 272 35 -393 -318 -164 239 287 -4
7898 -4 -324 -304 -305 331 341 65 -461 -380 64 40 407 221 -108 -344 -185 239 330 165 -287 -374 -341 344 519 174
7922 174 -130 -291 -318 8 261 283 14 -334 -258 195 358 446 42 -125 -536 -24 261 301 93 -139 -232 -194
7944 -194 172 432 246 -360 -261 -197 166 401 203 -212 -406 -66 127 371 410 -66 -401 -111 312 379 350 26
7966 26 -298 -51 30 192 198 -6 -388 -257 -6 421 -118 273 5 72 -301 372 548 514 -421 154 -318 5
7988 5 221 293 23 -135 -18 426 207 -62 -317 -486 -408 50 446 350 -18 -468 -291 118 253 62 -39 -295
8010 -295 -273 -238 202 399 147 -292 -276 -147 304 361 216 244 -187 -294 684 386 613 152 -563 -359 -6 525
8032 525 264 39 13 -170 192 -71 454 -13 -531 -55 34 323 549 94 -389 -406 87 304 291 -28 -326
8053 -326 35 -240 391 540 309 -45 -594 -183 197 518 348 -242 -480 -267 176 336 368 -251 -291 -213 190
8074 190 328 228 9 -323 -321 -184 276 274 189 -329 -313 -53 101 104 -75 -298 -218 -26 194 322 309 -213 -166 0
8098 0 298 431 249 -33 -228 -195 69 334 301 -95 -251 -138 244 209 -1 -204 -304 -269 -63 273 393 159
8120 159 -228 -194 -14 250 202 -26 -357 -400 -52 524 429 -69 -393 -384 51 200 108 280 3 -308 -75 4 439
8143 439 298 49 -373 -479 146 500 438 172 -230 -217 372 198 378 245 -191 -212 159 -40 234 569 -156
8164 -156 -467 40 400 287 159 -565 -398 217 369 267 110 -507 -450 -357 143 330 301 -170 -136 473 -326
8185 -326 586 546 405 -354 -80 -136
8191a36
$$ Imaginary data points
##PAGE= N=2
##DATA TABLE= (X++(I..I)), XYDATA
0 0 0 0 0 0 0 0 0 0 0 0 0 0 0 0 0 7 -8 8 -8 9 -10 15 -17 21 -24 31 -32 39 -43 48 -56 65 -72 83 -95 106 -120
37 -120 135 -150 170 -186 208 -232 256 -281 312 -344 379 -419 460 -507 560 -617 680 -752 831
56 831 -921 1028 -1147 1291 -1463 1668 -1933 2273 -2733 3399 -4444 6333 -10834 46525 -31953
71 -31953 -185256 -134053 26996 176397 147343 -13696 -166551 -156172 -1568 156940 161332
82 161332 14851 -148997 -168438 -31753 134506 168706 43369 -124648 -172940 -59501 109277
93 109277 170817 70265 -97691 -171400 -83166 82298 167841 94194 -68707 -163749 -103321
104 -103321 55180 160221 113592 -39765 -152551 -119178 27931 147739 127984 -11872
114 -11872 -137880 -131208 692 131516 137562 14153 -120530 -139411 -25443 111692 142122
125 142122 38184 -100959 -143240 -49549 89688 142372 59537 -79607 -142538 -70931 66065
136 66065 138912 78590 -56322 -137629 -88688 42970 131895 94779 -32428 -128739 -102645
147 -102645 19592 122115 107644 -8868 -115950 -112554 -2311 109369 116673 13990 -100778
158 -100778 -118710 -23391 93477 121607 34875 -83395 -121141 -43029 75743 122689 53603
169 53603 -65019 -120755 -61049 56020 119601 69724 -45668 -116829 -76921 35752 113327
180 113327 83101 -25898 -109778 -89513 15103 104285 93491 -6170 -99784 -98971 -4764 92638
192 92638 101135 13125 -87353 -104863 -23481 79414 105680 31455 -72249 -107013 -40227 64283
204 64283 107282 48553 -55804 -106336 -55423 47792 105448 63115 -38465 -102194 -68612
215 -68612 30420 100309 75232 -20493 -95980 -79768 12488 92513 84975 -2687 -87218 -88210 -5524
228 -5524 82358 91581 14140 -76347 -94010 -22432 69469 95346 30022 -63635 -96553 -38229
240 -38229 55953 95945 44416 -49325 -96215 -52043 41021 94224 57528 -33741 -92736 -63679
252 -63679 25656 89779 68712 -17516 -86686 -73195 9683 82966 77473 -1379 -78375 -80306
264 -80306 -5933 73793 83729 14340 -67786 -84866 -21006 62619 87210 28944 -56162 -87353
276 -87353 -35478 50077 87891 42308 -42934 -87171 -48394 35959 85988 53639 -29074 -84102
288 -84102 -59081 21858 81178 63393 -14514 -78580 -67977 6828 74657 70944 11 -70800
300 -70800 -74463 -7359 65908 76614 14336 -61198 -78355 -21307 55553 79699 27998 -50054
312 -50054 -79995 -34036 43981 80239 40177 -37362 -79079 -45233 31500 78006 50724 -24503
324 -24503 -75937 -55113 18320 74181 59390 -11447 -70815 -62819 4861 67771 65904 1735
336 1735 -63756 -68761 -8208 59578 70359 14342 -55248 -72221 -20900 49895 72943 26459
348 26459 -44972 -73212 -32200 38995 73075 37227 -33683 -72672 -42760 27665 71216 46955
360 46955 -21656 -69753 -51120 15916 67594 55177 -9369 -64572 -58256 3736 61444 60812 2308
373 2308 -57691 -62821 -7994 54095 65212 14148 -49933 -65787 -19232 45414 66863 25001
385 25001 -38920 -66104 -29655 35250 65483 34704 -29787 -65079 -39683 24463 65075 43666
397 43666 -18807 -63949 -48255 13415 61988 51393 -8012 -59455 -54784 2039 56307 56912 3127
410 3127 -53580 -59178 -8975 49727 60611 14280 -45725 -61865 -19263 41415 62790 24222
422 24222 -36726 -62768 -28837 32194 62494 33322 -27250 -61355 -37288 22307 60687 41320
434 41320 -17106 -59005 -44722 11848 57173 47938 -6633 -54762 -50351 1661 51965 52943 3363
447 3363 -48841 -54990 -8648 45594 56103 13261 -42103 -57234 -18285 37860 57757 22376
459 22376 -34047 -58271 -27011 29254 57699 30834 -25056 -57028 -34981 20418 55996 38355
471 38355 -15643 -54263 -41255 10673 52560 44039 -5850 -50320 -46747 1165 47817 49061 3749
484 3749 -44852 -50504 -8192 41762 52049 12905 -38287 -52669 -17049 34572 53307 21229
496 21229 -30787 -53765 -25259 26798 53153 28982 -22860 -52581 -32503 18318 51482 35477
508 35477 -14210 -50264 -38654 9427 48241 40844 -5259 -46519 -43527 648 43963 45248 3377
521 3377 -41386 -46814 -7819 38318 48067 12170 -35088 -48812 -16037 31898 49348 20029 -28115
534 -28115 -49463 -23682 24854 49453 27295 -20510 -48348 -30155 17095 47801 33355 -12599
546 -12599 -46457 -35768 8756 44823 38446 -4375 -42738 -40688 293 40377 42101 3775 -38048
559 -38048 -43791 -7914 35186 44383 11653 -32541 -45534 -15577 28800 45682 19022 -25864
571 -25864 -45972 -22417 22148 45632 25513 -18687 -45092 -28560 15059 44115 31499 -11070
583 -11070 -42705 -33528 7374 41581 36059 -3614 -39395 -37643 43 37654 39535 3906 -35032
596 -35032 -40396 -7412 32444 41656 11226 -29907 -42130 -14606 26994 42407 17667 -23768
608 -23768 -42730 -20997 20218 42160 23747 -17163 -41856 -26854 13582 40716 28891 -10306
620 -10306 -39766 -31587 6581 37971 33168 -3506 -36589 -35058 -201 34603 36586 3632 -32282
633 -32282 -37412 -7145 29966 38575 10666 -27273 -38912 -13501 24907 39674 16760 -21707
645 -21707 -38901 -19281 19072 39085 22155 -15856 -38485 -24391 12400 37701 26820 -9554
657 -9554 -36669 -29028 6087 35389 30669 -2855 -33797 -32499 -507 31730 33465 3247 -30145
670 -30145 -34895 -6730 27552 35496 9261 -25443 -35608 -12377 22757 35783 15033 -20319
682 -20319 -36179 -17618 17278 36096 20425 -14608 -35536 -22678 11983 34991 24999 -8430
694 -8430 -33796 -26628 6069 32925 28631 -2749 -30970 -29825 -227 29417 30878 3412 -27970
707 -27970 -32347 -6034 25841 32838 8939 -23307 -33173 -11718 20902 33233 13810 -19007 -33767
720 -33767 -16639 15776 33169 18248 -13426 -32920 -20675 10772 31664 22968 -7735 -31732
732 -31732 -24358 5378 30233 26530 -2829 -28873 -27761 -613 27735 29019 3263 -25450 -30172
745 -30172 -5823 23875 30755 8627 -22219 -31691 -11108 19827 31981 13888 -17401 -31785
757 -31785 -15828 15327 31243 18151 -13008 -31433 -20146 9944 30451 21825 -7322 -29916
769 -29916 -23899 4892 28281 25140 -1862 -27586 -26538 -470 25851 27695 3338 -24153 -28199
782 -28199 -5311 22349 28993 8189 -21090 -29564 -10326 18340 29990 13037 -16240 -30021
794 -30021 -14998 14203 29675 17015 -11573 -29073 -19103 9289 28241 20575 -6685 -28041
806 -28041 -22278 4645 26802 23347 -2177 -25561 -24819 -753 24064 25580 2637 -22895 -26663
819 -26663 -5774 21089 27013 7546 -19154 -27817 -10215 17122 27696 11630 -15114 -27860
831 -27860 -13924 13005 27664 15542 -10993 -26751 -17409 9013 27219 19388 -6751 -25995
843 -25995 -20481 4378 24898 21819 -1910 -23808 -23248 -235 22545 24182 2821 -21102 -24784
856 -24784 -4868 19443 25257 6853 -18033 -26043 -9134 15989 26388 11058 -14643 -26350
868 -26350 -12922 12752 25747 14569 -10871 -25568 -16293 8256 25143 17604 -6236 -24735
880 -24735 -19536 4015 23451 20315 -2084 -22786 -21254 52 21642 22831 2171 -20363 -23410
893 -23410 -4112 18568 24306 6554 -17092 -24225 -8204 15442 24348 10016 -13732 -24480 -11557
906 -11557 12118 24362 13609 -10081 -24826 -15540 7889 24009 16885 -6107 -23199 -18123 4150
919 4150 22492 19160 -2197 -21840 -20882 -135 20502 21212 1782 -19090 -21925 -4062 18136
932 18136 22701 5937 -16037 -23003 -7789 14637 23224 9788 -13357 -23546 -11276 11399 23430
945 23430 13128 -9442 -22950 -14473 7817 22829 15984 -6023 -22264 -17139 3559 21051 18355
958 18355 -1801 -20356 -19341 78 19513 20387 1858 -18559 -21156 -3697 16968 21701 5735
971 5735 -15636 -21953 -7506 14067 22311 9078 -12558 -22416 -10944 10771 22265 12540 -9176
984 -9176 -21902 -13953 7328 21363 15202 -5558 -21027 -16332 3576 20387 17671 -1651 -19539
997 -19539 -18696 -84 18317 19371 2070 -17358 -20031 -3755 16085 20570 5473 -14581 -20984
1010 -20984 -7150 13369 20975 8833 -11585 -21266 -10418 10157 20948 11650 -8500 -20875
1022 -20875 -13019 6702 20226 14468 -5190 -19401 -15571 3366 18837 16424 -2111 -18022 -17696
1035 -17696 -387 16890 17785 1627 -16430 -18802 -3700 15135 18753 4979 -13699 -19247 -7153
1048 -7153 12604 19359 8043 -10488 -19736 -9334 9184 19551 10966 -7404 -18887 -11937 6104
1061 6104 18335 13324 -4244 -18350 -14403 2983 17762 15635 -1470 -16750 -16090 256 16153
1074 16153 17069 1844 -15123 -17801 -3144 14190 18280 4631 -12982 -18468 -6459 11914 18724
1087 18724 7710 -10553 -18880 -9444 8686 18977 10296 -7578 -18391 -11681 5977 18198 13007
1100 13007 -4503 -17710 -13997 2992 16981 15049 -1151 -16344 -15533 -372 15524 16216 1771
1113 1771 -14418 -16855 -3225 13276 17326 4729 -12192 -17774 -6138 11099 17762 7706 -9856
1126 -9856 -17523 -8741 8491 17898 10350 -7010 -17428 -11417 5470 17110 12373 -4164 -16635
1139 -16635 -13419 2266 16064 14176 -1334 -15447 -15067 -471 14347 15832 1988 -13709 -15930
1152 -15930 -3341 12370 16478 4597 -11587 -16621 -5971 10219 17137 7505 -9052 -17001 -8806
1165 -8806 7914 16878 9738 -6504 -16433 -10956 5177 16487 12045 -3689 -15667 -12987 2315
1178 2315 15327 13465 -955 -14537 -14448 -332 13711 14857 1740 -12818 -15194 -3254 12034
1191 12034 15598 4531 -10855 -15930 -6014 9539 16045 7085 -8547 -16178 -8370 7374 15767
1204 15767 9409 -6076 -15671 -10497 4877 15335 11330 -3302 -14906 -12140 2213 14450 12904
1217 12904 -775 -13519 -13513 -354 12958 14213 1856 -11897 -14452 -3276 11173 14957 4395
1230 4395 -10287 -14994 -5586 9157 15283 6705 -8117 -15114 -7883 6929 14931 9095 -5534 -14857
1244 -14857 -9870 4494 14445 10850 -3200 -14222 -11416 1877 13859 12231 -405 -13146 -12975
1257 -12975 -547 12087 13686 1770 -11223 -13808 -2957 10467 13861 3965 -9416 -14084 -5526
1270 -5526 8660 14318 6639 -7462 -14334 -7660 6351 13897 8413 -5213 -14087 -9180 3926 13653
1284 13653 10142 -3044 -13142 -10982 1738 12530 11661 -243 -12185 -12236 -1067 11099 12662
1297 12662 1860 -10582 -12897 -3198 9645 13473 4368 -8970 -13524 -5217 8170 13411 6328
1310 6328 -6665 -13495 -6919 5824 13436 8258 -4638 -13101 -8913 3693 12978 9756 -2428 -12466
1324 -12466 -10592 1211 12163 11119 -638 -11299 -11720 -905 10870 12251 1986 -9955 -12157
1337 -12157 -3029 9254 12486 3987 -8042 -12754 -5264 7236 12859 6151 -6416 -12774 -7095 5033
1351 5033 12865 7825 -4407 -12492 -8388 3347 12224 9118 -2649 -11541 -9830 1444 11255 10845
1365 10845 -308 -10640 -11005 -652 9899 11100 1974 -8845 -11424 -3008 8420 11935 4141
1378 4141 -7760 -11996 -5095 6958 12233 5552 -5878 -11823 -6558 5032 11795 7727 -4029 -11851
1392 -11851 -7967 3169 11391 8872 -1868 -10959 -9535 952 10466 9984 103 -10106 -10425 -1048
1406 -1048 9218 10910 1887 -8575 -10689 -2980 7676 11132 3744 -6924 -11282 -4678 6305 11135
1420 11135 5244 -5551 -11252 -6416 4421 11154 6702 -3283 -10403 -7792 2735 10670 8467 -1727
1434 -1727 -10355 -8880 582 9498 9318 127 -9611 -10153 -919 8514 9378 2440 -7892 -10182 -2549
1449 -2549 7087 10473 3864 -6700 -10659 -4567 5968 10592 5037 -5191 -10635 -6014 4175 10572
1463 10572 6744 -3468 -10346 -7877 2495 9671 7779 -1725 -9393 -8418 495 8774 8984 267 -8674
1478 -8674 -8927 -1289 8276 9566 2105 -7790 -9844 -2991 6588 9579 3686 -6197 -9925 -4672 5212
1493 5212 9890 5361 -4475 -10008 -5729 3529 9673 6427 -3054 -9466 -7280 1982 9032 7837 -1183
1508 -1183 -8935 -8116 393 8542 8487 469 -7922 -8682 -1274 7500 9263 2198 -6782 -9417 -2815 6220
1524 6220 9356 3702 -5705 -9228 -4242 4792 9304 4959 -4008 -9361 -5651 3402 9208 6290 -2552
1539 -2552 -9212 -6764 1730 8706 7348 -951 -8186 -7662 47 7964 7947 683 -7741 -8557 -1113 6553
1555 6553 8761 2142 -6479 -8716 -2718 5967 8707 3617 -5328 -8911 -3947 4209 8466 4321 -3458
1570 -3458 -8537 -5397 2831 8963 5749 -2492 -8576 -6095 1831 8180 6777 -772 -7738 -7483 269
1585 269 7286 7908 468 -6466 -7609 -807 6236 7589 2416 -5515 -7840 -2583 6336 7586 3472
1600 3472 -4591 -8416 -3935 3699 8356 4231 -3486 -8450 -5448 3175 8195 5889 -2149 -8051 -6659
1615 -6659 1405 7528 6942 -933 -7524 -7249 -110 6662 6745 736 -6407 -7222 -1860 6193 7945 1783
1631 1783 -5407 -7988 -2270 4684 8175 2880 -4810 -7941 -3776 3878 7686 4673 -3849 -7660 -5384
1646 -5384 2617 7717 5584 -1981 -7636 -5959 1490 7185 6318 -576 -6794 -6619 204 6490 7091 782
1662 782 -6151 -7049 -1507 5567 7135 2054 -5044 -7428 -2559 4769 7477 3323 -3796 -7777 -3978
1677 -3978 3334 7314 4451 -2926 -7392 -4977 2365 7178 5400 -1693 -6931 -5951 878 6808 6008
1692 6008 -229 -6246 -6165 -255 6176 6695 992 -5699 -6593 -1758 5227 6977 1882 -4747 -6926 -2720
1708 -2720 4262 6805 3171 -3729 -6966 -3725 3188 7035 4195 -2582 -6720 -4851 1952 6699 4976
1723 4976 -1382 -6360 -5515 694 6152 5548 -109 -5834 -5977 -503 5675 6047 942 -5254 -6292 -1695
1739 -1695 4708 6470 2104 -4374 -6434 -2507 3811 6513 2987 -3340 -6512 -3693 2841 6480 4017
1754 4017 -2248 -6460 -4239 1678 6248 4863 -1301 -6111 -4998 631 5808 5419 -17 -5452 -5533 -366
1770 -366 5085 5737 927 -4840 -5859 -1501 4163 6009 1905 -3892 -6134 -2371 3536 6183 2979
1785 2979 -2931 -6049 -3488 2664 6028 3390 -2216 -5892 -4043 1643 5691 4475 -1190 -5147 -4502
1800 -4502 572 5248 4881 -79 -5174 -5188 -740 4812 5533 752 -4390 -5575 -1232 4087 5056 1886
1816 1886 -3547 -5889 -2510 3328 5834 2678 -2537 -5906 -3027 2337 5784 3834 -2121 -5470 -3503
1831 -3503 1068 5615 4251 -1224 -5144 -4177 52 5142 4844 276 -4670 -5441 -645 4120 5430 826
1847 826 -3842 -5325 -1886 3699 4996 1528 -3239 -5219 -2315 2820 5492 2518 -2722 -5092 -3111
1862 -3111 2574 4809 3263 -2273 -5152 -3524 1035 4856 3750 -1465 -4515 -4510 865 4497 4422 134
1878 134 -4653 -4604 -1097 3995 4280 706 -3030 -4745 -1428 3621 4786 2062 -3060 -4774 -1782 1828
1894 1828 4229 2538 -2741 -4338 -2341 2161 4770 3490 -1660 -4628 -3121 1070 5169 3502 -678
1909 -678 -4565 -3980 -228 3891 4018 150 -3674 -4277 -1391 2697 3734 1010 -3954 -3871 -1807 3190
1925 3190 4461 1141 -3466 -4800 -1901 1476 5263 1745 -1562 -4458 -2304 2227 4222 3384 -815
1940 -815 -3907 -3494 212 4946 3005 -1225 -4121 -3921 328 3481 3725 264 -3218 -4348 -563 2970
1956 2970 3964 676 -3441 -4277 -1438 2666 3923 2180 -2412 -4332 -2915 2056 4164 2215 -2194
1971 -2194 -4336 -3172 1856 4326 2549 -2124 -4306 -3346 843 3646 3588 -1800 -3161 -3685 268 4048
1987 4048 5171 453 -3727 -3807 -1312 2571 3996 502 -3123 -3992 -2139 2121 3908 1615 -2660 -4540
2003 -4540 -2850 1111 4241 1591 -1036 -3443 -2401 902 3884 3648 -1328 -3158 -4255 1175 3424
2018 3424 3091 -501 -3607 -4191 238 2907 3574 797 -2789 -4188 -978 2677 4221 1237 -3395 -4167
2034 -4167 -1026 2322 3807 2115 -1809 -4116 -1839 2073 3818 2291 -1185 -4006 -2607 1767 4060
2049 4060 3080 -1027 -3383 -2507 964 2939 2572 -1420 -2956 -3333 -454 2711 3881 129 -2899 -3323
2065 -3323 -1348 3063 3743 1373 -2506 -4015 -1955 2110 3741 2413 -2127 -3667 -1981 1860 3732
2080 3732 2553 -379 -3592 -2390 923 3345 2435 -1086 -2892 -2534 -149 2758 2631 -302 -3028 -2774
2096 -2774 74 2923 3283 520 -2532 -3509 -486 1598 3465 969 -2364 -3313 -1220 1272 3489 2107
2112 2107 -2202 -3324 -1737 1164 2981 1877 -1118 -3660 -2333 831 3048 2538 -1387 -3258 -2999
2127 -2999 -529 2810 2511 -113 -2690 -3122 -465 2542 2762 771 -2073 -2652 -1333 2225 2674 1817
2143 1817 -1907 -3094 -1662 1089 3522 1684 -2246 -3319 -1667 1243 3182 1878 -1433 -3281 -2339
2158 -2339 713 2886 2546 -300 -3446 -3398 -176 2337 2155 -183 -3134 -2514 -563 2536 2512 137 -2561
2175 -2561 -3225 -870 2190 3218 1211 -1495 -3055 -1183 780 3211 1993 -1082 -2161 -1843 604
2190 604 2614 1889 -1026 -2980 -2594 448 2814 2277 -186 -2698 -2381 249 2040 2866 657 -2343
2206 -2343 -2864 -83 1758 3110 190 -1995 -3316 -667 1645 3040 1337 -1836 -2518 -1294 1325
2221 1325 2615 1659 -1369 -2951 -2221 536 2505 1808 -875 -2949 -1930 356 2666 2339 2 -2791
2237 -2791 -2117 -621 2672 2883 442 -2414 -2609 -235 2300 2639 792 -2309 -3301 -1567 1543 2487
2253 2487 1495 -1167 -2761 -1608 1405 3311 2092 -660 -2524 -2536 1096 2589 1688 -579 -2812 -2350
2269 -2350 132 2569 2346 -137 -2438 -2325 -97 2422 2525 74 -2013 -2644 -1313 1843 2818 684
2285 684 -1665 -2848 -638 1511 3020 1467 -1028 -2599 -1843 1238 2596 1673 -932 -2515 -2159 366
2301 366 2704 2017 -749 -2200 -2240 -141 2056 1989 231 -2064 -2617 -221 2234 2430 553 -1851 -2239
2318 -2239 -724 1705 2600 936 -1423 -2281 -1163 1546 2863 1318 -1019 -2615 -1455 887 2386
2333 2386 1781 -638 -2392 -1815 449 2381 2038 -133 -2299 -2188 87 2288 2249 207 -2067 -2431 -327
2350 -327 1748 2489 625 -1693 -2518 -782 1604 2371 1126 -1293 -2158 -1148 1130 2514 1524 -1152
2366 -1152 -2482 -1494 615 2401 1697 -284 -2192 -1936 255 2149 2042 -208 -1881 -2107 -183 2049
2382 2049 2228 310 -1821 -2351 -441 1723 2258 938 -1554 -2479 -1050 1378 2342 953 -1029 -2250
2398 -2250 -1452 943 2165 1638 -934 -2361 -1840 525 2240 1692 -243 -2054 -1858 201 2137 2055 -83
2415 -83 -2019 -2036 -347 1748 2157 572 -1774 -2202 -581 1496 2138 740 -1220 -2191 -934 1095 2213
2432 2213 1065 -982 -2334 -1454 815 2162 1359 -489 -2167 -1594 578 2107 1792 -181 -1783 -1841
2448 -1841 -40 2002 1966 25 -1793 -1862 -539 1529 1950 494 -1419 -2177 -771 1440 2134 690 -1409
2465 -1409 -2146 -1124 859 1934 1125 -859 -2105 -1355 571 1894 1525 -399 -1961 -1582 383 1858
2481 1858 1716 -218 -1901 -2004 -176 1771 1944 124 -1569 -1857 -408 1596 2197 493 -1516 -2081
2497 -2081 -673 1348 2217 891 -1094 -1902 -1223 1145 1637 1351 -767 -2138 -1261 494 1932 1528 -93
2514 -93 -1760 -1826 256 1863 1415 172 -1497 -2240 -47 1477 1728 428 -1491 -1852 -263 1819 1444
2531 1444 219 -1617 -1948 -998 1237 1868 793 -1211 -2385 -633 775 2049 1154 -723 -1776 -1565
2547 -1565 517 1873 1522 -319 -1621 -1234 324 1519 2148 264 -1480 -1753 -403 1245 1834 385
2563 385 -1594 -2038 -781 1341 1448 930 -1236 -1828 -934 901 1662 621 -679 -2141 -1242 801 1752
2580 1752 1545 -381 -1882 -1350 423 1465 1158 -249 -1811 -1369 -17 1661 1412 -40 -1570 -1902
2596 -1902 -66 1200 1558 474 -1229 -2040 -793 890 1908 685 -773 -1962 -830 1063 1813 795
2612 795 -912 -1752 -1256 574 1766 1160 -194 -1722 -1500 259 1610 915 185 -1295 -2039 237 1416
2629 1416 1278 287 -1233 -1920 -506 814 1499 729 -1472 -1855 -946 968 1560 600 -768 -2432 -1322
2646 -1322 588 1711 515 -535 -1207 -911 577 1306 1503 -396 -1054 -1461 -226 905 1190 11 -1584
2663 -1584 -1430 -44 1388 1590 509 -910 -1668 -449 1463 1588 496 -1111 -1774 -886 750 1546 878
2680 878 -769 -1569 -983 620 1256 1008 -303 -1457 -1159 173 1413 1409 -112 -1495 -1394 140 1309
2697 1309 1522 187 -1268 -1476 -180 1021 1421 265 -1091 -1457 -553 822 1539 668 -727 -1399 -917
2714 -917 656 1608 827 -544 -1345 -1087 426 1517 1045 -409 -1403 -1174 159 1420 1281 -172 -1442
2731 -1442 -1324 -10 1184 1124 314 -1120 -1373 -459 968 1320 298 -1002 -1451 -662 778 1395 794 -676
2749 -676 -1306 -611 541 1416 871 -461 -1254 -799 593 1321 964 -168 -1426 -1383 121 1332 1119 75
2767 75 -1328 -1317 -137 960 1259 441 -1061 -1371 -558 846 1649 620 -798 -1098 -567 840 1394 720
2785 720 -420 -1230 -684 529 1645 889 -360 -1158 -1111 121 1186 1203 -236 -1073 -1020 -52 855 1326 23
2804 23 -1082 -1009 -359 784 1146 454 -889 -1334 -546 749 1130 594 -600 -1415 -817 554 1142 865 -289
2823 -289 -1377 -622 393 1375 1010 -274 -1235 -1175 73 1086 981 25 -1086 -1332 -84 1033 1275 262
2841 262 -827 -1129 -195 944 1069 299 -573 -1315 -517 691 1264 542 -490 -1169 -739 501 1286 777
2859 777 -392 -1235 -710 323 1168 904 -136 -1079 -953 -37 1105 852 149 -944 -993 -16 993 1116
2877 1116 171 -1047 -1249 -296 719 1289 386 -776 -1301 -360 870 1149 789 -482 -1146 -883 515 1282
2895 1282 872 -437 -1104 -808 226 1023 1122 -247 -1012 -1061 81 1141 914 167 -840 -1179 -105 886
2913 886 970 151 -847 -1122 -377 578 1228 197 -351 -941 -641 634 1166 864 -533 -1211 -849 259 977
2932 977 955 -296 -1157 -862 104 1089 824 -108 -951 -926 133 947 1032 98 -792 -885 -260 556 1116 361 -786
2953 -786 -1005 -494 473 1214 547 -624 -1085 -765 262 1238 729 -302 -842 -603 13 1074 1002 -26 -1016
2972 -1016 -910 122 1004 824 95 -879 -970 -160 831 1006 240 -729 -1222 -408 803 1119 448 -693 -1156
2991 -1156 -460 463 1260 687 -552 -1101 -628 399 1129 527 -278 -1079 -832 235 929 541 2 -916 -908
3010 -908 13 834 944 127 -763 -1036 -116 721 1015 182 -979 -1015 -372 608 1169 432 -325 -1025 -627 536
3030 536 1207 461 -414 -970 -826 398 1006 904 -247 -1048 -834 152 920 811 6 -906 -1018 -123 854
3049 854 1046 0 -740 -976 -329 736 971 439 -743 -908 -519 434 1122 338 -528 -783 -655 472 1081
3068 1081 628 -226 -1032 -767 204 1050 724 -112 -894 -901 -28 724 916 -92 -928 -793 -128 594 864 90
3088 90 -834 -865 -466 674 1013 316 -578 -889 -589 400 1130 476 -551 -672 -447 96 853 697 -385 -867
3108 -867 -681 152 838 826 -148 -852 -713 24 822 821 7 -736 -865 -13 610 876 53 -660 -1110 -408 459
3129 459 694 530 -492 -854 -437 513 1015 494 -278 -894 -711 293 1162 659 -294 -799 -805 -30 995 766
3149 766 -53 -768 -938 113 669 845 12 -652 -1053 107 612 847 341 -634 -775 -503 448 795 540
3168 540 -548 -962 -307 90 1049 494 -381 -1033 -659 331 614 621 -282 -828 -942 255 837 508 391 -817
3188 -817 -1051 40 373 800 155 -641 -957 155 495 940 987 -911 -921 -432 442 784 466 -453 -995 -473
3208 -473 349 814 527 -403 -862 -518 116 867 648 -89 -745 -780 -181 742 672 231 -662 -775 -25 692 786
3229 786 293 -626 -633 -432 503 966 245 -468 -877 -346 296 891 483 -274 -796 -453 467 766 530 -310 -702
3250 -702 -628 119 675 584 -209 -1052 -659 62 707 897 -168 -809 -634 -124 576 836 130 -540 -802 -236
3270 -236 570 807 299 -484 -840 -279 440 710 532 -283 -764 -346 433 735 351 -351 -651 -713 10 804
3290 804 455 -51 -641 -627 -2 697 677 34 -743 -696 70 591 696 58 -493 -928 -73 398 847 339 -598
3311 -598 -667 -491 339 790 502 -405 -725 -535 349 912 642 -172 -712 -606 131 712 636 10 -737 -551 -187
3332 -187 538 755 149 -399 -873 -136 632 682 320 -455 -659 -563 507 910 404 -473 -897 -422 186 744
3352 744 788 -322 -1004 -439 174 611 893 -201 -623 -605 29 478 618 394 -776 -730 30 777 746 -37
3372 -37 -637 -980 -369 682 822 325 -715 -747 -573 449 616 581 -4 -616 -189 575 786 250 -212 -1113
3392 -1113 -445 -137 813 776 -184 -720 -472 -273 1246 398 5 -537 -729 29 173 971 -102 -730 -636 119
3412 119 824 1574 91 -377 -483 -177 -270 956 742 -620 -46 -269 -422 533 928 -164 -549 -763 161
3431 161 354 -89 -340 -624 -584 -711 1251 394 -229 -351 -507 -133 952 844 233 -227 -1060 62 323
3450 323 610 879 -451 -913 115 827 803 668 -561 -903 -92 138 355 757 -563 -1041 -427 450 103
3469 103 66 -441 -864 -250 65 752 876 -41 -992 -214 -187 789 734 217 -730 -1266 -540 662 1240 867 -536
3490 -536 -883 -45 343 1414 34 5 -1180 -902 -132 332 355 -770 -576 -333 8 698 84 -76 -606
3509 -606 -520 724 424 449 214 -607 -978 -655 752 425 -41 -1199 -952 -377 740 1015 -33 -358 -1069
3528 -1069 -668 -83 832 458 -988 -1088 -558 -22 814 206 -469 -1072 -293 180 572 1236 -26 -521 -440
3547 -440 -40 974 724 477 -958 -454 -535 715 423 134 -84 -866 -67 108 400 -86 145 -841 -717
3566 -717 549 782 311 204 -732 -957 130 484 1057 -582 -984 -469 562 460 706 194 -1307 -778
3584 -778 -29 805 200 -29 -983 -508 -116 324 805 -61 -901 -1229 -471 0 1038 215 -279 -764 -72 197
3604 197 723 142 -330 -548 -793 284 1124 475 -510 -761 -856 181 492 452 283 -519 -951 -124 1093 498
3624 498 -275 -1084 -1127 49 885 969 285 -555 -584 -450 372 696 37 -314 -1200 -778 173 902 624 -463
3644 -463 -1551 -438 98 1093 153 -457 -468 -681 58 571 1075 -331 -644 -695 -143 700 418 212 -681 -979
3664 -979 -92 564 1148 393 -430 -814 -177 1014 700 74 -630 -705 -14 1085 930 729 -314 -742 -555
3683 -555 560 1158 997 432 -643 -557 103 828 1040 -401 -256 -796 355 427 765 249 -805 -1160 113
3702 113 1091 1009 38 -574 -827 -409 523 681 498 -97 -787 -475 341 827 629 -263 -823 -714 243 939
3722 939 600 24 -760 -669 114 745 540 -140 -704 -765 48 770 833 129 -477 -666 -268 524 957 267 -577
3743 -577 -892 -397 530 862 420 -370 -839 -328 245 865 559 -252 -777 -496 209 742 685 -182 -638 -821
3763 -821 36 647 700 16 -899 -852 -160 451 843 36 -653 -979 -243 431 729 142 -577 -893 -285 581 902
3784 902 239 -457 -1018 -567 227 855 526 -252 -907 -570 126 735 783 -16 -771 -412 171 655 704 118 -444
3805 -444 -835 151 512 886 334 -409 -889 -236 559 793 380 -495 -866 -604 505 646 454 -452 -595 -626
3825 -626 317 762 714 -206 -908 -290 238 983 220 424 -750 -733 74 675 1009 -125 -825 -769 -218 772
3845 772 1230 100 -716 -653 -523 366 1144 357 -594 -854 -434 528 855 315 -326 -1082 -511 289 780 725
3865 725 -267 -838 -538 211 847 907 -246 -653 -722 -109 662 829 46 -706 -796 -269 585 969 180 -436 -1027
3886 -1027 -342 561 912 461 -493 -996 -656 404 837 445 -505 -953 -666 367 848 760 -255 -823 -743
3905 -743 123 566 657 30 -618 -916 199 685 846 34 -905 -958 -140 617 849 390 -809 -686 -412 394
3925 394 811 344 -421 -860 -428 391 780 366 -471 -772 -495 226 685 477 -55 -828 -847 261 761 809
3945 809 -507 -654 -1029 -19 844 486 319 -579 -420 370 796 866 487 -245 -561 -317 848 1325 -37
3964 -37 -659 -374 -78 -108 355 767 -8 -939 -567 211 798 645 -141 -1049 -582 105 728 599 188 -719 -774
3985 -774 -83 316 827 52 -453 -1142 -536 781 1126 74 -656 -545 -443 367 598 327 -292 -834 -376
4004 -376 357 430 507 -255 -507 -638 204 461 724 -37 -1016 -796 201 822 518 207 -689 -866 -293 244 923
4025 923 48 -976 -887 -453 471 907 474 -550 -855 -461 516 848 407 -523 -701 -427 325 730 551 -325
4045 -325 -774 -458 106 909 522 -250 -821 -805 129 625 757 181 -715 -824 -186 679 734 147 -608 -777 -184
4066 -184 474 706 457 -539 -731 -523 234 797 502 -273 -930 -598 217 788 611 -92 -788 -415 -58 471
4086 471 717 -316 -609 -753 368 677 625 -216 -850 -638 -507 508 546 415 -943 -1160 -473 525 715
4105 715 -58 -528 -588 -220 263 1019 354 -181 -1272 -160 609 625 571 -216 -407 -428 484 431 713 -349 -691
4126 -691 -814 30 992 1024 577 -693 -734 -411 709 1183 54 79 -1321 -533 389 667 260 -353 -534 -438
4146 -438 583 787 384 -493 -848 -135 697 610 606 -573 -440 -1140 33 1082 955 -330 -344 -854 468
4165 468 1317 1004 655 -894 -724 347 718 608 349 -306 -763 -343 270 825 838 -564 -670 -52 500
4184 500 922 364 55 -1027 -15 598 377 743 -114 -690 -644 180 831 663 -237 -886 -490 -39 295 809
4204 809 42 -720 -982 124 240 669 -121 -171 -361 -244 425 740 136 -291 -737 -338 418 777 381 -246
4224 -246 -1019 -368 161 1158 824 21 -337 -579 161 614 1067 -205 -330 -341 -32 1150 828 -62 -879 -586
4244 -586 -244 771 308 312 -425 -835 -481 724 282 748 -223 -1015 -183 -144 566 1130 -68 -625 -768 -127
4264 -127 429 1297 -410 -663 -418 -709 914 661 -57 -586 -193 138 665 620 -354 -731 -302 306 -93 601
4284 601 267 -159 -202 682 -40 376 1182 498 -934 -475 3 1075 882 -431 -601 305 39 560 543 35
4304 35 -516 84 45 548 731 171 -289 -725 -17 612 631 560 -767 -399 -136 919 642 274 -259 -792 -551
4325 -551 422 928 210 -675 -1173 -224 487 763 606 -44 -591 53 294 765 843 -72 -687 -594 -3 447 469
4346 469 19 -502 -436 -323 589 654 101 -458 -457 -43 172 661 166 -368 -514 -389 396 504 365 -292 -535
4367 -535 -358 36 717 571 -164 -471 -450 130 392 440 94 -543 -707 113 431 324 30 -557 -599 -110 500
4388 500 628 234 -168 -698 -264 165 474 297 -275 -475 -411 217 538 253 -9 -498 -94 -102 502 488 -48
4409 -48 -605 -439 180 424 437 -126 -497 -538 -28 446 570 74 -422 -600 -229 440 565 192 -180 -565 -287
4430 -287 155 424 314 -198 -457 -253 424 580 216 -156 -437 -374 77 295 345 -28 -442 -454 177 447 372
4451 372 53 -543 -497 58 389 456 6 -412 -453 -173 356 530 334 -306 -387 -45 300 471 251 -355 -434 -331
4473 -331 274 320 379 -195 -624 -321 99 513 383 -78 -509 -538 81 532 359 51 -326 -450 -3 384 473
4494 473 5 -274 -463 -74 425 472 328 -324 -497 -123 317 476 308 -82 -177 -275 218 325 216 -253 -353
4515 -353 -312 214 305 291 105 -394 -428 11 45 368 160 150 -48 -4 313 635 -471 -572 -311 194 309 72
4537 72 -138 -227 -419 -183 450 -10 182 -27 -451 -186 442 15 340 99 -814 -268 171 460 384 -273 -618
4558 -618 -45 -99 354 76 -136 -79 -241 -164 89 135 41 -294 -496 -142 304 433 210 -313 -137 -49 106 180
4580 180 47 -465 -431 -94 434 181 47 110 -169 -391 -173 -18 422 -17 -139 -376 -432 106 257 -297 -491
4601 -491 -573 -241 272 393 23 106 -5 -597 94 599 229 -369 -603 -293 531 68 286 -13 -109 -108 290 -84
4623 -84 469 -74 -126 -359 101 -4 5 43 -153 -165 56 359 173 241 -510 -252 117 -8 285 -47 223 -114
4645 -114 -156 -6 304 161 -452 -363 -112 -6 -35 65 -40 -351 -465 -32 310 259 18 -109 103 -161 312
4666 312 166 8 -26 -322 15 -137 206 -27 -173 -170 -372 -66 329 283 -26 -521 -100 421 572 85 -425
4687 -425 -705 -109 -250 471 100 -257 34 -370 345 269 399 -460 -315 -278 143 -89 -406 16 -414 -68 162
4708 162 358 143 86 -107 -212 -326 91 213 -58 -68 -233 -96 -9 349 350 46 -23 -298 -2 139 19 108
4730 108 -264 -262 40 258 114 124 -223 -44 -11 116 74 87 -46 -268 -1 -8 199 87 -57 -115 147 154 21 30
4754 30 -88 -290 -140 9 99 152 -175 -249 -195 -57 115 291 0 -50 -95 88 147 95 -12 -211 -206 -140 25 288
4778 288 18 -106 -198 -81 75 131 56 -329 -45 -79 -109 77 251 -159 -91 -120 274 249 -6 11 -141 -218 210
4801 210 217 162 -179 -120 -156 -23 82 123 201 23 -43 -103 69 124 75 -116 -156 -17 291 198 -54 -112 48 -181 173
4826 173 201 170 -77 -262 -11 -66 67 61 -113 -27 -76 -22 203 151 77 -306 -202 -47 76 117 -55 -187 -150 143
4850 143 -66 16 102 60 -107 -107 105 90 -5 -9 -131 -255 70 -1 96 -44 -58 -95 241 -16 140 -84 -10 -40 -17
4875 -17 6 -16 78 -154 -166 -111 111 287 -219 -82 -127 39 182 90 -51 -25 -175 102 39 -62 86 76 -38 -61
4899 -61 -1 51 -3 -168 -111 -85 -287 -35 48 48 -146 -90 -87 221 35 -44 -154 52 36 188 269 -55 -49 -24 -22 60 136
4926 136 70 -78 -24 45 152 11 -190 52 -137 -162 -70 79 72 -167 21 28 21 187 184 18 -56 -17 -222 175 173 75
4952 75 -140 -186 -80 25 2 -58 122 88 -79 38 30 -36 -156 -125 55 2 -91 -16 -13 -169 -155 120 6 35 98 -142
4978 -142 88 116 74 94 -127 -27 211 -56 -108 95 52 -15 -93 -90 -96 80 96 -64 5 -142 -81 3 186 181 74 -127
5004 -127 0 -132 138 56 12 99 -164 -141 56 -146 36 157 -43 74 49 153 -48 192 -64 190 3 -120
5026 -120 306 -190 20 -84 -26 66 248 -31 54 -137 -22 -77 -13 67 -35 -69 60 135 -4 106 -99 -90 -45 -93
5050 -93 30 87 48 -126 95 -100 -43 80 -182 -252 -53 -50 218 66 -33 -26 6 -38 129 34 87 6 108 -1 67
5075 67 -96 -40 -189 -285 -41 102 -40 76 -76 -268 -186 -74 51 87 -35 -161 -26 71 90 189 141 0 -139
5098 -139 -27 127 152 47 -100 57 -79 78 132 58 -184 51 -209 54 162 154 -92 -158 -78 17 127 102 -94
5121 -94 -269 -168 -24 75 18 -68 -26 -213 -241 269 5 -7 -164 -164 55 158 85 49 -354 -91 28 75 13 -88
5145 -88 -167 -169 -176 132 24 20 -109 -262 -158 -134 151 118 -80 -58 -122 -83 177 298 -100 15 -266 -122 291 33
5169 33 -109 -211 -283 -66 136 206 -99 -71 -10 -206 -18 56 180 -208 -152 -113 4 164 111 -60 -135 -59 -49 235
5193 235 95 -133 -224 -214 64 78 106 -71 -39 -289 -101 109 198 -19 -46 -235 -36 201 196 -11 -129 -357 -159
5216 -159 80 294 239 -77 -192 -110 7 228 165 -13 -30 -36 -32 200 57 -30 -369 -160 197 412 231 124 15
5239 15 -313 -172 59 231 23 -131 -289 -166 89 351 82 -3 -80 -55 -202 156 212 -269 -270 -134 -72 267 59
5262 59 -176 -315 -202 164 219 418 221 -153 -212 61 143 204 73 -229 -243 -150 404 248 190 -83 -212 -30 -24
5285 -24 98 53 -27 -415 -407 279 431 61 -198 -567 -242 -73 246 -260 110 -67 -277 383 -92 -6 -654 -374
5307 -374 -903 -622 -210 -79 85 -18 -483 -401 -133 246 49 25 -257 -24 144 7 78 111 -198 -134 -72 173
5329 173 218 -34 -284 -352 32 225 223 37 -166 -449 -56 337 138 109 -36 -451 -52 232 336 308 -142 -391
5351 -391 -51 43 443 9 -103 -183 -132 6 239 211 26 -479 -350 -6 314 323 -240 -429 -397 -38 286 523
5373 523 112 -419 -415 -41 330 355 86 -284 -411 -134 202 329 186 -140 -455 -95 195 287 -51 -284 -369 -349
5395 -349 209 85 348 -48 -226 -31 -105 317 307 28 -244 -335 78 249 367 -79 -263 -387 -103 242 307
5416 307 88 -142 -335 -168 215 238 173 -311 -542 -212 83 319 256 -6 -289 24 47 344 187 -155 -384
5437 -384 -81 -29 472 361 -25 -191 -182 -42 238 337 -76 -220 -187 -202 303 487 -4 -119 -418 -84 310 441
5459 441 264 -249 -407 -250 212 317 180 -38 -504 -189 -13 420 529 -94 -268 -349 -34 403 391 -47 -358
5480 -358 -430 159 488 485 34 -161 -244 -112 284 411 61 -274 -343 -117 156 285 268 -309 -395 -109 436 443 232
5503 232 -151 -627 -119 222 241 426 -31 -230 -354 166 549 362 -36 -467 -549 -19 364 387 46 -167 -398
5524 -398 -130 119 403 180 -329 -457 -258 292 458 172 -245 -323 -375 298 467 398 -233 -521 -196 171 394
5545 394 273 -42 -382 -540 -41 424 312 -19 -555 -574 51 366 365 -55 -446 -543 -303 384 457 115 -301 -444
5567 -444 -199 256 474 299 -202 -326 -250 352 460 290 -242 -424 -430 200 320 299 -65 -542 -358 -32 301
5588 301 471 121 -532 -551 -97 371 422 102 -427 -502 -67 364 552 236 -542 -277 95 53 336 339 -302 -726
5610 -726 -505 384 538 89 -162 -866 -219 218 424 285 -36 -510 -94 76 689 557 36 -689 -694 447
5630 447 511 729 -53 -185 -482 -93 362 650 283 -131 -469 -297 437 542 81 -130 -349 -146 100 465
5650 465 111 -111 -612 -109 127 687 280 -181 -302 -699 220 376 404 61 -387 -399 -9 344 597 -27 -326
5671 -326 -523 -285 393 600 151 -402 -473 -220 304 604 128 -386 -495 -320 262 748 418 -277 -536 -399
5691 -399 264 492 559 -94 -475 -445 -112 529 345 60 -282 -523 83 409 527 67 -548 -593 -35 388 565
5712 565 317 -224 -459 -177 148 663 305 -272 -642 -413 403 601 323 -146 -615 -357 167 508 335 -160
5732 -160 -475 -422 89 482 726 2 -427 -569 -40 347 567 139 -225 -482 -264 332 412 333 -459 -468 -238 350
5754 350 444 291 -350 -522 -332 239 573 415 -158 -607 -258 330 471 330 44 -563 -424 81 462 433 -65
5775 -65 -369 -372 -16 330 489 151 -274 -409 -52 388 486 108 -281 -470 -192 356 452 215 -296 -570 -466 334
5797 334 541 352 -223 -552 -495 61 418 363 -2 -576 -536 267 267 343 -166 -301 -535 -78 253 629 203 -555
5819 -555 -444 -301 307 738 19 -45 -624 -137 129 265 483 -376 -505 -326 229 546 496 158 -255 -130 134
5840 134 -39 524 -67 -561 -158 7 885 565 245 -639 -287 165 203 354 -67 -225 -372 -365 78 111 385
5861 385 -699 -383 2 241 469 363 -421 -258 -185 465 490 726 -24 -412 -21 261 1073 409 -235 -299 -191
5882 -191 198 858 505 -181 -352 -436 -137 1047 890 -176 -185 -564 -314 867 296 211 65 -830 -418 -231
5902 -231 979 1128 229 65 -92 420 255 365 -156 -120 -175 295 662 322 -358 -326 -613 409 483 443 246
5923 246 -711 -555 -216 618 996 -6 -863 -590 -255 432 298 268 -687 -548 -40 208 756 328 -508 -394
5943 -394 -466 175 709 480 -123 -714 -703 -75 439 353 -114 -489 -301 266 433 597 132 -579 -502 84 393
5964 393 472 175 -447 -645 -165 444 666 160 -386 -595 -360 191 376 225 -397 -620 -487 362 355 326 -7
5985 -7 -568 -201 15 523 374 -137 -499 -411 -13 350 346 65 -762 -519 7 588 447 230 -592 -606 -235 464
6007 464 563 232 -257 -461 -479 477 900 124 -193 -688 -273 -124 1000 427 -676 -387 -682 219 450 458 -1
6028 -1 -446 -234 283 529 470 106 -505 -344 -81 571 650 266 -431 -620 -228 137 472 162 -309 -777 -400
6049 -400 267 820 462 -381 -556 -382 286 503 473 -135 -523 -353 -106 567 411 -9 -555 -514 -29 417 581
6070 581 -233 -573 -592 -90 494 474 372 -535 -489 -75 377 616 243 -289 -456 -194 333 438 260 -436 -754
6091 -754 -354 77 392 253 -72 -508 -309 157 542 568 -104 -601 -541 73 374 480 45 -537 -453 -237 539
6112 539 535 253 -357 -739 -104 496 543 186 -378 -547 -276 329 651 407 -367 -552 -416 315 706 433 -58
6133 -58 -536 -524 -48 650 236 -156 -602 -539 10 595 449 -83 -568 -476 3 595 624 69 -216 -585 -162 379
6155 379 612 242 -505 -743 -86 268 714 320 -265 -447 -353 210 584 431 -21 -707 -578 74 640 493
6175 493 -191 -470 -423 143 378 463 22 -467 -637 -163 460 720 83 -572 -451 -197 508 488 353 -444 -493
6196 -493 -369 381 679 283 -16 -473 -102 164 596 279 -142 -461 -414 45 550 463 -154 -568 -682 43 421
6217 421 621 33 -455 -555 -213 333 421 5 -538 -432 -237 439 619 249 -336 -372 -184 294 513 292 -318
6238 -318 -688 -417 -25 614 281 -92 -494 -490 140 615 342 -127 -493 -507 -216 603 618 -57 -447 -676 93
6259 93 538 788 143 -539 -594 -306 360 606 504 -390 -623 -386 328 570 372 -292 -638 -317 191 726 388
6280 388 -142 -281 -442 223 489 476 -56 -302 -791 -163 523 299 -139 -586 -619 51 231 397 447 -345 -701
6301 -701 -30 915 417 95 -20 -402 -200 412 430 668 -210 -516 -713 325 654 808 -341 -760 -91 96
6321 96 758 331 420 -88 -415 41 405 500 -368 -557 -376 195 706 447 143 -500 -908 -247 677 199 -12
6342 -12 -361 -852 -559 769 738 48 -476 -709 -57 -138 797 530 -314 -569 -384 -63 467 -99 145 -668 -413
6363 -413 8 990 892 -3 -239 -594 -442 867 527 157 -347 -405 -484 197 532 16 -395 -779 -375 -6 264
6384 264 209 64 -579 -496 120 450 95 -106 -437 -321 119 453 734 242 -538 -716 -35 541 592 57 -70
6405 -70 -838 -74 579 570 107 -821 -557 -161 414 548 358 -286 -533 -111 443 550 236 9 -543 -479 137
6426 137 360 303 110 -391 -460 -91 635 244 -141 -485 -148 309 445 756 137 -310 -530 186 651 464 235
6447 235 -472 -410 -162 219 763 185 -585 -512 -239 326 657 387 -325 -621 -297 227 520 348 -285 -486 -650
6468 -650 -166 589 560 100 -571 -539 -202 594 271 -32 -498 -413 -189 397 645 67 -278 -554 -308 636 679
6489 679 266 -371 -486 -229 121 604 397 -263 -568 -302 122 770 287 -330 -407 -380 142 548 528 -264 -377
6510 -377 -364 11 475 399 288 -367 -447 -75 408 444 127 -241 -608 -145 312 445 158 -312 -322 -260 242 687
6532 687 393 -155 -490 -351 263 581 423 -193 -596 -509 155 558 445 -49 -440 -495 -49 511 456 59 -454
6553 -454 -547 -119 479 665 236 -397 -401 -137 471 567 333 -362 -530 -122 129 551 164 -104 -422 -200 113
6574 113 341 371 -293 -454 -496 189 513 469 -58 -571 -403 -110 604 457 -29 -210 -373 -60 347 613 155
6595 155 -540 -465 -97 287 549 187 -210 -314 -400 322 498 290 -166 -436 -358 40 550 404 -67 -386 -421
6616 -421 117 291 531 -173 -508 -447 73 550 426 -64 -474 -587 -244 350 588 73 -448 -465 -90 270 532
6637 532 420 -385 -630 -356 406 573 342 -244 -643 -265 192 696 398 -203 -614 -343 78 550 296 174
6657 174 -526 -528 32 397 581 73 -321 -465 -105 364 399 179 -413 -637 -289 492 546 310 -292 -750 -238
6678 -238 333 605 467 -157 -424 -205 139 704 446 -277 -238 -362 60 541 439 -64 -486 -641 14 343
6698 343 511 67 -457 -402 -414 536 490 126 -334 -672 -94 337 751 127 -285 -480 -180 271 666 188 -329
6719 -329 -432 -272 227 429 314 -311 -663 -478 34 536 386 17 -421 -546 9 547 475 118 -394 -699
6739 -699 -23 318 260 104 -216 -352 42 275 232 43 -538 -833 -278 248 143 -158 -397 -231 -147 348 673
6760 673 605 -311 -298 -113 -199 524 518 -154 -738 -276 -272 389 1007 60 -417 -512 605 679 913 139 -171 -436 -55
6783 -55 67 312 342 -212 -521 -113 577 614 252 -359 -490 -355 659 1096 291 -229 -462 -567 147 420 121
6804 121 -358 -645 -837 178 352 343 119 -455 -495 -318 462 702 181 -617 -690 79 445 555 188 -590 -221
6825 -221 -772 470 938 369 -85 -846 -424 382 433 436 -357 -507 -372 -13 502 289 -31 -596 -107 -119 273
6846 273 337 16 -653 -453 102 457 562 106 -390 -629 -364 243 748 563 -628 -637 -114 117 187 -25 -165
6867 -165 -419 -488 620 133 476 -396 -1035 -1100 65 423 557 -617 -388 -408 -107 1037 398 421 -448 -354
6887 -354 -70 507 586 42 -644 -489 -344 451 645 281 -234 -688 -209 191 384 317 -216 -659 -116 303 609
6908 609 583 -99 -486 -430 96 548 386 -197 -479 -576 -89 572 472 79 -594 -515 -185 349 558 167 -513
6929 -513 -380 149 376 496 191 -249 -467 -207 149 417 221 -242 -619 -206 225 265 539 -93 -391 -387 99
6950 99 314 791 72 -320 -602 241 359 530 -503 -434 -502 48 365 271 69 -611 -194 -481 303 592 -3
6971 -3 -173 -508 11 443 610 346 -499 67 -775 422 413 341 1 -205 -109 108 512 -99 -75 -525 -680 338
6993 338 845 588 95 -315 -580 82 409 538 239 -467 -634 -112 393 581 173 -247 -523 -370 180 373
7013 373 201 -364 -540 -359 295 548 408 -58 -493 -503 198 572 590 -143 -526 -541 29 492 335 44 -488
7034 -488 -586 -45 225 573 -50 -397 -372 -257 316 468 256 -350 -452 -111 309 461 337 -218 -566 -176 309
7055 309 513 284 -198 -476 -399 23 551 427 -116 -485 -375 140 443 522 -7 -473 -531 70 387 343 -38
7076 -38 -547 -481 -143 366 528 51 -396 -564 -225 333 609 180 -123 -569 -425 283 517 162 -111 -599 -375
7097 -375 122 356 321 -3 -596 -357 52 201 450 -72 -474 -531 -41 207 575 201 -655 -446 -87 559 503
7118 503 10 -286 -619 -80 270 548 235 -228 -441 -218 218 529 378 -201 -660 -277 68 372 307 12
7138 12 -547 -263 119 474 506 -119 -320 -539 -76 425 392 19 -347 -346 41 334 495 299 -403 -567 -81 120
7160 120 359 203 -79 -581 -210 168 424 193 -191 -474 -343 -109 406 465 75 -299 -524 -54 451 307
7180 307 -5 -488 -524 17 534 360 258 -487 -415 -204 231 431 140 -326 -436 -36 229 287 295 -351 -531 -216
7202 -216 288 527 324 -215 -467 -223 129 481 266 -83 -443 -402 197 471 258 -51 -375 -365 -180 556 332
7223 332 -3 -344 -585 28 468 472 147 -237 -570 -112 328 518 79 -372 -553 -374 61 570 210 -7 -597
7244 -597 -395 -14 441 428 -87 -743 -403 89 346 379 73 -407 -448 -19 338 454 -140 -123 -464 42 329
7265 329 495 314 -157 -223 -168 358 360 291 -345 -464 -246 165 535 365 -184 -317 -433 19 537 252 -73 -491
7287 -491 -363 141 498 467 113 -449 -690 -18 439 516 93 -298 -396 -197 280 570 101 -354 -555 16 218
7308 218 529 284 -133 -510 -231 227 577 218 -182 -260 -388 217 449 408 9 -461 -335 128 445 258 -101
7329 -101 -432 -396 -193 304 598 95 -417 -372 91 376 455 220 -362 -575 -9 461 467 307 -284 -471 -106 95
7351 95 692 368 -117 -546 -525 10 560 608 -84 -467 -401 169 331 289 -122 -520 -213 -84 587 566 127 -317
7373 -317 -267 -122 411 482 255 -224 -496 -282 318 661 276 -154 -141 -22 305 332 267 149 -564 -616 251 833
7395 833 82 111 -497 -664 -113 613 299 -402 -332 -393 -293 244 143 -72 -750 -492 -229 -288 954 225 78
7416 78 -1033 -368 -25 445 162 286 -402 136 -419 486 106 198 -302 -510 784 20 355 -48 -764 -633
7436 -633 344 752 376 -454 -278 -36 -264 244 620 -80 -394 -2 -90 257 -21 -121 330 -667 159 207 572
7457 572 152 -320 -431 -140 -234 580 180 79 -446 -367 170 454 465 423 -619 16 289 347 387 163 -151 -164
7479 -164 -119 374 363 -96 -340 26 -163 440 381 169 -10 -35 10 57 900 -40 175 -252 58 696 142 -182
7501 -182 163 -144 -289 277 237 724 -11 10 -460 -289 25 -119 -57 -522 -634 -171 387 375 -22 -244 -306 205
7523 205 252 380 -285 -110 -244 -154 339 509 604 -308 146 -310 165 561 32 -112 -227 -96 104 747 349
7544 349 173 -480 -443 -118 783 114 -83 -147 -470 -7 292 424 161 -163 -348 71 120 613 67 -170 -228
7565 -228 -238 258 379 388 -349 -402 -40 121 536 232 -278 -556 -134 100 303 234 -145 -462 -377 27 194 273
7587 273 175 -361 -393 -201 443 506 200 -332 -446 -90 402 212 102 -169 -371 -134 180 535 308 -191 -481
7608 -481 -267 147 502 198 -248 -451 -311 80 343 346 8 -472 -287 122 350 291 37 -157 -495 -72 330
7629 330 410 41 -240 -502 20 374 467 118 -239 -402 -219 277 274 339 -180 -346 -189 63 365 252 -131 -324
7651 -324 -391 169 498 299 83 -380 -420 24 454 303 -213 -368 -413 -115 386 286 182 -110 -354 -135 414
7672 414 426 73 -204 -619 -84 163 314 428 -155 -540 -199 184 179 110 2 -496 -207 90 399 14 -245
7693 -245 -170 -384 -2 -309 588 527 -403 44 35 418 540 318 -727 -345 -216 551 206 258 -333 -403 -99 267
7715 267 683 93 -260 -594 -423 188 397 375 15 -217 -300 130 503 196 -207 -423 -368 -19 539 282 154
7736 154 -338 -131 -443 131 334 -341 83 -398 -370 523 555 -10 -609 -288 433 186 708 -238 310 -698
7756 -698 -180 197 722 877 338 -406 4 -6 656 556 78 -331 -209 -57 907 647 -184 -453 -670 -21
7776 -21 132 300 -143 -361 -464 -1 182 556 193 -378 -389 -263 323 411 105 -372 -491 -128 251 351 313
7797 313 -177 -382 -205 120 348 193 -62 -248 -523 -28 250 140 -95 -341 -422 -5 201 368 139 -219
7817 -219 -418 -99 177 424 123 -211 -256 15 217 341 77 42 -240 -258 180 341 70 16 -598 -465 -90
7838 -90 499 333 -25 -503 -339 -60 269 -14 -67 -353 -545 11 142 605 53 -72 -708 -301 325 164 -79
7859 -79 -430 -286 -107 479 144 -12 -370 -206 233 -149 157 58 -524 120 -87 -28 351 -51 -18 -95 -481 -248
7881 -248 56 463 82 -248 -333 -201 202 301 377 -191 -344 -203 339 240 176 -172 -563 -74 184 362 380 -230
7903 -230 -434 -79 218 584 186 -105 -290 -252 -181 222 483 -170 -537 -413 -196 326 449 33 -204 -409 -38
7924 -38 109 365 15 -256 -438 -159 257 531 50 -292 -339 -346 17 486 291 5 -423 -271 103 333 273 -164
7946 -164 -462 -383 73 403 332 0 -314 -215 52 397 404 113 -200 -343 -153 491 291 -53 -111 -368 -284 451
7968 451 398 166 -406 -561 5 674 471 615 245 -206 -345 -249 1008 419 -290 -364 -250 -288 717 254 -408
7989 -408 -135 -452 35 372 630 107 -220 -447 -133 226 346 112 -238 -317 -194 205 251 222 -134 -342 -152
8010 -152 114 449 218 -60 -410 -347 19 412 69 161 7 -330 550 185 497 183 68 -316 72 232 581
8031 581 244 -165 -723 187 148 -23 74 -357 -192 -310 303 187 -29 -83 -476 -279 6 296 152 20 -158
8052 -158 -479 58 218 107 142 -266 -635 97 490 374 202 -327 -177 195 173 177 65 -241 -274 -104 432 411
8074 411 48 -290 -301 -34 -22 302 171 1 -305 -312 51 322 233 -104 -495 -298 274 386 275 -104 -400 -252
8096 -252 -23 320 87 -16 -149 -260 -110 264 371 31 -314 -542 27 176 418 48 64 -478 -96 71
8116 71 390 7 -254 -353 -281 224 -51 15 -34 -554 -215 325 431 394 -410 -459 -37 -13 181 416 -143 -515 -512
8139 -512 -116 210 313 -256 -104 -363 -86 460 371 246 -210 -540 -100 276 172 137 -57 -295 -639 45 424
8160 424 -20 -147 -184 -200 -462 642 34 -113 -122 -382 -152 562 463 37 -697 -410 125 149 727 7 -263 -726
8182 -726 -380 -126 319 331 -98 -357 19 369 68
8191F8
##END NTUPLES=NMR FID
##END=
