##TITLE=1H_SR62x_k
 CDCl3, 8 sc, 
 31.05.2021
##JCAMPDX= 6.0         $$ Bruker NMR JCAMP-DX V2.0
##DATA TYPE= NMR FID
##DATA CLASS= NTUPLES
##ORIGIN= UXNMR, Bruker Analytische Messtechnik GmbH
##OWNER= root
$$ XWIN-NMR		Version 3.5
$$ Mon May 31 14:03:23 2021 Russian Standard Time (UT+4h)  she@DPX200
##.OBSERVE FREQUENCY= 200.131506
##.OBSERVE NUCLEUS= ^1H
##.DELAY= (6, 6)
##.ACQUISITION MODE= SIMULTANEOUS
##.ACQUISITION SCHEME= undefined
##.AVERAGES= 8
##.DIGITISER RES= 18
##SPECTROMETER/DATA SYSTEM= spect
##.PULSE SEQUENCE= zg30
##.SOLVENT NAME= CDCl3
##.SHIFT REFERENCE= (INTERNAL, CDCl3, 0, 15.7039)
##AUDIT TRAIL= $$ (NUMBER, WHEN, WHO, WHERE, WHAT)
$$ ##TITLE= Audit trail, XWIN-NMR		Version 3.5
$$ ##JCAMPDX= 5.01
$$ ##ORIGIN= Bruker BioSpin GmbH
$$ ##OWNER= she
$$ F:/spectra/data/she/nmr/H-F/1/audita.txt
$$ ##AUDIT TRAIL=  $$ (NUMBER, WHEN, WHO, WHERE, WHAT)
(   1,<2021-05-31 14:02:17.43 +0400>,<she>,<DPX200>,
      <created by zg, POWCHK disabled, PULCHK disabled
       configuration hash MD5:
       00 E9 B6 7A A2 85 ED C7 34 08 36 98 17 FE 4E 26
       data hash MD5: 16K
       AD 87 F1 B9 36 C7 41 06 4B DF EB 16 C0 00 BD 28>)
$$ ##END=
$$ 
$$ hash MD5
$$ 24 39 E9 02 07 8D 32 C2 5F 92 87 5C 4E 9B DB B7
##$RELAX= 
##$RELAX= 
##$RELAX= 
##$RELAX= 
##$RELAX= 
##$RELAX= 
$$ Bruker specific parameters
$$ --------------------------
##$DU= <F:/spectra>
##$EXPNO= 1
##$NAME= <H-F>
##$PROCNO= 1
##$TYPE= <nmr>
##$USER= <she>
##$AMP= (0..31)
100 100 100 100 100 100 100 100 100 100 100 100 100 100 100 100 100 100 
100 100 100 100 100 100 100 100 100 100 100 100 100 100 
##$AQSEQ= 0
##$AQ_mod= 1
##$AUNM= <au_zg>
##$AUTOPOS= <>
##$BF1= 200.13
##$BF2= 200.13
##$BF3= 200.13
##$BF4= 200.13
##$BF5= 200.13
##$BF6= 200.13
##$BF7= 200.13
##$BF8= 200.13
##$BYTORDA= 1
##$CFDGTYP= 0
##$CFRGTYP= 5
##$CHEMSTR= <none>
##$CNST= (0..31)
1 1 145 1 1 1 1 1 1 1 1 1 1 1 1 1 1 1 1 1 1 1 1 1 1 1 1 1 1 1 1 1 
##$CPDPRG= <>
##$CPDPRG1= <>
##$CPDPRG2= <>
##$CPDPRG3= <>
##$CPDPRG4= <mlev>
##$CPDPRG5= <mlev>
##$CPDPRG6= <mlev>
##$CPDPRG7= <mlev>
##$CPDPRG8= <mlev>
##$CPDPRGB= <>
##$CPDPRGT= <>
##$D= (0..31)
0 1.2 0 0 0 0 0 0 0 0.06 0 0.03 0 0 0 0 0.0002 0 0 0 0 0 0 0 0 0 0 0 0 
0 0 0 
##$DATE= 1622455336
##$DBL= (0..7)
120 120 120 120 120 120 120 120 
##$DBP= (0..7)
150 150 150 150 150 150 150 150 
##$DBP07= 0
##$DBPNAM0= <>
##$DBPNAM1= <>
##$DBPNAM2= <>
##$DBPNAM3= <>
##$DBPNAM4= <>
##$DBPNAM5= <>
##$DBPNAM6= <>
##$DBPNAM7= <>
##$DBPOAL= (0..7)
0.5 0.5 0.5 0.5 0.5 0.5 0.5 0.5 
##$DBPOFFS= (0..7)
0 0 0 0 0 0 0 0 
##$DE= 6
##$DECBNUC= <off>
##$DECIM= 32
##$DECNUC= <off>
##$DECSTAT= 4
##$DIGMOD= 1
##$DIGTYP= 9
##$DL= (0..7)
0 120 120 120 120 120 120 120 
##$DP= (0..7)
150 150 150 150 150 150 150 150 
##$DP07= 0
##$DPNAME0= <>
##$DPNAME1= <>
##$DPNAME2= <>
##$DPNAME3= <>
##$DPNAME4= <>
##$DPNAME5= <>
##$DPNAME6= <>
##$DPNAME7= <>
##$DPOAL= (0..7)
0.5 0.5 0.5 0.5 0.5 0.5 0.5 0.5 
##$DPOFFS= (0..7)
0 0 0 0 0 0 0 0 
##$DQDMODE= 0
##$DR= 18
##$DS= 0
##$DSLIST= <SSSSSSSSSSSSSSS>
$$ [...]
##$SUBNAM2= <"">
##$SUBNAM3= <"">
##$SUBNAM4= <"">
##$SUBNAM5= <"">
##$SUBNAM6= <"">
##$SUBNAM7= <"">
##$SUBNAM8= <"">
##$SUBNAM9= <"">
##$SW= 16.9725357007746
##$SWIBOX= (0..15)
0 0 2 0 0 0 0 0 0 0 0 0 0 0 0 0 
##$SW_h= 3396.73913043478
##$TD= 16384
##$TD0= 1
##$TE= 0
##$TE2= 300
##$TE3= 300
##$TEG= 300
##$TL= (0..7)
0 120 120 120 120 120 120 120 
##$TP= (0..7)
150 150 150 150 150 150 150 150 
##$TP07= 0
##$TPNAME0= <>
##$TPNAME1= <>
##$TPNAME2= <>
##$TPNAME3= <>
##$TPNAME4= <>
##$TPNAME5= <>
##$TPNAME6= <>
##$TPNAME7= <>
##$TPOAL= (0..7)
0.5 0.5 0.5 0.5 0.5 0.5 0.5 0.5 
##$TPOFFS= (0..7)
0 0 0 0 0 0 0 0 
##$TUNHIN= 0
##$TUNHOUT= 0
##$TUNXOUT= 0
##$USERA1= <user>
##$USERA2= <user>
##$USERA3= <user>
##$USERA4= <user>
##$USERA5= <user>
##$V9= 5
##$VALIST= <valist>
##$VCLIST= <CCCCCCCCCCCCCCC>
##$VD= 0
##$VDLIST= <DDDDDDDDDDDDDDD>
##$VPLIST= <PPPPPPPPPPPPPPP>
##$VTLIST= <TTTTTTTTTTTTTTT>
##$WBST= 1024
##$WBSW= 4
##$XGAIN= (0..3)
0 0 0 0 
##$XL= 0
##$YL= 0
##$YMAX_a= 78878
##$YMIN_a= -38567
##$ZGOPTNS= <>
##$ZL1= 120
##$ZL2= 120
##$ZL3= 120
##$ZL4= 120
##$ABSF1= 10
##$ABSF2= 0
##$ABSG= 5
##$ABSL= 3
##$ALPHA= 0
##$AQORDER= 0
##$ASSFAC= 0
##$ASSFACI= 0
##$ASSFACX= 0
##$ASSWID= 0
##$AUNMP= <proc_1d>
##$AZFE= 0.1
##$AZFW= 0.1
##$BCFW= 1
##$BC_mod= 2
##$BYTORDP= 1
##$COROFFS= 0
##$CY= 11.3945322036743
##$DATMOD= 1
##$DC= 2
##$DFILT= <>
##$DTYPP= 0
##$F1P= 15.9154993809931
##$F2P= -4.1035820241983
##$FCOR= 0.5
##$FTSIZE= 0
##$FT_mod= 4
##$GAMMA= 1
##$GB= 0.15
##$INTBC= 1
##$INTSCL= 1
##$ISEN= 128
##$LB= 0.24
##$LEV0= 0
##$LPBIN= 0
##$MAXI= 10000
##$MC2= 0
##$MEAN= 0
##$ME_mod= 0
##$MI= 1.114404
##$NCOEF= 0
##$NC_proc= 0
##$NLEV= 6
##$NOISF1= 3.799351
##$NOISF2= 2.8
##$NSP= 1
##$NTH_PI= 0
##$NZP= 0
##$OFFSET= 15.70392
##$PC= 1
##$PHC0= -11115.3
##$PHC1= 3.000992
##$PH_mod= 1
##$PKNL= yes
##$PPARMOD= 0
##$PSCAL= 0
##$PSIGN= 0
##$REVERSE= no
##$SF= 200.130013532006
##$SI= 16384
##$SIGF1= 3
##$SIGF2= 2
##$SINO= 400
##$SIOLD= 16384
##$SREGLST= <1H.CDCl3>
##$SSB= 0
##$STSI= 0
##$STSR= 0
##$SW_p= 3612.71676300578
##$SYMM= 0
##$S_DEV= 0
##$TDeff= 0
##$TDoff= 0
##$TI= <>
##$TILT= no
##$TM1= 0
##$TM2= 0
##$TOPLEV= 0
##$USERP1= <user>
##$USERP2= <user>
##$USERP3= <user>
##$USERP4= <user>
##$USERP5= <user>
##$WDW= 1
##$XDIM= 8192
##$YMAX_p= 0
##$YMIN_p= 0
$$ End of Bruker specific parameters
$$ ---------------------------------
##NTUPLES= NMR FID
##VAR_NAME=  TIME,          FID/REAL,        FID/IMAG
##SYMBOL=    X,             R,               I
##VAR_TYPE=  INDEPENDENT,   DEPENDENT,       DEPENDENT
##VAR_FORM=  AFFN,          ASDF,            ASDF
##VAR_DIM=   8192,          8192,            8192
##UNITS=     SECONDS,       ARBITRARY UNITS, ARBITRARY UNITS
##FACTOR=    0.0002944,     1,               1
##FIRST=     0,             0,               0
##LAST=      2.4114304,     0,               0
##MIN=       0,             -38567,          0
##MAX=       2.4114304,     78878,           0
$$ Real data points
##PAGE= N=1
##DATA TABLE= (X++(R..R)), XYDATA
0@%%%%%%%%%%%%%%%%%Qj6J6j6J6j6K3l1L2l6M4m9N7o5P3q7R7j07J22j38J54j72
39i1J92k14K38k63K91l24L59l95M36m82N31n85O45p10P81q62R56j062J183j320
59f96J482j678J917k218K607l134L892n078P223j2305M7635L9231n7800J0763
73C1841J957k3695P783M0367o854j9046J1474l266l2046J9775L0711j8106o343
86C4552J7956k1528k1789J9625J5358j4109P326J4635k5974k1278K2231J285j3301
99A4989K2924O684l2199n866J3492r691l753K5487l56k8285L392Q267k2520N473
113a962K9107j2446j7066J2268o460k2025J2445K2847j3272r063J4663j3909k0793
126b5666K0248J0563j5808Q180J1265k1577j1970J7779J903j2420J5454Q816k4604
$$ plain form
0 0 0 0 0 0 0 0 0 0 0 0 0 0 0 0 0 0 0 8 -8 8 -8 8 -8 15 -16 16 -20 24 -25 32 -33 40 -47 50 -57 65 -73 81 -91
39 -91 101 -113 125 -138 153 -171 188 -207 229 -253 278 -307 338 -372 409 -453 503 -559 624 -696
59 -696 786 -892 1025 -1193 1414 -1720 2172 -2906 4317 -7988 39647 78878 21078 31841
73 31841 33798 10103 17886 58253 51399 32353 43827 40561 8515 28290 59001 40895 34552
86 34552 52508 30980 9191 28816 44174 30065 37391 52026 26052 4774 27005 28290 14989
99 14989 37913 44597 12398 6532 20024 10333 6580 32067 31711 3426 6818 15085 -7435 -1962
113 -1962 27145 14699 -2367 9901 3441 -18584 -6139 16708 3436 -5627 9036 -4873 -25666
126 -25666 -5418 5145 -10663 -2483 8782 -12795 -24765 -6986 -5083 -17503 -2049 6767 -17837
139a7837l261J5634j1044m701K2173j3k0000L503O657j5294L332K2957o651j5117
153a9662J0739k495j8091J1108J7608j0528l982J1186j0468j5308J4275J0922
165d696j2446N343J2136j8020j0331J6091O73q644J3513O134j8725l685J2737
178i920o458m177J8908K36j7734M406O086j1876K959J8681m683j1201P597o51
192g827j3864Q615J5568p999l370R696q369j1660J2660R040q196L897Q770j3000
206f039q060J3326K559o865J0929N387j5373k184J0769m286k521J4596R61j3970
220g71K503O173r226K672J5472m219r385O369p36j0735P471J2392o340l946P415
235A5109o640j0037J0240P745p185K328O388j0892p255J0687K084n735P812L719
$$ plain form
139 -17837 -21098 -5464 -16508 -21209 964 951 -19049 -15546 -8889 -24183 -20851 2106 -4545 -19662
153 -19662 -8923 -11418 -29509 -18401 -793 -11321 -15303 -4117 -14585 -29893 -15618 -4696
165 -4696 -17142 -11799 337 -17683 -28014 -11923 -11250 -19894 -6381 -247 -18972 -22657 -9920
178 -9920 -16378 -20555 -1647 -1411 -19145 -14739 -8653 -20529 -17570 1111 -3572 -14773 -7176 -7827
192 -7827 -21691 -13076 2492 -5507 -8877 819 -7550 -19210 -6550 2490 -5706 -1809 6961 -6039
206 -6039 -14099 -773 1786 -5079 5850 11237 -4136 -6320 4449 163 -2358 12238 13199 -771
220 -771 1732 7905 -1321 1351 16823 12604 3219 9588 8852 -1883 5588 17980 11640 7694 15109
235 15109 8469 -1568 8672 16417 9232 11560 17948 7056 -199 10488 12572 6837 14649 18368
249A8368j3407k873Q460l101k787J1004j85j2121J027M547p249J673J1805l581
263A1580r102L990o74q783N864J0007o127m503N347n525p796Q270O164o417R67
278C262M507r135n564Q966J949n127N626K142j0846k065P472k277k274Q839r26
293D549j0161Q95M265n047J613R387l354p984L327K89o277M673P835n019l834
308d843M144m014n713P062N255n807M76L399o648l946P540J736m300M296J605
323B42q568j386O457j429j802O572r28q048J128L966l563J111P225k927n880K444
339e386R76m698L488O815m318l104L389k521m290N814M322m206J12K966m948k823
355h412O391J608l264L037J699o107j371N696m86j701N018O3o285P98L887k746
$$ plain form
249 18368 4961 2088 10548 7447 4660 15664 15479 3358 4385 8932 1683 3356 15161 11580
263 11580 2478 6468 5794 -2989 2875 12882 6755 2252 7599 2074 -5722 2548 8712 2295 3262
278 3262 7769 -1366 -6930 2036 3985 -1142 4484 6626 -4220 -6285 1187 -1090 -3364 5475 4549
293 4549 -5612 -4717 -452 -5499 -3886 5501 2147 -5837 -2510 -2221 -8498 -3825 4010 -1009 -4843
308 -4843 -699 -4713 -10426 -3364 1891 -3916 -3440 -41 -6689 -10635 -3095 -1359 -5659 -1363 242
323 242 -8326 -9712 -3255 -4684 -6486 86 -842 -8890 -7762 -3796 -7359 -6248 977 -1950 -7830 -5386
339 -5386 -4410 -9108 -5620 1195 -3123 -6227 -2838 -5359 -9649 -3835 487 -3719 -3607 -641 -5589 -8412
355 -8412 -2021 -413 -3677 -640 1059 -5048 -6419 -723 -1209 -2910 2108 2171 -4114 -3316 571 -2175
371b175P06N834j808n136K220J352l419K946M933k899k718K650j059l565M435
386B297L282l178j45K267l536k417M751J520k668J846J510m788r76L901k3j597
402B046L230O9m623K45K798k100m3M651j359l973J058J147k726J653L979k281
418C771k452J533r08k691K840K886k193j119J995k695k467L668J601k305J047
433B511J169l693j378L370J43j608K290O31l712n03K259j087l67L294o79l403
449g63M82J276k160Q76L407j168k622J120k5k302J594K760j607j386J392j423
465e49j862J931K011j780K39J101k458j209K136O67j151J326N19k842o71K044
481e48n30n17K210q5k825lJ288j321L28K272l54k130N78K67j684P50K419r68j228
$$ plain form
371 -2175 -1469 4365 2557 -2579 -359 993 -2426 520 5453 2554 -164 2486 1427 -2138 2297
386 2297 5579 2401 2256 4523 987 -1430 3321 4841 2173 4019 5529 741 -235 3666 3643 2046
402 2046 5276 5345 722 967 3765 1665 1622 6273 4914 941 1999 3146 420 2073 6052 3771
418 3771 1319 2852 1944 -747 2093 4979 2786 1667 3662 967 -1500 2168 3769 1464 2511
433 2511 3680 -13 -1391 1979 2122 514 2804 3435 -277 -780 1479 392 25 3319 2640 -763
449 -763 -281 995 -1165 -289 3118 1950 -672 448 423 -1879 -285 2475 868 -518 874 -549
465 -549 -2411 -480 1531 -249 -10 1091 -1367 -2576 -440 227 -924 402 921 -1921 -2592 -548
481 -548 -1078 -1595 615 530 -2295 -2298 -1010 -2331 -2003 269 -85 -2215 -1637 -1370 -3054 -2304 115 -853 -2081
500b081R17n05j951J287K250j143n47J206j508j562J814Q91j129J055J114k383
516b275o60J667L6q75J606P07j881p21J358n67j99K072p3j379o5M18r88L24K264
535G69k59j684J040J57j884N91K127o34l68M70r8j720J007J394r61J56J409j519
553gj421J759N81r14O62J162j902o30J345l61p0J502J42k288J270L08j038m89
571c89J819o7j067J64N47p51j050K104k80r28J317m76j324L51J749j323l49J458
589A505o90j438J022L63o49R96P68j381j27K07N38j426K345L05j073j275J561
606A551o50j286J946K30j196K42L22j104n8J719k46r59Q75J07j778L64J540m89
624A130n13J295m75j860O76R64q57M08J149j084j185P30M38j019P89J058j155
$$ plain form
500 -2081 -1164 -1669 -3620 -2333 -83 -1226 -1773 -567 -2075 -3637 -1823 -932 -2061 -1006 108 -2275
516 -2275 -2935 -1268 -1232 -2107 -501 206 -1675 -2396 -1038 -1605 -1804 268 195 -1184 -1249 -831 -1819 -1495 769
535 769 510 -1174 -134 23 -1861 -1270 857 223 -145 325 227 -1493 -486 908 -53 103 1512 -7
553 -7 -1428 331 912 -2 660 1822 -80 -710 635 274 204 1706 1848 -440 830 1138 100 -389
571 -389 1430 1363 296 460 1007 256 -794 1310 1030 102 1419 943 -381 -30 1719 396 47 1505
589 1505 815 -623 399 762 113 1109 1877 496 369 576 1114 -312 2033 2338 1265 -10 1551
606 1551 901 -385 1561 1791 595 837 1159 55 -3 1716 1470 511 1386 1493 -285 79 1619 1130
624 1130 617 1912 1437 -423 253 1217 360 768 1917 833 -352 378 816 -203 586 1644 489
641D89p09Q01o05p44J512M24j318n4P00j409k88J555lq16L34L90j641J72J433
660B23r25j59J038k72j466M03R63r89L56J276q28j526J220o0p93P22J001j205
678a021m42P95n20o44J200Q96j327j37R14j136n11J615M04j428P93J27j166K34
696a354J329m96n65J159k43j382K44J129q06L62J317p51j519J011M16r08P52J486
714A181j517n89R97m92o69J148P88j330n9Q46r52m06J582J88r42L91M47j429K84
733e33J145j47p55R53o7j313L47J136p08J26R96o29j293P71N38q54O12J393j442
752B76m66Q60l49n67J170L82q30l10R66p82p53J462M75j175N81L6r52L81L67k66
772E06K73M05N0j302M42N52l96p3Q84n42k12k03N14j040N82J666j022j110P29
$$ plain form
641 489 -220 581 -24 -768 744 1168 -150 -204 496 -913 -1201 354 351 -465 -131 259 -1382 -1210 223
660 223 -702 -861 177 -95 -1561 -1158 -195 -1184 -828 448 -380 -1906 -686 -746 -1539 -817 184 -1021
678 -1021 -1463 -668 -1188 -1832 -632 264 -1063 -1200 -286 -1422 -1933 -318 86 -1342 -549 -422 -1588 -1354
696 -1354 -25 -521 -1086 73 -170 -1552 -1308 -179 -985 -623 694 -57 -1576 -565 -149 -1057 -305 1181
714 1181 -336 -925 72 -420 -1089 59 847 -483 -542 304 -648 -1054 528 716 -226 165 612 -817 -533
733 -533 612 465 -290 663 596 -717 -370 766 58 184 1180 551 -742 29 567 -287 325 1718 276
752 276 -190 670 321 -246 924 1306 476 166 1132 350 -403 1059 1534 359 940 976 24 405 772 506
772 506 779 1184 1234 -68 374 926 530 457 1341 799 587 384 898 -142 440 2106 1084 -26 703
791G03J46j040J194R36k244J45O54l72O3J352n94k90J5J34j012j88J316o67k85
810c4K83Q4j264M45P73l69j96Q26q96o01P80J63q77Q41M85r07n12O27k45k66P87
831g3O26j157k03N74o43m42J206N5n97K61J46j008J08J093j87m52M70j46j044
850a413N70Q66m90m7P47m98r91N00N14l21L14Q54j404j44P18p0l80Q73K29q46
870d19O2L90n65M1O14J74p23L43J55q02L77O91q3m78K04k22o45O24N90m70Q1P30
892F69p62n06N31J73j19J53L91m13o73N72K43m9K66r1m94M6L69l25Q1M09J30m91
914A10J38O7o99N54K30N6k44L92l77m20K84N90m40J80L03l77j72J80k37Q3M89
935F90q9l70l58N50n2j57K82j41j22k18K71j17k95O20j03m87K96ll24L35J4J11
$$ plain form
791 703 849 -191 1003 1939 -305 -160 494 122 185 1537 943 653 668 802 -210 -398 918 251 -34
810 -34 249 333 -931 -486 287 -82 -278 548 -348 -949 -169 -6 -883 -42 443 -464 -976 -349 -594 -860 -73
831 -73 553 -604 -807 -233 -876 -1318 -112 -57 -654 -393 -247 -1255 -1147 -54 -241 -693 -223 -369 -1413
850 -1413 -843 23 -467 -514 233 -265 -1256 -756 -242 -563 -249 605 -799 -943 -225 -295 -675 198 427 -419
870 -419 -357 33 -532 -491 123 297 -426 -83 72 -730 -353 338 255 -223 -19 -241 -886 -262 328 -142 -61 669
892 669 -93 -599 -68 105 -14 139 530 117 -556 16 259 210 476 385 -109 -63 306 -19 62 471 601 110
914 110 248 315 -384 170 400 456 212 604 227 -193 91 681 241 421 724 347 175 355 118 201 690
935 690 601 231 -127 423 371 214 496 355 233 15 286 169 -126 494 391 -96 200 197 -127 208 222 333
957C33l8n25J27k61L99Q7J58l42J73k37r9M74l11L3r7J56l71nK34j18l1L83m8
980G4n39K17K88k54J04L85n55nJ43j38n3L97j40j27K86j60l16n8M10Jj9j18K61
1003H4l17j83O26k48q0K37k63j36K36O5j83L19j3k31k81M25Q7j47L47k65l28M97
1025B48m3j84j1K88j89j56N95m01l33N82r5l0j83J04l2m12O03P7n04M0M16m03
1047b3j02P24l70m7O5p4j56m0M20k59l7L49m29J05j31K68j57j17L32l78j88L94
1069A49J45m96M17l3j37j51J82k70p5M58l9j27j63J03n06K94M50l34l78P14k88
1090h5m24J73M24k75j84O15p28j50M55N8m55M22K11m93j69M79j63l02M62R9l14
1111c44k33K97j98K07L75n5m92L00J31p67L78M76k28j38M89k56m95K56L05q7k31
$$ plain form
957 333 295 -230 -103 -364 35 122 280 -62 111 -126 -225 249 -62 -29 -126 30 -341 -346 -112 -230 -261 122 74
980 74 -465 -248 40 -214 -110 275 -280 -285 -142 -280 -333 64 -76 -203 83 -77 -393 -451 -41 -40 -59 -177 84
1003 84 -233 -416 210 -38 -118 119 -144 -280 -44 21 -162 157 144 -87 -368 57 144 -3 344 79 -249 248
1025 248 205 21 10 298 109 -47 548 147 -186 396 301 271 88 192 160 -252 351 428 -76 -36 380 -23
1047 -23 -125 599 229 182 247 173 17 -23 397 138 101 450 21 126 -5 263 106 -11 321 -57 -245 149
1069 149 294 -202 215 182 45 -106 76 -194 -269 189 150 23 -140 -37 -543 -249 201 -133 -511 203 -85
1090 -85 -509 -336 88 -187 -371 244 -484 -634 -179 -121 -576 -154 57 -436 -605 -126 -289 -591 -129 -30 -344
1111 -344 -577 -280 -478 -271 104 49 -443 -143 -12 -779 -401 75 -153 -291 198 -58 -553 -297 8 -79 -310
1132c10L77k63k89N80j32l07M60L29q47M0J85J8J66K36J88m72k2M21l46l6M46
1153D22j54m78J92K13m41K84O14l38m25M71k9o84M39O90m82K2J20l11k94M48K04
1174D83n46N70K19p44j60O75k35j57L71K38q25J14O28k02L2L60j96n09J35P4m63
1195a38M96P47o02m49N33k67j19K41N32n90k76k29J86l32J074l67p17J082M5p60
1215I0k75Q89m01k08L93j08m45j95O03m03J5N51j61o88k3L16l64L84N15m95l59
1236c69N16l32l73J74P28o22qK21l30m44O57K64o37J82N28r24O3N72n7m22M28
1257a85ko93qO84n16P3N13l4m34j76L67k33m4Q27m15k19M76l46m93N66M95o40
1279d37J89M79o77l86O20L09l32K10O3p21J60M75J58l77M05J22m93j67O16k66
$$ plain form
1132 -310 67 -196 -485 95 -37 -344 116 445 -402 -362 -177 -159 7 243 431 -41 -63 358 12 -24 422
1153 422 268 -210 -18 195 -246 38 652 314 -111 360 331 -353 86 776 294 316 436 125 -169 279 483
1174 483 -63 507 726 -18 -178 497 262 105 476 714 -111 3 631 429 461 821 625 116 251 325 -138
1195 -138 358 1105 503 54 587 320 201 442 974 384 108 -121 65 -267 807 440 -277 805 850 90
1215 90 -185 704 303 95 488 380 -65 -260 343 -60 -45 506 345 -343 -366 -50 -414 -30 485 -10 -369
1236 -369 147 -185 -558 -384 344 -278 -286 -65 -395 -839 -182 82 -555 -373 155 -769 -706 -134 -191 -613 -185
1257 -185 -187 -880 -888 -204 -720 -647 -134 -168 -602 -778 -411 -644 -688 139 -276 -495 -19 -365 -858 -292 203 -437
1279 -437 -248 231 -446 -832 -212 97 -235 -25 38 -683 -523 -48 110 -267 138 260 -233 -400 216 -50
1299e0K45J08L0m96N1K84n95N90K95l72k35J66j0m27N39M69o90N0L17q7n84R81
1321E79l93k31L56K30o00j00M48j21k44N06J19o01j96M61n5K0L34p4k04J54J53
1342E41m22J68L51m81j98M17k15m06M57N32o20j30K61j71k04L71Q05j106J41M29
1362E20p52O0M69L95n69M90l92k16P6L34j30k82N35j84n27J75N72m61p0L79J22
1383E44n91R5qk24J2L56k51l37N91k58l71P39j93j57l24K57l89k1O14K3k71m5
1405b09L74q75L17K70k22K48j2o6m94K32Q8K88R8J64l2n40K46k19j39L55J86o6
1427hn07M20l74p8J75K38k67n0N06m59n5L65J33j5O3Po08L13j70L73l09Q0J57
1450g0l47k11N34o2j42M86l85Q6k42L16N7N2K73l59o6J45j03j87M2N97j71l29
$$ plain form
1299 -50 195 303 333 -163 -112 172 -423 167 462 90 -145 21 11 -416 123 592 -98 -48 269 182 -402 579
1321 579 186 -45 311 541 -59 -159 289 168 -76 430 549 -52 -248 213 158 178 512 438 234 388 541
1342 541 119 287 638 157 -41 376 161 -245 212 744 124 -6 255 84 -120 251 1056 -50 91 520
1362 520 -232 -172 297 692 123 613 221 5 81 415 285 3 538 354 -173 2 574 113 43 422 544
1383 544 -47 48 40 -184 -172 184 -67 -404 187 -71 -442 297 104 -53 -377 -120 -509 -530 84 107 -164 -209
1405 -209 165 -710 -393 -123 -345 -97 -109 -175 -669 -437 -349 -61 37 201 169 -371 -125 -344 -483 -128 58 -8
1427 -8 -515 -95 -469 -547 -372 -134 -401 -451 55 -404 -459 -94 39 24 87 94 -514 -201 -371 2 -307 -227 -70
1450 -70 -417 -628 -94 -156 -298 188 -197 -111 -353 -37 20 72 345 -14 -80 65 -38 -225 -183 414 243 -86
1472h6J39k34m8K7L96l80j21K47j04j55K69Rnj5K34k99k5J41PQ2MJ01k40o4J97
1497G7j88J88L07j10l99K12K39l93K55J08l5o0j29j68O1p7L48J29j64j07K0k00
1519h6K68K41k27p4L3m5j97K04L0q8L14K6j65k80K57j59J87M04j82p25J29L23
1541A88l01O6N57j09l25j5o4j77K88p9k1J75m6p9l82K44M85n51J63L02m58K5J6
1564i8J04k22L47q3k97K9L30J11j03j25J94l51R3J21m41J63L65K41l43n2J6k25
1586b26RM16%l51J78N7j57m3K37L0k55K24l23M1K89j64k93M69k48k35K22J16j7
1609b4L7k14J99j87M4L9R0m88N59R7k32J79j85k41P1L22k63n5L82l94q0L02J43
1632A01k85J30J97k25l12L34K53m58J29K45m41j87M92j02j40M31L6m25j3j25J86
$$ plain form
1472 -86 53 -181 -229 -202 194 -186 -307 -60 -164 -319 -50 -41 -46 -61 173 -126 -151 -10 -3 79 83 184 -56 -120 77
1497 77 -111 77 384 274 -125 87 326 -67 188 296 261 201 72 -96 -35 -112 236 365 201 94 114 -86
1519 -86 182 423 196 122 155 110 -87 117 147 59 373 399 234 -46 211 52 239 643 461 -264 -135 188
1541 188 -113 -47 510 401 76 61 -3 -180 108 29 8 183 137 58 -324 -80 405 -146 17 319 -139 -114 -98
1564 -98 6 -216 131 48 -249 -220 110 221 118 -7 187 -164 -71 50 -391 -228 137 378 35 -17 -1 -226
1586 -226 -217 199 199 -152 26 83 -74 -117 120 150 -105 119 -204 -163 126 -38 -331 138 -110 -345 -123 -7 -24
1609 -24 13 -201 -2 -189 -145 -106 -16 -504 55 152 -80 99 -86 -327 -256 66 -197 -252 130 -264 -344 -42 101
1632 101 -184 -54 143 -82 -394 -60 193 -265 -136 109 -332 -519 -27 -129 -269 162 198 -227 -240 -365 -179
1653a79j54M08M4l67K41o0k23J30L87l30k49K81L6j43J77J35nj07J67k25j30L17
1675A51lp1M2L39m04k59M10lk08L66n4k96J5L64m25M3K60k6l43K65k79J88p4L76
1699C74j13Qm5j85k64K29K22k14J1P32j50p13l66M37k04R8O32K29q35K00K9On0
1722F8L47m85m8j5J31J8J64p9j74M6R8k66r1N63J7l07J1J25k57J34J82k15O8K18
1746B53m23j11J98K11p1Q4J2k33%K06j9m75K00L54j14l02Q4O8j64M97j53J5k05
1769h8K8k55K70J62j84j39l5K93l58J95J27j17k0K09K5m77L95q6k1k98M66k87
1791a95l8J94N7k18P6K39k36o9Q1J12k93J37J73l71R1M03k60k49M38l17j83J26
1813c02K66j75M0J00Q1j20L31k07m38O0K80j98K54J57o7l13K15L68n18M22k51
$$ plain form
1653 -179 -333 75 119 -248 -7 -67 -290 -160 227 -103 -352 -71 -35 -178 -1 134 129 22 189 -36 -166 151
1675 151 148 77 119 458 54 -205 205 202 -6 360 306 10 25 389 -36 7 267 241 -102 163 -116 72 -2 374
1699 374 261 269 224 39 -225 4 226 12 23 755 605 -108 -474 -37 -241 -143 489 718 -117 83 112 118 68
1722 68 415 -70 -118 -133 -2 16 180 101 -73 -27 71 -195 -286 277 294 -13 -2 123 -134 0 182 -33 35 253
1746 253 -170 -281 -83 128 57 141 153 -80 -80 126 107 -368 -168 186 72 -230 -146 -78 -242 255 102 117 -88
1769 -88 -60 -315 -45 117 -67 -206 -241 52 -306 -111 16 -101 -121 88 113 -364 31 -55 -76 -374 92 -195
1791 -195 -233 -39 18 -200 -124 115 -121 -190 -109 3 -290 -153 20 -351 -260 143 -117 -366 72 -245 -428 -302
1813 -302 -36 -211 -171 -71 10 -110 221 14 -424 -364 -84 -282 -28 129 62 -251 -36 332 -186 236 -15
1834a5K87l47J99p7k60M86j46K5r8J72k80M6%K55k59O8K80k98l16M71K6j9l6j4
1858A50k20k38P26j91L47j62m71k03L63J5P0j38K28j79j97K99L17l98M71nl47
1879B37p42Q08k74M1L72K2L4n50N84p33j42M27L19r12R44k27j38J81R9m66K16
1900A00O4p94P79L0R0k62l39J67j35O98l03L65k66n83J331m57l00p56Q39o22N56
1921B02K84l47j59q6J09j89M72k14q9J95N38j032j80O57n72P21M26o87o31P84
1941B02P5o08q6M62j50l15Q43Q7n30m41J28J204j869J464l15j69n01N21L5n73
1961e36O87l07q98J034k15k42O32p6n90J85n7J12K08J34p20L97jn4J51N25m16
1982d7r4j48o57J391j23r09R19n67j11K18J70j20J18j028J280n85R00r42n8R10
$$ plain form
1834 -15 272 -75 124 47 -213 273 127 152 54 226 -54 -8 -8 247 -12 56 336 38 -278 193 219 200 164 150
1858 150 -70 -308 418 227 574 412 -59 -262 101 116 186 48 276 97 -100 199 516 118 589 584 237
1879 237 -505 303 29 70 442 464 498 -52 532 -201 -343 84 403 -509 435 208 70 251 350 -116 100
1900 100 164 -630 149 179 269 7 -332 -165 -300 398 95 460 194 -389 942 485 185 -571 268 -354 202
1921 202 486 139 -20 -106 3 -186 286 72 -17 178 716 -316 -496 161 -411 310 736 49 -582 202
1941 202 277 -331 -417 45 -105 -420 423 510 -20 -461 -333 871 -998 466 151 -18 -519 2 37 -536
1961 -536 151 -156 -1054 -20 -235 -477 155 79 -511 -326 -383 -271 -63 71 -649 -252 -253 -307 -156 369 -47
1982 -47 -141 -289 -946 445 322 -587 332 -235 -346 -128 42 -78 40 -988 292 -293 607 -335 -393 517
2002E17m47J29r44O57j80j93M61j3n48L38L86l24Q9JO44K32n93K63p37J09M7M05
2024B99J1l03J4M53o71L51m03M77N28p28j13k23O53K15o5L71p94L63L32p87J94
2045A74J9O0n59J011p76k71J62k50L81j67L50j4r4N8O44p37M02j7k84K41p63L20
2067a10J1N97j0m50o5k8M41r07R51j76o65N24n12R22m13k22J61J86l54Q3n09L96
2089a49K44K12l19M47p99L14m31N45m0j60L99j45m51K89j20j01K38nj98O10k66
2110A14N5Lm62P42m80N9J42n66J8K97%L04k20J6k41N9M93k96k95M73q9m21k44
2133e39P98k30K7k99J92j05N6k26L51q6n9l3L53n22k27M96K65j22k40l9K92k85
2155a82Q9L12J19m32k10M97j77j83L6j9J28n2M75n17l0L46m27K69k5j43L8l6j29
$$ plain form
2002 517 70 199 -745 -88 -268 -461 0 -13 -561 -223 163 -161 -72 -71 573 805 212 475 -262 -153 -106 299
2024 299 310 7 21 474 -197 154 -249 228 756 28 -85 -308 345 560 495 866 72 435 767 -20 174
2045 174 193 253 -306 705 -71 -342 -180 -430 -49 -216 134 120 26 84 728 -9 393 376 92 333 -430 -110
2067 -110 -99 498 488 38 -27 -55 386 -521 430 254 -411 113 -399 523 110 -112 49 235 -119 -36 -545 -149
2089 -149 95 307 -12 435 -364 -50 -481 64 24 -136 263 118 -333 -44 -164 -265 -27 -32 -230 380 114
2110 114 169 172 -290 452 -28 31 173 -393 -375 -78 -78 226 6 22 -219 -160 333 37 -258 215 126 -295 -539
2133 -539 259 29 56 -243 -51 -156 -100 -326 25 -61 -120 -153 200 -322 -549 -53 212 90 -150 -189 103 -182
2155 -182 -93 219 338 -94 -304 193 16 -167 -131 -150 -22 -74 401 -116 -146 200 -227 42 17 -126 -88 -124 -253
2178b53J58j18M74L1n15p9K79J74r0L05j64l77K98j29N9m58N71l93K73m4j28K8
2200i8R8L35m05Q8L00l18J31P5l62LJ12J54m50J49L51j50L08l77N7J94j69M14
2222D40o03l1n0M13l78J80L5J80J0L52q78R61m69k70O7j96L75k59%K64l35M1P84
2245F33n57k34M30k99j45P04j38n08j1L67j49j38k40N77k23J78j57J8m16P41n76
2266a43l80O35j8o7Q2j04L40n65L65K0K42k28m04j27J71J91p3J84k52oJ58Q8p9
2289C0q9K68JK05l11l02k1L98k51N21m78K56n32L37K09j97Q9K24n58j89J48K63
2311B1K37k1p46N11m29M77j78K42Lm29K77k54N18j94M92l76J09L9m91J29K57o46
2333d52M57L11m5K7m22j33L73oK42m20m07R8N78k62n2o7N64k93q73K06N1M09J69
$$ plain form
2178 -253 -95 -213 261 292 -223 -302 -23 151 61 366 202 -175 123 -6 53 -405 166 -227 46 2 -126 -98
2200 -98 0 335 -70 18 318 0 131 206 -156 -153 -41 113 -337 -188 163 13 321 -56 1 195 26 440
2222 440 -163 -194 -244 169 -209 -29 6 186 196 548 -330 631 162 -108 -41 -237 138 -121 -121 143 -192 -151 633
2245 633 76 -158 272 -27 -172 532 394 -114 -125 242 93 -45 -285 292 69 247 90 108 -308 433 -143
2266 -143 -523 112 94 27 109 5 345 -220 145 165 407 179 -225 -352 -181 10 -63 121 -131 -137 21 109 30
2289 30 -59 209 210 415 104 -198 -219 179 -72 449 -29 227 -305 32 241 44 133 357 -201 -390 -242 21
2311 21 258 237 -509 2 -427 50 -128 114 117 -312 -35 -289 229 35 527 151 260 299 -192 -63 194 -452
2333 -452 5 316 271 298 -124 -257 116 110 352 -68 -475 -377 201 -61 -113 -180 384 91 -782 -576 -525 -116 53
2356E3O0o0o9j43Q7L2p4k7J53l04N11k71k03R8k7K45K29q6k9j65L5J39kj71K20
2381B31k50L2p8K19l77L20m5LL2k02R8N4j76L52j22k1j50J6K74k81r5Q5K18o4
2405G3p4p7QpJ58j27J65m1l02M65k15J0R0j13oM9l3j16L1N6j5L4Jp7j26K75l0
2432E6J22J1l30J91N2j11m2ln2J30n5m2R2O4J18j73k13L94j3j56j58K55j46M18
2456D09k63l78J70J67j30J29j97K94R2j25j83J82jm79N57k27L18j32N09k21m45
2477D6O68j068K23Q75j66r60N61m75J27M11k20j06M1L26j80O5k65J13Q1L5j16
2498A6J44j34J78j97j04j22J32K0K37k46K49j82j73K10M2m2k41n5N09j06p8l37
2520b80O7J70J42n0j47J89j14j26R2L38n37J24J94j62L18j98j88M8J31k8j85m
$$ plain form
2356 53 113 53 -16 -159 -72 -40 -114 -141 12 -292 219 -52 -255 -157 -184 61 290 204 175 10 45 184 182 11 231
2381 231 -19 13 -65 154 -223 97 52 55 87 -115 -17 37 -139 213 91 70 -80 -64 210 -71 -166 -81 137 73
2405 73 -1 -78 -70 -77 81 -46 119 78 -224 241 26 36 126 13 7 56 23 -93 -62 -6 -21 13 14 -63 -189 86 56
2432 56 178 189 -141 50 102 -9 -51 -54 -106 24 -31 -73 19 83 201 28 -185 209 196 40 -118 137 -9 409
2456 409 146 -232 -62 105 -25 104 -93 201 293 168 -15 167 166 -313 244 17 335 203 712 491 46
2477 46 714 -354 -131 744 578 -382 179 -296 -169 242 22 -84 -43 283 103 168 -97 16 97 132 16
2498 16 160 26 204 7 -97 -219 -87 -67 170 -76 173 -9 -182 28 70 28 -213 -268 241 135 57 -280
2520 -280 -213 -43 99 49 -98 91 -23 -149 -57 281 -256 -132 62 -100 218 20 -168 -120 11 -17 -202 -206
2542b06R5J03q8j09L29k60J57p3j8j35R6k6L0J11j42MN6r9O3M7o6J46r4o1O5n8
2568a33o7L09k48J10J06j7n6j9L79m42J70l3k23Q2K59P2k04J39l22k67M32qJ16
2591A35l01J91Q9l43J31J66k62R4J75j15p2p0K33j61J39m3J12P9o6n6o6Q7J07
2614A83l92K36m5R7j11Q2L0k70K73J36j60J22J0m01O9K69o1j17Q3%j13J3m5J04
2638hQ2k2J4P0mm1j50j01K6J26P2J47j67j07l5L49N4k43K16j39L7J70k82Q8l7
2663A15j75k2J52J6j24j19J39J97k30K06p2m7N0J48m29j39K11K85j23j87J60j31
2685a19P3q4K03r8J38k84K92l12J66n8j63L87m33M41l69K65l61K98J97o5m48L51
2707A7k12k2O8L1o0n2L14k26J66m4N2k49R0J64q8j72J71l8J3M6K05m27p1L24P0
$$ plain form
2542 -206 -111 -8 -96 -205 124 -136 21 -52 -70 -205 -109 -135 -105 6 -136 -132 -76 -175 -112 -65 -131 15 -79 -140 -75 -133
2568 -133 -200 109 -139 -29 77 60 4 -15 364 -78 92 59 -164 -82 177 249 45 184 -138 -405 27 19 135
2591 135 -166 25 114 -229 -98 68 -194 -100 75 -40 -112 -182 51 -110 29 -14 98 177 111 55 -11 76 183
2614 183 -209 27 -18 79 -32 50 80 -190 83 219 59 181 191 -210 -141 128 67 -50 33 33 -80 -67 -112 -8
2638 -8 74 52 66 136 132 91 -59 -160 -134 -8 64 211 44 -63 -98 251 305 62 278 139 176 346 64 152 115
2663 115 -60 -82 70 86 -38 -157 -18 179 -51 155 83 36 86 234 -195 -334 -123 162 39 -148 12 -119
2685 -119 -46 -130 73 -25 113 -171 121 -191 -25 -83 -246 141 -292 149 -220 45 -316 -18 179 114 -334 17
2707 17 -195 -217 -149 -118 -178 -230 84 -142 24 -20 32 -217 -127 37 -51 -223 -52 -90 -77 -31 174 -253 -324 0 70
2732G0j02j3J29k47J41j38K46K9j71J23j22j41K41K9k30K11j83Q0j50K49J24j35
2754D0o6J98j14J88j02r3L3N7o1Q4k44J51q8L53j06k24L74k90p0K16l64M9M9Q6
2778E6l7o9Q3j87J15R0n4j09o0L17o0m04K92K10j45o1K30j18N5k36K70k58l9Q7
2802c2Q3K23l60K81k22K0q4m3K65O8Q9j90l0K06j41j23j8J30k09K04k86K26K1
2825G8j4j46J16K51m10l5K93j44q5O7l1j75J08M7l1Q5J71o3k75K2K59j52q8J72
2849B0j64K8K61k32o4J3K20j60r9PJ9j7L61l34J14l35J97K99k21J54k3q4J19p8
2873Aj31M7J9j62O6p6J92n3M3j71J93R8k48J70k62K55J88j97J32j07K7l4k3K4
2897iJ9o3R1k43L49j14q3J37j37k37J39M76l33J64j39L9r9J82j24P3k17L2L06
$$ plain form
2732 70 -32 -45 84 -163 -22 -160 86 115 -56 67 -55 -196 45 74 -156 55 -128 -48 -198 51 175 40
2754 40 -26 172 58 246 144 51 84 141 80 164 -80 71 -17 336 230 6 380 90 20 236 -128 -79 -30 56
2778 56 19 -50 33 -154 -39 51 -3 -112 -172 145 85 -319 -27 183 38 -23 207 89 144 -92 178 -80 -119 -32
2802 -32 51 274 -86 195 -27 -7 -91 -134 131 199 288 98 68 274 133 10 -8 122 -87 117 -169 57 78
2825 78 64 -82 34 285 -125 -160 133 -11 -96 -29 -60 -235 -127 -80 -111 -26 145 82 -193 -171 88 -64 -152 20
2849 20 -144 -116 145 -87 -151 -138 82 -78 -177 -170 -151 -168 193 -141 -27 -362 -165 134 -87 67 44 -40 79 1
2873 1 -130 -83 -64 -226 -160 -236 -44 -97 -54 -225 -32 66 -182 -12 -274 -19 169 -28 104 -3 24 -10 -33 -9
2897 -9 10 -53 38 -205 144 30 -53 84 -53 -290 -151 325 -8 156 17 56 -43 139 15 88 -129 -97 209
2920B09m58K77l4J31k73m3K38l48N27j46P6j06j27k28Q3O05k51j66j65K58k0k70
2942b31L74j98J9p8K13o1j64J80J07j94k04N53l28m0O7J09q2K08m04q4L83r2j63
2965a10K75j13j24J09j87J89n4j40K08l34K93K46n75J74K82J6j41o3N1O2l09K46
2987AJ1j2K04K3p5k56M10l70k4J89J04l56K26j52j4n5K01M2l59K69j08j29K40
3010A0q5j65L91k45Q7n9K12n2j78K4nm3M66m42K16l33J45M4k17L41J20l22m3n3
3034a86P3N7k17L85j07k46L07j18k8J42j95J61j6J07r9j36N0J64j71M5J85k60
3056a03J20n2P7j98J1L37k16o9J37j9r1J0p9M76j52k09j9j52M34l35R1m0J28j56
3080f9J62q3R0J0M3m15L36j05n7L89k50M5j46m1L3j71N13l51L0J30j28K22k8j11
$$ plain form
2920 209 -249 28 -6 125 -148 -191 47 -301 226 80 156 50 -77 -305 -222 383 132 -34 -199 59 39 -231
2942 -231 143 -55 -36 -114 99 38 -126 54 161 -33 -237 316 -12 -52 15 124 42 250 -154 -238 145 53 -110
2965 -110 165 52 -72 37 -150 39 -15 -155 53 -281 12 258 -317 -143 139 155 14 -49 2 64 -245 1
2987 1 12 0 204 227 152 -104 306 -64 -88 101 205 -151 75 -77 -91 -146 55 97 -262 7 -101 -230 10
3010 10 -75 -240 151 -94 -7 -66 146 94 -84 -60 -65 -108 358 -84 132 -201 -56 -12 -229 112 232 -90 -133 -186
3034 -186 -113 -56 -273 112 5 -241 66 -52 -80 62 -133 28 12 119 20 -116 -66 98 -73 -28 157 -103
3056 -103 17 -35 42 -156 -145 192 -24 -93 44 25 -66 -56 -135 341 189 -20 -39 -191 243 -92 -1 -41 87 -69
3080 -69 93 10 100 110 153 -262 74 -31 -88 301 51 96 -50 -91 -58 -229 284 -67 -37 93 -35 187 159 48
3104D8q1Q1K16l58Q3m6L61l64P1j03j13K20M6J92l31K9J21oQ0Kj85J69j28j05
3128a01qJ87j11J98N7j64o3qJ14j4%k65L7L26J26l94K63R2l12j11J54J50j64J7
3152FO7k1J7j35J03j80J22j08K93j8j61R6l21M76l51m5J45J12r6r7p2M5O8J05
3176E0l4k59M17p0j60Q7nM3m00K6L70r3r0J19jm1k10K90O7o3k50P4J02J76l09
3201a64j83K75O3p1J26Q4p4m0L9j56J99qRj45k62K27K00l22K09j83k9KK41p1J51
3226A17j28J62j52MR5n8k58L81k14J9j63n4K23N4l25J11m1L17N6l40N5J13j4o8
3250a08K61Mk4j24J2l5n9j7J75j22pj1o4M02j11l90R5J2N0J6N7K33l49J8m3J70
3276D1%p8L2J4N4k05L25k70N6k54J73K02k09R3J04jq1M7O8OJ27k24j05K18l6r3
$$ plain form
3104 48 -33 48 264 -94 -11 -57 304 -60 11 -92 -205 15 61 253 -78 -49 72 66 146 148 -37 132 4 -101
3128 -101 -109 78 -33 165 222 58 -5 -13 101 87 87 -178 -141 185 311 -83 180 272 -40 -151 3 153 -11 6
3152 6 73 52 69 -66 37 -143 -21 -129 164 146 -15 81 -240 236 -115 -160 -15 97 1 -96 -168 -123 -55 50
3176 50 16 -243 174 104 -56 31 26 69 -331 -305 65 -28 -118 1 0 -41 -251 39 106 43 -207 -133 -31 145 -164
3201 -164 -347 -72 -9 -80 46 130 56 16 55 -101 98 90 99 -46 -308 -81 119 -203 6 -177 -206 -204 37 -34 117
3226 117 -11 151 -1 3 98 40 -218 163 -51 -32 -195 -249 -26 28 -297 -186 -227 90 146 -194 -139 -26 -40 -108
3250 -108 153 157 133 9 21 -14 -73 -90 85 -37 -44 -55 -119 283 172 -218 -123 -111 -61 -45 12 245 -104 -86 -129 41
3276 41 41 -37 -5 9 63 -142 183 -87 -31 -285 -112 90 -119 -26 78 77 -4 43 111 117 244 20 -85 133 97 4
3302Dj00J81k62K76j79n4L14j31l1Rj46L56j43l01M23k58q7p3L34k84N9Q7k7R9
3326F6Q7K7l85L50j99J49o3J4L1j10J34n0j76J92j57L1j9J18K1j68J84j62R8k84
3350b71K5R1K53ro6k63K38qj28K17o4j28PK4P8J30j17R4l39K87q7J75j78j26O7
3375i8O7O7K5j12j13L95k59M9O6j01j88L07J9l48J27r5O2J08J02r7NJ27k41J36
3399A0j07J24qN7o9J73k88J0m4J36nJ23r7k31J79oR8j03m9J38M6j30K3J1j68J54
3425b3J4j0q9O5K30k79K40j09N2j57j16M35j50j03k06J78l3n2Q9K6mq1kK32L4
3450A81j0O3j89q1j05L39j13l4k42L14l8l47J50J03j16m5K21J52j37R4j08j11
3472e9J47l2j65J45Q6j19J10J74k40Kj43K11m3j86o5Q2P9L6J59k1K9j54jj18J91
$$ plain form
3302 4 -96 85 -177 99 -80 -134 180 49 18 27 -119 237 94 -207 216 -42 -129 -202 132 -152 -93 -6 -33 66
3326 66 153 180 -205 145 -54 95 32 46 77 -33 101 51 -125 67 -90 -59 -78 40 61 -107 77 -85 13 -271
3350 -271 -246 -155 98 89 23 -240 -2 -10 -138 79 15 -113 -106 -82 -4 126 9 103 -236 51 -36 139 -39 -165 -98
3375 -98 -31 36 61 -51 -164 231 -28 21 87 -14 -202 105 124 -224 -97 -192 -130 -22 80 -17 -12 115 -126 10
3399 10 -97 27 19 76 7 180 -108 -98 -142 -6 -11 112 15 -216 -37 -43 55 -48 -97 41 87 -43 -20 -9 -177 -23
3425 -23 -9 -19 -108 -43 187 -92 148 39 91 -66 -182 253 103 0 -206 -28 -61 -113 -24 2 -2 -83 -85 147 181
3450 181 171 234 45 -36 -141 198 85 51 -191 123 85 -262 -112 -9 -125 -170 51 203 66 160 52 -59
3472 -59 88 56 -109 36 122 3 113 287 47 49 -94 117 74 -112 -177 -95 -16 20 179 158 187 33 32 -86 105
3497A05q6K3j93J88l8P2K6j84L62k39J84k85L1J29k29K12l19N5K22J91k51O6J22
3520A64q5j08M9M9j86J8J31j36J18l3jP3j45P4O4m5R7p0n2m6L1O0j08N5J0j61
3546a83j6N2M03l93r5K43o7j77K19o9j09J83q6O0k6m4J63j69R3n7J9L40j86j22
3570b4J5j07K66j50o4J8j30L82k43n0J6M8j04k1K42Nj93J16j1o4j83K38J01o9
3594C4l2L4j53J20m3J09o1j65Q3j59J87J72j32J1l4K29k16k34M61k25J32k21o4
3617a67pP1K63j87J10j19K43n2j49K7o5N9k43J26K0J84j26J39q6j8R0j48J81K2
3641A68K7k90L04l11r3K16m0l8K10l78R9l5O0J21j22L57Qm35Q3J4J7O5l5J17k01
3666a12P6R0j6k77L25l8l8K33k21n2Kj85M72l74K25K1M9l86J72J68k19pJ13J55
$$ plain form
3497 105 19 42 -151 37 -1 71 97 -87 275 36 220 -65 -34 95 -134 78 -241 -186 36 227 -24 42 164
3520 164 79 -29 20 69 -117 -99 32 -104 14 -19 -20 53 -92 -18 46 1 98 28 -24 -70 -39 21 -87 -32 -22 -183
3546 -183 -199 -147 256 -137 -232 11 -56 -233 -14 -83 -192 -9 -95 -35 -61 -105 58 -111 -18 -75 -56 284 98 -24
3570 -24 -9 -116 150 0 -64 -46 -176 206 -37 -87 -71 -23 -127 -148 94 99 -94 22 11 -53 -236 2 103 34
3594 34 2 36 -117 3 -40 69 8 -157 -74 -233 -46 126 -6 5 -29 200 -16 -250 211 -14 118 -103 -167
3617 -167 -174 -103 160 -27 83 -36 207 155 6 33 -32 27 -216 -90 -70 114 -12 127 41 23 113 -35 146 168
3641 168 195 -95 209 -102 -195 21 -19 -57 153 -225 -126 -161 -101 20 -102 255 263 -172 -89 -75 -58 7 -28 89 -112
3666 -112 -36 54 38 -239 86 48 10 243 22 -30 -28 -213 259 -115 110 131 180 -206 -34 134 -85 -92 21 176
3690A76p8j75J28k6O1j60J49j74O2K76k07J0l5j14L09j65k13K75Pk24K94j42j1
3713B3Rj33J43j89J73j28P7J18j08J63j08m5qJ56k11L0j42K33L8l38K52R1o3k61
3737b28J04J03J25j25o3J16k0j60J62o4l7J17n1Q8j43N4Q9r8r9K99j37j21J69
3760H0j68J66k08Q1K7Q0j76J94j0j37O5k14M9J19P9j10m5O7K78J9m46P3O0q4M2
3785a19J36Q8l2J57k88r8J71o9J07j87N3K62k50l4P7P9k96K67o5J62j83J96k09
3808g5N1J08j87j04L19j72O2j14K31R4q3k57J35j21j6L06k5k56J82j59k9M00j91
3831I9r4Qj0j5O3k06J09p5Q2J95m9j9l8p7K20k92J67l3M9k36J33k02K56J55m4
3856A46j48j50K77p3j06j05L44n2k92J73J61l18K21l1k66L68j29M6R7%l27J53
$$ plain form
3690 176 98 -77 51 25 86 -74 75 -99 -37 239 32 42 7 -107 202 37 -176 99 106 -118 176 34 23
3713 23 32 -101 42 -147 26 -102 -25 93 -15 148 40 -5 -13 143 -68 -38 -180 53 91 -247 5 96 33 -228
3737 -228 -124 -21 104 -21 -84 32 12 -148 14 -50 -87 30 -21 67 -76 -22 67 -31 -130 169 32 -89 80
3760 80 -88 78 -130 -49 -22 58 -118 76 66 -71 -6 -220 -171 -52 27 -83 -128 -61 217 236 -210 -137 -77 -161 -119
3785 -119 17 105 73 230 -58 -156 15 -54 53 -134 -81 181 -69 -103 -26 53 -243 24 -41 121 -62 134 -75
3808 -75 -24 84 -103 -207 112 -60 2 -112 119 213 130 -127 8 -113 -129 177 152 -104 78 -81 -110 290 99
3831 99 5 13 3 -12 51 -155 -46 -121 -39 156 107 88 50 -27 193 -99 68 35 84 -152 -19 -221 35 190 146
3856 146 -2 -152 125 52 -54 -159 185 133 -159 14 175 -143 78 47 -219 149 20 66 163 163 -164 -11
3878a1l4J69l01K06j41m4J8N7lN8K32p4o4k54L15J01j71j29L78l04j29J24J1L74
3902C84k95L1J31k77P7m7j18K22r6J12J82m21K03R2r7p7m0p5J33p1O5K92k62J10
3926A58j56j33M48m0l16J08k65J80k0r0m7J93L59l92J66o3k43J41Oq4J55q5n0
3949g0j33L91l08K37l45Q6j14K27J49J28j57m8R1Q4k21n0J63J59j37O1j45O2R3
3972B03j45l4j20Q3Kn8P2J28k65J39j56J62pj00K12j70J73Jj38M0k7j2j27R6m4
3997i2n9K03O4j54n6J27J48r9n1J40n2k79J39Q0J22J20m26m2K84Ok88P1K68j43
4021C1k6J8qk21J74K81l53K65j01r2l4J67q4J39j36j40K22m2%k50L73k65k06L89
4045A01k60K92m8j62m3L24q7j91n9J93j28J22j29k2L54l13J06j58J97k88K51J58
$$ plain form
3878 -11 -45 124 -177 29 -112 -156 -138 -81 -84 -26 206 132 68 -186 129 230 59 -70 308 4 -125 -1 10 384
3902 384 89 120 251 -26 51 4 -114 108 12 124 306 -115 88 180 83 6 -34 -109 24 -47 18 310 48 158
3926 158 2 -131 317 277 -39 69 -196 -16 -36 -126 -173 20 379 -13 153 90 -153 -12 -6 -90 65 -20 -70
3949 -70 -203 188 -120 117 -228 -142 -256 -29 120 248 91 43 134 218 -3 -53 110 269 132 193 48 110 203
3972 203 58 24 -96 -13 -11 -69 3 131 -134 5 -151 11 4 -96 116 -54 119 120 -18 22 -5 -17 -144 -48 -92
3997 -92 -151 52 116 -38 -94 33 181 82 31 171 119 -160 -21 59 181 301 -125 -167 117 123 -165 -94 174 31
4021 31 5 23 15 -206 -32 249 -104 161 60 -32 -66 101 17 156 20 -120 102 60 60 -190 183 -82 -288 101
4045 101 -159 133 85 -77 -120 204 117 -74 -133 60 -68 54 -75 -97 257 -56 50 -108 89 -199 52 210
4067B10k01J4r5m2pL39l01j10K66j59J36n2L4j62k70L32l6K68r3l7q0j30J99l2
4091ik77M08mj11J04r6J38l48L82k21j04J28O2n8K7J34j68K2l9K23j53J42K9o7
4115A44K7j92R4J06j35J8J12l33J71J62Lk12l1k86K33J48q3rK98j09j37J37k49
4138a23j25M09j89J3Q1j10J0J21l8j86L51j93j67O2j24J81R8O6k72K27j02K80
4160B70k65K21q6l00L35r9m3q6R6r3nO1j0m8J26R3k34J61K9k84K46j39L7J12k66
4185a71K57l8k61J63J40o0j27J51J03K8k14N0j23K0n2L15k65O0q8K0R7J77j62
4208B0J91l11j0K87j53R2q9j81K41J2O0j33k78L53l34Q6L07k10J1J4Q4j31K04
4231A32j59o2J40K8j4l29K40O7k14R2K68p2j19l5J56k90L64l74J56L2J16K2l2
$$ plain form
4067 210 9 23 -72 -114 -121 218 -83 -193 73 -86 50 -2 32 -130 -400 -68 -104 164 71 34 -46 -176 23 -9
4091 -9 -286 122 118 7 111 15 153 -195 187 -34 -138 -10 52 -6 21 155 -13 9 -30 193 40 182 211 144
4115 144 171 -21 73 179 44 62 174 -159 12 174 177 -35 -66 -352 -119 29 -54 -63 235 126 -11 126 -123
4138 -123 -248 161 -28 -15 66 -44 -34 87 49 -137 214 21 -146 -84 -208 -27 71 137 -135 92 -10 270
4160 270 5 226 140 -160 175 76 33 -53 43 -50 -55 6 -4 -52 74 167 -67 94 123 -161 85 -54 -17 95 -171
4185 -171 86 48 -213 -50 90 30 -97 54 157 185 -29 21 -102 -82 -134 181 -84 -24 -112 -92 5 182 20
4208 20 211 -100 -110 177 24 116 27 -154 87 99 159 26 -252 101 -233 -147 160 -50 -39 -25 59 -72 132
4231 132 -27 -89 51 79 65 -264 -24 43 -171 -79 189 117 -2 -37 119 -171 193 -181 -25 7 123 145 113
4254A13N2k41RP5L9J60k94J70PJ3j43j08J97j26O6j44L2R9q9P8J89j11m3j18P8
4279d0r4J47m3l9K06Ok48K58j78J3j4n5J95mN0k43K35l32Q2J53K8p3M5n8J71k04
4305c6J96j38J16k49L30m51L43r3J6k54L59k60RN9M0k61J68J65j71P3l6pK14m3
4329H9j68O7J41k80K83p7p9L41k04k03M11m08O9l4N5K14k19m8QK83l06k4M20j47
4353A84j11k1q4r2L21l01j50K46j00K23m19K16n0J16K77k70m1P5k67J41J9K6o2
4376a24J72j80j49J18J54J77q4o1r8J52j66Jo4q8J50J09j81K42k28J18k4j39K39
4399D6O8l84J72J28jK14l01k3n8lJ30J22j25L6P3m8j69j11K11j96K73K1J75k54
4423dqm1L7J45r1k73K71j93L23k79R8Q8k12J41j49J32n4K40m31M23j52o8J03m0
$$ plain form
4254 113 165 -76 -67 8 47 207 -87 83 90 103 -40 -148 49 -77 -11 -155 -123 -24 -113 -35 154 43 0 -118 -40
4279 -40 -134 13 -30 -69 137 143 -105 153 -25 -12 -26 -81 114 110 160 -83 152 -180 -98 55 83 10 55 -3 168 -36
4305 -36 160 22 138 -111 219 -232 111 18 34 -220 139 -121 -112 -53 -13 -274 -106 59 -112 -39 -75 -82 132 89
4329 89 -79 -12 129 -151 132 55 -24 317 113 -90 321 -87 -18 -52 3 217 -2 -50 -42 241 -65 -89 331 184
4353 184 73 52 -32 -124 197 -104 -254 -8 -108 115 -304 -88 -138 -22 255 -15 -56 19 -248 -107 -88 -62 -124
4376 -124 48 -132 -281 -163 -9 168 84 23 -75 77 -89 -88 -152 -240 -90 19 -162 80 -148 -30 -54 -193 46
4399 46 114 -270 -98 30 29 243 -58 -81 -139 -142 -12 110 -15 21 94 46 -123 -234 -23 -219 54 75 250 -4
4423 -4 -12 -53 -16 129 38 -235 36 -157 166 -113 -15 73 -139 2 -147 -15 -69 171 -260 163 11 -57 46 6
4447FQ2j42o8J55r1j02J61J26j47J44m42N25l68K69l04L21q2J6Q1k39K75m30L32
4470G8q5P0j92J08m8J0J27j04j84j58j73M43r3K95k64J0q3L06J46k02K0l7j11
4493a21J02L2l06L94k05po8K39J24k35KJ56j33J06o7o4J59p0p8j17P2L4J29p0
4517Hj32N2L50q3j97j78R2L45k1k08J71m02J41j4J01J08o2Nk25j87L55o0K74k76
4541d3Q7p4L29j96q1J55j95p7j36M20l00p2J55k00pM10k18Q7j23J72k31k82M00
4564b0K80o62L31k5o1R1j96M4KR1J49j09J66o3L55n52M1Q8J44Q0j71R3m4j3l6
4589CP3j09j61K89l25K78K24n32L98k96J73l9k1M9J01k97K91j74mL0r1J94k27
4612a73J52J70j81J97k40j04J46K24P7l67K47j64L49k30j84J85j82j38K15o6K54
$$ plain form
4447 6 88 -54 -122 33 -58 -160 1 127 -20 124 -318 207 -161 108 -196 125 43 59 140 -99 176 -254 78
4470 78 -7 63 -129 -21 -69 -59 68 -36 -220 -378 -551 -108 -201 94 -170 -160 -243 63 209 7 27 -10 -121
4493 -121 -19 13 -293 101 -104 -111 -179 60 184 -51 -49 107 -26 80 13 -51 108 38 -40 -157 -85 -51 78 8
4517 8 -124 -72 278 195 -2 -180 -88 257 236 28 199 -203 -62 -76 25 133 71 76 -149 -336 19 -41 233 -43
4541 -43 44 -30 299 103 22 177 -18 -95 -231 189 -111 -183 -28 -228 -235 175 -43 44 -79 93 -138 -420 -20
4564 -20 260 -402 -71 -96 -157 -66 -262 -218 -216 -125 24 -85 81 18 373 -179 -138 -50 94 174 3 96 52 39 3
4589 3 76 -33 -194 95 -230 48 272 -260 138 -158 15 -24 -45 4 105 -192 99 -75 -79 -49 -140 54 -173
4612 -173 -21 149 -32 165 -75 -179 -33 191 268 -99 148 -16 333 103 -81 104 -78 -216 -1 -67 187
4633A87k85J08j82R7N8Q0j71l1L02p9k16q3L77k29L3j03K06Q0j20J8j80K46R6
4656B09l55K42k43J21M0j40K04j28J33O8j80j36J63j15L13k37L64k88k35J97k19
4677b22R9J89K21k72M6o8j56K49p9K39k94K04m09M95j72R9j34Q7j16l7J90J42
4699C01k74K5j44J49J86m62L03m5j18J43J78j51L4j46J07J24k31J15j15J55k13
4720g9j02J64r7K33j70K89K7p1j91K83l13j31M06m39J77j78J16J22j51K05k44
4741a44K08Q1k04J12j51K39j9k60J38q5K4J55k69r5N27m45J70J97j21r9L5J93
4763A87q6n9k1o7K78n3M4l23J36j97L63j95k48K88J3J8n3j53Q5K21j71j74l5J34
4787f8j63R9J54j0J45j9k03j26p4K81j5k02J93L4O9j81n0J35P1N2R1j47j08J98
$$ plain form
4633 187 -98 10 -172 -75 -17 63 -108 -139 163 84 -132 -215 162 -67 -34 -137 69 149 29 47 -133 113 209
4656 209 -146 96 -147 -26 14 -126 78 -50 83 151 -29 -165 -2 -117 196 -41 323 35 -200 -3 -222
4677 -222 -123 66 287 15 61 -7 -163 86 7 246 -48 156 -253 242 70 169 35 122 6 -31 159 301
4699 301 27 52 -92 57 243 -219 84 39 -79 64 242 91 125 -21 86 210 -21 94 -21 134 -79
4720 -79 -181 -17 -114 119 -51 238 265 194 3 286 -27 -158 248 -191 -14 -192 -76 46 -105 100 -144
4741 -144 64 145 -59 53 -98 141 122 -138 0 -85 -61 94 -175 -270 257 -188 -18 179 58 -41 -6 187
4763 187 101 42 21 -46 232 179 223 -100 36 -161 202 7 -241 47 60 78 25 -128 -43 178 7 -167 -202 -68
4787 -68 -231 -132 22 12 157 138 -65 -191 -265 16 1 -201 -8 26 95 -86 -136 -1 70 122 213 66 -42 156
4811A56k8j05J60l29K68p2k0j13J14k05J68J0o4K03q4j32L9J10k10O5o8J53J26
4834A42j22j18J59k07K96j45M6k17O8kJ86q5Q1j65R6Mr3J10j49j62K99R5l5n0
4858C2N2j12K22J65k74J06l08k8Q3J24j18o2J00rn1K2J32p4J1j7k24M14m6k23
4882h3J73k45J51j15J05J94j79J8Q6q2nk7j02K88j82R5l12M68m2j27q1J48R7l19
4906g8j8J29k02K00j02J70Q5r0j52R5q3l8N8j07K00n9N0o2J55j32J08K7m31K67
4930a0N0k79L07k17L36K2k93J3N7j38K37J17j36j1L24l91J3j05j11J63K02q9k11
4953a50R9J92m4J7r3j22M8PJ05J3M0J47j16R8l10l2J01K9%j91J74k52J06J70L3
4978F9j5n2p9O5J17m6k25L38m02K96p7K46m66K42j16p8J86j88p6L43O0l9l34P1
$$ plain form
4811 156 128 23 183 -146 122 50 30 -83 31 -174 -6 4 -60 143 59 -73 -34 76 -134 -69 -137 16 142
4834 142 20 -98 61 -146 150 5 51 -166 -98 -100 86 1 82 -83 13 17 -76 34 -115 -277 22 117 82 32
4858 32 84 -28 194 359 85 191 -117 -145 -62 62 -56 -118 -18 -27 -78 -56 76 2 13 -4 -228 186 140 -83
4882 -83 90 -155 -4 -119 -14 180 1 19 105 23 18 -9 -111 177 -5 90 -222 246 204 77 -4 144 241 -78
4906 -78 -96 33 -169 31 -71 99 184 94 -58 37 -46 -84 -26 -133 67 8 58 -4 151 19 127 154 -277 -10
4930 -10 40 -239 68 -149 187 209 -84 -71 -14 -152 85 202 66 55 379 -12 1 -104 -215 -52 150 61 -150
4953 -150 -51 141 97 114 21 -101 -53 -46 59 72 112 259 143 241 -69 -101 0 29 29 -162 12 -240 -134 36 69
4978 69 54 2 -77 -12 105 59 -166 172 -230 66 -11 235 -231 11 -105 -183 3 -185 -261 82 142 103 -231 -160
5002a60j44M42Pn1j06l3k41J52L60k24K5N6j60N3O2m0K29k29k5j72K68m6k44L09
5026H8j64r4O6K20l8j09O3j73M6M8L11k56j76K10j00J75k27J12j53M31j92m39
5048c51K61J58l6m1J74J12k43j51l2J08m3L52K0k57j02K65K1l32L77l17M0j43
5070a60K68j93j49J89oJ29Q9j32j95N9K00j26j14M06k56l1J52Q0l71K00K0j53
5092i4K89k00K3M9J04q0k33J52N1J21j9j93J61j48L26o26L51R7l80K03K23j94
5114a7K43j03m3o1P4J21j71j59K55r8j37J9j4J5J33l2j22l9J18J5R4j69J32r2
5138c8oQ8R3R7l02J71J28k76J65j39J3r1J85j10J10o0j29k1J83j03p2J13J33m8
5162H4j01Rp3Kk05M48m26J87p9J56J77k55J07K0j46K26j19j33R7J02K19m04K37
$$ plain form
5002 -160 -304 138 145 94 -12 -45 -286 -134 226 2 27 83 -77 -24 38 -2 227 -2 -27 -199 69 23 -221 88
5026 88 -76 -170 -104 116 78 -31 32 -141 -95 -47 264 8 -168 42 -58 117 -110 2 -151 280 88 -351
5048 -351 -90 68 32 -9 165 277 34 -117 -149 -41 -84 268 288 31 -71 194 215 -117 260 -57 -17 -160
5070 -160 108 -85 -234 -45 -51 78 167 35 -160 -101 99 -27 -141 265 9 -22 130 210 -161 39 59 -94
5092 -94 195 -5 18 67 171 91 -142 10 61 182 163 -30 131 -17 309 -317 34 131 -249 -46 177 -17
5114 -17 226 123 80 19 93 214 43 -116 139 41 -96 -77 -91 -76 57 25 -97 -136 -18 -3 91 -78 54 -38
5138 -38 -44 44 137 234 -68 103 231 -45 120 -19 -6 -97 88 -22 88 28 -101 -122 61 -42 -114 -1 132 84
5162 84 -17 -8 -81 -79 -284 164 -262 -75 -154 2 179 -76 31 51 -95 131 12 -121 -24 78 297 -107 130
5185A30J7k12m3j4J9k4M8j65L03K8l54K33r9J6J42nr4J53k46L14Pj82J49j42l4
5210e5K5j8L07j93L7j77J80O2j97K15j74K0j87J67Q3j53M0N5o3n8K60l80Q9L78
5234B63k25p1M3P1k10RK77k00j27J76M9k77p3N3R7J95j24l3J60j03J31l5j71n
5258a30L11%j51l9J01J07o3r3k05M41j47j79J89k34J81j67p0k2J51K17j83M6l72
5281c11L16K7q3J02Mk6Pj80L15j53M7o1k86K40l0J12j6Q8P0M6k11L19j98J6k18
5306f4q9J48M9K5K9M5L8k31K16l47J94P8j94K33j74Q4J03k67J4N7k67M30O3k22
5330d9K9J77l12J36j75J23j48J85j80J49r9J11K42l20K20R5k20k5R0K08p5l30
5352a68J26J72J46k45k42K43jj17J53j98j41R5J29m4P8j2p2R7j02J86k84J05j01
$$ plain form
5185 130 147 -65 -108 -122 -103 -127 -79 -244 59 87 -267 -34 -133 -117 25 20 -74 79 -167 147 154 -28 121 -21 -55
5210 -55 -30 -48 259 66 103 -74 106 168 -29 186 12 32 -155 12 95 -58 -18 37 -26 -84 176 -204 -115 263
5234 263 38 -33 10 81 -129 -120 157 -43 -170 6 55 -222 -295 -242 -145 50 -74 -107 53 -50 81 46 -125 -130
5258 -130 181 181 30 -9 92 199 136 43 -162 279 132 -47 142 -92 89 -78 -148 -170 -19 198 15 61 -311
5281 -311 5 32 -51 51 55 29 36 -144 171 18 65 4 -282 -42 -72 40 24 112 182 228 17 336 138 154 -64
5306 -64 -153 -5 44 69 98 143 181 -50 166 -181 13 91 -103 130 -44 40 143 -124 -110 -53 -320 110 173 -49
5330 -49 -20 157 -155 -19 -194 -71 -219 -34 -214 -65 -164 -53 189 -131 89 184 -36 -61 29 237 162 -168
5352 -168 -42 130 276 31 -211 32 31 -86 67 -131 -272 -177 -48 -92 -14 -26 -98 -1 -103 83 -201 -96 -197
5375a97L25k20R1k37M14l2q7R0L4r9r8P8l81K0J94O7j17j45J62J42J41k70J23
5398bj02o0L67l99K09J3K5o3M8j02n7J68j64J32J1K43l18O5p2m8nJ26o8r5J86
5423C8J57l92Q1J71k1K2j15K48l11J26J66l58J26Q4n9K06j68j4k09K05l3Q2j73
5446a41K45j92J65k95J84MJ53l23K40k4j73K65o1L0j79J48J30j66n7Q8J97j83
5468E5R7p4l23O2J8K55j51J58k31q9L13n7R5J22l36j26M72k14j94j55K93n9K4
5491d5Jo2K44k67P8p1J10K02j58p6kp6o7J00J09L5k79J68J23J66l95K69r2n0P1
5516C6k30K18j17J73n6k6P2j19Q5J07l54J69p1O4P3L6m45M14p4L4L75k45p2L47
5540C94k28j82J17M9l75l3j68Q84l78j67L73j55n1K26j33o2R5J67o49M72k18M61
$$ plain form
5375 -197 128 -92 -1 -238 176 144 57 147 181 82 -16 62 -319 -299 -105 -38 -155 -300 -138 4 145 -125 -2
5398 -2 -104 -164 203 -196 13 26 51 -12 36 -66 -123 45 -119 13 24 267 -51 14 -58 -106 -111 15 -53 -148 38
5423 38 195 -197 -116 55 34 56 -59 189 -122 4 170 -188 -62 22 -37 169 1 -13 -222 -17 -50 32 -141
5446 -141 104 -88 77 -218 -34 -30 123 -200 40 16 -157 108 47 77 -102 46 176 10 -47 41 238 55
5468 55 152 78 -245 -183 -165 90 -61 97 -134 -223 90 33 128 250 -86 -212 260 46 -148 -303 -10 -69 -45
5491 -45 -44 -106 138 -129 -51 -122 -12 190 32 -44 -46 -122 -189 -89 20 55 -224 -56 67 233 -162 107 15 -35 36
5516 36 -194 24 -93 80 24 -2 70 -49 36 143 -211 -42 -113 -49 24 60 -385 29 -45 -11 364 119 47 394
5540 394 166 -16 101 150 -225 -258 -426 458 80 -87 286 131 80 306 173 111 206 373 -276 196 -22 439
5562D39o9K94m60m82J57J98J93m14L53o3p5M6K48K6n41M96m01MM99l91O34o04
5584H7j76n30P67j44O78n01J82m96J71p9M4J69NK80j74o20L07N06m75n2K78l61
5606a34J11L7jk27K02J22O2m19J81R1j99J61m2J41M6m7q2J28M7j69J25o2L9l30
5630b19K99j25k07K00J03J19j09J72l67K60k51oK06r1J69q7r5J67l76K26K19k61
5652e4J63j32J69j67M5j29K69j72O1K9k79J89J09j54K00j57%P5j01K04j22LJ26
5675A75k24O0nK33k42j39m2K02Oj62K86j60N0m0o1J21j22N1J15j52K8p2m3Q2P4
5700A9M7j35PK4k4N8j51K89k01R6j50J99j82Q9J05k4N4j59j78L23j79J38O1oj43
5725b3q9J40n1j55L36J5k4j68J34j69j22K84p0K0j51K71k28q5K4J85j63K79j19
$$ plain form
5562 439 370 664 204 -278 -121 77 270 -144 209 146 71 117 365 391 -150 346 -55 -51 448 57 691 87
5584 87 -89 -619 148 4 682 181 363 -133 38 -41 3 172 177 457 283 -337 -30 476 1 -51 227 -134
5606 -134 -23 14 13 -214 -12 110 172 -247 -66 25 -174 -13 -55 86 132 85 3 131 178 9 134 72 111 -219
5630 -219 80 -45 -252 -52 51 170 61 233 -134 126 -125 -131 75 -16 153 66 -29 138 -238 -12 207 -54
5652 -54 109 -23 146 -21 24 -105 164 -8 53 82 -197 -8 101 -53 147 -10 -10 65 -36 168 46 49 175
5675 175 -49 11 6 239 -3 -142 -184 18 24 -138 148 -12 38 -2 -63 58 -64 -13 102 -50 -22 -94 -137 -55 19
5700 19 66 -69 -62 -38 -62 -4 -155 134 -67 29 -121 78 -104 -15 90 66 120 -39 -217 106 -73 65 126 120 -23
5725 -23 -112 28 -23 -178 158 173 149 -19 115 -54 -176 108 38 58 -93 178 -50 -135 -111 74 -89 190 71
5748G1j34j13K53q4J24m9l27M50k55L18O2l59q6l08L16k09N18n34N96M12P9n19
5770B22R1l81J01R19j062O1l21O2N60K88j23l6k55M34j430R59L19j17m94l89P10
5791A18j24j43J36K83j38M5R1k25K81k91J95k86j60O25k85j64o4J94mj70P1n1
5813f6oO0J06j63K3O9N5j00K52m21P4J5O6J94j98J24q1q6j32J84J71k56J16k54
5837b54M07k94K29O4k45K20k96K67j51K67j42q7r5R6N4K3L7q4j48K57Jk36k21
5860c31K12j7R3L2j68K11k66J05J21n1K11j63o6J53o3p4R4j04q1J60k24K52j63
5883a27J40k48K42R9k15M23m63R5j01%J5K38r0J6j02J86j96J16k2q2N0m4N4j08
5907a24Q4lq0J84p8j00J61j35J53m7J24P2k14j42J10J7J29R5j97J92j13m04L22
$$ plain form
5748 71 -63 -176 77 -7 117 68 -259 191 -64 254 316 -43 -129 -437 -121 -330 188 -346 250 662 741 222
5770 222 313 -68 33 952 -110 -49 -370 -308 252 540 417 381 126 560 -870 89 408 291 -203 -592 118
5791 118 -6 -149 -13 270 132 177 268 43 324 33 228 -58 -218 407 122 -42 -106 88 84 -86 -15 -66
5813 -66 -72 -12 94 -69 -46 23 78 -22 230 -191 -117 -102 -36 158 -40 84 3 -83 -215 -31 140 -116 0 -254
5837 -254 153 -141 88 152 -93 127 -169 98 -53 214 72 -15 -110 -14 40 63 100 16 -132 125 126 -110 -331
5860 -331 -119 -136 -43 -11 -179 32 -234 -129 -8 -59 152 -11 -77 76 13 -61 33 -71 -152 8 -216 36 -127
5883 -127 13 -235 7 106 -109 314 -149 -54 -155 -155 -140 98 8 24 -78 108 -88 28 6 -76 -26 -70 -16 -124
5907 -124 -40 -43 -123 61 -17 -117 44 -91 62 15 139 211 -3 -145 -35 -18 111 206 9 201 88 -316 6
5930FK23k32K6qQ4o3L2j94P4K18k37k6P6J3Q2k2j74J17k9J06m1L6Q5J6l57Q6O0
5957d3n1J48K6J9k75R0J51P9j55K08k53J04Q6l26K16jM7j55Q9R3k6q0m0O6J3R4
5983A24j94J96K5m4q8M9r2k50J31K02m4J2r6j0P4O0J03j88q0L57j38k38L2J93
6007I6M0l8l2j86J51O9k32K17j26J52rj53M4L49j68p5K3l0k22K17N2j12K05l56
6031a24K10k30J69j45K4K36j10J98k38J24n7R7n9k94J99k9J71j72J6J00k72K45
6053E9j84J01p2J58r6J3Q0j23M1k0J33k20K10k65K52p5j3j70K51Qj51J5J42Rq8
6078eN3Rj37k0J35M3j98J64n4k8J01k30L12O1p4j73k34J10K67J4p7l4K24l28J00
6103AQ7q6J68l45L06n1O3j35ql1J17qM0k32K31l0j74k00K41p5J95O8k07K83l49
$$ plain form
5930 6 229 -3 23 15 99 36 68 -126 -52 166 -71 -97 -21 -8 74 52 -122 -5 -34 72 31 67 152 168 -189 -103 -43
5957 -43 -94 54 80 99 -176 -86 65 144 -11 197 -56 48 134 -192 24 23 70 -85 4 97 71 -9 -49 17 30 124
5983 124 -70 126 151 107 19 68 -24 -274 -143 59 15 27 -69 -79 -5 55 158 -30 -110 247 109 -129 -97 96
6007 96 136 98 66 -120 31 100 -132 85 -41 111 102 -51 -7 342 174 99 122 92 -130 87 139 27 232 -124
6031 -124 86 -144 25 -120 -96 140 30 228 -10 114 57 154 95 -199 0 -29 142 -30 -14 86 -186 59
6053 59 -125 -24 -96 62 -34 -21 59 -64 -23 -43 90 -130 80 -185 67 -8 -21 -191 60 68 -83 -68 74 83 -5
6078 -5 48 57 -80 -100 35 78 -120 44 -10 -38 63 -167 145 206 132 -41 -275 -165 102 116 39 5 229 -99 1
6103 1 88 2 170 -175 131 80 143 8 0 -31 86 78 118 -114 117 87 -87 -287 -46 -121 74 142 -65 218 -131
6128a31J98O7l42K69K63m40K27k36P3J56j04p1J18j11M9p6J24j27P2O7j12K31
6150A64j76K6j05J20K8R8k47J33k07J6N0jR4j66K79k69q4K30q3R4j38J3J38p1
6174f4j87R1L9M9Q1p1j09K77j04J35j78J28j13j34L55j14O4k13R9J19o9n6l1j14
6198a20K20r9r1j48K57j45J39qJ1k1j84K01j80J66J7J79l93K15J31j36L9O3P8
6221A91k62R9l26J55J71k14L40k7j51J11k89J58P0qj24R2o7j22N7O9J06k39J50
6244f0N9n6J20k58J87N1j06K6o4Jl2j95L00J6O6k20K20lnk12K7P4j23K27Lj21
6270g8P8Q7l21J59J31q4J5PJ2Jj59K87k48Q5m3J31L7k83J43J15j29K21k65l6J95
6295E8p1o8Q5P4q2k5N3O2k35J03n3L95j77k06r4R9J49n6M4j33K28l26N8L25j36
$$ plain form
6128 -131 67 134 -208 61 324 -116 111 -125 -52 104 0 -71 47 -64 -15 -91 33 -94 -22 45 -67 164
6150 164 -12 14 -91 29 57 155 -92 41 -166 -150 -100 -101 -7 -173 106 -163 -247 -17 -100 -6 -144 -131 7 -64
6174 -64 -251 -160 -121 -72 9 -62 -171 106 2 137 -41 87 -26 -160 195 81 145 -68 31 150 81 25 -6 -120
6198 -120 100 1 -90 -238 19 -126 13 5 16 -5 -189 12 -168 -2 15 194 -199 16 147 11 50 113 191
6221 191 -71 28 -298 -143 28 -186 154 127 -24 87 -202 -44 26 18 -106 -14 -81 -203 -146 -77 29 -210 -60
6244 -60 -1 -57 63 -195 -8 43 -63 -37 -101 -100 -132 -327 -27 -11 55 -165 55 52 47 -165 -138 -64 -187 40 43 -78
6270 -78 0 87 -234 -75 56 -28 -13 -6 6 7 -152 135 -113 -28 -71 60 97 -186 -43 72 -57 164 -101 -137 58
6295 58 -13 -81 4 78 -4 -29 24 86 -149 -46 -99 296 119 -87 -181 -82 67 11 55 -78 150 -176 -118 207 71
6320G1Q7p2k77Q9J07J65j95j3r0r1J96k13M14K9p7j40J60l29K96k38M8J87k06
6343i2K3J25P2j26j03J98j82k5%j9P3l1K94J18k28J0j31J80J1j88j49J04R9Kj96
6368a61J95j64K42n2k32L06j55J50p1r8R7k91j04K80j03J44m8o4J97j93J25K0
6390B0K42r6j70l2j51J42j39K65j1L3q4j81q4K98p2M4L6j08Ol01M72n0r0J28j77
6415f0nK31J5j07j91M8q9O5N4m6P2jj30k21K46K78K05m81K86k13j4J0j77J37K92
6440B04k69k9M1j49K15r9q7O2k7K19j65K68k67J38k06K52k21J98j79m0L03k7m0
6463I5O3k3Q4j36Ql9q1L48l23J0l0j14K97k9j7j68K9N7j14j66L48k9Q0k36N0n3
6489h9M6J27k9p4j43R0K5J00j10RJ65j19J00r4M5n1k9K07k27K86m27R2L60k25
$$ plain form
6320 71 158 86 -191 -102 5 170 -25 -38 -128 -219 -23 -236 178 207 130 -10 150 -179 117 -121 -73 114 -92
6343 -92 -69 56 128 2 -101 97 -85 -110 -110 -129 -56 -87 207 325 97 107 -24 156 167 -21 -170 -66 33 35 -161
6368 -161 34 -130 112 60 -172 134 -21 129 58 -40 57 -234 -338 -58 -161 -17 -65 -129 68 -125 0 20
6390 20 262 166 -4 -36 -187 -45 -184 81 70 103 19 -162 -246 52 -20 24 60 -48 -42 -343 129 79 -11 117 -60
6415 -60 -65 166 181 74 -117 -69 -158 -93 -39 -85 -13 -14 -144 -365 -119 159 364 -117 169 -44 -58 -48 -225 -88 204
6440 204 -65 -94 -53 -202 13 -86 -173 -111 -138 81 -84 184 -83 55 -151 101 -120 78 -101 -141 162 135 95
6463 95 158 135 219 83 91 52 -29 319 -4 6 -24 -138 159 130 113 -55 -26 31 -83 -249 99 70 150 -86 -36 -89
6489 -89 -43 84 55 -19 -162 -72 -47 53 -57 -48 117 -2 98 4 49 -2 -31 176 -51 235 -192 -100 260 35
6513C5jL22l28k18O1J75j66J20p5QN9k34M38L7k09o3J11j66J23j75K61j62J70
6536A23l01J76J24k73J68j42J68Q1j73J0J27J3k58J97o7l1k0K73m0j00k44K77
6558H8k00R2kj5j30L30j40O9l03k2J95o5J83o6r0j53K88j88J95J70j52q3J12q7
6582B6o8M3J90j99L2j12K46L3j92p6M8k69K67kP1k76K26P9m3K47l75J46j04M2
6606b0P3l17J70K32k49Pl58K43K05L6L36l75J13OR2m19R9l8L84k05j62j04L65
6629A14m91M20p4J58n1j19k5J92k54J67n3J95j86k70K14o0P3j67J50k50M39j41
6651a9j90J98o3RJ24j33K70k44j03n0J58J0k3%m5J80N6k47MJ62j11j12Q6M16j20
6676B13j73R6k61J22K42k24N2q8J16p2k61K00k01J34lm9pK08k43j65M72k29J69
$$ plain form
6513 35 34 356 28 -190 -129 46 -120 0 -75 -67 -8 -242 196 233 24 -39 72 -94 29 -146 115 -47 123
6536 123 -178 -2 122 -151 17 -125 43 124 -49 -39 88 101 -157 40 -27 -58 -78 195 155 55 -189 88
6558 88 -112 -20 -22 -37 -167 163 23 92 -211 -233 -38 -103 80 14 -76 -229 59 -129 66 236 84 1 113 26
6582 26 -42 1 191 -8 24 -88 158 191 -1 -77 -29 -298 -31 -33 38 -238 -12 67 24 271 -104 42 -62 -20
6606 -20 53 -264 -94 138 -111 -104 -462 -219 -14 22 358 -17 96 102 194 -225 -126 -164 220 15 -147 -251 114
6629 114 -377 43 -31 127 76 -43 -68 124 -130 37 -16 179 -7 -277 -63 -123 -50 -217 -67 -317 122 -19
6651 -19 -209 -11 -74 -65 59 -74 196 -48 -151 -201 -43 -33 -56 -56 -101 79 135 -112 -108 54 -57 -169 -83 333 213
6676 213 40 136 -125 -3 239 15 67 -21 95 23 -238 -38 -239 -105 -108 -157 -164 44 -199 -364 108 -121 48
6699D8K88L09o17l1j54R8l22N39K04Q1o74K13k7J25k09J41P8j72K61k56LJ25j32
6722h1O5M3J38l06J40M4o3j17K73j50Q3j54j48J74k6J27j68R2N5j03l5L78k53
6745Hj30M1K00j43N8m9r2K70j10J83j23j11j88L5L28k29L5l7j3O4n0Q0q6j67R3
6770a33K36j34P2M1o3O1l4L2M8pk50J84o0N4q1j8%O6J2j29K3J9Q5j37R2j23J86
6797D2j64J79j80J31l1L13k16o3j07M6J23J10j03k4k08N4%R5J39p2j94K42k9K1
6821A04p5P9k57J13o5K23R0m13q0K78k49L52P3j51j41PK44p1o9L1J51j06J15n1
6845A32j37j33J40k43O9L46K0j92N6m7kl1R7Kk42J26L4K38n03N3K68k43K36k70
6869b26M78k46n2M4o3L35j98j79p9K16l1J19k26PQ9J63m1k21n4J36J4P7l53L46
$$ plain form
6699 48 336 645 28 -3 -157 -59 -381 158 362 443 -231 -18 -45 80 -129 12 90 -82 179 -77 -74 51 -81
6722 -81 -16 27 165 -141 -1 43 -20 -137 136 -14 69 -85 -233 -59 -85 42 -126 -34 21 -82 -117 261 8
6745 8 -122 -81 119 -24 34 -15 -107 163 53 236 113 2 -186 -151 177 -52 -17 -54 -67 -3 -53 27 -59 -226 -133
6770 -133 103 -31 41 82 19 80 46 78 126 119 -131 53 -7 47 -34 -52 -52 14 26 -103 -80 -61 24 -113 -21 -144 42
6797 42 -122 57 -123 8 -23 290 74 11 -96 -50 73 183 80 56 -152 -98 -98 -3 136 64 -130 112 83 104
6821 104 29 108 -149 -36 -101 122 212 -201 -281 -3 -252 100 173 22 -119 -112 132 61 -8 23 174 68 183 132
6845 132 -5 -138 2 -241 -172 174 194 2 58 11 9 -22 75 77 -165 -39 -5 233 -270 -217 51 -192 44 -226
6869 -226 252 6 -46 -2 -65 270 72 -107 -186 30 -1 118 -108 -101 -12 151 110 -111 -165 -29 -15 62 -291 55
6893E5j59L3K15j16L5p8k05P4K4Q4J11j5M1j28p8r4M30k32j1j0q3j68L69N6k37
6918h7Q3K5m2r7L18l90M7J4L26q1k23J22l60K32OK40k21J46J57l38J98MR1j08
6942F2l03K74j50J58k61N30j52k37L0J54Mj62J2J78j70l28O56l13n9J51o5L7L2
6965G8l7K8j81J17j86J64j8n2KK81k65k42N37k93J82j35J79j16K6P6k59K40j71
6988d5L41j35p8k62j21L85j50K24k19M2K09k14N0Kq7m5o0P7J68j26Q4o0J78l33
7012a75K02m6p7K98n4k1q4p4j24M21m00p7J22J60j59k71M46j39J10j30m4k52K12
7035a56K19l7j58O9J99k42J84q4J97rj94J42l05K3K76o1r9k48J31J14J4J94k55
7058h6Q6r4oM6p3K25j78K2nJ37J62k30J03j00J94k31R5k87L49k58J41m7J1K62
$$ plain form
6893 55 -104 -71 144 28 63 -15 -220 -146 -122 -38 73 58 99 -29 -107 -201 229 -3 -14 -24 -107 -275 94 150 -87
6918 -87 -4 21 -21 -118 200 -190 -143 -129 197 116 -107 15 -345 -113 -107 133 -88 58 215 -123 75 79 170 62
6942 62 -241 33 -117 41 -220 310 158 -79 -49 105 109 -53 -41 137 -33 -361 295 -18 -77 74 9 46 78
6965 78 41 69 -112 5 -181 -17 -35 -87 -85 196 -69 -311 226 -67 115 -20 159 43 69 145 -114 126 -45
6988 -45 296 161 83 -179 -300 85 -65 159 -60 -18 191 -23 27 29 -58 -103 -163 -86 82 -44 40 -20 158 -175
7012 -175 27 -19 -96 202 148 127 43 -31 -155 266 -134 -211 -89 71 -88 -359 87 -52 58 -72 -116 -368 -156
7035 -156 63 26 -132 -63 136 -106 78 -6 191 182 -12 130 -175 -152 124 63 -36 -284 -153 -39 -25 169 -86
7058 -86 0 -94 -100 -54 -127 98 -80 -58 -63 74 236 6 109 9 203 -28 67 -220 129 -129 12 -35 -24 238
7082B38l23O5lo8kk8P5P6k8m2L4N1j31j53J54K05j94K89j52J25k40K63j29j12
7106c0J24p0l2P0J09j17L3N7j43n6J4J41j55n7R6J73J4j38o5K3o9N8K76l11K59
7131B04j63K05j88qk0J35Mq0j47J55J2O8m09K25J33j65K46k13J01l3j40J30j11
7154e9J83L3j84J78L8j85L2p4l4J89r7P5J08l42K96N8k5l65K31Jj7l6l26L95r6
7179b3J08j97K7L1q5K15J03j05p4M9j5j14K27k67n1J29r6J25m0r3J93j63Q4K02
7203A70j01m8qp3J77l07L59K28n78J41Q2j65LJ09O2k66J29j44P9J01q9K42k10
7226a07J92j45P8j95K27j3k2J05l6J75k04j36K16m4j01j57J31p4j28J26lM6j0
7249g9o6J51j34L52l02J31L8j29J06k73L85j26j28J76Jj0k11L9J63k22J19Kl00
$$ plain form
7082 238 -85 -20 -23 -91 -93 -121 -46 30 2 -40 -6 45 -86 -239 -85 120 -74 215 63 188 -52 211 82 -30
7106 -30 94 24 -8 62 171 54 87 144 1 -55 -41 100 -55 -112 -16 157 171 33 -32 -9 -78 -20 256 -55 204
7131 204 41 246 58 50 30 165 169 89 -58 97 109 177 -232 -7 126 -39 207 -6 95 62 -78 52 -59
7154 -59 124 157 -27 151 189 4 36 -38 -72 117 20 95 203 -139 157 215 190 -175 56 57 40 4 -322 73 -23
7179 -23 85 -112 -85 -54 -139 76 179 74 0 49 34 -80 147 -120 -171 -42 -138 -13 -53 -146 47 -116 -32 170
7203 170 69 21 13 -60 117 -190 169 397 -181 -40 42 -123 -120 -11 51 -215 -86 -230 -151 -50 -139 103 -107
7226 -107 85 -60 18 -177 50 37 15 120 84 259 55 -81 135 91 -10 -167 -36 -110 -238 -112 -115 -69 -79
7249 -79 -145 6 -128 224 -78 53 91 -38 68 -205 180 54 -74 102 103 93 -118 -79 84 -138 -19 -17 -317
7272c17L58k08K54k6k82J82Qj02N9J81k46J98N2l65L76K07m16k03Q4K84j13l5
7294g0K81pl06M40k80j22J18p9J01m05N10m43J71J33K52m87J29Q4j16J58k73J63
7316d8J24O8j33j92L03L9N3q7j04J15j73O5j08j07J19j8J40l9k6j0n0oL0p6J22
7341Aq2R2J17j81mj13J76N8j07j50L32j57m3J6j96K60j35J73j30K49k49J16o8
7364b5J4J20l38P8K91j19k15K62J15p1p4n0n1L08k80J60l2k37K60Q3l05K09k97
7387a94L01m4l83O02q5l08K29j40J46k0r2J6k56J69J09K28l07K9j22J54J05k11
7409g4P5k03N9R2J4M4J26j98L3J28k58J51k23ROJ98j56J88R3j44j00J86n9J22
7433A09J51k54qj25K26j32l2K93k10J14j48P6j66ol4J79R7m1r5R1j11J30k58r6
$$ plain form
7272 -317 41 -167 87 61 -221 -39 -31 -133 -74 107 -139 59 111 -254 122 329 -87 -290 -206 78 -35 -70
7294 -70 211 204 -102 338 58 -64 54 -25 76 -329 181 -262 -91 42 294 -193 -64 20 -96 62 -211 -48
7316 -48 76 144 11 -181 122 161 214 127 23 138 -35 30 -78 -185 -66 -84 56 17 -9 -19 -69 -75 -45 -121 1
7341 1 -81 11 128 -53 -57 -170 6 64 -43 -193 139 -18 -61 -45 -241 19 -116 57 -73 176 -73 43 -25
7364 -25 -11 109 -229 -151 140 21 -194 68 183 112 38 -12 -63 245 -35 125 93 -144 116 199 -106 103 -194
7387 -194 107 63 -320 282 197 -111 118 -22 124 104 12 28 -228 -59 50 278 -29 0 -122 32 137 -74
7409 -74 1 -202 -143 -51 -37 7 133 -65 -32 96 -162 -11 -234 -225 -219 -21 -177 11 104 -40 -140 46 -13 109
7433 109 260 6 -2 -127 99 -33 -65 228 18 132 -16 60 -106 -112 -146 33 130 89 -6 85 -26 104 -154 -250
7457b50L86J14j15k57P5J17j16J47q8L1J19N7l07J43n9n5J6J68J98j62j10q5L88
7480C55k73m73M03j6m46Q95j56r07M78K40K01o88K32j58P5J73j67Q5k8K39j02
7501c8K14j31O00p33l3K34n1M62n20j96M78J11P2q40M37j70pJ68K9L6j10L2J73
7524B17j6O4l1l38K62j40k30O3L17J9j41M7j88o2QJ3oL3N8J50j84l18M84k2k60
7549b01J95R7n8j71J43J21j5j2j38k60J23K89r1l33M93k21oK6L3K30l09M9pP0
7573D7J41k89%J03R2j63L22l07p2L46k27N9j20K77j87m5j02rN2N2K48p0L3j85
7597dN6j50J69j01J08k59J15L01k24r3Lq6K7j14K17K23l10K68k71OJ48k5J07Q5
7621A96j14k09K01m56M29QJ15k95J28k4k7K35j09M1j33R9l1nR5j16n8k1J66m69
$$ plain form
7457 -250 136 250 135 -122 -47 70 -46 101 13 44 163 220 -87 56 -3 -58 -42 126 324 162 52 -33 355
7480 355 82 -391 12 -4 -450 445 289 -618 -140 100 301 -387 -155 -313 -238 -65 -232 -147 -175 64 -38
7501 -38 176 45 645 -88 -121 113 62 524 4 -192 286 397 469 -371 66 -104 -111 57 86 122 12 44 217
7524 217 201 265 234 -104 158 18 -212 -149 168 187 46 93 -95 -157 -149 -136 -142 -109 -51 99 -85 -403 81 59 -201
7549 -201 -6 91 33 -138 5 126 111 99 -39 -299 -176 113 22 -311 182 -39 -45 -19 14 244 -65 -16 -23 47
7573 47 188 -101 -101 2 94 -69 253 -54 -126 220 -7 52 -68 209 22 -23 -125 -134 -82 -30 218 148 181 -4
7597 -4 52 -98 71 -30 78 -181 -66 235 11 -82 -79 -165 -138 -252 -35 188 -122 146 -125 -119 29 4 111 196
7621 196 82 -127 74 -382 47 55 170 -125 3 -21 -48 187 78 119 -14 85 54 49 144 28 -30 -51 115 -354
7645c54K86J19K6k0O3l33M38j07o3j65J24j87J2K31j21L0K48j12k40K21k3Q4N9
7668B16l06K34k37J78O6j11J39k99L39r8J18k43j34J93J46l22L63j09o4m2O8j26
7690c1J88l23K03l5J84j03q3P7k3O2j59M1K9r5r7J85r5Q2p2n0O7J49j69K74k30
7715b4P5j01L26l32O0j23J69l21K44K7P1Q8l80L19j83J89j35K12l65K68jk6k80
7738b23L65q5j25J32r7j80K31N4R1q7j6k8j41K32p2J96j05k91L78k00Q9j18J24
7761A24O9l42k3J65J02j83K74k35QR5j74Q8j13J44j22K89l94J32J11J32k88J88
7783D7j39J3J17j74K55j21j9M9j63M4J03P9J53n6k94j3K44m68N39k47J42l41J38
7806a12J16K5k29K51p9M0k86K47o3j10K5J58R8j76K5j21J71j45J26O6l80M77m9
$$ plain form
7645 -354 -68 51 77 57 120 -213 225 118 55 -110 14 -173 -161 70 -51 -21 227 115 -125 96 73 157 216
7668 216 -90 144 -93 85 151 40 179 -120 219 121 239 -4 -138 55 201 -121 242 133 69 27 95 -31
7690 -31 157 -166 37 2 186 83 0 77 54 116 -43 -2 27 -68 -165 20 -75 7 -65 -115 -48 101 -68 206 -24
7715 -24 51 -50 276 -56 4 -119 50 -271 -27 0 71 159 -221 98 -85 104 -31 181 -184 84 83 57 -223
7738 -223 142 57 -68 64 -33 -213 18 72 163 76 60 32 -109 123 51 247 142 -149 229 29 118 0 124
7761 124 193 -149 -172 -7 95 -88 186 -49 -41 54 -120 -32 -145 -1 -123 166 -228 -96 15 147 -141 47
7783 47 -92 -79 38 -136 119 -2 -21 28 -135 -91 12 91 244 188 -106 -119 125 -343 196 -51 91 -250 -112
7806 -112 4 29 -200 51 -28 12 -274 -27 -90 -200 -175 -17 81 -95 -70 -191 -20 -165 -39 27 -353 124 75
7829G5j05j25J14J82L8j09J30n2l70J58m0J05j08J16L3j06nJ62l3j68J6J22n2
7852b2Q6n6l5O2m7o2JM3p7J42r7K0J81j45K02k19R1K63j76j72P9k46M23r0j57
7877hm3K67m7o8k32J09J58q4R0j61J64q0k22K62j71K92j62Pp2N3J33q9q9j39K45
7902A13J55l17P1L2k19J30p3r1J26J82M0k99k3Q3J21J37l66K87k21K12k16o3L06
7925A07l9k6J2l79L03K0%J13m0l11M6M3M12j48k84K72o9j57J70L8k6o2j2M2lJ95
7951B17m0q9j7j31K76k23j68L98k73J96j93M1q1J86k79m1L45l3j30M8n4K13k41
7974g3n2J32J9q9O8J61N1j74J45j89j41n3Q4J16M0j39J29O8k26L22l04q5j2J45
7998e7J32k6p1J91k33Qj00J04J85j19j9L2K3K8j46K7J77M5j44o0j20L00nj19%
$$ plain form
7829 75 -30 -155 -41 141 179 70 200 148 -222 -64 -104 1 -107 9 42 -64 -69 93 60 -108 -92 30 -22
7852 -22 64 8 -27 35 -12 -74 -73 -30 -107 35 -62 -42 139 -6 196 -23 68 331 155 -17 62 -184 239 149 -8
7877 -8 -51 216 169 101 -131 -22 136 52 142 -19 145 65 -157 105 -66 226 64 71 -1 52 185 96 7 -132 113
7902 113 268 -49 22 54 -165 -35 -108 -199 -73 109 149 -150 -173 -90 31 168 -198 89 -132 80 -136 -199 107
7925 107 68 42 54 -325 -22 -2 -2 111 71 -240 -194 -151 261 113 -171 101 32 -125 45 83 57 -5 -17 25 22 217
7951 217 177 88 71 -60 216 -7 -175 223 -50 146 -47 -6 -87 99 -180 -221 124 91 -39 9 -45 168 -73
7974 -73 -125 7 26 -63 5 166 217 43 188 -1 -142 -195 -111 5 45 -94 35 103 -123 199 -105 -190 -202 -57
7998 -57 75 49 -22 169 -64 -56 -156 -52 133 14 -5 27 50 78 -68 -41 136 181 37 -23 -143 157 152 33 33
8023C3J55j83oN1L1q9J58J49l41l1J67j25L3j54K61j26J12O4j79K77k16j3n5K68
8047B41j20k14J95o5j66K74p9j65Q2j5l4J7J08j13m7K39k58P4r6J65m1m6rL33
8071B60P4m65N6L20l42k16J73J93Ko4J41j29J43j7k76J09R1J05p6n7O5o0o2j95
8095b27M29j34q1J86k59M7j97O6J47j33J39K16j20j29l3Q8j68M08l46L9J25m4
8117A9J25j81M1J32j89l4k2J69M3m78M28j06P8J43q8r2Q7j51l1J31r0L0R8j09
8141d7M9O0j17K6j15J68o9j71K36K6J10k44j64M17j95J21j13j46K48k10J64M3
8163G7j22j72K87j55M4l9J86l86J33O9Kj68K27J76k0l1m1j40MQ5l9R6o4rN2n1
8189AM2o1
$$ plain form
8023 33 188 5 -1 50 81 -8 150 299 -42 -73 94 -31 2 -152 109 -17 95 159 -20 257 41 28 -27 241
8047 241 121 -93 102 37 -129 145 66 -99 -17 -32 -66 -49 59 -54 -101 138 -120 -46 -142 23 -18 -64 -73 260
8071 260 334 -131 -75 245 -97 -313 -140 53 55 -9 132 3 146 129 -147 -38 53 158 82 25 90 30 -32 -227
8095 -227 202 68 -13 173 -86 -39 -236 -170 -23 -156 -17 199 79 -50 -83 5 -163 245 -101 -62 63 19
8117 19 144 -37 4 136 -53 -87 -109 60 103 -375 53 -53 25 168 80 -12 75 -76 -107 24 -66 -36 62 -47
8141 -47 2 62 -55 -29 -144 24 -45 -216 20 46 156 -88 -252 165 -30 91 -22 -168 80 -130 34 77
8163 77 -45 -217 70 -85 -41 -80 106 -280 -147 -78 -76 -244 -17 159 139 108 67 -73 -69 16 -23 73 9 0 52 1
8189 1 43 -18
8191a8
$$ Imaginary data points
##PAGE= N=2
##DATA TABLE= (X++(I..I)), XYDATA
0@%%%%%%%%%%%%%%%%%Qj6J6j6J6j7K5l2L2m0M8n5O3p2Q3r1J04j20J36j52J69j91
39a02K14k38K66k94L25l62M00m39M84n35N91o50P16p90Q71r62J063j178J309j460
59g71J637j847K102k416K817l353M103n243P214j1590M3099j4488k0767L2767
73C3264k3431R691L0497o479l6302O680M172k2070J0599L4687k3306k1326J4561
86A1237j1046k2394K3038J8570j7161p180J1784k0408k0983K4686J3224j8584
98a5217J0193Q163l1971q263K3953j594p685J8066N91l0840M26J9399j3119k78
112b8176K8541j0569k5842J1988M607j6817J1760K3988j2439j7618J3185l016
124b0408j8159J9801J8108j8605o99J2856j6426j1746K1673R129j4472O907J1007
$$ plain form
0 0 0 0 0 0 0 0 0 0 0 0 0 0 0 0 0 0 0 8 -8 8 -8 8 -9 16 -16 16 -24 24 -31 32 -40 43 -48 56 -64 72 -80 89 -102
39 -102 112 -126 140 -154 171 -191 209 -230 254 -281 310 -340 376 -414 457 -505 558 -620 689 -771
59 -771 866 -981 1121 -1295 1522 -1831 2272 -2971 4243 -7347 35752 21264 497 33264
73 33264 9833 19524 50021 43542 7240 13920 18092 -3978 6621 41308 18002 -3324 11237
86 11237 191 -22203 835 19405 2244 -4936 6848 -13560 -34543 -9857 3367 -15217
98 -15217 -5024 3139 -28832 -37095 -13142 -14736 -22421 -4355 -3764 -34604 -34178 -14779 -27898 -28176
112 -28176 365 -10204 -36046 -24058 -19451 -36268 -24508 -520 -12959 -30577 -17392 -20408
124 -20408 -38567 -18766 -658 -19263 -19962 -7106 -23532 -35278 -13605 -4476 -18948 -12041 -1034
137a034k2198o574K2152k822q973J8346J722k2422J143J4017q468L4K0831m643
151A111k1073Q264P036j4467R102J9889j1156j1717J0742l682j3192J4019J5567
164A0443j3332k769J1994j2697j1142J8850O974j1625P196P147j7477n270J7476
177E768j19p413J4258J967j9839J916J2902p390j42J7230m350j5737N788N728
191A0567j0454O063J6714q588j0462R001k764j0986J1993J2083j0180l385Q500
204A8102r640q661J4198O671r988M040N552j4555m356J3867k41o477R856J222
218A9590j6112n8J0502n793j039J2741m040j3917M069L944q501M326J2599p511
232A0800r782N938k197q959Q894R670r575l500N760q111p325J1237N266q451K141
$$ plain form
137 -1034 -23232 -29806 -7654 -10476 -19449 -1103 619 -21803 -20660 -6643 -15111 -15077 5754 1111
151 1111 -19962 -11698 -4662 -19129 -10027 9862 -1294 -13011 -2269 -5951 -19143 -5124 10443
164 10443 -2889 -5658 6336 -6361 -17503 1347 8321 -3304 3892 11039 -6438 -11708 5768
177 5768 5649 -1764 12494 14461 -5378 -3462 9440 2050 1908 19138 14788 -949 4839 10567
191 10567 113 6176 22890 14302 3840 12841 10077 -909 11084 23167 12987 9602 18102
204 18102 8462 -199 13999 20670 10682 14722 20274 5719 1363 15230 14989 8512 18368 19590
218 19590 3478 3420 13922 8129 7090 19831 15791 1874 5943 9887 1386 5712 18311 10800
232 10800 1018 6956 4759 -4200 4694 14364 4789 1289 7049 -1062 -8387 2850 8116 -335 1806
247A806M112j2057m075J1426K98n730P179N70j3488k45R205l811j360J0035l536
262C29j1945L212M351o446L842J0398o614q034N167j247o318P810P965p755l127
277h412M691n856m926J0365M456p453J818L173r252j990J0309N21m446N456K01
292a345j0374P57Q173k672p19P443k855r353K906M719m575L285P725n290o720
307h895M554M2m880O053O681o358l273M426l917l659Q655L628o283R99K753o403
323e877j897Q525P57m029L971L49p960J070O937j921j269O172k158p247K943L815
339B181l465K325N897l880n578L807O52l494M598N191n183k478L581k635k795
354a276O221K787m412K93K446n271j189O629O38l608K846M13o052M25N571j434
$$ plain form
247 1806 5918 -6139 -10214 1212 1510 -4220 2959 3529 -9959 -10204 -999 -4810 -6170 3865 329
262 329 -11616 -8404 -4053 -10499 -6657 3741 -2873 -10907 -5740 -6987 -13305 -5495 2470 -5285 -8412
277 -8412 -3721 -9577 -14503 -4138 318 -7135 -5317 -2144 -11396 -13386 -3077 -2556 -7002 -1546 -1345
292 -1345 -11719 -10962 -2789 -5461 -6180 1263 -1592 -10945 -8039 -3320 -7895 -4610 3115 -2175 -8895
307 -8895 -4341 -4299 -9179 -3126 3555 -2803 -6076 -1650 -5567 -9226 -571 3057 -3226 -2227 526 -5877
323 -5877 -7774 751 1508 -2521 1450 1799 -6161 -5091 1846 -75 -1344 4828 2670 -4577 -1634 2181
339 2181 -1284 1041 6938 3058 -2520 1287 1939 -1555 3043 8234 3051 573 4154 1519 -1276
354 -1276 4945 7732 3320 3613 6059 788 -401 6228 6866 3258 6104 6517 465 890 6461 5027
370E027j502M156j580n749J931L378k798J283M317l274m649K642P67l388L491
385D052L762l999k667K455j794k687M703K274m060l08J770l722j625M758Q44l026
401G30K058P8m671m8M002q79q92K502p98m742R09K685j665K81L516k382l778J676
419a418Q48k147K194L104l073k186J863r27j994L011K435l287j73J677k548j436
435d057L628J056k355R84O47l354o14L500k09j184K103l79l654O91K308j201J98
452a892K507j101l192R46J082j357J165K508j653j850R93n4j799K161K197j879
468a218j215J405j752j275K586J709j930L81N96k196q43K613M75j116J261J66
484c53k587j96K467o97j33K361q50k549O94J124j003O65K196r66k106J070O02
$$ plain form
370 5027 3525 7681 6101 352 2283 5661 2863 4146 8463 5189 540 3182 3949 561 4052
385 4052 7814 3815 1148 3603 1809 -878 3825 6099 2039 1731 3501 -221 -1846 2912 3756 730
401 730 2788 2866 -1805 -1853 2149 1270 378 2880 2082 -2660 -1751 934 -731 -450 3066 684 -3094 -1418
419 -1418 -570 -2717 -523 2581 -492 -2678 -815 -1742 -3736 -725 1710 -1577 -1750 -73 -2621 -4057
435 -4057 -429 627 -1728 -744 -97 -3451 -4065 -565 -774 -1958 145 -234 -3888 -3197 -889 -2090 -1892
452 -1892 615 -486 -3678 -2732 -1650 -3007 -1842 666 -987 -2837 -1844 -1898 -3697 -1536 661 -1218
468 -1218 -2433 -1028 -2780 -4055 -1469 240 -1690 -1309 -713 -2909 -3752 -1139 -664 -1780 -519 -353
484 -353 -2940 -3136 -669 -1366 -1499 862 12 -2537 -1843 -719 -1722 -1057 1139 173 -1933 -863 -261
501b61j717J414K100j223j091R00l79j492J830J624j266j96J106j684p12J903
517H56P54j097P57O59j925o78K057p5p08J405rj882R2J267n67m36J915k56j923
536B06M92R65j429O29J832p75j212O85m51j144J311J414q87j094J192q90j527
553f83J477J476j768k05J801j797r71K047n23j73N43P89j872j283J711o87k65
570c83J738L02j923j69J180p56J7J070J81j254N01J70j605R55J779j226p75J374
588A176j118q88O96J231p45m60J115p39j500J557K25r82O48O70o89j971K328m83
606G1j057J563P73j777k82R47q29n52J756k9j395N70M05j409J21J632m29q76P82
625a5l77j460P34J370n18o53J225r89j306P61P86o69K47J201j534j003J238J24
$$ plain form
501 -261 -1978 -564 1536 313 -778 122 -257 -1749 81 1705 439 243 1349 -335 -1047 856
517 856 1610 513 1270 1929 4 -674 1383 1308 600 2005 1996 114 206 1473 906 470 2385 2129 206
536 206 698 1663 234 863 2695 1920 708 1393 942 -202 1109 2523 1636 542 1734 844 -683
553 -683 794 2270 502 297 2098 301 -670 1377 854 681 1224 2013 141 -1142 569 -118 -383
570 -383 1355 1657 -266 -435 745 -11 6 1076 1257 3 504 674 -931 24 1803 577 -198 1176
588 1176 58 -830 -134 1097 352 -108 1007 268 -1232 325 550 -432 216 886 197 -1774 554 71
606 71 -986 577 1350 -427 -709 238 -591 -1143 613 584 -811 -241 164 -1245 -1124 508 79 -797 -15
625 -15 -392 -1852 -1118 252 -266 -919 306 -683 -1989 -1228 -442 -1111 -864 337 -1197 -2200 -962 -838
643h38r90J226Q45j329o15J090o74n50J871k07j419L63O17j217N7J500q3q73P78
662d48P1j610K97J652p39k41J074p22j063P45R88q79M19J285j341r44J244J93
680a9r61J131O23j039p31J564q83m24J467N28j430L39N24j376K36J737j85j229
698a28O56L47j488M37J550p02m18R92o76j200P27R70o60K64J064j107j121Q47
716C54M60r26J113P90j235n33Q94o00o78J542M85j522L86L56j058J71J329k9j028
735B71O41L4j125M23J056l12p11Q84n76j147Q35Q87q17K35J021j049r07Q86M63
754I92j067R37O21j073o93J161n99p76J294N81j346k86J119j387P5J746K2j387
772f6O45J4r92n85J410n44m64O98J3q52K88O66l92k99J019j241l00Q21k69p22
$$ plain form
643 -838 -1828 -602 243 -1086 -1701 -611 -1285 -1835 36 -171 -1590 -1227 -610 -1827 -1770 -270 -353 -1226 -448
662 -448 -377 -1987 -1690 -38 -777 -1018 56 -666 -1729 -984 4 -875 -456 829 -512 -1456 -212 -19
680 -19 -980 151 774 -265 -996 568 -315 -739 728 1256 -174 165 689 -687 -451 1286 1101 -128
698 -128 528 875 -613 -176 1374 672 254 1246 570 -630 97 1067 407 671 1735 628 -493 354
716 354 814 -112 1001 1791 556 23 917 317 -361 1181 1666 144 530 886 -172 -1 1328 1299 271
735 271 912 946 -179 244 1300 988 277 1161 585 -562 273 1160 343 578 1599 550 -357 529 992
754 992 -75 862 1483 410 -283 878 279 -497 797 1378 32 -254 865 -522 -447 1299 1321 -66
772 -66 579 593 -399 -984 426 -118 -582 116 129 -723 -435 231 -161 -460 559 -682 -982 -161 -430 -1152
792a152J198N19j126k70Q20p92n08L56R50o45M81k89j008m7J011L28o98J68J66
811e38o87M2J332n70m15O18l68r97Q61Q36p38Q5P56j008o55R76L35q12P04M54
831B11p91j97Q53l41m89J117K87j393O9O87n42NR75j32l80J22ol12J90P79k26
852D86o46P84k96o90L61N62k80L6K97o36o44J117Jk37P2M65p30l97R04j48m62
873h1P64J09p23N5J41j96L4Q27k84n83p7J43k83K52O10l43r1J7J1o42N24O69r51
896i8M05M08p68j04N03J94j33mJ30q05j11P17j86k29O07L05q52j11N60m68K09
917A69N79k87l96k7J82o73O59J60k76j28L74n13j06L08K42j00j05j45K7l19M64
938H9m2k70M62m2n79j60K56J02k24L40J05n29k8M33l12K21J52l42Q4j62q8J97
$$ plain form
792 -1152 46 565 -561 -831 -11 -803 -1311 -955 -5 -650 -169 -458 -1466 -1513 -502 -174 -872 -704 -538
811 -538 -1225 -1183 149 -421 -836 -218 -586 -1583 -722 114 -624 -539 217 -791 -1446 -470 -135 -947 -243 211
831 211 -580 -777 76 -265 -754 363 650 -743 -674 13 -529 -524 451 319 -61 61 55 -257 -67 712 486
852 486 -160 624 328 -362 -1 561 281 317 614 -22 -666 451 452 215 287 752 22 -375 529 381 -81
873 -81 683 792 69 124 265 69 103 930 646 63 -14 129 -154 98 708 365 274 291 302 -340 184 853 -98
896 -98 307 715 -53 -157 346 540 407 403 533 -272 -383 334 148 -81 526 831 -21 -132 428 -40 169
917 169 748 461 65 38 220 -453 206 366 90 -38 336 -177 -283 25 267 167 62 -83 -56 -375 89
938 89 47 -223 239 197 -382 -542 -286 -184 -408 -68 37 -492 -520 -87 -399 -178 -26 -368 -284 -446 -534 -337
960c37J78J18j72R4K5k76o7J52M31m41J99k38j35J01K29J45j81J9O8m83L81J20
982g0J05M3K07j94l44L26p3j39K65R9j59J30l47R2m8L05L54m23J24j39k11J57
1004F0L96k97p8K02m4m89N26J64k76j81L8kj25P5J6P9L11O0l70j21J16N4q7K30
1028B57j60l46M04J14k59P5L39j67m60J28k45K41K32J9j31r5K05n19j68O22j57
1049g1L7n0K49m60J84J33k68j12O25k94p8j59L51l60J37K79l50r0J83J9j23J55
1071f3Q0l06J44K5k59J4L12o8j12R0J29j99j8L02j35l34K67k50k47M18K96j81
1093i5k41L04j66m83M29N79p20K95N74q09n5O76j86l72M95O7o88m6O15j04L5M69
1115E73k84l71n3K59j21p0P27m20j69k35K88m1J43M33l10j73L70j86m35L64M44
$$ plain form
960 -337 -159 -41 -213 -119 -94 -370 -437 -285 146 -295 -96 -334 -469 -368 -139 6 -175 -156 -88 -571 -190 -70
982 -70 35 78 285 91 -253 73 0 -139 126 225 66 196 -151 -59 -107 198 552 129 253 114 -97 60
1004 60 456 159 81 283 239 -250 276 440 164 -17 21 19 -106 -31 -15 64 375 435 65 -56 60 114 27 257
1028 257 97 -249 155 269 10 85 424 257 -203 -75 -320 -79 153 172 41 -54 151 -368 -536 86 -71
1049 -71 -34 -84 165 -295 -111 22 -246 -358 267 -27 -105 -264 87 -273 -136 143 -207 -297 -114 -95 -218 -63
1071 -63 17 -289 -145 -120 -379 -365 -53 -121 -233 -143 -14 -213 -231 71 -64 -398 -131 -381 -628 -210 86 -95
1093 -95 -336 -32 -198 -681 -252 327 -393 -98 476 -333 -388 288 102 -270 225 292 -396 -442 173 69 104 573
1115 573 289 -82 -135 124 3 -67 660 240 71 -164 124 83 226 659 349 176 546 360 -75 289 733
1136G33m09j01J78j7n69O73r4k14K65J28n34j25O55l60j90L22K21m96K4K07k31
1157F6o1M39o0o67N95l18l32M06N92n25k36K93k12l54O10L94p24R2K71l74j84
1178b89M72P2k70J74P3o88L79J60K0m10N26K88j022L65nm49L60P60o47o54Q03
1199A8k3n64P58P1j77p47N26n59o08J361O73j397K9Q42o02l35L29O17m15m6M5
1220b04p99M73N50l50J2M53l96n22L09M95o48K28N73n82n10O08K9l39K53N82n96
1241c81n01N36k28k44O15L64q12L01L61n82j32N89L56p36K81K82p67J53Q85j42
1261A98m21N24j21r82N56N87n71J47Q23l98o94M04K15l38M02J41n00oL47j69k62
1282a18N33K94n21J59K42l07n44Q90J62m90j6J79m37j17P30Q0m66K97p2l08M9
$$ plain form
1136 733 324 223 401 384 -185 488 394 180 445 573 39 -86 569 209 19 341 562 66 90 297 66
1157 66 5 444 384 -283 312 -6 -338 68 660 135 -101 192 -20 -374 236 630 -94 -2 269 -105 -289
1178 -289 183 255 -15 159 232 -456 -77 83 103 -307 219 507 -515 -150 -155 -604 -244 516 -131 -785 18
1199 18 -5 -569 189 260 83 -664 -138 -697 -1305 56 729 -668 -639 203 -399 -734 -405 212 -203 -249 -204
1220 -204 -1003 -530 20 -330 -318 135 -261 -783 -474 21 -627 -399 174 -408 -918 -310 -281 -620 -367 215 -381
1241 -381 -882 -346 -574 -818 -203 161 -651 -350 11 -571 -703 -114 242 -494 -213 69 -698 -545 340 198
1261 198 -223 301 180 -802 -246 341 -230 -83 740 342 -352 52 267 -71 331 472 -28 -34 313 144 -118
1282 -118 415 709 188 347 589 282 -262 628 790 300 284 463 26 -91 639 719 253 550 478 170 219
1303B19K79j97l6L31j95q40N95J71k16K80J28m15k31L41l2k79K80N70m11j43R4
1324B93r5o07Q63k61j73KJ99m53o4O49K38k90P9k75n33K98L92j38k17Q18n10p64
1346e49M10L24j54j35O28n44l41N14j55k36L30M37n05k83K75m11j12O50M74q38
1366b21L32l42j7k47L19L76n25J72j39j30K75M03n66o7L44k75l1K99j67M8J01
1387e8K17o50k94N78j71j79N38K67n94j52L33j85k05K32L40l85J87Q6k04K69o3
1408i3K63l18J67Q3p86M89K95j09q4J71o7l39K82K62m79J53K41q3l82J61J29n3
1430i7J95K52k46k74N7J48k73L90K97j62m14L40m56K75J99J97m59RJ62k13L15
1451B42o0J32j44N6k03k07J00K58rp5L45j59n29K94K07k45m9L45o9m25K45Q6K
$$ plain form
1303 219 498 301 265 596 401 -439 156 327 111 391 519 104 -127 214 182 -97 183 753 342 199 293
1324 293 198 -409 454 193 20 22 221 -232 -296 353 591 301 380 105 -428 -130 262 124 -93 725 215 -549
1346 -549 -139 185 31 -104 524 -20 -361 153 -2 -238 92 529 24 -259 16 -395 -507 143 617 -221
1366 -221 111 -231 -248 -495 -176 200 -325 -153 -292 -422 -147 256 -310 -377 -33 -308 -339 -40 -207 -159 -58
1387 -58 159 -491 -785 -207 -378 -557 -19 248 -346 -498 -165 -350 -555 -323 17 -368 -181 -95 -299 -30 -93
1408 -93 170 -148 19 102 -684 -195 100 -9 -93 78 11 -328 -46 216 -263 -110 131 48 -334 -173 -44 -97
1430 -97 98 350 104 -170 -113 35 -238 152 449 287 -127 213 -243 32 231 428 -31 -22 140 -73 242
1451 242 182 314 170 226 23 -184 -84 174 165 90 435 276 -253 41 248 3 -46 299 230 -195 50 136 138
1474A38K16qj29J53j53j23r4K81J75l27J92o2l63l0L17K4q4K32ml21J8J78O1k48
1498C9L25n1l44k42M48p9J09l5o3k10J30J94l10J94K54l00M4K3l47J89Q9J05j76
1521a4o9K81m94N8K95J95k07o0q7R1j59L40j95R8Ol34L3j92N10l69q4M90q1o60
1545f08P10k50o8O6K50j54m8k31L03l37K59K12k56j65M2rrL09l1j20r4J53p0N9
1569h7r1J11j98K40q8k52K31K53m72K43K03q6j18l10M24m22N09J6L2m81K83l6
1591i6k99N67q6r0l01N10k61k16K43K93n14M00l0j82j79L43j8j12K3J39k31l7
1613a34P5k2l41N73L5j94j34K51l31J09J89Qn51J21M67k10J14J33k01K7OK49l85
1636a46J71J77j80M0K87k92j87K88M3j31R5M11m15j91K76p2q6J20L52p41L17L8
$$ plain form
1474 138 354 346 217 370 217 94 0 281 456 129 321 259 -104 -134 183 207 123 355 351 30 48 226 287 39
1498 39 364 313 -31 -273 175 96 205 170 107 -103 27 221 -89 105 359 59 103 126 -221 -32 57 162 -14
1521 -14 -83 198 -296 -238 57 252 45 -15 -102 -11 -170 170 -25 73 79 -255 -222 -414 96 -273 -357 133 52 -608
1545 -608 102 -148 -216 -150 100 -54 -102 -333 -30 -367 -108 104 -152 -317 -275 -284 -293 16 -15 -135 -229 -76 -146 -87
1569 -87 -178 -67 -265 -25 -113 -365 -134 119 -353 -110 93 7 -111 -421 3 -419 90 106 138 -343 -60 -96
1591 -96 -395 172 86 -4 -305 205 -56 -272 -29 264 -250 150 120 -62 -241 102 84 -28 -5 134 -97 -134
1613 -134 -59 -81 -422 151 186 -8 -142 109 -222 -113 76 84 -467 -346 121 -89 25 158 -43 -16 -10 239 -146
1636 -146 25 202 22 62 349 57 -130 158 201 70 165 576 161 -30 246 174 88 208 560 -181 136 174
1658A74j80j6K56K87k94r8J28n26M33J61K12m75K09n2m16L47J59k79p9L69m22
1679a02J82j8M99l51L9J05m73jK73K22k74L58O6k70Mn5j91k22M47p1P3k03K59
1702B96l59j07K89P8m32M76l28p04M37R12p73l25L25m86N96o1L72m86J57J66m68
1723d25l0M14J28k21n2K91L4k38P7p8j35K9R3k4k48L85l21rL11J35l60P6K30l58
1747b96J16L81n93K16K80j84l16K29L72m42J60J15r9j94J06K69k33K62j24m20
1767c95K1M41m69N90n1J50m03P3J74l38n8K76Rj28j05J6j8j10K97K16o5j8j38
1790c3k84K14K97k72j38L90k53k65K55J19O7l8J01j96k15K46L01l41J29J90k57
1811A7mK12k30j05L35K3j55j4J6O2l30M81Q6k83J79j0l32L88J17j96j68J54j77
$$ plain form
1658 174 -6 -22 234 521 227 129 257 -269 164 325 537 62 271 219 -197 150 309 30 -49 320 -102
1679 -102 80 62 561 210 249 354 -119 -120 153 375 101 459 525 255 259 204 13 -209 238 167 240 37 296
1702 296 -63 -170 119 197 -235 241 -87 -791 -354 558 -215 -540 -215 -701 -105 -166 206 -280 -123 43 -425
1723 -425 -455 -41 87 -134 -186 105 139 -99 -22 -100 -235 -206 -113 -137 -385 0 -321 -330 -19 116 -244 -168 62 -296
1747 -296 -180 201 -392 -176 104 -80 -396 -167 205 -237 -77 38 -61 -255 -149 120 -113 149 25 -395
1767 -395 -374 67 -402 188 137 287 -116 -43 131 -207 -265 11 20 -108 -213 -197 -215 -325 -28 188 123 105 -33
1790 -33 -317 -103 194 -78 -216 174 -79 -344 -89 30 97 59 160 -36 -251 -5 296 -45 84 274 17
1811 17 13 225 -5 -110 225 248 93 79 95 157 -173 308 394 111 290 280 -52 336 453 257 89 243 66
1834F6m5R8k6J93j68R8j25j6K04N2j79Q3j8r0J84q1l96K29PP0j29l45Q07n93K8
1859i2J49Kq3K2J10l64L85Q3m93J76J59JL3N3J4n23L60N92l21m07R0p3N09m24
1883d2L87q87R2L51J9oL08m89N8j89N74j93J89l20K83n46P15j37p25J15M52m66
1905d57J71Q16l09j115P52M39j98P3o15P34l52K05J34K88r79O32n25j15l6O31
1925A74j23n30Q02m29K00j31l82K28O39m49l47k28Q07p37k54P98N74j201R28k46
1945I3j98K30l19J12R6r2o57K34P07o0n03j71J04K03L64m86N20j8K22j65o87J92
1967b79J15p4Q5k6M72K2rk71m24O51o87J351r64k63KM58l42K98n57m08J377j38
1989C89l47j5l11M04k0K97j90R6K84j058N22K83K08r6o23P88q14j69k91N86m3
$$ plain form
1834 66 21 119 93 286 118 216 91 75 279 331 152 235 217 127 311 230 -166 63 70 140 11 -334 473 -120 -92
1859 -92 57 59 -24 -2 108 -256 129 212 -281 -105 54 55 88 141 155 -368 -8 584 263 -144 -54 -127 382 -42
1883 -42 345 -542 -450 -99 -80 -86 222 -267 -209 -398 176 -17 172 -148 135 -411 304 167 -558 -443 9 -457
1905 -457 -286 530 221 -894 -142 297 99 172 -443 291 -61 144 278 566 -413 219 -306 -421 -457 174
1925 174 51 -479 323 -106 94 -37 -419 -191 448 -1 -348 -576 231 -506 -760 38 612 -589 339 93
1945 93 -105 125 -194 -82 14 -78 -735 -501 206 146 -357 -528 -424 -221 143 -343 177 159 381 216 -471 -279
1967 -279 -164 -238 -153 -179 293 315 306 35 -389 262 -425 926 -38 -301 -299 159 -183 115 -442 -850 527 389
1989 389 42 27 -284 120 100 397 207 303 587 -471 51 334 542 446 -177 611 -203 -372 -663 -77 -120
2010a20r0O04o04n43J056l23L8R07q21k43l09J039l11m62O92m72K69p55O00M0
2030A92J94N26j08j128K86q5j13K86q36O58k67O20p49M68K49n01O53n10M42k73
2050Dl63L42j59nL16m81P15n50O15K77j270Q08l00l5k80Q40o24j66j55M20m08
2071d59R1K15m99P49q0k70r7K80m4j16K47l46J93j66J4N6r8K64K55n91L93M1j02
2094g0J15j51L94m13J2K15r68M30L26k19N11j71J61n46Q69n28M3J3k25K70l93
2115c25M06l05J49J50j6M0l92J43K19q4k03L99k62j53K33k24M5l8M09k62j69M62
2137B22o60J30O88l46J34Q7j00l19L08j53j77J48k3M6j41P6K14l04L67q7l32J69
2159e3K75j5r1L40j18l99J21k4J3n8L65m77K26P5p6J18m14L44k7j77L62p7l00
$$ plain form
2010 -120 -210 394 -210 -753 303 -20 18 925 104 -139 -448 591 280 -182 510 38 307 -448 152 192
2030 192 386 912 804 -324 -38 -123 -236 50 -786 -128 -395 225 -524 -56 193 -308 345 -165 277 4
2050 4 -359 -17 -176 -181 135 -346 369 -181 434 711 -559 249 -51 -86 -366 474 -150 -316 -471 -51 -459
2071 -459 -368 -153 -652 97 17 -253 -350 -70 -114 -230 17 -329 -136 -302 -288 -232 -330 -66 189 -402 -9 32 -70
2094 -70 45 -106 288 -125 -113 102 -866 -436 -110 -329 182 11 172 -374 495 -33 10 23 -202 68 -325
2115 -325 81 -224 -75 75 59 99 -293 -150 69 -15 -218 181 -81 -234 -1 -225 -180 -218 191 -71 -240 222
2137 222 -438 -308 380 34 168 255 155 -164 144 -9 -186 -38 -61 -15 -156 -80 134 -170 197 110 -222 -53
2159 -53 222 207 116 456 338 -61 60 36 49 -9 356 -121 105 180 104 222 -192 152 125 -52 310 233 -67
2182f7K37m3r8J98J71J70o95J14K45Lj62J27j63L1j4j76J91P5j83K75J83k48k24
2205e3k17N75k30Kj01M06p97M82l9j20J65K04q7J2j8mJ52l92L01j75j05K05k53
2228h7k46L73J4j22q6Q2k49J79K78K27l70j78L10k46n8K24j97r4J79L37l31k07
2250b68L37p8m0J73J16l08K0P2j3m47L71j30K37j29j13j5K67j05N5J56n27J53
2272b16N47l31L92J69o60R5m8J02k79K06M01k79n66O21j78J98P3o2p5J81k76l27
2294c12K73j4K75l25J13K30j35K09k94m87M18j20l5J32L33q56R96n03k53J32L07
2315H4P05o21l39N09l94m8J49m3j11m0P36o37O1k5N56O5l10j27k03M50k21k28
2337c2%L54m03J39M6m5l27k95P38M03m50L3k15p61R69j05M0n3M7K82j88k74J26
$$ plain form
2182 -67 170 127 29 227 398 568 -127 -13 232 235 73 200 37 68 54 -122 69 144 -39 236 419 171 -53
2205 -53 -270 305 75 77 -24 382 -415 67 28 -92 73 277 190 202 184 180 332 -60 241 66 -39 166 -87
2228 -87 -333 40 54 -68 -154 -72 -321 -142 136 363 -7 -185 125 -121 -179 45 -152 -246 -67 270 -61 -268
2250 -268 69 -9 -49 124 240 -68 -48 24 11 -436 -65 -195 42 -87 -200 -215 52 -53 2 158 -369 -216
2272 -216 331 0 392 561 -99 -4 -52 50 -229 -23 378 99 -467 154 -24 174 247 185 110 291 15 -312
2294 -312 -39 -53 222 -103 10 240 105 314 20 -467 -49 -169 -204 -72 261 -595 401 -102 -355 -223 84
2315 84 789 168 -171 338 -56 -104 45 2 -109 -149 587 -50 11 -14 542 607 297 170 -33 417 196 -32
2337 -32 -32 322 -81 58 104 59 -268 -563 175 578 128 161 -54 -815 154 49 89 36 83 365 177 -97 29
2360B9m11K62M02N4k6l84qJ92Q0j43r1K48j04O7k32K20m6L8K0j07o6Qj80K20N1
2385I3j69K73j98P0j64qK40k28P5J61j55nl1j76j08N18j47R8m14P4J87j29K9J15
2409AJ84j61NJ48k27R2m3J43k86L53j45j65J54j74j14J44JJ72m3q9J07k4r7n2
2433a16K12k20K58K4j75L0o4J1l77K80K08j70j34j99M28k60K28K20j75J03k04
2454i2K78n20M36QK58k10l71L66k64J01M53n22k43Q1O00r37O11l95K28j13K56
2475Il20j8Ln3R69o58K77q71O15J81k07M3J93j57j10L56m6k77p6L58p5l0j78K42
2499A70l30J33M4k8K88k56J77j32N6j16K2J83k90N3lP0l05J99o1P2j57L33k24
2522a02J18O3J3k06jJ28J36k09J28O5j88J14J24r6k94L06J94l49q4K59j27p8M2
$$ plain form
2360 29 -382 -120 282 336 310 -74 -82 110 190 47 -44 204 100 167 -65 155 109 147 167 60 -6 2 -178 42 93
2385 93 -76 197 -1 69 -95 -103 137 -91 -16 145 -10 -15 -46 -222 -330 188 41 139 -275 -201 -14 -143 -114 1
2409 1 185 24 29 177 -50 42 -1 142 -144 209 64 -101 53 -121 -235 -91 -90 82 39 -50 57 33 -64 -116
2433 -116 96 -124 134 158 -17 13 -51 -40 -417 -137 71 -99 -233 -432 -4 -264 -36 184 9 112 -92
2454 -92 186 -334 102 110 368 158 -213 153 -111 -10 443 -79 -322 -241 359 -578 33 -362 -134 -247 9
2475 9 -311 -329 -326 -379 590 -68 209 -662 -47 134 -73 -30 163 6 -104 252 206 -71 -147 211 136 106 -72 170
2499 170 -160 -27 17 -11 277 21 198 66 122 6 28 211 -79 -26 -29 41 -264 -65 -126 -54 -211 122 -102
2522 -102 16 79 92 -114 -115 13 149 -60 68 133 -55 59 183 87 -207 99 293 -56 -140 119 -8 -86 -44
2545d4K95nk85K26j80j93J6M48m35Q9J17k72J41M16m16N1j3L60m87J09pJ06j11
2568g4O1P1r3K13o2J3o2K45m27K35L6k57K8J2J19r1M5k09L37l32j24L10R6J44
2592B34nj56l6K5j04K22j91J60j29P0n4J03qj9o6RJ36n9l87L08p8n6P7J07k3m32
2618c52L74K0l80J13K38j9R1j83j0J01o6K3n8N1j9q8Q3R6l5k4k3K4J44o4m0k28
2644b31J27J76l9j64O0N6o9O0J37j50P3j00M01k87j19n5n3p9M43j81K2m4q0J78
2668H2j22O5m2j19J19P5j97J33m1J37j11j7j45M8Q0QJ82j82j04R4J02Qp4j05K86
2693A60K1k46P1L53m48J02m0N7r5o1K3q3K34j02R4K07k45Nj45J10J74q8K52k83
2717B7R5l88L44j55pN0J6J6J07J90j16j04N1J09j97r6n4J31O4j12k3j02K60kj44
$$ plain form
2545 -44 251 246 -39 187 7 -186 -170 278 -157 -68 49 -223 -82 334 -82 -31 -44 316 -171 -62 -69 37 -74
2568 -74 -13 58 -35 178 116 129 67 312 -115 120 156 -101 -73 -61 58 -33 12 -197 140 -192 -316 -6 90 234
2592 234 229 73 37 62 -42 180 -11 149 20 90 36 139 131 112 46 55 191 132 -255 53 -25 -81 -4 103 80 -352
2618 -352 22 42 -338 -225 13 -6 85 -98 -108 -7 -73 -50 -108 -57 -76 -164 -81 15 -20 -44 -67 -43 101 37 -3 -231
2644 -231 -104 72 33 -131 -71 -15 -84 -24 113 -37 36 -64 337 50 -69 -124 -177 -256 187 6 28 -16 -96 82
2668 82 -40 25 -17 -136 -17 58 -139 -6 -47 90 -21 -38 -183 -135 -55 -47 135 -47 -151 -57 45 53 -21 -126 160
2693 160 181 -65 6 359 -89 13 -27 30 -65 -126 -103 -186 48 -54 40 247 2 7 -138 -28 146 58 310 27
2717 27 122 -266 78 -77 -84 -34 -18 -2 105 295 179 75 126 235 38 -58 -112 19 83 -29 -52 -154 106 104 -40
2742d0J35l3R8j62M3Q6N4j67J81j09J10j64L8j64L27j40q1K50J06k27j90J70j85
2765f4J33O1l0Pj22Q4q5P4J17R1l08K30N4j68j31N1k16K32K8J25k06K04q2j0k63
2790a94J17P9J7K6n6k41K54J67l73J1M13l5k71K58k9j25j1L4j59K90j01Q0l57
2813b06N9l4K33o3K51n16K36j52L54j60k7J27k56j39L20l23K12K59m55qJ88J59
2835E9j32n3o5k13L85n4L57l84K1L5J3j57Q4J58q9L77m36M5k24O46n65Q7J33j9
2859Ij40K46r2m6O4n7K9k9J02J35k41j13K95l8j62K4Q4l36J86K5L2P2p6j08o0
2884a95N2K67k9K28j62K1j61K58k68J78K1k16J33j1n7J26l19K42j40R2j25j57
2906b22J26%K03Q1r7N9k8q0k14K29j88L15k24L51m79M35k32l9N4k04J28k3K39
$$ plain form
2742 -40 95 62 160 -2 41 127 181 14 195 86 196 32 70 -94 233 93 12 262 368 141 -49 121 -64
2765 -64 69 130 100 107 -15 69 -16 58 175 266 -42 188 242 74 -57 -6 -222 10 38 163 -43 161 79 69 -194
2790 -194 -77 2 19 45 -11 -252 2 169 -204 -193 220 185 -86 172 143 18 7 41 -118 172 71 151 -206
2813 -206 -147 -181 52 -11 240 -276 -40 -192 162 2 -25 102 -154 -293 27 -296 -84 175 -280 -288 -100 59
2835 59 -73 -126 -191 -404 -19 -73 284 -100 -79 -44 -31 -188 -104 54 -35 342 -94 -49 -273 373 -192 -105 28 9
2859 9 -131 115 23 -23 41 -16 13 -16 86 221 -20 -133 162 124 -38 -14 70 -266 -80 -55 -23 49 -27 -135 -195
2884 -195 -143 124 95 323 161 182 21 279 11 189 210 -6 127 116 59 185 -134 108 -32 60 -65 -222
2906 -222 -96 -96 107 188 91 150 122 42 -172 57 -131 184 -40 311 -168 267 35 -4 50 -154 -26 -49 190
2929A90j21J6k87M8J7K57k10J96l4j18J55j00K69k70j94J55J67k61j2L68O8j32
2951A67j85J03j56J98j43l8J27J69p3n31M13M1Lrj41l7O0Q9O6L1j87M6j72J14
2975d5J06k01o3M3P2K15j52M5j51K6K03O5l71L23j07j86J4L6N2j77K00q5Q3O4
2999IL0k44J53J42J3k65l6J21Q2J9n7L7q1Q1L6R2k08N4m6K33r3j60N1J8l7k41
3025b97M71k33K49m92K92j7J17j90rM5j6m6J10Q0J06j30j02R6jO9n7j36r1Q0o3
3050a65K26j81L18j72q4J24q5J49P1k01Q3l9o5m5m5R9l2O8q1k1O7j22J41K48k35
3075B1J8J51l32j79J81K9RL1J26k7O0j90L4j52M17k23J03n1Mk6j9O9q0k3j50L31
3101A32j85m7KL69n63L92k30o0K64Mn6L2J3J79l39J57K7j48J22j54K36l54J41
$$ plain form
2929 190 69 85 -202 -154 -137 120 -90 106 72 -46 109 9 278 8 -186 -31 136 -125 -137 231 299 167
2951 167 -18 85 -71 127 -16 -54 73 242 169 -362 51 92 95 86 -55 -92 -32 57 123 154 -33 13 -159 -45
2975 -45 61 -140 -203 -160 -88 127 -25 20 -131 -105 98 163 -208 115 8 -178 -164 -128 -76 -253 -53 -138 -55 9
2999 9 39 -205 -52 90 103 -162 -198 -77 5 24 -33 4 -77 4 40 132 -76 -22 -68 165 72 -88 -37 -19 -56 -297
3025 -297 174 -59 190 -302 -10 -27 90 -100 -109 -64 -80 -126 -16 64 170 40 -62 34 33 102 45 -91 -182 -102 -165
3050 -165 61 -120 198 26 -58 66 -19 130 201 0 83 44 -21 -66 -111 -12 -44 24 -57 -78 -11 -133 8 256 21
3075 21 39 190 -142 -321 -140 -111 -102 -71 55 28 88 -102 -68 -220 197 -26 77 26 30 4 -15 54 -26 -49 -199 132
3101 132 -53 -100 -98 271 -292 100 -130 -190 74 78 22 54 67 246 -93 64 91 -57 65 -89 147 -207 -66
3124f6pJ21j0j54M4m8N7O5p4J27q4j1j93M39J5k37j11K19k88O5K84L8k92N1J8
3149c2j33L38k13j29J31Q7l4l9Q9p9j74J71j19J19k01QK19r6L02j72o0o2L9j4
3173e4P3R3j57l7K45j92N5M1q2Kl17M69l06j3K35p3J70j07O6l29J28M3lK7J97
3198A74k25k45M35j68Qo4l4k9j9qJ26K09Q3Nk87L01k55P6j75J22K9J51l02m9J28
3223a3j19M2J25k35k9K20k15K4K01M3J51k88J3L3r4J34p8j10K36J76k16j95M7
3246a47J69J28J4J0j1Rn3j24j26N8K21l36K76L0k91R1K58j86J4P8j32N0j38O7
3270g1N5pJ0K14k9j69j6N9j9N2o6J25Kk93O0O4J71k35J85rk4l16Q3K01j2P8k15
3297a22K0K79j83K98Q7k16l0l38J36J15k29J05M2J37n9k2mr9n3P9J04l0m2j63
$$ plain form
3124 -66 -73 48 38 -116 -72 -120 -63 2 -72 55 -29 -40 -233 206 221 -16 -127 92 -196 -131 153 191 -101 -50 -32
3149 -32 -165 173 -40 -169 -38 49 15 -24 65 -14 -188 -17 -136 -17 -218 -210 9 -87 215 43 -17 -79 -40 -54
3173 -54 19 112 -45 -82 163 -29 26 67 -15 -13 -330 139 -167 -180 55 -18 152 45 111 -218 -90 -47 -50 -23 174
3198 174 -51 -296 139 -29 -21 -85 -119 -148 -167 -175 -49 160 243 248 -39 262 7 83 -92 30 59 210 -92 -141 -13
3223 -13 -132 -90 35 -200 -229 -9 -224 -200 1 44 195 -93 -80 -47 -141 -7 -85 -195 41 217 1 -194 -147
3246 -147 22 150 164 174 163 172 119 -5 -131 -73 148 -188 88 118 -173 -82 176 -10 4 82 -50 0 -138 -71
3270 -71 -16 -23 -13 201 172 3 -13 46 27 79 13 138 140 -153 -93 -29 142 -93 92 83 59 -257 -174 27 15 93 -122
3297 -122 -102 177 -6 292 379 163 133 -205 -69 46 -183 -78 -36 101 42 20 16 -83 -136 -57 47 17 -25 -188
3321a88K01k11R7r5J67K69j88j62P3k9P8j66J52j54L13q2p2J89j06r3K2P6M3k59
3345a25M3j33K86r8R2j07J5j1o2K37l54J63j47J06l5K63j77r3K19r2k00M2K52
3368H4l63K28L4J41j38k8P6P5j15J65j65m4L1l6J09J1j34n5K04j69K33k68L04
3391A80j19j16K42l2k76K97l51N7r0K13J05l50L99l22K73j12q0M8O5J35m41L32
3413E7o2j31K28P2j0k55K83j51K13j55L2Q5j82K64l25K32p9q3k03q0K92N3j64
3436f9K4L0k40J54k0J3K46q7j4p9M4J04k77K00l64L49k19J25K60k51rR1K0j05
3460g4K34Ol26K19qK4n9K9L3k60J91j82L11k10Q2j34j19K96k43J23N3q6n5L5J47
3485B7q9K30k85K09P7l22L07j38M3n6k10K27mk17J93m7J2k4n0J30j49L7Q6j7K30
$$ plain form
3321 -188 13 -198 -101 -196 -29 240 52 -110 -37 -66 12 -154 -2 -156 157 75 3 192 86 -7 15 91 134 -125
3345 -125 -82 -215 71 -27 65 -42 -27 -38 -100 137 -217 -54 -201 -95 -130 133 -44 -137 82 -10 -210 -168 84
3368 84 -279 -51 -17 124 -14 -42 34 109 -6 159 -6 -50 -19 -55 54 65 -69 -124 80 -89 144 -124 180
3391 180 61 -55 187 155 -121 176 -175 -118 -208 5 110 -240 159 -163 110 -2 -82 -34 31 166 -275 57
3413 57 -5 -136 92 164 154 -101 182 31 244 89 121 206 24 288 -37 195 116 33 -170 -250 42 95 -69
3436 -69 -45 -15 -255 -101 -121 -108 138 51 37 -42 2 106 -171 29 -335 14 -205 -80 180 -71 -80 11 31 -74
3460 -74 160 166 -160 59 51 75 16 45 78 -182 9 -173 138 -72 10 -124 -243 53 -190 -67 -14 -100 -155 -120 27
3485 27 -62 168 -117 92 169 -153 154 16 59 3 -207 20 16 -201 -8 -55 -43 -67 -117 13 -136 -99 -13 -30 200
3510B00l80K73k20K42o0k1j86N1p5J27K7J65j5k87L54l45l1K11kML1KO9l45J40
3535g1nRJ07p0o5K16k77L06j87J17l18L37k9l35N19m01J09k98J75J38l8N1j70
3558a80L40j37Lj01ML7Q4J49j73j17K2L73l08l29J23J37J17Q2n7R2q2k02J42j1
3582Hk15q9K72K10l66J00j45K11K66r1q9j11J48K1r5J89l30J94q7K5j13K18l7
3605I4q7l8N5j9L08j20j49p5p4L96l90L15j10O9k14K06m0l52R1K81q9k1m7r5R8
3630gQ0l0o1J51j3K4k08O2J87j62jk05L28m0J5j72O1q1P8o1Q3j58k55M40j09j23
3656a77K87J7k4kj4k86K13J87k02J81k14N7j47J36j04m9J29K91j63j84J23m10
3678c55L21K6J30k44k0R7j21O4J03j76O12l45k79M45k28J1j41J51pP0K5j79J68
$$ plain form
3510 200 -180 93 -127 115 55 34 -152 -101 -176 -49 -22 143 128 -159 195 -150 -181 30 28 32 63 65 134 -211 -71
3535 -71 -76 -67 40 -30 -95 121 -156 150 -37 80 -238 99 70 -265 254 -147 -38 -336 -161 -23 -61 -10 -180
3558 -180 160 23 26 -75 -71 -34 50 199 26 -91 -69 304 -4 -333 -210 -73 44 126 69 161 79 -123 19 8
3582 8 -207 -296 -24 186 -180 -80 -225 -14 252 161 72 -39 109 130 35 224 -106 88 1 26 -87 131 94
3605 94 7 -31 24 5 313 193 44 -31 -105 291 -99 216 106 175 -39 167 127 -225 -134 147 58 37 -10 -105 -7
3630 -7 73 43 -18 133 120 144 -64 -2 185 23 22 -183 145 105 120 -52 9 -72 6 -55 28 -130 -385 55 -54 -177
3656 -177 110 127 103 101 87 -199 14 201 -1 180 -34 23 -124 12 -92 -141 -12 279 116 -68 55 -355
3678 -355 -34 -8 122 -122 -142 -45 -166 -102 1 -175 437 92 -187 258 30 41 -100 51 44 114 139 -40 128
3701A28J23p7n3j53N3j24J99j80k4j33j05K80J2L8K47m23l4J44K51j01k74L62
3723A56l14K38k81J44K35k90J10j00J15K7j71J64J48j81J79k88K03k01J29J9j9
3744B2j97K25K4J49k34j13K42N5l9N2k2k92M9O6R9k93J54o9J38J09k60K04j07
3767c8J34j10Q9k29p5J47J72j46Q2K82j43k04kL9K2M7n9L4L9m8j59K47j29k23
3791b31nL7L35k57l2N8R9K06j66j30O0Q9j54j1Mm9N0k19L39j36J16j44K48k18
3815a11M5J03j24r7K97l65P8LJ79k7L5L4l37K76OJj5J62k43N1m4Q3m1l49K94J67
3841F1R9j41k0n6K6J82q4n9J12k14N3j76K35k84L36L8j50j25J35K52j20o4o4O8
3865D0q6jj87J30J21N6j5j19J20r4j59K78rQ3j52m7pK5k08J31J04r5M46l97M3
$$ plain form
3701 128 251 174 121 -32 21 -103 96 -84 -108 -241 -346 -66 -54 -16 231 -192 -226 -82 169 68 -206 156
3723 156 -158 80 -201 -57 178 -112 -2 -102 13 40 -131 33 181 0 179 -109 94 -107 22 41 22
3744 22 -175 50 74 223 -11 -124 118 173 134 186 164 -128 -79 -13 86 -207 -53 -122 16 125 -135 69 -38
3767 -38 96 -14 75 -154 -229 -82 90 -56 26 308 165 -39 -41 -2 20 67 8 42 81 33 -126 121 -8 -231
3791 -231 -236 -199 136 -121 -153 -95 4 210 44 -86 -26 63 -91 -102 -98 -147 -97 -316 23 -113 3 -141 107 -111
3815 -111 -66 37 -87 -184 113 -252 -174 -171 8 -19 16 50 -287 -11 -5 -4 -19 143 -100 -49 -93 -10 -51 -400 -106 61
3841 61 160 19 -1 -57 -31 151 67 8 120 -94 -41 -217 18 -266 70 108 -42 -167 -32 220 100 36 -28 40
3865 40 -46 -47 -234 -104 17 73 58 -61 59 -35 -194 84 75 158 6 -41 -48 -23 -231 -100 4 -91 355 -42 1
3890AJ04j04j58O8K6K10j95K61l90l7L00J08p3j77K63j14r7J80k9j76j65L17o8
3913E5m9m8K0j74L38o5k84J59J65P9j38l5k53K96M8j76N9q3M2J95k35J17L1l51
3937b87J47N0k3J84l02M97r5k09J62k33J45j99K82k45Q0M4p7J1k0l2O2J15j32
3960g5q9M39j74k76J64Ko5m1O3K22k13M7n0R7p6K02k52N7O1j05l1L46o6k21J17
3985H3K1k04J95k80j0L21l5j27j2L19k48k22L67j48O2L2j6j11R0o9n5j13J21J2
4009b7J39k49mJ80Np8J20P4k2k08Q0n6m2JJ38J24j15p3J48l48J18q5J87K93m08
4034a08k03K43J49N2P7j86k4K10l16J70n9j43qK17j92NP1J66j6l17K73q6K21k51
4058e5J69j00o5L8J33L5j73j48K48j90J27k5Q3j14M8K90l87Q7j45R6Q4k6M0Q4
$$ plain form
3890 1 105 1 -157 -89 -63 147 -48 213 -177 -214 86 194 121 -56 207 93 -4 176 147 -29 -194 123 55
3913 55 6 -42 -22 -196 142 77 -207 -48 117 196 58 23 -230 66 114 -62 -3 -86 -44 151 -84 33 64 -287
3937 -287 -140 -90 -113 71 -231 266 171 -38 124 -109 36 -163 119 -126 -46 -2 -79 -68 -88 -120 -58 57 -75
3960 -75 -164 275 101 -175 -11 -9 -74 -115 -52 170 -43 4 -46 51 -25 177 -75 -18 43 -62 -93 253 187 -34 83
3985 83 104 -100 95 -185 -195 126 91 -36 -48 271 23 -199 168 20 82 114 98 -13 77 8 -47 -160 -39 -27
4009 -27 112 -137 -141 39 44 -34 86 160 138 -70 10 -46 -88 -87 51 175 60 -13 135 -213 -95 -180 7 300 -108
4034 -108 -311 -68 81 133 210 24 0 210 -106 64 5 -138 -146 71 -121 -116 -45 121 105 -212 61 -25 196 -55
4058 -55 114 14 -51 -13 120 155 -18 -166 82 -108 19 -6 77 -37 11 301 -86 1 -144 -48 36 10 50 134
4082A34J17r5l64K97k7j95J48J80k25P7r3R3j97M96l31q8J50Q2j64k11L60K6k34
4105f4M0L11n05K40j54P9j87Q6J98K8j77K62k46p9J32N8QJ39j85O7k35K12l9l2
$$ plain form
4082 134 251 156 -208 89 62 -133 15 195 -30 47 -46 47 -150 346 15 -73 77 159 -5 -216 144 170 -64
4105 -64 -24 287 -218 22 -132 -53 -240 -154 44 72 -105 157 -89 -168 -36 22 30 169 -16 51 -184 28 -11 -43
$$ [...]
8191A23
##END NTUPLES=NMR FID
##END=
