##TITLE=1H_SR62_mat
 CDCl3,8 sc, 
 2.02.2021
##JCAMPDX= 6.0         $$ Bruker NMR JCAMP-DX V2.0
##DATA TYPE= NMR FID
##DATA CLASS= NTUPLES
##ORIGIN= UXNMR, Bruker Analytische Messtechnik GmbH
##OWNER= root
$$ XWIN-NMR		Version 3.5
$$ Tue Feb  2 13:17:51 2021 Russian Standard Time (UT+4h)  she@DPX200
##.OBSERVE FREQUENCY= 200.1315066352
##.OBSERVE NUCLEUS= ^1H
##.DELAY= (6, 6)
##.ACQUISITION MODE= SIMULTANEOUS
##.ACQUISITION SCHEME= undefined
##.AVERAGES= 8
##.DIGITISER RES= 18
##SPECTROMETER/DATA SYSTEM= spect
##.PULSE SEQUENCE= zg30
##.SOLVENT NAME= CDCl3
##.SHIFT REFERENCE= (INTERNAL, CDCl3, 0, 15.7039)
##AUDIT TRAIL= $$ (NUMBER, WHEN, WHO, WHERE, WHAT)
$$ ##TITLE= Audit trail, XWIN-NMR		Version 3.5
$$ ##JCAMPDX= 5.01
$$ ##ORIGIN= Bruker BioSpin GmbH
$$ ##OWNER= she
$$ F:/spectra/data/she/nmr/H-F/1/audita.txt
$$ ##AUDIT TRAIL=  $$ (NUMBER, WHEN, WHO, WHERE, WHAT)
(   1,<2021-02-02 13:16:40.81 +0400>,<she>,<DPX200>,
      <created by zg, POWCHK disabled, PULCHK disabled
       configuration hash MD5:
       00 E9 B6 7A A2 85 ED C7 34 08 36 98 17 FE 4E 26
       data hash MD5: 16K
       86 58 DC 75 26 C2 22 FE 5F 01 36 C5 F5 26 46 81>)
$$ ##END=
$$ 
$$ hash MD5
$$ B0 C9 55 F6 A7 C4 13 01 17 4B E2 6F 76 49 81 D8
##$RELAX= 
##$RELAX= 
##$RELAX= 
##$RELAX= 
##$RELAX= 
##$RELAX= 
$$ Bruker specific parameters
$$ --------------------------
##$DU= <F:/spectra>
##$EXPNO= 1
##$NAME= <H-F>
##$PROCNO= 1
##$TYPE= <nmr>
##$USER= <she>
##$AMP= (0..31)
100 100 100 100 100 100 100 100 100 100 100 100 100 100 100 100 100 100 
100 100 100 100 100 100 100 100 100 100 100 100 100 100 
##$AQSEQ= 0
##$AQ_mod= 1
##$AUNM= <au_zg>
##$AUTOPOS= <>
##$BF1= 200.13
##$BF2= 200.13
##$BF3= 200.13
##$BF4= 200.13
##$BF5= 200.13
##$BF6= 200.13
##$BF7= 200.13
##$BF8= 200.13
##$BYTORDA= 1
##$CFDGTYP= 0
##$CFRGTYP= 5
##$CHEMSTR= <none>
##$CNST= (0..31)
1 1 145 1 1 1 1 1 1 1 1 1 1 1 1 1 1 1 1 1 1 1 1 1 1 1 1 1 1 1 1 1 
##$CPDPRG= <>
##$CPDPRG1= <>
##$CPDPRG2= <>
##$CPDPRG3= <>
##$CPDPRG4= <mlev>
##$CPDPRG5= <mlev>
##$CPDPRG6= <mlev>
##$CPDPRG7= <mlev>
##$CPDPRG8= <mlev>
##$CPDPRGB= <>
##$CPDPRGT= <>
##$D= (0..31)
0 1.2 0 0 0 0 0 0 0 0.06 0 0.03 0 0 0 0 0.0002 0 0 0 0 0 0 0 0 0 0 0 0 
0 0 0 
##$DATE= 1612257400
##$DBL= (0..7)
120 120 120 120 120 120 120 120 
##$DBP= (0..7)
150 150 150 150 150 150 150 150 
##$DBP07= 0
##$DBPNAM0= <>
##$DBPNAM1= <>
##$DBPNAM2= <>
##$DBPNAM3= <>
##$DBPNAM4= <>
##$DBPNAM5= <>
##$DBPNAM6= <>
##$DBPNAM7= <>
##$DBPOAL= (0..7)
0.5 0.5 0.5 0.5 0.5 0.5 0.5 0.5 
##$DBPOFFS= (0..7)
0 0 0 0 0 0 0 0 
##$DE= 6
##$DECBNUC= <off>
##$DECIM= 32
##$DECNUC= <off>
##$DECSTAT= 4
##$DIGMOD= 1
##$DIGTYP= 9
##$DL= (0..7)
0 120 120 120 120 120 120 120 
##$DP= (0..7)
150 150 150 150 150 150 150 150 
##$DP07= 0
##$DPNAME0= <>
##$DPNAME1= <>
##$DPNAME2= <>
##$DPNAME3= <>
##$DPNAME4= <>
##$DPNAME5= <>
##$DPNAME6= <>
##$DPNAME7= <>
##$DPOAL= (0..7)
0.5 0.5 0.5 0.5 0.5 0.5 0.5 0.5 
##$DPOFFS= (0..7)
0 0 0 0 0 0 0 0 
##$DQDMODE= 0
##$DR= 18
##$DS= 0
##$DSLIST= <SSSSSSSSSSSSSSS>
$$ [...]
##$SUBNAM2= <"">
##$SUBNAM3= <"">
##$SUBNAM4= <"">
##$SUBNAM5= <"">
##$SUBNAM6= <"">
##$SUBNAM7= <"">
##$SUBNAM8= <"">
##$SUBNAM9= <"">
##$SW= 16.9725356469052
##$SWIBOX= (0..15)
0 0 2 0 0 0 0 0 0 0 0 0 0 0 0 0 
##$SW_h= 3396.73913043478
##$TD= 16384
##$TD0= 1
##$TE= 0
##$TE2= 300
##$TE3= 300
##$TEG= 300
##$TL= (0..7)
0 120 120 120 120 120 120 120 
##$TP= (0..7)
150 150 150 150 150 150 150 150 
##$TP07= 0
##$TPNAME0= <>
##$TPNAME1= <>
##$TPNAME2= <>
##$TPNAME3= <>
##$TPNAME4= <>
##$TPNAME5= <>
##$TPNAME6= <>
##$TPNAME7= <>
##$TPOAL= (0..7)
0.5 0.5 0.5 0.5 0.5 0.5 0.5 0.5 
##$TPOFFS= (0..7)
0 0 0 0 0 0 0 0 
##$TUNHIN= 0
##$TUNHOUT= 0
##$TUNXOUT= 0
##$USERA1= <user>
##$USERA2= <user>
##$USERA3= <user>
##$USERA4= <user>
##$USERA5= <user>
##$V9= 5
##$VALIST= <valist>
##$VCLIST= <CCCCCCCCCCCCCCC>
##$VD= 0
##$VDLIST= <DDDDDDDDDDDDDDD>
##$VPLIST= <PPPPPPPPPPPPPPP>
##$VTLIST= <TTTTTTTTTTTTTTT>
##$WBST= 1024
##$WBSW= 4
##$XGAIN= (0..3)
0 0 0 0 
##$XL= 0
##$YL= 0
##$YMAX_a= 318364
##$YMIN_a= -276549
##$ZGOPTNS= <>
##$ZL1= 120
##$ZL2= 120
##$ZL3= 120
##$ZL4= 120
##$ABSF1= 10
##$ABSF2= 0
##$ABSG= 5
##$ABSL= 3
##$ALPHA= 0
##$AQORDER= 0
##$ASSFAC= 0
##$ASSFACI= 0
##$ASSFACX= 0
##$ASSWID= 0
##$AUNMP= <proc_1d>
##$AZFE= 0.1
##$AZFW= 0.1
##$BCFW= 1
##$BC_mod= 2
##$BYTORDP= 1
##$COROFFS= 0
##$CY= 11.3945322036743
##$DATMOD= 1
##$DC= 2
##$DFILT= <>
##$DTYPP= 0
##$F1P= 15.9154993809931
##$F2P= -4.1035820241983
##$FCOR= 0.5
##$FTSIZE= 0
##$FT_mod= 4
##$GAMMA= 1
##$GB= 0.15
##$INTBC= 1
##$INTSCL= 1
##$ISEN= 128
##$LB= 0.24
##$LEV0= 0
##$LPBIN= 0
##$MAXI= 10000
##$MC2= 0
##$MEAN= 0
##$ME_mod= 0
##$MI= 1.114404
##$NCOEF= 0
##$NC_proc= 0
##$NLEV= 6
##$NOISF1= 3.799351
##$NOISF2= 2.8
##$NSP= 1
##$NTH_PI= 0
##$NZP= 0
##$OFFSET= 15.70392
##$PC= 1
##$PHC0= -10762.13
##$PHC1= 15.00095
##$PH_mod= 1
##$PKNL= yes
##$PPARMOD= 0
##$PSCAL= 0
##$PSIGN= 0
##$REVERSE= no
##$SF= 200.130013532006
##$SI= 16384
##$SIGF1= 3
##$SIGF2= 2
##$SINO= 400
##$SIOLD= 16384
##$SREGLST= <1H.CDCl3>
##$SSB= 0
##$STSI= 0
##$STSR= 0
##$SW_p= 3612.71676300578
##$SYMM= 0
##$S_DEV= 0
##$TDeff= 0
##$TDoff= 0
##$TI= <>
##$TILT= no
##$TM1= 0
##$TM2= 0
##$TOPLEV= 0
##$USERP1= <user>
##$USERP2= <user>
##$USERP3= <user>
##$USERP4= <user>
##$USERP5= <user>
##$WDW= 1
##$XDIM= 8192
##$YMAX_p= 0
##$YMIN_p= 0
$$ End of Bruker specific parameters
$$ ---------------------------------
##NTUPLES= NMR FID
##VAR_NAME=  TIME,          FID/REAL,        FID/IMAG
##SYMBOL=    X,             R,               I
##VAR_TYPE=  INDEPENDENT,   DEPENDENT,       DEPENDENT
##VAR_FORM=  AFFN,          ASDF,            ASDF
##VAR_DIM=   8192,          8192,            8192
##UNITS=     SECONDS,       ARBITRARY UNITS, ARBITRARY UNITS
##FACTOR=    0.0002944,     1,               1
##FIRST=     0,             0,               0
##LAST=      2.4114304,     0,               0
##MIN=       0,             -276549,         0
##MAX=       2.4114304,     318364,          0
$$ Real data points
##PAGE= N=1
##DATA TABLE= (X++(R..R)), XYDATA
$$ [...]
2032B61P9p7o0k1J8R6o6j92J47j39J00k90K6J49j88J20P0k05k04J40j35J10L72
2055A11m31Q9Lj60j32K51r6K62k87o2J49J21k92J82J02k14L11l76J75K34J33k22
2077a49K25J0L5q4j93K62n6N8k9J19J70k33l4K03j69J22M0J27j35pk9J60j16k2
2101B75j88J95j00L10m47K83O9k57op1P6j07J29Pj40R5J8j64r5K0J21r4p0k45
2125c86K8K64l8r7j64K26k72QR0j49K82j65K64k61J22J56l50J63m8P5O6J68j10
2148a28MK07l41J30K38R7k61K36j25J3K74r4J96m02K42Pj46m5L16k23Q9j44K36
2171C76k13QL01j90N8J65j41p7Q4K7J55l28q9r5J37k86M07l55J08M0l1j69j07
2194b15K63j10k51L55l33J68j22q3J80j7%j94kK03k34o8L22k00j07J04J14L9k5
$$ plain form
2032 261 340 263 203 182 200 296 230 38 185 46 146 -144 -118 31 -157 -37 33 -172 -376 -236 -371 -261 111
2055 111 -320 -231 -228 -388 -520 -269 -365 -103 -390 -452 -303 -182 -474 -292 -190 -404 -93 -469 -294 -60 73 -149
2077 -149 76 86 121 37 -156 106 50 108 79 198 368 135 101 304 135 257 297 424 289 282 253 413 297 275
2101 275 87 282 182 492 45 328 397 140 134 63 139 32 161 168 28 123 141 -23 -118 -98 23 -71 -141 -386
2125 -386 -358 -94 -132 -229 -393 -167 -439 -431 -341 -490 -208 -373 -109 -370 -248 -92 -442 -279 -327 -252 -186 -18 -128
2148 -128 -124 83 -258 -128 110 207 -54 182 57 70 344 250 446 44 286 293 147 102 418 195 284 140 376
2171 376 163 171 472 282 340 505 364 287 371 398 553 225 136 41 178 -108 299 -56 52 92 61 -108 -215
2194 -215 48 -62 -313 42 -291 -123 -245 -328 -148 -165 -165 -359 -361 -158 -392 -460 -138 -338 -445 -341 -227 -188 -213
2217b13j28J18o2J52j72K41k23K16J8l9l7J88p8J1K23j71Q6J59m3k71J55K43Q
2240C81n1nk13J28O5J98llJk96O0P8k88K00K18m55O4K85k20P4r9l6J95k31k34
2265a87K85o9M6j71P8J6r4j15Jk3J79j85Q0QR7k37M9l2K39l88N0L05l40J13R6
2290a99J45k00J9j6o2r2K38J09l5n3J66j95R9J13j87L43j01K8J51M1rk48j32L87
2314C10j13J05Lr3j14M2p3L06R6j24j76K53j39k4j94K36n7j57J87N8l72j8J19
2337F1K23l24j4J48j12j46K05k69J12j53J02j58O0J48r8J89l37K04j9j64o6M00
2359hm51N2L43j75K3P5j19j85J40J65P3k75Q5J32J1J51J0j92M6J97j66L8K08L3
2383B11q4R7j85K29QM8k93L14p8r1OK03o9n39K65K13J55l7k79J44m5L01l09QJ67
$$ plain form
2217 -213 -341 -223 -285 -133 -305 -64 -287 -71 -53 -92 -129 59 -19 -8 215 44 130 289 246 -25 130 373 381
2240 381 330 325 112 240 305 503 500 497 498 202 262 340 52 252 470 15 79 364 144 218 119 83 278 47 -187
2265 -187 98 29 75 -96 -18 -2 -96 -211 -210 -233 -54 -239 -159 -151 -54 -291 -242 -274 -35 -423 -373 -68 -408 -295 -199
2290 -199 -54 -254 -235 -251 -313 -405 -167 -58 -93 -146 20 -175 -76 37 -150 193 92 120 271 312 303 55 -77 310
2314 310 197 302 305 212 98 140 67 373 469 345 169 422 283 259 65 301 244 87 274 332 -40 -58 61
2337 61 284 -40 -54 94 -18 -164 41 -228 -116 -269 -167 -325 -265 -117 -215 -26 -363 -159 -178 -342 -408 -8
2359 -8 -459 -407 -64 -239 -216 -141 -260 -445 -305 -140 -67 -342 -257 -125 -114 37 47 -145 -99 98 -68 -30 178 211
2383 211 127 224 39 268 276 324 31 345 267 176 182 385 316 -223 42 255 410 373 94 238 193 494 185 193 360
2408C60k69J02q3j84K9r2j31L28O3j9r2o0k8J40Rl11J03p6J68j50r9j16l8K19
2432b27m7L7p1OM3J57j16pJ74O8l21K84k62K24J43j84P2qJ7Q4k47J95J2j00K9
2457d5K10q8K9L1j26J65k23J92k7L1l1Q5J88Mj37K14l22N2j1q6j29M27m40L03
2481B66l45J07J90j35p2j23L42k42j60K2l1K89l43L9k86L90O30j076J65j79J36
2502d16N5P70p2n35K32J07n50L83J1n72L54J30J15p9q1o4k82j85J83k59O57o38
2524g36O61p63J121m87J35K00J2J99j90m10J49K33m96L28J5L86k37J94J65j41
2544C38k96l5j51P4J87k49q2R71j241J130p60k36J186o40m41N53k86j66j32J53
2564a23M00p95M36O2M31o61L65l23K6JP40j162L61k52j64J103m97l0Pk23J02l24
$$ plain form
2408 360 91 193 110 -74 -45 -137 -268 60 123 104 12 -48 -76 64 73 -238 -135 -211 -43 -193 -292 -408 -446 -227
2432 -227 -274 -237 -308 -302 -259 -102 -218 -225 -51 17 -304 -20 -282 -58 85 -99 -27 -35 -18 66 -181 14 26 -74 -45
2457 -45 165 77 106 137 11 176 -47 145 118 149 118 203 391 395 258 472 150 202 191 105 -24 403 -37 266
2481 266 -79 28 218 83 11 -112 230 -12 -172 -150 -181 108 -235 -196 -482 -92 538 -538 -373 -552 -416
2502 -416 -361 409 337 -198 34 141 -409 -26 -15 -587 -233 -103 12 -67 -148 -212 -494 -679 -496 -755 -98 -736
2524 -736 -75 -838 283 -204 -69 131 143 342 152 -258 -109 124 -372 -44 -29 357 120 314 479 338
2544 338 42 7 -144 -70 117 -132 -214 757 -484 646 -114 -350 836 196 -245 308 22 -144 -276 -123
2564 -123 277 -518 -82 -20 411 -250 115 -208 -182 -181 559 -603 -242 -494 -658 445 -52 -82 -75 -298 -196 -520
2586e20J99L24m04j47J61J81L29p65R63m58k98J148r57L17K51j81q56N34M66K50
2606E37q13R3k4N84m61n20M97l12L95m5L65K45o27q2p8J91OK28K26n71P17l6q
2629E07o61K42k15P28m98p62J025q01L69K41k14L97q43m0L21J77J40Q62o04n23
2649a52n18N31l45Q77j329K05J508p02R7l81j17J92q9m28J033o92k4M15l91J36
2669a74m2K76k4L3K80M41r48k16kN53r2N22n73J18L06r21L93o4J68J73k89M79
2691C97MO44j100J018j365k54O40L59l35k54k1P5m71M08J13L92L64n55m99L07
2711a33L89p9K33n90K7K58m08m45O10MR1n35L72J06j79M71n17k2J35K93r97L44
2733e72O63j005L84Q33o7o98L06K90n57p3K95P70p25n54L78J63p72J017K3M14
$$ plain form
2586 -520 -321 3 -401 -548 -387 -206 123 -642 321 -137 -435 713 -244 73 324 143 -713 -179 287 537
2606 537 -276 -183 -207 377 -84 -604 -107 -419 -24 -69 296 541 -86 -168 -246 -55 -49 179 405 -166 551 515 507
2629 507 -154 88 -127 601 103 -659 366 -435 -66 175 -39 358 -485 -525 -204 -27 113 975 371 -152
2649 -152 -670 -139 -484 393 -936 -731 777 75 172 -209 -326 -134 -223 -651 382 -310 -334 81 -310 -174
2669 -174 -216 60 36 69 349 790 -158 -374 -376 177 85 607 34 152 458 -463 -70 -134 34 207 -82 397
2691 397 401 1045 -55 963 -402 -656 -16 343 8 -246 -267 -192 -663 -255 -142 250 614 59 -440 -133
2711 -133 256 177 410 -180 -153 105 -303 -748 -138 -134 -43 -578 -206 -100 -279 192 -325 -347 -212 81 -916 -572
2733 -572 91 -914 -530 303 236 -462 -156 134 -423 -496 -201 569 -156 -710 -332 -169 -941 76 99 513
2753E13J16k34l82Q1P12o72K93l17K96k72k63j3J50J15m1L44K25k25m80K81l39
2774a12k00J24J33l62N10P9k11j79K07J92k74j21L06L48j64k30L16o80O6K28l60
2795c84J39L86q67J007o81O54j029J017p1l24k40J46l16Q62p90M67l87N7J0n78
2815i22N56j5J70K48Q3m61N18l16M10o41O7R0P9J83J00k34K3M33j70k47J72L1
2837A57p7o3j86J18J98J72l19o4m1r7L22L6L7k07K32Ol15J10L39k79J90j81J0
2860I8l0NJ1j94k1L59j72J3J17j22j90L8n3O1M5j90J11p4L6P6O8j55k59K92j13
2885b43K87o4j32j47K63k47J17K33J53l55K0J49l6l9p7K4m1J78J5J49j86j77K3
2908a33J5J81k01N18j61j59O7j08N9j01N5O9R9k0k12%K29n1J93Nj90p7q2j61J08
$$ plain form
2753 513 629 395 13 94 806 134 427 110 406 134 -129 -142 8 123 82 426 651 426 -54 227 -112
2774 -112 -312 -188 -55 -417 93 172 -39 -218 -11 181 -93 -214 92 440 276 46 362 -318 -252 -24 -384
2795 -384 -245 141 -726 281 -400 254 -775 242 171 -153 -393 -247 -563 299 -491 -24 -411 -354 -344 -922
2815 -922 -366 -381 -211 37 120 -341 177 -139 271 -370 -303 -213 -134 49 149 -85 -62 371 201 -46 126 157
2837 157 80 17 -169 -51 147 319 0 -64 -105 -202 120 156 193 -14 218 224 -91 19 358 79 269 88 98
2860 98 68 73 84 -110 -131 228 56 69 186 64 -126 -88 -141 -80 -35 -225 -114 -188 -152 -76 -8 -163 -422 -130 -243
2885 -243 44 -20 -152 -299 -36 -283 -166 67 220 -135 -115 34 -2 -41 -118 -94 -135 43 58 207 21 -156 -133
2908 -133 -118 63 -138 380 219 60 127 19 78 -23 32 101 200 180 -32 -32 197 146 339 344 154 77 -5 -166 -58
2933e8L52m69L15l2K06j61l22K27j42J19k77K99j89K66l35L11j21j40p6J81M3
2954cJ12k23M5k0J39j73l6j56J68o4K77l6j76P0J06j07J47n2j9K3Rq2O6J87k8
2979A74J38k44j64L2J41K56m29M0j5K26j46j53L66j39M8K21k64N3J66Nk83J69
3001A98l4j4J26J06l57m7K35j25J71l95K73q8j72L02j44m9K9m9m4q7J94j38M2
3024f7K17l30j62J45J67j91J7M2q6j02K37j36Q9R0L69n55J37j51J39r7J41R5Q2
3047I0J76j88P9n38L59k7o2J75K8P9j31l62N18j61J13j67k4j04k27K92k0L67k98
3070c3K05n0K35Rl66M30m99j06M95m35J19l96O80j64L7k04L95k24k9J1j23lj98
3093b14kJ13L84m6m31j5K03j10p2L9k18k79O9P54j91j78r0J42R3m53K29M70j37
$$ plain form
2933 -58 294 -175 140 108 314 153 -169 58 -84 35 -242 57 -132 134 -201 110 -11 -151 -227 -46 -3
2954 -3 109 -114 -69 -89 50 -123 -159 -315 -147 -211 66 30 -146 -76 30 -77 70 18 -1 22 31 -51 15 202 174
2979 174 312 68 -96 -64 77 333 -96 -56 -71 155 9 -144 222 83 131 352 88 141 307 312 29 198
3001 198 164 150 276 382 25 -22 213 88 259 -136 137 49 -123 179 35 -14 15 -34 -78 -165 29 -109 -67
3024 -67 150 -180 -342 -197 -30 -221 -204 -162 -248 -350 -113 -249 -160 -70 299 -256 -119 -270 -131 -228 -87 8 90
3047 90 266 78 157 -381 -22 -49 -111 64 92 171 40 -322 196 35 148 -19 -43 -147 -374 -82 -102 265 -33
3070 -33 172 122 357 366 0 430 -69 -175 320 -115 4 -392 288 124 161 -43 352 128 99 110 -13 -16 -214
3093 -214 -216 -103 281 235 -196 -211 -8 -118 -190 -151 -369 -648 -579 175 -16 -194 -284 -142 -49 -502 -273 197 60
3116F0M8k64J93m46M43M22m6l66M70n50M81m84k8M73k67p22M95N07Q0k1n99K86
3138A65j98R6o5J65j52L4L5J03j45J31N91L7l72m17L23J64q04k36N53j1K45k09
3160C3L1O8j66k06K46p33O53M86m18p27J109j97R01j268m03J036l56L45L5j236
3180g67N35O81n42K07o0q58J324j070Q70p61N84L13n24r8n59P50k28j5l49M34
3200a33k7R0L37m0L1l06J14j40M91n44L38j30j82L68k07j6OJ74J69k17J08j36
3222A48J12j14l08L17j14L22k27n4K0N4j35P4k2J03j58Q5j08J24j69j23K14m6
3244eJ82j74N0L4j73L6j05J48j94oJ47q1J79Lk07J19j21n3P8N3K45l33L04j59
3268c3k13M08k44q5K35k05m1K21q3P4kj46n5J45j32L49q2j53J07J22j00q9J81
$$ plain form
3116 60 108 -156 37 -409 34 456 410 44 514 -36 445 -39 -67 406 139 -583 -88 419 499 478 -121 165
3138 165 -33 63 -2 163 11 45 80 183 38 169 760 797 425 8 331 495 -309 -545 8 -3 242 33
3160 33 64 132 -34 -240 6 -727 -74 412 -6 -733 376 179 1080 -188 -591 445 89 434 469 -767
3180 -767 -232 449 -93 114 54 -804 520 -550 320 -441 143 456 -68 -166 -725 25 -203 -218 -567 -133
3200 -133 -160 -70 267 227 258 -48 66 -74 417 -127 211 81 -101 267 60 44 50 224 393 176 284 148
3222 148 260 146 -162 155 41 363 136 82 102 156 21 95 73 176 18 103 -5 119 -50 -173 41 -5
3244 -5 177 3 53 87 -86 -50 -155 -7 -201 -207 -60 -141 38 41 -166 -47 -168 -221 -143 -90 155 -178 126 -33
3268 -33 -246 162 -82 -167 68 -137 -178 43 -40 34 32 -114 -169 -24 -156 193 111 -42 65 187 87 -2 179
3291A79j06J33P7l78nJ39L7j33l5L5K04r3j60k2J99J26o4k8n7l8Q1q0p5O4j17
3316a17K38q9J6j68J45O9J54n67N85m62J26j60K07k07K37j25NJ99J63Q8l99K90
3338B28m63J20L66k17L3j75L52o25M85l75L01kK91j46j87M20o61J47NR3l06O0
3360b56N88j81K18l74J24l79M47j13L28l54k06J77k14J63L25m15j17l37J386r84
3380a74R5l02L58N93n50j39l7J46M60k87j77jl04N4M54l58N3m39N18k10J42m0
3402a45K7m7L43k4o92R10j29L13q17j25K75l6p9M42p49N50o27L91J46K74m99M62
3424A64p2j99n4J99K11J3j81p21M52P33n42N4L32r3q52K33L62p9M6M48p3m51Q29
3447G59l76J8k84N4k37q1J13l6j63J41J07q9M73o2k26P3k62k27J49M58m57j23
$$ plain form
3291 179 73 206 283 -95 -100 39 76 -57 -92 -57 147 54 -106 -128 71 197 133 105 48 10 91 11 -64 0 -117
3316 -117 121 32 48 -120 25 94 248 -319 266 -196 -70 -230 -23 -230 7 -118 -113 86 249 337 -62 228
3338 228 -235 -115 251 34 67 -108 244 -381 104 -271 30 28 319 173 -14 406 -255 -108 -103 -10 -316 -256
3360 -256 332 151 369 -5 119 -260 187 74 402 48 -158 19 -195 -32 293 -122 -239 -576 810 -174
3380 -174 -79 -381 -23 570 20 -119 -156 -10 450 163 -14 -15 -319 -265 189 -169 -116 -555 -37 -247 -105 -145
3402 -145 -118 -165 178 154 -538 372 243 556 -261 -386 -111 -147 -226 216 -533 17 -610 -219 -73 201 -298 164
3424 164 92 -107 -161 38 249 262 81 -640 -188 545 3 57 389 296 -556 -323 39 -40 6 454 381 -70 759
3447 759 383 401 117 171 -66 -147 -34 -70 -233 -92 15 -74 399 337 111 184 -78 -305 -156 302 -155 -278
3469b78P21n42k52M04o76O44qK91k50k77L34N6m34L33K31j10k06J9J41l43k0l24
3491e46P28p32j73J052n23P2N8j32k5Q0L68l8m52P6j03j77L46j31MM56j94j14
3513a00P48o48K26k06j13J31k10j31P72m87L98n51M23l04O3k8l19M55m18L72j25
3534e2k4r3J55K42j79K15j12j19k38K29j27k56k97O67j6J16k49J13J42l60K27
3555a6n1K73k65j4R0J21j64j23K41k27J57ql21K17K2J71k96Q8k02M11l48J91K73
3578B20k03r2J68J07k56j93N0M19q6j63M9J16n2J61k65K27Mk11O9J54j02j2j52
3601d3J10j87L18k84K33j89k2o9N18K7o38L08J53l53J87l27K37J47l84J46m3j13
3623b68K70l03K56j43L53k97mJ78J98m36J42j54J68J46n21L71O8R2q4j38r2N6
$$ plain form
3469 -278 443 -99 -351 53 -623 21 13 304 54 -223 111 167 -267 66 297 187 -19 0 141 -202 -222 -546
3491 -546 182 -550 -723 329 -194 -122 -64 -196 -221 -141 227 189 -263 -187 -290 -467 -121 -252 -248 208 14 -100
3513 -100 648 0 226 20 -93 38 -172 -303 469 -18 380 -171 252 -52 11 -17 -336 119 -299 73 -52
3534 -52 -76 -169 -14 228 49 264 152 33 -205 24 -103 -359 -656 11 -5 111 -138 -25 117 -243 -16
3555 -16 -67 206 -59 -73 17 138 -26 -149 92 -135 22 14 -307 -90 -68 103 -193 -105 -307 104 -244 -53 220
3578 220 17 -75 93 200 -56 -249 -199 220 134 -29 20 136 84 245 -20 207 211 0 69 223 121 109 -43
3601 -43 67 -120 198 -86 147 -42 -64 -133 385 412 -226 82 235 -118 69 -258 -21 126 -258 -112 -155 -268
3623 -268 2 -301 -45 -188 165 -132 -136 42 240 -196 -54 -208 -40 106 -415 -44 24 116 32 -106 -198 -142
3645a42j24P3K07K02l14q6j37n7O99o72J4M84k62N5J18J7k46K92j16K16j66L2
3667H7j14R4j78L40l24J77J7j74Rk20K63j05J58j89Q0J58m23K63p7Q4q3N41n27
3690a43O9o3Km87N28M2k04l4L29n6m03M94l12K11j54OJ61K25k78L9Q9mo9k3Q4
3715D9k9K28l19K43Q0j93q3l8K25J29l96L28J47k94M3L7J80k17j58K07k22J91
3737A38l34P7J55J4j4N1M4o5J73Kk00k72L54k8n6q5k5J57k5J07l54Q2J10j30K26
3762A02k98K09Q4k29J15Q5rO0j40L0N6l9k07J68J98k67r1J57l2J2k3L4k00L6L35
3787A46m17J05K03K8Nj99K23r0j78Q1J96k90K11p2K08j72j05K76%r5l1p5o5K35
3811A28q6L7P5q3M3l7J9k51K94l55Q3K18n6P8j72J06O2j05J57J57l95J07Nqj44
$$ plain form
3645 -142 -266 -193 14 216 -98 -184 -321 -378 321 -351 -337 147 -115 -60 58 75 -171 121 5 221 55 87
3667 87 -27 67 -111 229 -95 82 99 -75 -66 -286 -23 -128 30 -159 -79 79 -344 -81 -158 -74 -157 384 -143
3690 -143 -74 -137 -135 -622 -94 -52 -256 -290 39 -17 -420 74 -238 -27 -181 -175 -14 211 -67 -28 61 57 -12 -35 49
3715 49 20 248 -71 172 252 59 -24 -62 163 292 -104 224 371 77 120 157 337 120 -38 169 -53 138
3737 138 -196 -119 36 50 36 87 131 66 239 241 41 -231 123 95 39 -46 -71 86 61 168 -186 -104 6 -124 102
3762 102 -196 13 97 -132 -17 68 59 119 -21 9 65 26 -181 -13 185 -82 -173 -16 -48 -36 -59 -25 -225 -189 146
3787 146 -271 -166 37 65 70 -129 94 4 -174 -93 103 -187 24 -48 160 -12 -117 159 159 64 33 -42 -107 128
3811 128 42 79 154 71 114 77 96 -155 139 -216 -133 85 29 107 -65 41 103 -2 155 312 -83 24 29 21 -123
3836a23N4P4k9j8l07L22K89l5n69pL54j6L55q27Q2N33M2j42k56Q2J19M9o6J06
3860F6P5k43P7k25k7J48L6K69m72J59J44k7n2r0N8J96nJ03J59n31L49J21k80J42
3884A50k50J56l14J84J04k9K22k10n62N34K85k32N6p3nj76J22j23J71j3l35P50
3906D12j49j63q5l16J0J084q59k01J90j21K44L23p46L76K52m69J3N89l90J29o00
3927d77L89L08r8J58l52O01r24J03M8P2L16N9J01j80j2k54K46j48N13l86M58m60
3949H1p5K38oN0n35M50K31p05Q64j024M74l41M73l17J21j48M01J69j42m51J27
3970f5L77m0p56N05l71M09K14k58nK93j85J5l24L30J16o16N37k19q8M68k27J0
3992A20m50K89q3l4O05o8j29j20M8p5l19P9M3K44k41j97N21n92R60p57j03J52
$$ plain form
3836 -123 -69 5 -24 -42 -349 -27 262 227 -342 -349 5 -11 344 -483 -401 132 174 32 -224 -142 -23 26 -40 66
3860 66 141 -102 -25 -250 -277 -129 -93 176 -296 -137 7 -20 -72 -162 -104 92 87 190 349 -182 167 288 8 150
3884 150 -100 56 -258 -74 30 1 223 13 -549 -15 270 38 94 21 16 -160 -38 -161 10 -3 -338 412
3906 412 263 100 15 -301 -291 793 -66 -267 -77 -198 46 369 -377 -1 251 -218 -205 384 -6 123 -477
3927 -477 -88 220 122 280 -72 529 -395 -292 -244 -172 144 203 304 124 112 -142 104 -44 469 83 541 81
3949 81 6 244 238 288 -247 203 434 -271 593 -431 43 -298 175 -142 -21 -169 232 401 259 -192 -65
3970 -65 312 272 -484 21 -350 59 273 15 10 303 118 133 -191 139 255 -361 176 -43 -131 337 110 120
3992 120 -330 -41 -124 -158 447 379 250 130 178 103 -216 -137 -94 150 -91 -288 233 -359 601 -156 -259 -107
4014a07q6M45n02L37l07L69J7m27M5L55j66m67P24J1l16K64n62P44q25M69j90
4035a75K41K95m98L56P6m59L93k19o70N62O2J64k60K61J47m46j98L66m1m39R05
4056D23K22n46l02N9N0L12m48k96K73JL54M10k56m13k54O90n26L99p08R08m0l90
4078g8l51M53q91P97O1j31k14l84N66J01L09j59P8k71K15m4J08m13j01N83m25
4099a91j38O89N5m94J68J25j73p73L07L50l82K20Q4K10k87l6P91o19L86k93O2
4120F1r9L3j39M44j99r6J16P6M13n69k43p7J85N3j73l69Q34%m92j3m72N42L14
4143A30o12P58n98K7M05N0J60m90R4j19j26M02J82l39O7o2J25q4j26J41J6J6M09
4166D26m70l09L84k27K29J70l93J58K92K43k39l95N2l28L20J75m3O93p93Mq8M5
$$ plain form
4014 -107 -193 252 -250 87 -220 149 166 -261 -216 139 -27 -494 230 241 -75 189 -373 371 -454 15 -175
4035 -175 66 361 -137 219 295 -164 229 10 -660 -98 -36 128 -132 129 276 -170 -368 -2 -43 -482 423
4056 423 645 99 -203 -144 -94 218 -230 -526 -253 -252 102 512 256 -157 -411 279 -247 152 -556 352 312 -78
4078 -78 -429 24 -867 -70 -9 -140 -354 -738 -172 -71 238 79 157 -114 101 57 165 -248 -349 234 -191
4099 -191 -329 360 415 -79 89 214 41 -732 -425 -75 -457 -237 -153 57 -230 -266 525 -94 292 -1 61
4120 61 -38 -5 -144 300 101 5 121 197 610 41 -202 -279 -94 -41 -214 -583 251 251 -241 -254 -726 -184 130
4143 130 -482 276 -322 -295 110 160 320 -170 -76 -195 -321 81 263 -76 -9 -71 54 -30 -156 -15 1 17 426
4166 426 -44 -353 31 -196 33 203 -190 -32 260 503 264 -131 -79 -407 -87 88 45 738 -55 -51 -139 -94
4188i4k60M4M11k3j48J54K65q9K78p46L94K56q47M83m44P98q58P73N5p09N99k62
4210C0J78n05m88O45m19L98k60L78J94n79J89M11J97o54J86m8K62j57k32L55q5
4231dj0M4k69K65o04O36o86N58L37j39q77J502m66p88P55o21L06m31K86K13Q1
4252H8J99j051J006n14R46o94k33R76j051J84J27M4p30J044k07m90k22M1M92n15
4272e60N52k60n44J572m37m55j20k83O57K55j6l39r99J404n52j48K71J36l92K44
4292a4L6n30K97J58l62N06j22O7q52P96K50n29N71q94L04N73L96k65m41R7M45
4313D87r06Q61j642J782r03L15R46o50j027J075p50m92N80P85q15R36m23o8j79
4332h8m78N25q26M10K45K94m81M72l02J14J4k20j01j70Q65l94k94Q80j003N75
$$ plain form
4188 -94 -354 -310 101 78 -70 84 349 260 538 -208 186 442 -405 78 -366 432 -426 347 402 -307 292 30
4210 30 208 -297 -785 -140 -559 -161 -421 -43 151 -428 -239 172 369 -285 -99 -147 115 -42 -274 81 -4
4231 -4 -14 30 -239 26 -578 58 -628 -70 267 128 -749 753 287 -501 254 -367 -61 -492 -206 7 88
4252 88 287 -764 242 -272 674 -20 -253 723 -328 -144 -17 27 -703 341 134 -356 -578 -537 -45 -560
4272 -560 -8 -268 -812 760 323 -132 -252 -535 122 377 361 22 -977 427 -125 -273 -2 134 -258 -14
4292 -14 22 -508 -211 -53 -415 91 -31 36 -816 -20 230 -299 272 -622 -318 255 651 386 -55 42 487
4313 487 -419 442 -1200 582 -321 -6 940 290 -737 338 -412 -904 -324 461 -354 582 159 91 -88
4332 -88 -566 -41 -867 -457 -212 82 -399 73 -229 -115 -101 -321 -422 -592 273 -121 -415 465 -538 37
4352C7J90m13L15j61n29R17R5o84j49J38K33l74M97p8j58l9J54N18o97k5K06k76
4374b83N5j46K16QJJ85j45J27K04j55r1q8K87k20J50j21J58m1l51K63k3k39j38
4397c87N86j47o7j4kj54J21k8K11j83J96k92J2K59k34KJ71%l1L08k07j60j47L27
4421A40j58R4j68J2n1J61j43k45M50J06q8j57j21j0K16J51l04N2JO8j86M8J32
4444@q9K9J42k10J48k13K33k59K85L6p1K7P9l48K17J9J48j96k32M01J17l59J05
4467IK18j08j91j15j20N0L56J63J09j26l83k07j5Q92n00N3L11j44j96J35k20k18
4489b47m9J03K25Q30n69m43JK91j65m01P81j070R88l40k45R0j97j13O01k51L22
4510A42q00O96L35l69k1J5l13M46m95KL24K50j67l77r9L89N4j31M39q07N67l22
$$ plain form
4352 37 227 -186 129 -32 -561 356 451 -233 -382 -244 -11 -385 112 34 -124 -163 -9 509 -188 -213 -7 -283
4374 -283 -228 -374 -158 -150 -149 36 -109 18 222 67 -24 -112 175 -45 105 -16 142 101 -250 13 -10 -249 -387
4397 -387 199 52 -15 -29 -31 -185 -64 -92 119 -64 132 -160 -148 111 -123 -121 50 50 19 327 120 -40 -187 140
4421 140 -18 76 -92 -80 -131 30 -113 -358 92 198 110 -47 -168 -178 38 189 -115 -63 -62 6 -180 -132 0
4444 0 -89 -60 82 -128 20 -193 40 -219 66 102 31 58 137 -211 6 25 173 -23 -255 146 263 -96 9
4467 9 227 119 -72 -187 -307 -257 99 262 371 245 -138 -345 -360 532 32 85 396 252 56 191 -29 -247
4489 -247 -296 -193 32 862 293 -150 -149 142 -23 -424 357 -713 275 -65 -310 -220 -417 -530 71 -180 142
4510 142 -658 38 373 4 -17 -2 -315 131 -364 -362 -38 212 45 -332 -431 -42 12 -119 320 -487 80 -242
4532b42Q7q5k5J13Q6n3K58P0m8l49M04k86j3RJ42l95j21N40j65O9j11K87k65O87
4556E94m43p8L0j56J03l4j44N76n20J32J47m42M37lk53k1J34p1J19q1j03J87j32
4579b2L6K20j40K38k93J76p7j95N0J83j28j18M5J8kK77l32l76M91m01O03m36M51
4602B68m04j47J86l1j9j75L07n2P5J23j25N08l59M35p27k19N85k08J5M77j82p99
4624d68L15k81p4J73K47J32l2M5l50m69J452r90L42o8j25j06O42n67j94L35J65
4645A24J17l32j26o3J01M20k89K20j84J82O9k73k1k62M00on88Q61r84J55Q10q13
4667d82J13M95l05m4P49o27l33M12l15Q44p38J20p84N37K85j34Q7o27O14J15J171
4688A153j341Q82M19j470M72L98m15O95m21n06j52M30M03k68n56L01j7L22j019
$$ plain form
4532 -242 -155 -240 -265 -152 -66 -119 139 209 161 -188 216 -70 -83 -74 68 -327 -448 92 -73 -4 -115 172 -93 594
4556 594 151 73 103 -53 50 16 -128 448 -72 60 207 -235 202 199 -54 -75 59 -12 107 26 -77 110 -22
4579 -22 14 234 94 332 39 215 138 -57 -7 176 48 -70 -25 -7 -9 268 -64 -440 51 -350 253 -183 268
4602 268 -136 -283 -97 -128 -147 -322 -15 -67 8 131 6 514 155 590 -137 -356 229 21 36 513 331 -468
4624 -468 -153 -434 -508 -335 -88 44 12 57 -293 -762 690 -300 42 -26 -151 -257 385 -182 -376 -41 124
4645 124 241 -91 -217 -280 -179 241 -48 172 -12 170 239 -34 -55 -317 83 77 -511 350 -634 -479 331 -482
4667 -482 -369 126 -179 -223 526 -101 -434 -22 -337 507 -231 -111 -895 -358 -73 -207 -120 -747 -133 -18 1153
4688 1153 -188 694 1113 -357 115 513 98 793 372 -134 -286 144 547 279 -277 24 7 329 -690
4707f90P87N1M12m87l51M95k56k88M90k35J60r51K11N50O67n63J7K5J73o41M18
4728fL16p21L74K7L59m78j53N30J76m40K86k07p7J10k84j62L92m41O10k77l0J38
4750D2l7R1J85j7k23k21O36k89k88R9L93l6o02O91l42K67m90K20j23M51r82N02
4772g3l18J84P97k50j035L85M45N58j189O69k93K1N45K4l14m30K67l33j74M55
4792e9O65n65l31Q88j024J94L12O8J32J87j348O71j05o8K66J012r21P72o33p2
4812D1l33K07kl19N98k28r8j52q33J312P55j639N89J47k07m43P62M8m44O12J19
4833D92n79r7j68p5K82P7R39o61k48k93O55l11L24j229J187l25K49l33j80P28
4853D34j70M14M5p79k72N60L01j35q49K49P8K54o48P00K59n80j53N97m79L28J72
$$ plain form
4707 -690 97 148 560 73 -278 217 -39 -327 163 -72 88 -863 -652 -102 565 2 19 44 217 -424 -6
4728 -6 310 -411 -37 -10 349 -129 -282 248 424 -16 270 63 -14 96 -188 -350 42 -399 211 -66 -96 42
4750 42 5 96 281 264 41 -180 456 167 -121 -22 371 335 -267 424 82 349 -141 79 -44 407 -575 -73
4772 -73 -391 -207 590 340 -695 -310 135 693 -496 173 -120 -99 446 470 156 -274 -7 -340 -514 -59
4792 -59 606 41 -290 598 -426 -232 80 148 280 467 -881 -210 -315 -383 -117 895 -26 746 113 41
4812 41 -292 -85 -87 -406 192 -36 -134 -286 -1119 193 948 -691 -102 45 -162 -605 157 205 -239 373 492
4833 492 -87 -184 -352 -427 -145 -68 871 210 -38 -331 324 13 337 -892 295 -30 219 -114 -294 434
4853 434 264 678 723 -56 -328 232 533 398 -451 -202 -124 130 -518 182 441 -139 -292 305 -174 154 326
4874C26J5j52Q2o78L88M9J30j55J47k61K04n9M0n3L2J6k11j31M47k98J87q9o1
4897h5L91k33M3m2K2M8K71l73j80L09n2n7M9mq6J15j36K30J4m04K10mJ2j39L68
4922B87j55o7o5r6J47J70k82L41m25M7r5J60P1K05q2j1J4j86k7OJ75l32K50j54
4946a04R1J88l15L44k50j53L51k76l5K20P9p6j65k3K10M0J5j33j71K68k21J06
4968a0n4r3J67M3J95n66L06k9P8k2N0k54J69OJ68l9m64J91J65j01L3m4J50J55
4992B00l56o6K95j95K37N7k1j9P9k07M2L7p2L00k09K9k91K50J7j20o8N4N5O7p0
5017B5j32L1J79j8k2l31L24P9j68n3P7J42k53K18m8j08J63j28k9j0RJ82k36o9
5041a76Q5O4J78o9l35K52n1l3K22j75R6O0l86J01J65J3J9j06k5K95m16L05j75
$$ plain form
4874 326 341 189 271 -407 -19 30 160 5 152 -109 95 36 76 23 55 71 -140 -271 176 -122 65 -24 -85
4897 -85 306 73 116 74 96 144 415 42 -138 171 119 62 111 107 21 136 0 230 244 -160 50 46 58 -81 287
4922 287 132 65 0 -96 51 221 -61 280 -145 -98 -193 -33 38 243 161 150 164 -22 -49 -43 132 -200 50 -104
4946 -104 -13 175 -140 204 -46 -199 152 -124 -159 61 140 64 -101 -124 86 126 141 8 -163 105 -116 -10
4968 -10 -64 -157 10 53 248 -318 -12 -41 37 15 65 -189 -20 -14 154 115 -349 -158 7 -94 -61 -105 45 200
4992 200 -156 -222 73 -122 115 172 151 132 211 4 46 83 11 311 102 131 -160 90 107 -13 -81 -27 28 95 25
5017 25 -107 -76 103 85 63 -268 56 135 -33 -86 -9 133 -120 98 50 -58 105 -23 -52 -62 -53 129 -107 -176
5041 -176 -91 -27 151 82 -253 -1 -52 -85 137 -38 58 118 -268 -167 -2 11 30 -76 -101 194 -222 83 -92
5064i2J95p5j20L1K3L8j16O1oO2N7j77N0P6K0l4Q0J84j16j82R1M7r2J80rj37N3
5091I2p4j55J96J37l75J45j47K55PM1q8p4K35j00p7J41r2pJ6Kk08K40o2j21j18
5116a91J60K09k48L2j0o2Q6P7k18L46K5k34J09J83k48J1j41K40n1p9j06j0J75
5139E5k26k3N93n52k14K87j77J51J96j06k17N57n3L2n27P95k95l33L4K58l45K98
5161A88l5m66M15L09o91J48K10k5M08r91L85l59J085n95l09N16L1M0k37N38m53
5182A12j74M66n50P7N0j1j15j92J84M37r4K61m77l87J011r22Q10j18j257n8P71
5203a76J96l10L22K62p99J11O54k87L08q95J031J53p63N7L14n07M06o08m98Q82
5223a47Q32p31R1O09o58Q19j204m2p5Q60o91j05L25M02k62m36K80N28m15k63l13
$$ plain form
5064 -92 103 28 -92 -61 -38 0 -116 -55 -61 1 58 -119 -69 7 27 -7 73 257 141 -41 50 97 5 185 176 39 92
5091 92 18 -137 59 196 -179 -34 -181 74 81 122 34 -40 195 95 18 159 67 60 76 78 -130 110 48 -73 -191
5116 -191 -31 178 -70 -38 -48 -110 -24 53 -165 181 206 -28 81 264 16 27 -114 126 75 -4 -110 -120 55
5139 55 -171 -194 399 -153 -367 -80 -257 -106 90 -16 -233 324 271 303 -224 571 276 -57 -23 235 -110 188
5161 188 153 -313 102 411 -280 -132 78 53 461 -530 -145 -504 581 -14 -323 193 224 264 27 565 112
5182 112 -62 404 -146 -69 -19 -30 -145 -337 -153 284 190 451 -26 -413 598 -324 486 368 -889 -947 -176
5203 -176 20 -290 32 294 -505 -394 260 -27 281 -614 417 570 -193 -136 178 -329 77 -531 -1029 -147
5223 -147 685 -46 45 654 -4 815 -389 -431 -506 354 -337 -442 -117 285 23 -413 -133 395 -20 -283 -596
5244e96P2M71L43o55N09k85J24p97O96j16j99Q14p46J57j41O03n8p6n30N4K85
5265g1j82L11j25j14l48P48L7K6j28j28J33l61N51m06k57O6P0J53l52J68L31j47
5287b5j75L71m56%N53l04j00M83k59m29K37K73j93J61m34K92j43J03j48J94j02
5308a01J9K4K35m98M44Q4q3j15l0n1P7p5L6M8k03K96o0J7j10j31o2L90k8k88K94
5333A29j11k12K54j34N9o4J20j09Q1p2m8J87Q9k04o1J10k28J71M5J83mj03j85
5356a07K00pj59m4K12j24J64j63O8k1J08j59L2J15j41O5Jk19K11j48K11J47n6
5379A86R4j10k3k14pM7N3Q5j02k38K18K09j41K2k13J04n6J40j95J97r1r9N0K58
5403A74J0k07K10mk65J15R0j37o4M6k66L72m7L5n58P62j93j56k47M32j65j22O2
$$ plain form
5244 -596 -524 -53 290 -365 144 -141 -17 -814 -118 -234 -433 381 -365 -208 -349 254 196 120 -410 -356 -71
5265 -71 -253 58 -67 -181 -529 219 256 282 154 26 159 -202 349 -57 -314 -248 -178 -25 -377 -209 122 -25
5287 -25 -200 171 -285 -285 268 -36 -136 347 88 -341 -104 169 -24 137 -297 -5 -148 -45 -193 1 -101
5308 -101 -82 -58 177 -321 123 207 124 9 -21 -72 5 -70 -34 14 -189 107 47 64 -46 -177 -239 151 123 -165 129
5333 129 18 -194 60 -74 -15 -79 41 -68 13 -59 -107 80 169 -35 -96 14 -214 -43 2 185 181 78 -107
5356 -107 93 86 -73 -117 95 -29 135 -28 40 19 127 -32 0 115 -26 39 40 -179 32 -116 95 242 186
5379 186 280 170 147 -67 -74 -27 26 111 9 -229 -11 198 57 79 -134 -30 -86 54 -141 56 -35 -134 -84 174
5403 174 184 -23 187 183 -82 33 123 -14 -78 -32 -298 74 27 62 -496 266 73 -83 -330 102 -63 -185 -123
5426a23J44K89l62L17m16J92M5p8J24L03r3m14j28L89l1K3q3m0j60J33l3J26j20
5449Dk04M4K98k92ON2Q4J67j27p4j25j24J36K94r3q7l0L5L61m51J51k24J49j81
5473b31M03jJ00l59j47M82k53J64o4J49k64J52l50L41l2R9l76K60k30Q5J51Rm6
5496D2j75K23m21L49j9L00m22L24o0j33J81l3l22pJ95j34K03N7k58M16k89j14
5518i7P3m11L42R2M1M0K44m56L67l48J77Jj89M3K66l25K40l82L97oj99j15L23
5541A18j68M3J56l3m0K1k50J41k3p9k46K84K48j43N6k36R3L14o8n8R8l32J58j07
5565e3j56K67jJ37j02j90J11K22l00j25o0L42J86m01R1O1j45k3O1K36o5j90k8
5588a25k20L2J55J51J54l62J63N17k84j75l5J14l4r4O9L8N3N5k14j4J38j22pJ19
$$ plain form
5426 -123 21 310 -52 265 -151 41 86 8 132 435 342 -72 -200 189 158 181 98 58 -102 31 -2 124 4
5449 4 -200 -156 142 -150 -144 -92 -8 159 32 -42 -167 -291 -155 139 46 -41 -71 -36 325 -126 25 -199 -50 -231
5473 -231 172 171 271 -88 -235 247 -6 158 94 243 -21 131 -219 122 90 189 -187 73 -157 -72 79 88 42
5496 42 -133 90 -331 18 -1 299 -123 201 141 8 189 156 -166 -173 22 -112 91 148 -110 306 17 -97
5518 -97 -24 -435 -93 -1 40 80 324 -132 235 -113 64 65 -124 -81 185 -140 100 -282 115 109 -90 -205 118
5541 118 -50 -7 149 116 76 97 -153 -12 -35 -114 -360 -76 172 29 85 -151 -58 256 188 130 228 -104 54 -53
5565 -53 -209 58 57 194 92 -98 13 235 -65 -190 -250 92 278 -123 -32 29 -116 -139 -78 158 93 -97 -125
5588 -125 -345 -313 -158 -7 147 -215 -52 465 181 6 -29 85 51 -43 26 64 117 172 -42 -56 82 -40 -47 72
5612G2K7k31L23L1n6j43j06n3L04l5J50l03P0J48m81M54j11J05L84l59L2n43j1
5635c32L13J2p3N3M2l25N08j48j82J85m01L45j7K58j94K56o6L8j58o98O25k98
5657b57N79m26O7O06m50rN76r49M83o33O12k20k92P21r13N85j87K03n38K76K05
5678C9K07k39N5J50j01j25j16K49p1N6L2l15r3K65J43K15m20r1O0K94k7l82L4
5701a81J46j62J05J01J7J01k33m9P9l0K38j22j36K4R3k07L87l8k30J46k2m0j40
5724a53L10l15K23l1L0n4k9N7o6j12J6q8J83p2n4K13j26n8J71Q1j25k2K1k38K60
5749B2k9K0L4j24L7j33K36o3J63k58j25M44j66k1rQ9j0P7j06Nk31J75J6k07%Q6
5775g8M7k40M54j59l1p8q9L66k10J89l2k92M70k65%k80M95k98j80K49j25m9r7
$$ plain form
5612 72 99 -132 191 222 166 23 -83 -136 168 133 283 -20 50 198 -283 171 60 165 549 190 222 -321 -332
5635 -332 -19 -7 -80 -27 15 -310 198 50 -132 53 -348 -3 -20 238 44 300 234 272 114 -584 41 -257
5657 -257 322 -104 -37 569 119 110 686 -263 220 -413 199 -21 -313 408 -505 80 -107 96 -442 -166 39
5678 39 246 7 62 212 111 -14 -130 119 48 104 136 -179 -272 -7 136 351 -69 -160 -100 194 167 -215 -181
5701 -181 -35 -197 -92 9 26 127 -106 -155 -76 -106 132 10 -126 -102 -9 -216 171 133 -97 49 27 -13 -153
5724 -153 157 -158 65 34 64 10 -19 38 -28 -140 -124 -212 -29 -101 -155 58 -68 -126 45 126 1 -21 0 -238 22
5749 22 -7 13 47 -77 -40 -173 63 0 163 -95 -220 224 58 37 28 117 107 184 78 83 -148 27 43 -164 -164 -78
5775 -78 -31 -271 183 24 -7 -85 -174 192 -18 171 139 -153 317 52 52 -228 267 -31 -211 38 -87 -136 -233
5798b33M41m01j2J26m24M28l25L71J28k47L91l73K66J36l34O29o80p0k01M93p8
5819C1l6K04k48O40o60Q4K11k58R3J3M0p0j82K51l24J17K97j48j08J95l35N43
5841C50n43J85q6K24m54M05j44J88Q0j24k40N48n24J82R36j138K78l20n45M50
5861b92J028n03K23M02op37r6l08k21O86Kq66O89m6m66P60l50k98N37n32K99K67
5883A72j28M9j24j10J25L0j2l7K55k14l46M89m73M06j14N6j05P5j58K17J0K0j96
5906a13J45j5l12L74p1j96L55j04k10L66k10or3M02n27L74j05r9R2j39L4k4K2
5929f0J35j7k98L16k35N8J62L4j76j1n0R7J08M7q4j85J41k1j5j29K41J74j72n0
5953A0K10j77p0j60J55P5k6n9k15J43p6K19j72K64r8nk3j29L4L12j97p2J27q7
$$ plain form
5798 -233 208 -193 -205 -79 -503 -75 -400 -29 99 -148 243 -130 136 272 -62 567 -113 -183 -384 109 31
5819 31 -5 199 -49 591 -69 15 226 -32 61 74 114 44 -138 113 -211 -94 203 55 -53 142 -193 350
5841 350 -193 -8 -94 130 -324 81 -63 125 205 81 -159 389 -135 47 983 -155 123 -197 -742 -292
5861 -292 736 233 456 858 852 115 19 -289 -510 176 178 -688 1 -45 -511 249 -101 -399 138 -394 -95 172
5883 172 44 93 -31 -141 -16 14 2 -35 220 6 -340 149 -324 82 -32 24 -81 -6 -164 53 63 83 -113
5906 -113 32 17 -295 79 8 -188 167 63 -147 219 9 3 -90 312 -215 159 54 -45 47 -92 -58 -82 -60
5929 -60 75 58 -240 76 -159 -101 61 95 -81 -92 -142 -45 63 110 26 -159 -18 -39 -54 -183 58 232 60 10
5953 10 220 43 -27 -187 -32 43 17 -42 -257 -114 -190 29 -143 121 23 18 -5 -134 -100 212 15 -57 70 -17
5977a7j55J60R7pk88J53l8J45r7l1P7j16Q5K7J29k77K14k4J4q1K8Q9K0j39J16
6002H4j51m0R5N9j04p5J39m1j06L61k32J19k25L52l09nk4J21J66K9k37j90J97
6025a7q9m2K63J73k21J28j36p1o3LJ59Q1j06j70j26J56j22M00k44j78R9P2J7j89
6049b23J80J03j22N2J68j60J40k58M8K52k61L08j66j96J82j79O1j97L69J3J53
6070B67k76n6J35j05l6q4K00P7j16Qj11j56o97R43m52N76j23O96j241N36P4p5
6092a6k31n1P88o17J28j77Q3N2k7k24N30o38L00k2K77qr6P7L77r37O98l19J7J39
6116A03n3Q2q5k9J96j77n5m4r1K86k95K05Rk19J99P1q7k22J01N0J04k7O0k31J30
6141a9P1l24L78n6j9k55K35k24J8J57R7j90Q4q5N2K31r7M0lr7j30K39k59N5p6
$$ plain form
5977 -17 -172 -12 85 78 -210 -57 -95 50 -47 -78 -1 -117 -32 -5 124 -153 61 37 51 -30 -2 87 107 -32 84
6002 84 -67 -107 -12 47 -57 -132 7 -34 -140 221 -11 108 -117 235 -74 -79 -103 18 184 213 -24 -214 -17
6025 -17 -106 -148 115 288 67 195 59 -12 -75 -72 87 168 62 -108 -234 -78 -200 200 -44 -222 -123 -51 -34 -223
6049 -223 -43 60 -62 -10 158 -2 138 -120 -72 180 -81 227 61 -135 47 -132 -71 -268 101 114 267
6070 267 -9 -65 70 -35 -71 -155 45 122 6 14 -97 -253 -950 -7 -459 117 -6 690 -551 -15 59 -16
6092 -16 -247 -298 490 -127 1 -176 -93 -41 -68 -292 238 -400 -100 -122 155 147 51 128 505 -432 266 -53 -36 103
6116 103 50 132 47 18 214 37 -18 -62 -153 133 -162 43 52 -167 32 103 16 -206 -105 -55 49 22 82 -149 -19
6141 -19 52 -272 106 50 31 -224 11 -213 -195 -38 59 -131 -47 -132 -80 151 54 94 91 -6 -136 103 -156 -101 -177
6166a77J05L72n27K65J90k81J19k03J42Q3j66M9n3J34Q8k83J34m8L7r2J08r6K12
6189A12p0k23L96R4k89n0j76P0M09n51L46J0m4j0j83J56l95J06M08j90K87L31
6211E44p3j09j1o59L10M66m61K0K3J15K2l04nJ96j48K29k94J02j79J98Q5J09k79
6234a03p0K54k16K32j17J38M8j42J36k87j85L96K5k70J97j80K22p9j32J66k59
6255b26P4K32j83J42J43o1j45P0J49r5k85L95j06n2k0L13n68J85K43lJ37o60P1
6278b50K18P0N3k46j4M95L9j8n02j47N6l15J111l30M82p15l24J14J91m4j3P72
6300F83p48J12R8l01M83q07O90n74N23j027J043M8j90L31L0M83r73J71o5n38J59
6321c69J25j62P83j59j37l44M52o09M55K4l77N46k03K33j49l1K15K21o22K74K19
$$ plain form
6166 -177 -72 300 -227 38 228 -53 66 -137 5 88 -78 -29 -82 52 140 -143 -9 -57 -20 -112 -4 -100 112
6189 112 42 -181 215 309 20 -30 -206 -136 273 -278 68 78 34 24 -159 -3 -398 -292 116 -74 213 544
6211 544 471 362 351 -308 2 468 7 27 50 165 187 -117 -122 74 -74 155 -139 -37 -216 -18 67 176 -103
6234 -103 -173 81 -135 97 -20 118 166 24 160 -127 -312 84 109 -161 36 -144 78 -1 -133 33 -226
6255 -226 -152 80 -103 39 182 121 -24 46 195 100 -185 210 104 52 32 345 -223 -38 205 202 339 -321 -250
6278 -250 -32 38 91 -155 -169 326 365 347 -155 -302 -246 -561 550 220 702 -13 -337 -223 -32 -76 -89 683
6300 683 -65 47 145 -156 327 -480 210 -364 159 -868 175 223 33 364 394 877 -96 75 10 -528 -369
6321 -369 -244 -406 377 218 81 -263 189 -420 35 59 -318 228 25 258 109 78 293 514 -108 166 385
6342C85m0j180R42P2l07P39r39J2K62q2l7j59K29R5j95P22r42L70l1L1M6M17j95
6365B15M26o07m0N16k98q17P47o12J77l39J625q33k22M63l83o62M91k6N61j64
6385B18j96K98l50k08O6l96O39j25K26j77J07O3k61L66p9m78K56J80o8r7k12M54
6407B26k5O0l29LPM6K61k54j93J70N44k83j49j66M2J42j06n5j09L60k05l05K26
6430i2R8j7o4N4L7m5R4o1m7L4q3K1J71K10k97J43N5n36J73q6L01j89j63Q25q47
6455c11K09M77j115J026o2L80k75q27M75L2K66l72N39r2j60m55L76j35J14k80
6475a90j28J81l39N09R5k32Q7j40j0K20l0J88l26K98k99L70m47J82k04K20L34
6496C39k74j23N10m3j027Q72p76J080o5m37j57K19Q1k59L64l73p7J27Q5Rj38M1
$$ plain form
6342 385 345 -835 107 179 -128 611 -328 -316 -54 -136 -173 -332 -103 -8 -203 519 -423 -53 -84 -53 -7 410 215
6365 215 641 34 -6 510 212 -605 142 -470 -293 -632 993 160 -62 401 18 -644 -153 -179 382 218
6385 218 22 320 -30 -238 -172 -568 71 -54 172 -5 102 165 -96 270 191 -287 -31 149 81 -16 -228 226
6407 226 201 261 -68 -65 -58 -12 249 -5 -198 -28 516 233 84 -82 -40 102 -4 -59 -168 192 -13 -318 -92
6430 -92 6 -11 -75 -21 16 -29 65 4 -43 -9 -92 -71 100 310 13 156 211 -325 -152 -238 63 -126 -289 536 -311
6455 -311 -102 375 -740 286 224 604 329 -498 -23 9 275 -97 442 350 190 -265 111 -24 90 -190
6475 -190 -318 -137 -476 33 128 -104 -17 -157 -167 53 23 211 -115 183 -116 254 -193 -11 -215 5 339
6496 339 65 -58 452 409 -618 254 -522 558 493 56 -101 118 199 -60 304 -69 -146 -19 66 75 -63 -22
6518b2N0r0L11p3j5J93o02M38m09Q2K43K37l28P8j99j4R5L20l90L41l18J36Q6
6541A50N3l93L22K05o15K69Pl17Q75o45L47j82K18q4J50l74j36M5m36J46M52K72
6563C29n96o8K95J43o09Q18k10j55M3M20m2j73l8j89K06N1k39m25j09J016l16
6584A52o77N66q89J094N22n97m38N6K42j05p0j43L98L03k07L6l36K4O8N6l6j06
6606h7K37j93n9K45J02l47N7l3J6o3J23J21j94m5K30j81J70q4k7K04k00j01K7
6629h2J41m55L82K07j86K53k37l83L91K85K01o13Q0N8J71k45j25J92M16p98J40
6650b07L67k18L26m4j75l2k02O66m91N7J1k42K23J80N7%K31p16P02l49J13k24
6672C3M05n6O3q31L10oK08m18M00j91M66j9j93M7m45L34L81J0p50M0M26q2K55
$$ plain form
6518 -22 28 -62 249 176 161 354 -248 190 -219 -137 106 343 15 93 -106 -120 -25 295 -95 246 -72 64 150
6541 150 203 -190 132 337 -278 -9 -2 -319 556 -89 258 76 294 210 360 -14 -150 -105 -541 -395 57 329
6563 329 -267 -335 -40 103 -506 312 102 -53 -10 410 368 195 157 -32 174 225 -14 -439 -548 468 152
6584 152 -525 41 -848 246 768 171 -267 -211 31 -74 -144 -287 111 414 207 243 -93 -69 -1 55 19 -87
6606 -87 150 -43 -102 143 245 -102 -45 -78 -62 -125 -2 119 -75 -120 110 -71 99 15 -12 192 -8 -109 -82
6629 -82 59 -396 -14 193 7 260 23 -360 31 316 517 -96 -16 42 213 -32 -157 35 451 -347 -207
6650 -207 160 -58 268 224 49 17 -185 481 -10 47 58 -184 39 219 276 276 507 -209 493 144 257 33
6672 33 438 382 445 -386 -76 -82 126 -292 108 -83 383 364 171 218 -227 107 488 498 -252 -212 214 132 387
6695C87K41r40J93R6k91J031r43l4L11J08j58k28K20q2j65L99k37j6N10l99L84
6716C87p46K44n1O05o97J45L1m2L27n67j29N17K12j66k2l56L69J6n6r3J27p21
6738f66J388q51L1J073j349K31J159l23n92m71O22L27J26j115R21n50J32J91j332
6757a048J359j48M43n98K62K46q36K08K92l87L94l62K54K00k74m5M2j77k2K77
6777H0J0k0j50p7M41l89K54k66pJ24l0N6j26J26q5LM21l04L4k28Q4J42j54M9P7
6802F5op9k8J20j15M4j39L24k20J38r3k5J73j98q0O9j01J08O1p8Q2J38l06K00
6826E4j33K19k85K12Qo7N9m4j27R6r8K50j52qQ6M0q3p0jl26K86j14M1J85j81J13
6852d0J42j80O5M2r8j30J27j18J48L27o7k02k68K83k2l30Q5M70j76r6L4M7k9n8
$$ plain form
6695 387 628 -312 -119 -23 -314 717 -226 -260 51 159 1 -227 -7 -89 -254 145 -92 -108 402 3 387
6716 387 -359 -115 -166 439 -258 -113 -82 -124 203 -364 -493 24 236 70 48 -308 61 77 21 -72 55 -666
6738 -666 722 -129 -98 975 -374 -143 1016 693 101 -370 252 579 705 -410 511 -39 93 284 -1048
6757 -1048 311 163 606 8 270 516 -320 -112 180 -207 187 -175 79 279 5 -40 2 -175 -197 80
6777 80 90 70 -80 -157 284 -105 149 -117 -124 0 -30 26 -100 26 -59 -56 365 61 95 -133 -49 93 -61 -12 65
6802 65 59 -20 -48 72 -43 1 -138 186 -34 104 11 -14 159 -39 -119 -50 -151 -43 18 -60 22 160 -146 54
6826 54 -79 140 -145 67 75 8 67 23 -104 -8 -106 144 -8 -16 70 110 27 -43 -44 -370 -84 -198 -157 28 -153 -40
6852 -40 102 -78 -13 29 -69 -199 -72 -190 -42 285 218 16 -252 31 9 -321 -236 234 58 -38 -4 43 14 -44
6876d4K04J44l09J25K11l12p0J49j46l5K09j97l4J98j2n6L8n4O5k52J75k50J83
6899g0J50J46k72l5L83n07L69k50P6l5K68k19J02j36j5J02j65n4L22l97L26r8
6921iK25k46j48K66k24K34NQ0m05L27o7j04q5K62r7j28J19p6L39m4j52q7J07l25
6945b33J73R4R8j01j17m7K64q5q1N1J08r6p3on4K10Kk08K02j25K63r8k24o1J26
6970a8p2R4o9R8J08j74j2km2K2M2M1N0j0q4J51J18m50K45O2j52L8o0K5j01K27
6996G5J50l15Q9r6L0k47q3N91k44O82l98l06K07j05L2M93j53k59kM41P7j55m34
7019G0m53kQ14o78M63R1k17O0n3M7k72p0J48k1k0J62n8l2r2k04K76O3K8j75k7
7044a52J57j45P9J70l30J58o6j1P2o3J59j08K07j62j14n2K62J3m1J33k66O7%m4
$$ plain form
6876 -44 160 304 -5 120 331 19 -51 98 -48 -83 126 -71 -105 93 81 25 63 9 74 -178 -3 -253 -70
6899 -70 80 226 -46 -81 302 -205 164 -86 -10 -45 223 4 106 -30 -45 57 -108 -162 160 -237 89 -9
6921 -9 216 -30 -178 88 -136 98 103 183 -222 105 38 -66 -151 111 14 -114 5 -71 268 224 72 -15 92 -233
6945 -233 -60 34 132 31 -86 -133 131 46 -35 16 124 28 -45 -51 -105 105 107 -101 101 -24 239 141 -83 -144 -18
6970 -18 -90 4 -65 33 141 -33 -45 -47 -89 -67 -25 16 66 56 -28 123 241 -209 36 98 -54 -16 -76 -51 -152 75
6996 75 225 -90 -1 -97 -67 -314 -397 194 -50 632 234 -72 135 30 62 555 402 143 141 582 659 504 70
7019 70 -383 -385 429 -249 214 305 88 148 95 142 -130 -200 -52 -73 -93 69 11 -21 -113 -317 -41 22 50 -125 -152
7044 -152 5 -140 -61 109 -221 -63 -129 -140 -68 -131 28 -80 127 -35 -149 -201 61 74 33 166 -100 -33 -33 -77
7068g7J89l82L03L3p4Lr8J16K4j61J5J44J98l21K13j79K00l9o7J0j55M9L03k40
7092Gn1J82k85L40k58K01j65K16k30R6J21k14R0j21j42K41k2j77L49k8k27J4k4
7115h7J28l5K86l68O3J81j34p7k90L41j30k4k1J20J92%o6k18J83n8M5P2j93r0
7139a80J72O3jj24L16j8r8j18RJ2r9J91r4j15K22J35m68M01l06K7j90L09L1k57
7163a80J60J98j66j98J76J04j16L7j93L33k69R0j81K01m1J04K18l05J35m0M0j77
7185g0L7j21jK28p0jQ8J28q5j91K1K13k28k30K16m2J64Q0p0j35J01N3J38q8j51
7210a6n7J89j22k40J97n5N1J39l09L21j83K59l1k73n2J46k4K27M4j45j85m0J06
7233e3J15j6k36J11p0j6k8M35l53J72J93j17j23k19J49o9L18J1q3k60J96J2Q0
$$ plain form
7068 -77 112 -270 33 66 -8 -5 -103 13 37 -124 -109 35 233 -88 125 -54 146 107 40 50 -105 -56 247 7
7092 7 -44 138 -147 193 -65 136 -29 187 -43 53 174 -40 50 -71 -213 28 6 -171 178 150 -77 -63 -87
7115 -87 41 6 292 -76 -13 168 34 -43 -333 8 -122 -146 -167 -47 145 145 79 -139 44 -14 31 103 -90 -180
7139 -180 -8 55 54 -70 246 228 130 12 21 33 -66 125 31 -84 138 273 -195 206 -100 -73 -263 46 77 -180
7163 -180 -20 178 12 -186 -10 94 -22 15 -178 155 -114 -24 -205 -4 -45 59 277 -28 107 67 107 -70
7185 -70 -33 -154 -155 73 3 2 90 218 133 -58 -37 176 -52 -282 -66 -108 56 136 66 -69 32 85 223 135 -16
7210 -16 -73 116 -6 -246 -49 -104 -53 86 -223 98 -85 174 143 -130 -182 -36 -60 167 211 66 -119 -159 -53
7233 -53 62 46 -190 -79 -149 -165 -193 242 -111 61 254 137 14 -205 -56 -125 193 204 121 -139 57 69 149
7256A49k44R8m8N2K40M2j82n9K57q8k84j09q8k4K09NK64j14j67N0P6k45J56J77
7280A23k48J41k1j16l6P0K3K7QP3k1mj78j58K98J2o2J08N2p9k34M75k90P7q7J62
7306A15J80l78J15o5J21L0j83o7N0j32J89N7R6r3j06J70j72O5k58J47N9q6N0R5
7330ak78L92n44M38j84pJ32p5l2p1L01J03l78L07J9l84K77q6J44j25K43q8R6k03
7354dp4J86k44M8K0J84M7l4l68K74L5q8r8J12pK58l90Q6K1M6qLr0L7L88m57Q1
7381c6m1J75op3n1R6j90J19k7o5m0K53j24K53j66K0j24J57k58N4J05O1k36J12
7405c2L5J7j23J95k26J70J87k62N2J19k49R5J40l16L02J12k77J33o5m9J4L3j64
7428a59L33l00j0J19J86j05k71PJ50J46k9%l58J98j81K04m0j04N7L27j41j43J33
$$ plain form
7256 149 -95 3 -45 7 247 289 107 48 305 217 -67 -176 -264 -288 -79 -74 190 76 -91 -41 35 -210 -54 123
7280 123 -125 16 -5 -121 -157 -87 -64 -37 -29 44 23 19 -159 -317 -19 -7 -69 39 91 12 -222 253 -37 40 -47 115
7306 115 295 -83 32 -33 88 118 -65 -132 -82 -214 -25 32 128 35 -71 99 -73 -8 -266 -119 -60 -146 -96 -1
7330 -1 -279 113 -431 7 -177 -184 -52 -127 -159 -230 71 174 -204 103 122 -262 15 -71 73 -52 191 103 199 -4
7354 -4 -78 108 -136 -88 -68 116 163 129 -239 35 70 -18 -116 -4 -11 247 -143 -57 -36 10 2 5 -85 -48 340 -117 -36
7381 -36 -77 98 92 19 -32 64 -126 -7 -34 -99 -139 114 -10 243 77 97 -27 130 -128 -74 31 92 -144 -32
7405 -32 3 20 -103 92 -134 36 223 -39 13 132 -117 -22 118 -198 104 216 -61 72 7 -42 -28 5 -159
7428 -159 174 -126 -136 -17 169 64 -207 -200 -50 96 67 67 -291 -93 -274 -70 -110 -214 -157 170 29 -114 19
7451A9Q0k00J86j18j34k9K70n2J84k99N1o2J74Q4j47J06l00J98O4J0O9j63j84
7474a93K22K9L7k35J92L3K4m8l9j78J88j0k41J83K07l9k04L81n48J68m2J88j99
7497a24J40R3j87L1J84k6k24O7J47k22R0Pk1J03j78J09J3j24J62j04N7m5J7J2
7521b3q6J32L2o2K6j67K22o6r4M01k76j55o5K55k61K03m6K02j18Nk2q7p4K40j68
7546e2R6n9J08k89J08o7N3P9j79n8o3K36qp8M56j4m15J50pj52J81PQ0l77L80k62
7572a46q2J56J1n9J81q7N2j95J47J82j98M5j3o7J38k45J63j19K35l27N9PJ56N5
7596D9j82N6R9R8j49J14k71L66o5J33k60j42L13j52j1k03K69k17J45j08N2j66
7618b32K65K28k23R5j53N5j41J68r1J02N7J27k62l1K55j19k31LK08j06J18j22
$$ plain form
7451 19 99 -101 85 -33 -167 -196 74 22 206 -93 -42 -104 70 154 7 113 -187 11 75 85 154 -9 -193
7474 -193 29 58 95 -140 52 85 109 61 22 -156 32 22 -219 -36 171 132 -72 309 -239 -71 -113 75 -124
7497 -124 16 109 -78 -47 137 111 -113 -46 101 -121 -31 -24 -45 58 -120 -11 2 -122 40 -64 -7 -52 -35 -23
7521 -23 -109 23 55 -7 19 -148 74 8 -86 315 39 -116 -181 74 -187 16 -30 172 54 59 37 -50 -124 116 -52
7546 -52 44 -15 93 -196 -88 -155 -102 -23 -202 -260 -323 -87 -95 -173 283 269 -146 4 -3 -155 26 33 113 -264 116 -146
7572 -146 -228 -72 -61 -120 61 -26 26 -169 -22 160 -38 7 -6 -73 65 -180 -17 -136 99 -228 -169 -162 -6 49
7596 49 -133 -77 22 120 -29 85 -186 180 115 248 -12 -154 159 7 -4 -207 62 -155 -10 -118 -66 -232
7618 -232 33 261 38 133 -20 35 -106 62 -29 73 130 257 -5 -36 219 100 -131 -128 80 -26 92 -30
7640c0J68j28R8k47j27P03n45p1K68k09J41r5J41l29M84j18k96J82J46j29K44
7661B51l47M04l22l84M52j97K3j49J01K05L25n17K27J1l21j01K32R3J2L06k33
7682G1j19O2L61k93j34P8J41l9l18k24N40Pl14K35n18N97m74J225p84m50N18J38
7704C06j122O29J75J87J23P2k11j79k68m15M98L25J9Nl33M4p8j84O00o98M11j05
7726a99m52P77J58J72j46r77Q25m63j00N5P26R4l54j25k01l0m03P33K87K4o25
7747b24q39J155L10n96P93p39k4M79m8n45Q02p19l57L89k32M20k37j6K73k69M09
7768A85l34k79O33o23M15n9P5N45j36r8l88O3j90J10j57L37l09n9J68n62J091
7789D28k20k32o3O15q74J59R8j9k03J86K66k26K1j44n39R89l23K48J57j03k22
$$ plain form
7640 -30 138 10 108 -139 -266 437 -108 -179 89 -120 21 -74 67 -262 222 104 -192 -10 136 7 251
7661 251 -96 308 -14 -398 54 -143 -120 -269 -168 37 362 -155 72 83 -238 -339 -107 -14 -2 304 71
7682 71 -48 14 375 82 -52 26 167 128 -190 -414 126 133 -181 54 -464 133 -341 884 100 -350 168 306
7704 306 -816 -187 -12 175 298 370 159 -20 -288 -703 -205 120 139 144 -189 -145 -223 -407 193 -505 -94 -199
7726 -199 -651 126 284 456 310 -667 158 -305 -405 -350 376 470 116 -9 -210 -240 -643 90 377 401 -224
7747 -224 -1063 92 402 -194 599 -140 -164 315 267 -278 524 -195 -552 -163 -395 25 -212 -228 45 -224 185
7768 185 -149 -428 205 -418 -3 -62 13 558 422 324 -64 -1 -191 -81 -238 99 -210 -269 -101 -663 428
7789 428 208 -24 -87 528 -346 -187 -89 -108 -311 -125 141 -85 -64 -208 -747 242 -81 167 324 221 -1
7810ak99Q20p86L35Q8j86J23J64p7k97J10Q6j01O3j02j75j3L76Q5k28l06K63p
7833f5K78k74J11q5Qm0j38K36j24k2K06j56k47M33j05N8K0j31N4R8k99J99q7O5
7857gNL4J12j42K33l16R9K7k06nJ01j26L37k52J00j41J37J14j96L76l43P2j09
7880i6J59k35L57m21K04J38k52J3J96q2k8n7K52l7j07L5L3o3l9N4p7K02j31j40
7904a22j05L45m3J52k10O9j31J39j36j54J59R0j57J4J48j44J93m4l21L52L1jk73
7927a49J57q9J55R4J07j85Q2m13J59J86n0r5P1J11m20L66n6J10k7mm96K66O9O2
7951A1r2J35m6J17k74O7K42j76R6J04j64j36j32L50l3l5Q5l11J69P6j12L6P3K21
7975B71p8j19j06q0R1j25Q5J04o2n5J95j53j52K42n7p6K38j06O5j92P4J42l13
$$ plain form
7810 -1 -300 520 -266 69 157 -29 94 258 181 -116 -6 80 -21 42 -60 -235 -248 128 213 -15 -321 -58 -65
7833 -65 213 -61 50 -35 -27 -67 -205 31 -93 -115 91 -65 -312 121 16 74 94 -37 17 115 -184 15 -72 -7
7857 -7 -2 32 144 2 235 -81 18 45 -161 -166 -65 -191 146 -106 -6 -147 -10 104 -92 284 -59 13 -96
7880 -96 63 -172 185 -236 -32 106 -146 -133 63 -19 -47 -104 148 111 4 39 72 9 -30 24 -53 149 18 -122
7904 -122 -227 118 75 227 17 86 -45 94 -42 -196 -37 53 -104 -90 58 -86 107 63 -258 94 125 124 -149
7927 -149 8 -81 74 168 275 90 172 -241 -82 104 54 -41 30 141 -279 87 31 141 114 110 -386 -120 -51 11
7951 11 -81 54 8 125 -149 -82 160 -16 80 184 20 -116 -248 102 69 34 119 -192 -23 53 -59 -23 50 271
7975 271 193 74 -32 -112 -21 -146 -61 43 -19 -74 121 -32 -184 58 1 -75 163 57 122 -70 4 146 -167
7998a67J08K60j59j68K84r6L9p3j40J48O2k49K02j46K2oJ3K1m2K86l82L05j30
8021hJ6J69j9k30R2Q6P2k11N5j12K23j37m7j37L39j79j5P9j41J54rp2M0j52N0
8046i4J24q9J14m1P7O7k78o8J29n5M4J13K6K9j38m4N2J38j98Q0R8J02l69L18J44
8071B81k33R5k24j7pQ9j11K31l09J20J57j93J60r4L5L23l87J20L6O1l30J71L6
8094A0L8j31R3q9J10M0K2j58OM5m6j7Q2L38q2q2k92l6mL10j95KJ95j29j35m3m4
8121a92K20L3J06l34L69k3j07k16K84P9k79K0M4M3Q0j37r5J56o8K40l29J27N1
8144G2k75r2L77j47qK64j29j56J42J2k7p9K55l60J15K40r7q1k40L24l17L26j50
8167c1O4m7o7J67J22m53J57j28J69r1K29k05J16J9Q2o6j30J38j5L0J36j18J21
$$ plain form
7998 -167 -59 201 42 -126 158 62 101 28 -112 36 98 -151 51 -95 -73 -79 -66 -45 -87 199 -183 122 -8
8021 -8 8 177 158 -72 20 106 178 -33 22 -90 133 -4 -51 -188 151 -28 -43 36 -105 49 40 -32 8 -144 -94
8046 -94 30 -59 55 14 91 158 -120 -188 -59 -114 -70 43 69 98 -40 -84 -32 106 -92 -12 86 188 -181 137 281
8071 281 48 143 -81 -98 -105 -16 -127 104 -205 -85 72 -121 39 -55 -20 303 -84 36 72 133 -197 -26 10
8094 10 48 -83 10 -79 31 71 93 -65 -59 -14 -60 -77 5 343 261 179 -113 -149 -153 157 -38 -36 159 30 -105 -148 -192
8121 -192 28 61 167 -167 202 179 72 -144 140 219 -60 -40 4 47 127 -10 -105 51 -17 223 -106 21 72
8144 72 -203 -295 82 -65 -73 191 62 -94 48 60 33 -46 209 -151 -36 204 107 26 -214 110 -207 119 -31
8167 -31 33 -14 -81 86 208 -245 -88 -216 -47 -138 91 -114 2 21 103 37 -93 45 30 60 196 78 199
8190A99l43
$$ plain form
8190 199 -144
8191a44
$$ Imaginary data points
##PAGE= N=2
##DATA TABLE= (X++(I..I)), XYDATA
0@%%%%%%%%%Qj6J6j6K4l2M0m8N6p2Q8j04J28j55J81k13K51k95L43l95M54n26O04
32C21o84P74q78R95j121J260j414J582j766J965k180K417k678K963l275L614l985
49b090M393m837N325n866O466p133P878q717R672j0765J2027j3514J5291j7458
63i328K0175k3689K8442l5286M6146o7005J78360l65138K92993K24293n51892
74b61929M33538l8874k76722K49659j6721k20101J38492O6917j31413M8570O1178
85E2594j89241J30764o057j09294J77348j08676J3917O8302k28784K33197j1961
96B2109k13488K64623q2691j48549J92925q8503q5481J63465K367j66258J12792
107b6689M3753k10855K10108J4451k25104K79122j06692j61925K51910j45327
$$ plain form
0 0 0 0 0 0 0 0 0 0 0 8 -8 8 -8 16 -16 24 -24 32 -40 48 -56 72 -83 98 -115 136 -159 184 -211 243 -283 321
32 321 -363 411 -467 528 -593 667 -747 835 -931 1034 -1146 1271 -1407 1556 -1719 1895 -2090
49 -2090 2303 -2534 2791 -3075 3391 -3742 4136 -4581 5091 -5674 6353 -7161 8130 -9328
63 -9328 10847 -12842 15600 -19686 26460 -40545 137815 -227323 65670 289963 -261929
74 -261929 171609 132735 -143987 105672 88951 -131150 7342 74259 -57154 -8584 52594
85 52594 -136647 -5883 -11940 -121234 56114 -52562 -38645 29657 -199127 34070 22109
96 22109 -191379 73244 -9447 -157996 34929 -53574 -139055 24410 26777 -139481 -26689
107 -26689 17064 -193791 16317 30768 -194336 84786 -21906 -183831 68079 -77248
117g7248m370J34583j33711O5786j0020n7473Q7586l4270K4666K1955m1317J2197
129a1636m99J8408k2972L6364J4276o1427P1775n3691j9435J09875q5600L0657
141B6095M0374r5464O3513j6239k0938O7915n6362K0879J1637n1484L8131p41
153B7316p157P607J0877k1837l4459O1425l7471m626P6826r5315K2684M7808r9548
166d5870O9825R694n4865O8101m8702r262L5917m6085M4069K534m3469L8883j4682
179F088m4499N1230J3441o1223O0491R097r9725Q8835P477j07049J26335j5658
191C4840j11769J22339l8304p8065J19011l1332o5564Q4433k5793o4840P7009
202B1965q879n1042P1358k5276m5753N8480l4015o019M7678m6538K3586N545n2169
$$ plain form
117 -77248 -81618 52965 -80746 -14960 -24980 -82453 5133 -29137 -4471 17484 -23833 -11636
129 -11636 -12135 6273 -16699 19665 33941 -27486 44289 -9402 -28837 81038 -4562 26095
141 26095 66469 -28995 34518 18279 -2659 65256 8894 29773 41410 -10074 28057 27316
153 27316 20159 27766 38643 16806 -17653 43772 6301 1675 78501 -16814 5870 53678 -45870
166 -45870 23955 33649 -21216 46885 -1817 -11079 24838 -21247 22822 25356 -18113 20770 6088
179 6088 -38411 12819 26260 -34963 25528 34625 -65100 23735 31212 -75837 50498 34840
191 34840 -76929 45410 7106 -70959 48052 16720 -48844 35589 9796 -55044 21965
202 21965 13086 -37956 33402 8126 -37627 20853 -13162 -19181 28497 -18041 5545 11090 -41079
215d1079N8493j8204l3678P3855m6202l4351P6490n5494k6173R3079n9220l2217
227d4701Q9091p1096k8368J00567o6975k1806R3275p7357j9534Q0832o5241k703
239c4016O9410n7957p416N0861m9490L206M5359l8225Q876K0830l5625J4393J1957
252B163j9079K4533m247j6711K2616j9237l299L0321k1457K773K4408l3274M234
265f256K8554l1547J5009K5183l7857J3348J5584l1531K0265J6712k5931J3656
277A5189P257k5376J3089J1397j6046J0037R375k2427N956R940j8021J3571P715
290B1656j7493O355J768j2967O219Q819r410p6O410j3379l766J4508r666l281
304d303J6041j6898n760J4222j2896j396J6288j0540r400J4137j1777o479J9076
$$ plain form
215 -41079 17414 -790 -34468 39387 -6815 -41166 35324 -20170 -46343 46736 -12484 -44701
227 -44701 44390 -26706 -55074 45493 -21482 -43288 49987 -27370 -46904 33928 -31313 -34016
239 -34016 35394 -22563 -29979 20882 -28608 -25402 19957 -18268 -9392 11438 -24187 -9794 2163
252 2163 -16916 7617 3370 -13341 9275 -9962 -13261 17060 -4397 -1624 22784 -10490 -6256
265 -6256 22298 -9249 5760 30943 -6914 6434 22018 -9513 10752 27464 1533 15189
277 15189 22446 -2930 10159 21556 5510 15547 24922 2495 8451 18391 370 13941 21656
290 21656 4163 10518 12286 -681 5538 14357 4947 4871 11281 -2098 -5864 8644 -1022 -4303
304 -4303 11738 -5160 -10920 3302 -9594 -10990 5298 -5242 -14642 -505 -12282 -18761 315
317C15r785m967J4073j4312l014J2653j0179N744N260j0516P556n490k487J1674
331c475p135J452J0276j4275J257J4692j6006O078J7393k1233M074J7978k4250
344a3174P822K3132k7615R365J9919l1126J1434J9849k7443J2666J8107l0296
356g360J1660J5872k7119J5107J3300k4909J2324P865k1560J4199N336j6148J3205
369A1772j482j1791J0970l722n580J0292o620l348Q056j0785K319P478j1964O143
383A738M271j3740O956M841j4568R613N757j7436J0393M719j8212J3083N989j9396
397a5992J4212L887k0381J7813P53j6743J7381j146j4313J4477r03j1358J3273
410I60j160r629J0542j98q513R145N49p889R213j648n796Q560k415k968N619j697
$$ plain form
317 315 -9470 -14437 -364 -14676 -17690 -5037 -15216 -9472 -4212 -14728 -7172 -12662 -15149 -3475
331 -3475 -10610 -9158 1118 -13157 -11900 2792 -13214 -7136 10257 -10976 -6902 11076 -13174
344 -13174 -5352 17780 -9835 -470 19449 -11677 -243 19606 -7837 4829 22936 -7360
356 -7360 4300 20172 -6947 8160 21460 -3449 8875 16740 -4820 9379 14715 -1433 11772
369 11772 10290 -1501 9469 5747 167 10459 3839 491 8547 -2238 81 7559 -4405 1738
383 1738 6009 -7731 -775 4066 -10502 -889 4868 -12568 -2175 2544 -15668 -2585 3404 -15992
397 -15992 -1780 2107 -18274 -461 292 -16451 930 -216 -14529 -52 -955 -12313 960
410 960 -200 -9829 713 515 -7998 1147 1696 -6193 3020 1372 -4424 4136 1721 -1247 4372 2675
426B675k204M608k052j295M840l768M36M144n350K138M260q275N332K896j0000
441a615R016j204q229J0199m364n790Q943m384m543P116l637m396N868k004n424
456d448N814L89q441P048r0q483R362k585o859Q687l189o374Q703k617n242P793
472e32l768l468O687l739k906O872l390j818N176m854J531L326l667K749M32j476
488b845J663m27J18J969k18l7R95K39j271Q69L003l428L460J014o443P177m25
505E413o170Q590l005m795P970m969l099Q612n254j370N293m362j683M315k164
520C322k246M443l231k464L539k625q21K766j951j057J618k656j142K669j200
535a036r15J354k093j295L134l345O09L480n583L011K49m752N482q64l182N297
$$ plain form
426 2675 471 5079 3027 1732 6572 2804 3240 7384 2034 4172 8432 157 5489 8385 -1615
441 -1615 7401 6197 -2032 8167 3803 -1987 6956 2572 -1971 5145 1508 -2888 2980 976 -4448
456 -4448 1366 1755 -6686 362 272 -8211 1151 -1434 -8293 394 -2795 -9169 -466 -3083 -8325 -532
472 -532 -4300 -7768 -1081 -4820 -7726 -854 -4244 -6062 -886 -5740 -4209 -883 -4550 -1801 -1369 -2845
488 -2845 -1182 -1609 -1491 478 260 223 1218 1457 186 1055 4058 630 4090 5104 -1339 5838 5413
505 5413 -757 7833 4828 33 8003 3034 -65 8547 3293 1923 7216 2854 1171 5486 3322
520 3322 1076 5519 2288 -176 3363 738 -83 2683 732 -325 1293 -1363 -2505 164 -1036
535 -1036 -1951 -597 -2690 -3985 -851 -4196 -3587 -107 -5690 -2679 -2430 -7182 -1700 -2564 -5746 -449
551d49l590j207M184l908K342K401l019J118K18k83L40J482%p40K374j415j480
568a632L164m17o76K924k339o77L205k233J82L268j475p67J799k791L51L693l041
585B538J508J092l861K024k23j403K713j366j491J359k429J131j15p09J314j413
601F69j22j415r46J745j038P43l21j920Q38n80j515K729j133j145J683k894N2
618d570J816r07O56J186k300j75J173j056J766N09j220R27r34m4R37j08J510J030
636A96j308N43q71M76K097p64J358J59j201J122n21L6J982J54j40k47q85K74J619
655D079j49K15k51q85M62o50M29P57K7O7r86k66K84j263J474p3j333J04j829L81
675E94J90o9L91l23k070N47k68j222K093o57n84o7k073K27K98j17O26R1m36j250
$$ plain form
551 -449 -4039 -5246 -1062 -4970 -2628 -227 -3246 -2128 -1910 -2193 -1853 -371 -371 -1111 1263 -152 -1632
568 -1632 1532 1115 439 3363 1024 347 3552 1319 1501 4769 3294 2527 4326 1535 1886 5579 2538
585 2538 4046 5138 1277 3301 3078 1675 4388 3022 1531 2890 461 1592 1477 768 2082 669
601 669 547 -868 -1814 -69 -1107 -364 -685 -2605 -1767 -2347 -3862 -1133 -2266 -3411 -1728 -4622 -4570
618 -4570 -2754 -3661 -3005 -1819 -4119 -4294 -3121 -4177 -2411 -1902 -3122 -2195 -3129 -3173 -2236 -2344 -834 196
636 196 -1112 -569 -1440 -964 1133 369 1727 1886 685 1807 1286 1322 3304 3458 3318 3071 2186 2460 4079
655 4079 3930 4145 3894 3009 3471 2821 3250 4007 4034 4101 3115 2849 3133 1870 3344 3271 1938 2042 213 594
675 594 784 715 1106 783 -1287 -740 -1008 -2230 -137 -794 -1378 -1445 -3518 -3291 -2993 -3110 -2484 -2393 -2829 -4079
695d079L86J39j9N93M4m39j7k57q6M87P16N56n09N64j393M86J951j341K788r04
715c34j185J798r96L84K273r98q4N88j033R41J98O89O05j71Q6j563J662l87j18
734B355J954j626M46J81j715J229O55q80R34p23j274L87j83p2N72L44j803O4N97
753A442k693K547k41j916J985j726j358J697q93O5J181j763m77N9k32k45J103
770a465o9j382J086j223o28K647j529M56J146k479J339K71j661K342N12j047N39
787a145k88o29J830N37r54R96K82k414K285L25j522K663nj905J642r56O2J371
805B175n65j34J114j225Q2O31P48j235J367r07j306K031k049J35K067j549k82
822A098P0j333O22O16l90j53K65j230J5O37q11J10R76j874L26j90j229J490O18
$$ plain form
695 -4079 -3693 -3554 -3573 -2980 -2936 -3375 -3392 -3649 -3735 -3248 -2532 -1976 -2485 -1921 -3314 -2828 -877 -2218 570 -334
715 -334 -1519 279 -717 -333 1940 942 858 1446 413 1354 1552 2241 2846 2675 2761 1198 2860 2473 2355
734 2355 4309 2683 3129 3310 1595 2824 3479 2599 3533 2810 1536 1923 1740 1668 2240 2584 781 845 1442
753 1442 -1251 1296 1055 -861 1124 -602 -1960 -263 -1156 -1091 90 -1673 -2150 -2091 -2323 -2568 -1465
770 -1465 -1534 -2916 -1830 -3053 -3681 -1034 -2563 -2107 -961 -3440 -2101 -1830 -3491 -1149 -637 -1684 -1145
787 -1145 -1433 -2062 -232 305 -649 347 629 -1785 500 825 -697 1966 1961 56 1698 742 804 2175
805 2175 1610 1476 2590 1365 1447 2078 2826 1591 2958 2051 745 2776 727 862 2929 1380 1098
822 1098 1168 -165 457 1073 683 530 795 -435 -420 217 -594 -484 492 -1382 -1056 -1246 -2475 -985 -367
841c67j460Q95m6j028L04J73p99J151j33j234J52J282j400J266J480j997K068
858C07j532r26K463j370N7K150j590J8O95j169O35J872m91m56J096p18m11J705
876B335j241r2J742k110R20J112p32j73J547k809M00J857k428J023Q54j951J796
893B050l5k881K178J79k181K685j581r73J439j867m89K213q97j298J459j482j019
910b500K289j542M1J110j451n67J814j678q1K105j992O39N59j546N08J558j905
927b639J315Q95k492J753N55j847K350O7j884K225l63j568K141j36o60J614r23
944D03l36J054P0LP38n75k49Q11m51J8M36M64m42M14n87p77J496n44m8N28r94
965A432j49J055j324J48Q51j563R44J49j748P79L28r12P17j21j642N31L18n21
$$ plain form
841 -367 -1827 -932 -978 -2006 -1702 -1529 -2328 -1177 -1310 -2544 -2392 -1110 -2510 -1244 236 -1761 307
858 307 -1225 -2151 312 -1058 -1001 1149 -441 -423 272 -897 -262 1610 1119 663 1759 1041 630 2335
876 2335 1094 1002 2744 634 1554 2666 1934 1761 3308 499 899 2756 328 1351 2205 254 2050
893 2050 2015 -866 1312 1491 -690 1995 414 -559 880 -987 -1476 737 -160 -1458 1 -1481 -2500
910 -2500 -211 -1753 -1712 -602 -2053 -2620 -806 -2484 -2565 -460 -2452 -1813 -1254 -2800 -2292 -734 -2639
927 -2639 -1324 -429 -2921 -1168 -613 -2460 -110 -43 -1927 298 -65 -1633 508 372 -288 1326 403
944 403 67 1121 1191 1194 1932 1357 1108 1919 1468 1486 1922 2386 1944 2358 1771 994 2490 1946 1898 2426 1432
965 1432 1283 2338 1014 1162 2013 450 1394 1543 -205 574 902 -10 707 586 -1056 -525 -207 -728
983g28J08J19r45J10N37j356K57J293j567N38M25j562O61J039j026O33L22k013
1001c155J721J09j218J639o15n92J717r99m33J677j012N82Q83j205L99Q18m95
1018a79K84M82m52L10J014j124L37J147j166O70R84j953J047O84j574J636J71
1035B318j987J809K72j893K000o23j608K220j080j215J806r72o75J745j860m71
1051b14J520j643N31O40j656N72M25q65k63L54m14m0Q95j243J3R05j344M28Q27
1070e72j662R61N36j621J378l04o59J388q52n16J154k16o55J694p56n89J611j073
1088g53K84R12q79p6J414j044J94Q23p15L19L75r8m52P95K05o94J054n34n10J144
1108A764r41O2J067j172N9J030j213Q02l71n09M86k96P7k44N6k78j70P7n16M41
$$ plain form
983 -728 -620 -501 -1446 -1336 -799 -2155 -1898 -605 -2172 -1634 -1209 -2771 -2110 -1071 -2097 -1464 -1142 -3155
1001 -3155 -1434 -1325 -2543 -904 -1519 -2111 -394 -1393 -1826 -149 -1161 -579 304 -901 -502 316 -179
1018 -179 105 587 135 445 1459 335 672 1819 653 1323 2307 354 1401 2085 511 2147 2318
1035 2318 331 2140 2412 519 2519 1896 288 2508 1428 213 2019 1047 372 2117 257 -214
1051 -214 1306 -337 194 834 -822 -250 175 -690 -953 -599 -1013 -1053 -158 -1401 -1388 -483 -1827 -1399 -572
1070 -572 -2234 -1273 -737 -2358 -980 -1284 -1943 -555 -1407 -1923 -769 -985 -1640 54 -702 -1291 320 -753
1088 -753 -469 443 -436 -512 902 -142 52 875 160 479 854 756 304 1099 1304 610 1664 1130 620 1764
1108 1764 823 885 1952 780 839 1869 656 1458 1087 578 1064 768 845 601 657 379 209 286 -230 211
1128B11j72o59L86l35k52O62n13k49N55m79n7n4k00l53N03M04r94P60j75r40J812
1149a39j013m77J501j485P4J723j665O80R35j121P47R7k01m51J153r37J02J594
1167A117j439O93N68o73N44J80o28P74L90j132R59Om61L09j50m35P98j98p40R50
1187A432k19o84J203r31k95J725k008P12L39j171M99K00j246P96j28q4l12N59
1205C87j437N88L14j833J266N10j402P62M31j192J338n48n90O05l86J77J63m51
1223a298J94m98J640j268L33k9j68Q16r00N02J38J00M32K81o33O61L88r75M58
1242A74M03n49K74j63M24L22j16n80R83q98N97m9P25m18N2M00j209J892o69o52
1262I43m54R51j243P21P28j763N14k92J17P60j194M91L90l83l48K99m48o55L54
$$ plain form
1128 211 39 -620 -234 -569 -821 -159 -672 -921 -366 -845 -902 -956 -1156 -1509 -1006 -602 -1596 -836 -1011 -1951 -139
1149 -139 -1152 -1629 -128 -1613 -1539 184 -1481 -801 134 -987 -240 -143 -344 -795 358 -579 -477 1117
1167 1117 -322 371 939 266 810 990 362 1136 1526 394 1353 1359 898 1207 1057 622 1420 1222 482 1432
1187 1432 1213 529 1732 801 506 2231 223 935 1274 103 602 802 -444 352 224 140 -172 387
1205 387 -1050 -462 -148 -1981 -715 -205 -1607 -845 -414 -1606 -268 -816 -1406 -801 -1187 -1010 -847 -1298
1223 -1298 -1104 -1602 38 -1230 -897 -926 -1094 -278 -1178 -676 -538 -438 -6 275 -358 303 691 -284 174
1242 174 577 28 302 139 563 885 769 189 1172 274 871 822 1547 1129 1181 1581 372 2264 1595 943
1262 943 489 1440 197 918 1646 -117 397 105 222 982 -212 279 669 286 -62 237 -211 -866 -512
1281e12K0O29j00K48j290N05n09Q2L33j061O91K13p30K20Q88q93P55j1j414O89
1301a247M61l12L65k77P59J73o74l4O53k82p15R00K30k20L30P8n4N50j04j295
1321g15R23k26K21K43k6K41M98P7j425Q11M50L89l19n79j41Q08r86m64J164m10
1341E34qN01m11j57l9n00M56j08k19k2J5k24K86l88k07O64p54kN37j095M3j37
1363a235N63l39L19Q3k08P37q41j54p7l54Q48J6k17j01M86l53k94M58l43j07P06
1384d07l3l74K11K06j28N95P67j049N58k64O5J118r75L88N0l49%K13O25q86l1
1405C00M31M80j32l19n62R35j12p03J83K53k48N23o15O4m56O73J90j644M31O9
1425b59K35L7m74K88m46M78q24N22l95K54N17m50j098R61R1n59p0P36m89M43Q3
$$ plain form
1281 -512 -492 137 37 285 -1005 -500 -1009 -927 -594 -1655 -964 -751 -1481 -1261 -373 -1266 -511 -522 -1936 -1247
1301 -1247 -786 -1098 -733 -1010 -251 -78 -752 -786 -133 -415 -1130 -230 0 -220 110 188 134 684 580 -715
1321 -715 208 -18 203 446 420 661 1159 1236 -189 622 1072 1461 1142 563 422 1230 244 -220 944 534
1341 534 526 1027 616 459 420 -80 376 268 49 27 42 -182 104 -284 -491 173 -581 -583 -46 -1141 -1098 -1235
1363 -1235 -672 -1011 -692 -609 -817 -80 -921 -1075 -1152 -1506 -658 -642 -859 -960 -474 -827 -1121 -663 -1006 -1113 -407
1384 -407 -440 -814 -603 -397 -525 70 837 -212 346 82 147 1265 290 678 728 379 379 592 1217 331 300
1405 300 731 1211 1079 760 198 1133 1021 318 501 754 506 1029 414 478 22 695 885 -759 -328 -259
1425 -259 -24 13 -461 -173 -619 -141 -965 -443 -838 -584 -67 -517 -1615 -654 -563 -1122 -1192 -456 -945 -502 -419
1446d19l80Q9p15O91k40P5k47n7Q29J99p83J38Q54p32p2L53J4k23OK41m4J199
1468G76r74N38J91L85k63n21J072j054P46M0j95K36J25q03L07J78l09R22o43m40
1488C14O48k79j40J38J48n80J51r3k18J60k30K25p26L99m73K85K83m22j65M12
1508a63n14k51M49k07k99L63l76J88M5J11M61k01l51J30j56J47j94j8O77n51M38
1529b72j15L5j4L21k88j83P46m45N64k39J89q05N64N68k96q2L39l19M05k03N50
1550A020n50K22K1k30M1K43N1l88mJ77K06m1l08K66k18jl8j56j24J16pk71K67
1573B94l64K3P2J7k34l7K42o09L38j51l5M6k92J0j02R8j68J24R8k5J76p2j54M0
1597f65j12K25po6p7L40j32P5K52j10p0k0J62L91j99k11M74j40o4M06j30j66J65
$$ plain form
1446 -419 -799 -710 -1425 -734 -974 -899 -1146 -1203 -374 -175 -958 -820 34 -698 -770 -417 -403 -626 -620 -379 -423 776
1468 776 -198 340 531 916 653 132 1204 150 896 936 741 977 1102 299 606 784 475 1397 754 314
1488 314 962 683 543 681 829 249 400 307 89 249 19 244 -482 -83 -556 -271 12 -410 -575 -163
1508 -163 -677 -928 -479 -686 -985 -622 -998 -810 -765 -654 -193 -394 -745 -615 -771 -624 -818 -836 -159 -710 -272
1529 -272 -387 -352 -366 -45 -333 -516 230 -215 349 110 299 -506 58 626 330 248 587 268 673 470 1020
1550 1020 470 692 713 483 524 767 818 430 426 603 809 768 460 726 508 507 469 313 189 305 298 27 294
1573 294 -70 -47 25 42 -192 -229 13 -596 -258 -409 -444 -398 -690 -680 -782 -684 -852 -728 -630 -655 -479 -551 -705 -665
1597 -665 -777 -552 -559 -625 -702 -362 -494 -419 -167 -277 -347 -367 -205 186 -13 -224 250 110 46 452 322 156 321
1620C21j31L92j41J78o7j51J5N05m38J90J9j4r8j48K73k23QK8oj0M7l0k8J5N3
1645E59j57l54J37r8r8J56k08J15k80L28q5l41O0m4j50J00l1k58L18lJ01l87k06
1668h26R9M34m16L07k23j26J55J69p6K53p6k10M57k34k38L85J80n25M13K16qj66
1690e6P8L6J59l6j15M66j33j7P0j05O14m92K37j26J01Q0k03N1k37J92j81j66J08
1713C25K24K20m45L12l38k20mk01N96m78L7n1O6m41j64N61q9L33n73J54k10J63
1735b23n7qk2k43J39l03J45K64k07l70K05M80k26L54m07j1J77m86O50p8L23n05
1757d09R3j89M31J26l49r4O00q9J15J66k00o0L78K64j46l7l67L85l66P25q80O75
1779G72l02J32j73L48m59N83o74L62l80l3P04p83K43M56r31J072r99m54Q01rJ95
$$ plain form
1620 321 190 582 441 619 552 401 416 921 483 673 692 678 580 432 705 482 490 518 512 502 549 519 491 506 559
1645 559 402 48 185 87 -11 145 -63 52 -228 100 15 -326 -266 -310 -460 -360 -391 -649 -331 -334 -233 -620 -826
1668 -826 -727 -293 -709 -402 -625 -751 -596 -427 -503 -250 -326 -536 -79 -313 -551 -166 14 -511 -98 118 110 -56
1690 -56 22 58 217 181 66 532 399 382 452 347 961 469 706 580 681 761 558 609 372 564 383 217 325
1713 325 549 769 324 636 298 78 74 -127 469 -9 28 -23 43 -398 -562 -1 -90 243 -330 -176 -386 -223
1735 -223 -280 -288 -310 -553 -414 -717 -572 -308 -515 -885 -680 -200 -426 -72 -479 -490 -313 -799 -149 -227 96 -409
1757 -409 -316 -505 -74 52 -297 -391 209 120 235 401 201 141 519 783 637 600 233 618 252 977 97 772
1779 772 470 602 429 777 318 901 227 589 209 176 880 97 340 796 -135 937 -62 -516 285 276 471
1800D71l71j77k29k08N50k1K67j78o82L16j010R99j24k25L12o05N92J57l38m21
1820i25L34J99k95J76O6K19O39n64RJ49l02O40r7o58pJ12k3J86J4L78n22n18J603
1843H13j006J004n2j316J101L57O2j419J761j368P10O06o47Kk13j63M58J26l48
1862D68M9M08p91n57Q37r44P89o52J188o70M42j15n07p4N57j226N09o81j8L85
1882f03J99j31n07J224o81l45Q17o10N02o43Q73p40J54m5K01p8M40j44n70O45
1902d2J80k53J18p63O82Q9m67M19q6J80M16p17k48K36N22J72q3L0j81L71m93P0
1924A52L00j23J90Ml8k50L50L7k98K8J34j51J25J50k32j26N6q9l3l44P00j02l60
1947H0N6m3j17ok46K58j12Q4r6j24j03L11l45J93j38j25M93m65K50q4j32m27M42
$$ plain form
1800 471 100 -77 -306 -514 36 15 282 104 -578 -262 -1272 -273 -397 -622 -310 -915 -323 -166 -504 -925
1820 -925 -591 -392 -687 -511 -445 -226 413 -151 -142 7 -295 345 248 -410 -417 -305 -328 -142 -128 250 -272 -790 813
1843 813 -193 811 759 -557 544 901 963 -456 1305 -63 647 1253 606 608 395 232 690 816 468
1862 468 517 925 134 -423 414 -530 259 -393 795 125 567 452 -55 -129 428 -798 -289 -970 -988 -603
1882 -603 -404 -535 -1042 182 -499 -844 -27 -637 -135 -778 95 -645 -491 -536 -335 -413 27 -117 -687 -42
1902 -42 138 -115 3 -760 -78 11 -456 -37 -123 57 473 -244 -492 -256 266 438 355 385 204 575 82 152
1924 152 452 329 519 523 485 235 585 622 324 352 486 335 460 610 378 252 308 219 186 -158 542 440 80
1947 80 136 93 -24 -30 -276 -18 -130 -46 -142 -266 -369 -58 -403 -210 -348 -473 20 -445 -195 -279 -411 -838 -396
1970c96J77M22j79l85K63l42k89J22l2N00n01P34M8m83O38j27l72K76M44Kr0o00
1992a70K57J17j03K74K39m66K94j62J76m1r5j22J45K2J25J26l08J87n2N2k39r8
2014A58p5K01J5k66l3L0j29R4L5J10N9l0k6J5k87K7k17L65j22l21J19j2r0K14
2038a66j10j76L9J72O8k12n0K36K7k69K11k59K52J6j47L19j31j60M97j13l32J31
2060a57K03K07l17J00J88j96K5m2N7J6O1K07k53K96j54L74m21J34L57m06j07L47
2082E19m1k83J06j45K53m37R9K20k09M3J07m5k14K50rj98J11k10J47l44K19j72
2104b33Q0k2J00m47L79j74L7P7j45n7M2J72q3M1j86K56j33j4j07m2K90r2r6J08
2128b49K53Nq2J13K2j38p4K87o8k50L0L11k24L19l55K18K45k73K46j63J93L4j72
$$ plain form
1970 -396 -219 203 24 -361 -98 -440 -729 -607 -639 -139 -640 94 142 -341 297 170 -202 74 518 520 430 -170
1992 -170 87 204 101 375 614 148 442 280 456 415 320 198 343 365 490 616 308 495 443 495 256 158
2014 158 83 284 299 33 0 30 -99 -5 30 140 199 169 143 158 -129 -102 -319 46 -76 -397 -278 -290 -380 -166
2038 -166 -276 -452 -413 -241 -173 -385 -435 -199 -172 -441 -230 -489 -237 -221 -368 -49 -180 -340 157 44 -288 -157
2060 -157 46 253 -64 36 224 28 53 11 68 84 145 352 99 395 241 615 194 328 685 279 172 519
2082 519 478 195 301 156 409 -28 71 291 82 125 232 187 -27 223 214 16 127 -83 64 -280 -61 -233
2104 -233 -153 -175 -75 -522 -143 -317 -280 -203 -348 -405 -363 -191 -274 -233 -419 -163 -296 -310 -417 -459 -169 -261 -357 -249
2128 -249 4 9 -73 40 62 -76 -150 137 69 -181 -151 160 -64 255 -100 118 363 90 336 173 366 400 228
2151B28L11p8l8j85J14L8J06k64J98j32r9J18j65J30j4j5O8k94J94J4j48k25K35
2174I7k06J96j08k37r4J00J9P3l70L57j26pP7J3M7k4k38J3N5p6R3J32J2O3j5j04
2200b58k34K90rj50J49K69m46L06K65n42N63k57J93j94K92j48N4j90K28k64N31
2221D48k15j26J06K15j75R2J46j82M6j76l7qJ22J09j46k7kj0K57m82K76k9j95
2244GK18r5j63JK50k40j1m7p6L24m75q0P7O3J17k81P8J41J9p9P7k0k55K86j49
2269c13J55j95K6k1L7j78K50J52k5j91K32l02K36N1N8j69L23jj25L77l13Q2j92
2292d6J96K82j39j12R3r4p6J43M0R1j68n5J20k34L80n6j52k9j61L6J46k27J71
2315A49n7l5M0N6r9O4R9l16L53m09J28J16l02M7Rl20L09j80M06k39k42L84k27
$$ plain form
2151 228 539 461 423 238 352 390 496 232 430 298 199 317 152 282 268 253 321 27 221 235 87 -138 97
2174 97 -109 87 -21 -258 -352 -252 -233 -160 -530 -173 -299 -306 -229 -216 -169 -193 -431 -418 -363 -439 -346 -214 -202 -139 -154 -258
2200 -258 -492 -202 -211 -361 -212 57 -389 -83 182 -360 203 -54 139 -55 237 89 143 -47 181 -83 448
2221 448 233 107 213 428 253 345 491 309 355 179 142 134 256 365 219 192 190 180 437 -45 231 202 7
2244 7 225 130 -33 -32 218 -22 -33 -80 -156 168 -307 -387 -310 -247 -130 -411 -333 -192 -173 -252 -175 -195 -450 -164 -313
2269 -313 -158 -353 -327 -348 -311 -489 -239 -87 -112 -303 -71 -373 -137 -86 -28 -197 126 125 0 377 64 146 -46
2292 -46 150 432 293 181 274 180 104 247 287 378 210 155 275 41 421 365 213 184 23 59 205 -22 149
2315 149 92 57 97 153 54 118 217 -99 254 -155 -27 89 -213 -166 -157 -477 -168 -348 58 -181 -423 -39 -266
2338b66j0L10k28j95Q9kJ54J5k29K18k25M2K50j9k8k4O2J63R4l29L69q8k5k67
2362a69L58k96L45p4p1J64L8j38N4j5q5J26R3l63L26J32jk12K88j79j71K09k7
2385C32j79J92j91p2N6J42j43j20J37j12m7m0K16o8k81K24r0J3k42K54k38K20
2407c7J2l47K09N4l45J50J69k36J21J69j59j91L39j94q3J16j61J56J4l9L49Qk05
2430a31j72O4J82j28L00k41J43l5P3J26o8j6L6j9m0J58l3N9k70R0J18J53j82M7
2454B14kN5J26j33m9k39K96L2n1J61k88j94K24j75L65k31k41L83j15k73K80k15
2476g0j4J65j45J00k24n1J44P8n25M03M5k97K90M1k92J29M50o05O9K23j90oK22
2499f0Nl45l97J019j83o3o04L99J76J01l01N97l42k77n08J020k22K43l22k04N04
$$ plain form
2338 -266 -276 34 -194 -389 -300 -302 -148 -133 -362 -144 -369 -327 -77 -96 -124 -148 -86 77 171 -158 211 123 98 -169
2362 -169 189 -107 238 164 93 257 295 157 211 196 111 237 330 -33 293 425 424 212 500 321 150 359 332
2385 332 153 345 154 82 138 280 137 17 154 42 -5 -45 171 103 -178 46 -44 -31 -273 -19 -257 -37
2407 -37 -25 -372 -163 -109 -454 -304 -135 -371 -250 -81 -240 -431 -92 -286 -369 -253 -414 -258 -244 -283 66 74 -131
2430 -131 -303 -239 -57 -185 115 -126 17 -18 55 181 113 97 133 114 74 232 199 258 -12 78 196 349 167 214
2454 214 212 267 393 260 211 -28 268 300 249 410 122 -72 152 -23 342 111 -130 253 138 -135 145 -70
2476 -70 -84 81 -64 36 -188 -239 -95 -17 -542 -139 -94 -391 -101 -60 -352 -223 227 -378 -309 -86 -276 -282 -60
2499 -60 -55 -400 -797 222 39 -24 -628 -229 -53 48 -253 344 2 -275 -783 237 15 258 -64 -268 236
2520B36K08J65k45k7K35L60n58M04k68l38K10j95q4j96K42K77p54J83M53m66j8
2541a76q77J051M02o83l05R64l9m12R44q64j77J48P44q62J57P2l91K6M28l14o24
2562g88M41J16mJ4m77J028l54l55k70M14j1N31m00M30m37m58Q04o53J47n7J47
2583a92k24K57J33j95M20p25M12j91l69J364j129N82n86N65n0k7P20o21n92o5
2603e13J158n05m94K58N08j11j39K70P22j036q7O2j211J173L24m21L67q81R42
2622C86j63N0m96m44R59K48r34L57J47m60m2L44o20P33K89n26Q3J37o10l01L25
2643e38M87n44J01P52J78o26q9K28Qm54M88K38o4J70N52j323O64p70J65J393o02
2664D14k5lo36L81m13J49M44m27M1O6L16O2J84j87n0j18m22o5j21J50K61L45l02
$$ plain form
2520 236 444 609 364 337 572 932 374 778 510 172 382 187 103 -93 149 426 -328 -145 308 -158 -176
2541 -176 -1053 -2 400 -283 -588 376 337 -75 869 5 -172 -24 720 -142 15 87 -304 -278 150 -164 -788
2562 -788 -347 -231 -235 -221 -698 330 -24 -379 -649 -235 -246 285 -115 315 -122 -580 224 -429 -282 -339 -192
2583 -192 -416 -159 -26 -221 199 -526 -114 -305 -674 690 -439 143 -443 122 72 45 765 144 -448 -513
2603 -513 645 140 -354 -96 412 301 162 432 1154 118 31 93 -1118 55 379 -42 325 -556 386
2622 386 223 273 -223 -667 292 540 -394 -37 110 -350 -392 -48 -668 65 354 -172 -89 48 -562 -863 -538
2643 -538 -51 -595 -494 258 436 -190 -279 -51 -43 -497 -9 229 165 335 887 -436 228 -542 -377 1016 414
2664 414 389 386 -250 131 -282 -133 311 -116 -75 -9 307 369 553 366 316 198 -224 -289 -410 -260 1 346 44
2687D4K62Kq65K48M35l45N98K68l92j12L24P2l74k83j23L9m75O96l13m49K34N21
2709A2o26J107r59J92M44q50O10n50K37k50r4Q23l95J32J89l22M72K2j00Q1j90
2730a5M1O33o30o65Q24l20J0j91L8P01p17P72P5m40L73m51j37j52n7L81M11o05
2752a21P49j056O07%l10k59N35M00j13l05M47j92j03k46p58L58N07l48LK88Q7
2773A70k75l4K43k93j27Q6l02L26M56J23n83K63k34M1j97L15j19J88j96M2j36
2794b43k96M97j59K8m83R54l20k21j67O61R0j5k23M96P9r01N36lj35j092Q46r8
2816a69o67J72J101J25k55M92O1m62L08o11J01R1k60J90j92j02J53Q3j15OQ0J97
2838C27l81O1J09O9k30J72j9q6r6J76L6o9Q4J1j44o7q9J11q0k36K57J02k24J26
$$ plain form
2687 44 306 308 -557 -309 126 -219 379 647 255 143 467 539 165 -118 -241 -202 -677 19 -294 -743 -509 12
2709 12 -614 493 -466 -274 170 -680 -70 -620 -383 -633 -727 96 -299 -167 22 -300 172 194 94 175 -15
2730 -15 26 659 29 -636 188 -132 -122 -313 -275 426 -291 481 556 116 489 38 -99 -251 -308 73 484 -121
2752 -121 628 -428 179 179 -131 -390 145 545 432 127 574 382 279 33 -725 -367 140 -208 -205 83 170
2773 170 -105 -139 104 -189 -316 -230 -532 -206 250 373 -210 53 -181 -140 -337 -22 -141 47 -149 -107 -243
2794 -243 -539 -42 -201 -173 -656 298 -22 -243 -410 251 341 326 103 599 678 -223 313 310 175 -917 -71 -169
2816 -169 -836 -664 437 562 307 799 860 398 706 95 196 287 27 217 25 -77 76 159 44 50 130 327
2838 327 -54 7 116 185 -45 127 108 22 -74 102 138 69 153 164 20 -47 -136 -25 -105 -341 -84 18 -206 -80
2862h0P3k74L51o5j50K50q1j43j53R8J05j66K5K23p7n8J97j69K08o8J12k43J00
2885A5m0J58q6R8k27J10P6J76o3r0j98%J79O9n9Q0Q8m68J88N6J82o6J79nn84M13
2911A81p5J02j38J37j37k43L77l38j12J50K09k45J59j57L67k62j1m9j55K59j24
2932a05J56n1j97K75j50p9L5j67M19m54j42M41k58K57k76J42n3p9K28O9Lj54J56
2955A6j8j03K27J82k25j45M71n71K27n6K08J67m11n6J14K9k19Q0K20r7K92k06
2977A26p1q6L37j60P8p4N7J01l33N6P3Jk46L68j71J99k11j1n4p8L37k47j15J78
3001E4o4k19J53N5J21O3k21j16K29J09m36P6J26k74L50q9L9j57m2J90M4J1j91
3024a89K56r1p9j20J85K5l2Q4k24R7j6J56o3R3O6L10n67L24o0n6m4L44M7J8o11
$$ plain form
2862 -80 -7 -281 70 5 -145 105 24 -119 -272 -174 -69 -235 -210 13 -64 -122 75 -94 114 46 158 -85 15
2885 15 -25 133 47 145 -82 28 104 280 217 127 -71 -71 108 177 118 198 286 -182 6 62 244 178 357 352 -232 181
2911 181 106 208 70 207 70 -173 204 -134 -246 -96 113 -132 27 -130 237 -25 -36 -85 -240 19 -105
2932 -105 51 0 -197 78 -72 -151 -116 -283 136 -318 -460 -19 -277 -20 -296 -154 -207 -286 -58 11 14 -140 16
2955 16 -2 -105 122 304 79 -66 405 -166 61 5 213 380 -31 -87 27 56 -163 -83 137 40 332 126
2977 126 55 -31 306 146 224 150 207 308 -25 31 104 105 -141 227 56 255 44 33 -21 -99 238 -9 -124 54
3001 54 -10 -229 -76 -21 100 163 -58 -174 55 164 -272 -196 -70 -344 6 -83 -44 -201 -243 -53 -9 2 -189
3024 -189 67 -24 -103 -223 -38 -13 -45 39 -185 -88 -104 52 -11 82 148 458 -109 215 155 99 55 399 446 464 -147
3049a47K80P6k71o5L98N9k32q0P8j19q3Q6j80O56k77K56O2l11m9K00j52j13K0
3072I2j0j92L85l49k34L57j58j28K09l02M38l95R86p27l00K51P0j05Q2L9m8k48
3094b87K40N52k75l26k36N55o24M49q1O00j03M6l52n95J16J09k21P17j18m95J29
3115b00K87K21m19j89N12r8M14J67p2r70k46R28j62L67m35N48j388J455j27j99
3135C94j9j81L47j80m31M5L68o07N45j91J40n57o8R48l16N76n27k55K75L34j498
3156h58J317k0j268m6J44P16m56P9J031k10n15k2O06n10k54J315j087M54o47M91
3176B60J65o33L55J49Qq30O20N08m71O52j018L80n94K42j6N49K26j53q05N45k28
3197h9J58R2Q2pk51J49K46j28l33j54N96k80l4q5O6Oj35L64k2k47J82j75j81M08
$$ plain form
3049 -147 133 209 -62 -127 271 330 98 18 96 -23 -106 -20 -200 456 179 435 497 186 137 337 185 72 92
3072 92 82 -110 275 -74 -308 49 -109 -237 -28 -330 108 -287 699 -28 -328 -77 -7 -112 -30 9 -39 -287
3094 -287 -47 505 230 -96 -332 223 -401 48 -33 567 464 510 158 -437 -321 -212 -433 284 166 -329 -200
3115 -200 87 308 -111 -300 212 114 528 695 623 -347 -593 335 173 540 105 653 -735 720 593 394
3135 394 375 194 541 361 -70 -25 343 -264 281 90 230 -327 -395 553 237 813 286 31 306 640 -858
3156 -858 459 439 -829 -875 -731 -15 -471 -392 639 429 -86 -108 498 -12 -266 1049 -38 416 -231 260
3176 260 425 -208 147 296 304 -526 94 602 131 783 -235 145 -449 -207 -223 326 552 399 -406 139 -89
3197 -89 69 161 243 236 -15 134 380 252 -81 -235 361 81 47 -38 28 34 -101 263 241 -6 176 1 -180 228
3221B28L4n17J09J74jk4J48l58K16j26k81M23k9n2lo2nj49J71J57M9k13K26rj97
3246i1Pj0j4k3j45J49K51k54R3L4o9o2l3R5O6P6L3Q8j32J26k77j26M52j62J24
3271A96l48O6K93J6k25k59L62m3O3m3j51o5J41K81j85J35j20l2j08J01p4p0Lj48
3295b14K02Oj51L99n21K54J04j93J53j75M7N8j13j75L09m4j70J69q5j49RK58j83
3318b05M17m31J23o7K24j49k99N22m50K64J77k97J66l3Q7j3l07L41R5j28l43K91
3340a5J18p4J54n92K36n9L14l0o1PL94k85p8J11l0k15J08L3L89j24m97J60K27
3363A91j13op2K82j14q06K68M50l1j60l82N11L35m73Q5K3K12K53p45Q7K50K12
3385B57l69M24m98j28P65m51o76O63n07O57q9m96O04p50M53J49J57n78P42l42
$$ plain form
3221 228 262 -255 -146 28 27 3 151 -207 9 -117 -398 25 -4 -56 -59 -121 -126 -275 -104 53 102 -111 115 106 -91
3246 -91 -84 -94 -108 -131 -276 -127 124 -130 -37 -3 -72 -134 -167 -72 -6 70 103 191 59 185 -92 -218 234 72 196
3271 196 -152 -86 207 223 -2 -261 101 58 121 78 -73 -138 3 284 99 234 114 82 -26 75 1 -69 -66 -214
3295 -214 -12 -6 -157 242 -279 -25 79 -114 39 -136 -89 -31 -144 -319 -10 -54 -224 -55 -140 -289 -280 -22 -205
3318 -205 212 -219 -96 -163 61 -88 -387 135 -315 -51 126 -171 -5 -38 49 36 -271 70 165 37 -306 -15
3340 -15 103 29 183 -409 -173 -232 82 52 -9 -2 392 107 29 140 110 -105 3 36 425 301 -196 -36 191
3363 191 78 72 0 282 168 -638 -370 80 49 -111 -493 18 353 -120 -35 -12 200 453 -292 -205 45 257
3385 257 -112 312 -186 -314 451 0 -676 -13 -520 137 48 -448 156 -594 -141 8 165 -413 329 -13
3405a3K46l28m54J18K47o4j13N07O75n75J41n34k2M82k68L05m34K36K02k67l0
3426E7l03J08K92j28J84K17K2n87O46j50K6o50N01m57N95k42J4l30K59k9K72o73
3448c56L01l04P7L79k84J13J58J5k13n80O75Q5n71L94M84n98J20J5K43l23Qk4
3470a86K63m4k46J02j22K95l66M30J89J7j88M5k24J20r1k77P30l86J43l31K43
3491A16K7L08q50j02P15j6m28R7j29K10J61J98n85L21r19P54J79k21K94l55M70
3512B45k09l30M4K99J28j21j23O9K07j51j22j91j04p8O63J7r46M43l03M23N6o9
3534a53N16m79o5j86QM10j41o5K55j15j77J6Q6Q7k28L02k53O9K01k75M52j94k02
3557a31Q3J05j0P6Q4J28k69l9K70m49J25K48jk34j53K25J09k91K76PJ80j05k25
$$ plain form
3405 -13 233 -95 -549 -431 -184 -248 -361 146 821 246 387 -147 -169 313 45 350 -84 152 354 87 57
3426 57 -246 -138 154 26 210 427 449 -138 508 358 384 -266 235 -222 373 131 145 -185 74 45 317 -356
3448 -356 -55 -359 -282 97 -187 -74 84 99 -114 -694 -19 66 -505 -111 373 -225 -105 -90 153 -170 -162 -186
3470 -186 77 33 -213 -111 -233 62 -304 126 315 332 144 189 -35 85 -6 -283 447 61 204 -127 116
3491 116 143 451 -399 -501 214 198 -230 -133 -262 -52 109 307 -278 43 -876 -122 57 -164 130 -225 245
3512 245 36 -294 -250 49 177 56 -67 2 209 58 -64 -255 -359 -437 226 243 -703 -260 -563 -140 -84 -153
3534 -153 363 -116 -181 -367 -359 51 -90 -155 100 -15 -192 -176 -90 -3 -231 71 -182 -113 88 -187 265 71 -131
3557 -131 -48 57 47 123 207 335 66 27 297 -152 -27 221 220 -14 -167 58 167 -124 152 159 339 234 9
3580I%J28k86K42J16l28l3n1L44oj77l74M76K03j53l42J23K77o6J3P8q9qr2J9
3605B3Q5q0p9M19l06l30r3L87m7R7K37j58l03K6L41o7k53M7J43k45N8l69O37K0
3629A90k34j94N76l91L28Q9k04o02Q69l25k08L30jQ4k45o5L2L31l70K03j91k2
3651b0k99J57M13j50jl02L84j49k15RJ91j65k10k89L99L20n75N63N5k17m96N37
3673f0j12N04m11K98j36l34K27o02K72N38l52J52J48j53L3j50q5p8P9L28l02O
3695a90O7K74p8r3N0k27L20l0K03j99K51l10J71k14J76m7j69O5J35k25J35K91
3717C56k33j67n5K16k74J69N2l20K79P8l19L16J27l24K26q9k95J12K17J67q3j28
3739B8p5K54l06L31l19P8J21j97K8J62k9Mjj67j52L33r4Q3m1j04q6Q8J24k37K98
$$ plain form
3580 9 9 137 -149 93 209 -119 -152 -203 141 135 -42 -416 60 263 110 -232 -109 168 102 115 193 104 96 4 23
3605 23 108 28 -51 368 62 -268 -361 26 -21 76 313 155 -148 -122 219 152 -101 -54 89 -156 -98 -467 170 190
3629 190 -44 -238 338 -53 275 364 160 -442 427 102 -106 224 223 307 62 -3 29 360 -10 193 2 -20
3651 -20 -319 -162 251 101 100 -202 182 33 -182 -173 18 -147 -357 -646 -247 73 -502 61 116 -101 -597 -60
3673 -60 -172 332 -79 219 83 -251 -24 -626 -354 184 -168 -16 132 -21 12 -138 -223 -301 -222 106 -196 -190
3695 -190 -123 151 73 -20 30 -197 123 93 296 97 348 38 209 -5 171 124 -45 20 155 -70 65 356
3717 356 123 -44 -99 117 -157 12 64 -256 23 101 -218 98 225 -99 127 38 -257 -145 72 239 156 28
3739 28 -47 207 -99 232 -87 -9 112 -85 -57 105 76 80 79 -88 -240 93 -1 82 41 -63 -149 -61 63 -174 124
3764A24m21L93o5k9k62K48nN3j07O1n4J42j09r6l0P0P2k3N5k29K57j00J67j78
3788f6J20o8N4q8j24K02m3m4J77J89r6j71rQJ62j75o3rJ93o8R3r4k27K21K51k08
3814A17k75J54m2Ok53L94j80R6P3n3k89J67J19p5j50K21k55j67L21J28m8P8j32
3837d5p1J13O6j00J46k01J24k6r0M8J81j10k38J05k18O24m46J48j05L38l77K22
3859H8k09L72l81P7L42m26J7M82m23K0N2K00k21L55m88M90j39m80N4O0L22m41
3881b77N46m60P60o61J57Rl6j73K77p7J88m2l21j8k85O15m02L09o66K68j0Q0N1
3904a68O70j53l28j28m99P62n8j93K42l01L55n08M73l48n71O43P1P9N70q74Q6
3925a78J52J71j93J75p53Q16j74l10J59J06K47J39p2o43l4P22m50n8P5J59K27
$$ plain form
3764 124 -297 96 31 2 -260 -12 -17 36 -71 -10 -64 78 -31 -127 -157 -87 -15 -38 17 -212 45 -55 112 -66
3788 -66 54 -14 40 -48 -172 30 -13 -57 120 309 213 42 33 41 203 28 -35 -44 149 81 174 80 -147 74 325 117
3814 117 -158 -4 -46 -40 -293 101 -79 17 90 37 -252 -85 34 -41 -191 30 -225 -392 -71 57 9 87 -45
3837 -45 -116 -3 63 -37 109 -92 32 6 -84 -36 145 35 -203 -98 -316 308 -138 10 -95 243 -134 88
3859 88 -121 251 -130 -53 289 -137 -120 362 -61 -41 11 211 -10 345 -143 347 208 -272 -218 -158 164 -277
3881 -277 269 -191 569 -92 65 74 38 -135 142 65 253 211 -110 -128 -413 202 -200 109 -557 -289 -299 -219 -168
3904 -168 502 349 21 -107 -606 156 98 -95 147 -154 201 -307 166 -182 -753 -110 -39 40 610 -264 -178
3925 -178 -26 145 -48 127 -626 190 16 -294 -135 -29 218 357 285 -358 -392 330 -120 -178 -103 56 283
3946B83l99O19n03k6m40K00M25J05m71J85m85N49l12J63O27n74N40n06p6k63M67
3967A08j44J1N6J83l81J15n97N28l6P03r99J35N20j22j71J0k89J78J46n4PL7k27
3990b83L79J64o43L97L32n46P68l41l40M6o3N73l66j1j43N05m36k18M19l32k35
4011c74L22R1N22p54k09N9K74nL24o29K78l13J184j881J067J30J40n36M18k49
4031a41k10Q79m53q31N29J67M94l65k3L41q11K85K8L13n90R8Q6M07j27l34K69
4052A1L04O6m46J50n19K43N08q38N23o20j05N60m51N74l12O93m4r33M49j92Q42
4073D63o80N20l0j75m69K23j7k56R20k13j88m15P92m81j10K38o4M92m62m9M8q8
4095ak03l46Q93j33q66J154p66L66l18K18J92l20K33K5j38k81J82O23k43j26J80
$$ plain form
3946 283 -116 503 0 -26 -466 -266 159 264 -207 -22 -507 42 -270 -107 520 -54 486 -20 -96 -359 108
3967 108 -36 -25 31 214 -167 -52 -649 -121 -157 546 -453 -318 202 80 -91 -81 -370 -192 -46 -100 -93 -56 -283
3990 -283 96 260 -383 14 346 -200 568 227 -113 -67 -130 443 77 66 -77 428 -8 -226 193 -139 -374
4011 -374 -52 39 561 -193 -402 -343 -69 -74 250 -379 -101 -414 770 -1111 -44 86 226 -310 108 -141
4031 -141 -351 528 75 -756 -227 -60 434 69 46 387 -424 -139 -111 202 -388 -290 -204 203 76 -258 11
4052 11 315 381 -65 85 -434 -191 317 -521 2 -618 -723 -163 -614 -40 -352 341 297 -636 -187 -379 463
4073 463 -217 303 273 98 -371 -148 -165 -421 499 286 98 -317 475 -6 -116 122 58 550 88 39 87 -1
4095 -1 -204 -550 343 210 -656 498 -268 98 -220 -2 190 -130 103 128 -10 -291 -109 514 271 145 325
4116C25n72Q0l10Q42m00J71K90j25j99L4l97P88n48l47K49l59N66m7j49R5O54
4137F41m96n26M46K31p24M35j63J02K41k32K71n68M31j04J61J26k98m6J10N2k04
4158a14L1oN3j48N09j18l4J59l52J72O2j29N0m94J81j45Q3L6M78o58j76J069j019
4181e10K90J39l54j26L22L93K78k6k44n44K2M90l64J94l37N76j71R9m58K49N6
4202b6k74K27L64n71M66n7k72jK33Rj34L97m36j32L1k7L76k09K71n19N52m71J55
4225d8J8k42M94l18J05o18Q64o11R4L95PK10l7m5J77m71M62l71L08k62k62N33
4247C82k59m65n8J09J69L63l70k20P85J42o41J52J43l99J10l48K54J83J29j033
4267h72Q00N6j48L61k19l08J41%k35n65M54P12m26J91n06P47j84n03Q84l19L9
$$ plain form
4116 325 -247 -167 -477 365 -35 136 426 301 102 136 -261 527 -21 -368 -119 -478 88 41 -108 -13 641
4137 641 145 -381 65 296 -428 7 -156 -54 187 -45 226 -342 89 -15 146 272 -26 -72 38 90 -114
4158 -114 -83 -89 -36 -184 325 207 173 332 -20 152 214 85 135 -359 -178 -323 -240 -204 274 -384 -560 509 -510
4181 -510 -220 -81 -435 -561 -239 154 432 406 162 -382 -360 130 -234 -40 -377 199 28 127 -331 -82 -26
4202 -26 -300 -73 291 -280 186 129 -143 -144 89 98 -36 361 -75 -207 -176 -203 173 -36 235 -284 268 -203 -48
4225 -48 -30 -272 222 -96 9 -609 255 -356 -262 133 140 350 313 268 445 -26 436 65 373 111 -151 382
4247 382 123 -342 -400 -291 -122 241 -129 -349 436 578 -63 89 232 -167 -57 -405 -151 32 161 -872
4267 -872 -72 -16 -164 197 -22 -330 -189 -189 -424 -989 -535 177 -249 -58 -564 183 -1 -504 380 61 100
4288A00o32R21m12l19K4K5o57R50k11m71J02R5P3J06L77j05n38K92K28L70j13
4309B05k02M2L16o21R0M67o05N43J81k83m08L74j95J41l55N28j87N2k60N15n91
4330b53P44o11J55K76l61L76o46K66j93R9L68k49k2L6l19R96o31m64N97m27o1
4351c24K21N7R6K81J32o44j67P40m77j95J12j95K91o7L51o86P73j97l75P7K24
4372B8K0K1J48k80l1K28m97M95J22j14j04L6k62K87J73l20K46n21J71L77q4k1
4394A18j31j45K15pQ5j90j36K14j00O0Npq0K18k44j98J00L37k04P7K56k78q5Q9
4418c1J14m3n6J96k40j12pJ63j27J49r3MJ66R1l9j15Q9k38J03J83k44J5L00j71
4442E7K4j66K79r2k2K2Lj52m0J01J61q7k19J65n5K5J96m87J32K83j58l05K85J01
$$ plain form
4288 100 -532 389 -23 -342 -318 -293 -950 0 -211 -682 -580 -485 -412 -306 71 -34 -572 -280 -52 318 205
4309 205 3 45 361 -260 -170 297 -308 235 416 133 -275 99 -96 45 -310 218 31 83 -177 338 -253
4330 -253 491 -120 35 311 -50 326 -320 -54 -247 -148 220 -29 -51 -15 -334 662 31 -433 164 -263 -324
4351 -324 -103 -46 50 331 463 -181 -348 392 -85 -280 -168 -363 -72 -139 212 -474 299 102 -273 -196 28
4372 28 48 69 217 -63 -94 134 -363 132 254 140 36 72 -190 97 270 -50 196 -325 -154 223 139 118
4394 118 -13 -158 57 50 135 -55 -191 23 -77 -17 -12 -19 -99 119 -125 -323 -223 114 -90 -13 243 -35 -120 -31
4418 -31 83 40 -16 180 -60 -172 -179 -16 -143 6 -87 -83 83 174 135 20 109 -129 -26 157 -87 -72 228 57
4442 57 81 -85 194 102 80 102 105 -47 -87 14 175 88 -131 34 -21 4 200 -287 -155 128 -30 -335 -50 51
4466E1l8L9J48j85K83l44J03nn7N3j00M09m65O64m71m44L09K43o50J53K2K07m3
4489a18L57j75L83p72M64K47r38R62m18L72m46J99lj61N07m04k62N36l54L03j51
4510A28k07M8r8L30q22N29j17q3R13j312Q77m03K35L4n98M98N31r21J037q98J27
4531a72J4N33p25R9K22r5K31k74j68M06r7L63r4l02pk10K74J06N9j8Q9k6l62L79
4555B25j11O0m20j07L92N5l1k14n6L44l32K08J6O9j7j33J69j81j37K37N9k54P8
4578h1J2l6j50K91n8j49K16P7n7j88K7m23N12Q7k65J42J83j59j94L79L1k62K5
4601d0N2K03M60j38O5j042J49J36m02M20K88k84m22J28P54J23o55M24J04m81j6
4622a74n26M19J67K73J14k87j25K00j13N7J62M5q3k47L04j18l11Pm80O66q3K94
$$ plain form
4466 51 13 52 200 15 298 -46 57 52 -5 48 -52 357 -108 556 85 -359 -50 193 -457 -304 -282 -75 -118
4489 -118 239 64 447 -325 139 386 -552 410 -8 364 -82 117 114 -47 460 56 -206 330 -24 279 128
4510 128 -79 -31 -129 201 -621 -92 -209 -292 621 -691 186 -217 18 52 -546 -48 483 -438 599 -299 -172
4531 -172 -158 375 -350 -251 -29 -124 107 -167 -335 71 -26 337 243 -59 -66 -276 -2 104 163 145 234 208 -154 225
4555 225 114 174 -246 -353 39 94 63 -151 -207 137 -195 13 29 98 81 -52 117 -64 -201 36 95 -159 -81
4578 -81 -69 -105 -255 36 -22 -171 45 122 65 -123 -96 -519 -7 80 -185 -43 140 -19 -213 166 197 -65 -40
4601 -40 12 215 675 537 602 -440 -291 -155 -557 -137 151 -133 -555 -427 327 450 -205 219 323 -158 -174
4622 -174 -700 -281 -114 159 273 -14 -139 61 -52 5 167 212 129 -118 186 68 -243 -236 -716 -50 -133 161
4644A61k39m6m7L0j67M06J40j89K18k65O8N5M94n59k02K5M17lp48K52r2k0k84
4667e95M12j90l1k06l3O91j63M38j42k54j61K52j36j23Q80r50N38M57q25l03J40
4688c04O50o6l10m99O14k15N34l2l30J27j04O6q36J179o03k94N82m49M71K0j64
4709C7k56N92n30J81L72j3n80L25l89K71P2l00P0L98J45q81R29q57L00L77J20
4730C83n00R9j07K30J9n4Q7O3l97J2L36k66K03j11K92k92J93K76n24K96J20M5
4752D03o10R7N7q7L78m17K64k45J90N17r32O75J47J1n38L25J89l94Q58l56p99
4773b67K2N31n50J136j180M51m42O40J53J42m11J67m1j5q01M82J04k02L72qk23
4794F0m96M6Q8N26L23o30k04L98j98L30o86QN36j14o46N56J49P34l91j241J1Q13
$$ plain form
4644 161 -78 -124 -171 -141 -308 98 238 49 267 2 70 125 619 60 -142 -117 300 297 -451 -199 -291 -311 -595
4667 -595 -183 -373 -404 -610 -643 48 -115 323 181 -73 -234 18 -118 -241 639 -311 227 684 -141 -444 -304
4688 -304 346 280 -30 -529 85 -130 404 372 42 169 65 131 -705 474 -129 -423 159 -290 181 201 37
4709 37 -219 373 -157 24 396 383 -197 128 -261 10 82 -218 -148 250 395 -486 443 -414 -114 263 383
4730 383 -117 -18 -125 105 124 70 157 220 -177 -165 171 -95 108 -3 289 -3 190 466 -58 238 358 403
4752 403 -207 -110 -53 -140 238 -179 85 -160 30 547 -385 290 437 448 -90 235 424 30 888 532 -267
4773 -267 -245 286 -264 872 -308 143 -299 341 494 636 225 392 351 336 -465 17 121 -81 291 283 60
4794 60 -436 -390 -302 224 547 -83 -287 111 -87 243 -443 -435 101 -13 -659 -103 46 780 389 -852 -841 -28
4816b8n26J019n65M87J39j41o11O08q13N53k0L98l98o94P91m53M06P87p37n04
4836c02J648q67r55Q33j98o96J049o1k46q97Q13k38J29M05r37j1K41M25m7jM34
4857E21m12J44kj36l40k51J89N65l1N19j285N08N7J08k08l85M11m53Q93k27P0
4878B55n2l60N7j84L87K00k14J36j38L1l25K61J45j44j49k05K51N3M4K18m08l7
4900a78J94J30k6K73l00j89J99mM5k67J04R7j19j26K64Pl0nOr3k5j69K21j1j0
4925a2Nj71J05n9L75k21J29R5k62j02J66J5j4l6K41l04n5Kl8MJ45J54k73M0k09
4950b80J47J65N8l0j40J97k21P8J71k90J68P4j54NN9O4j40P7J01J12k10R1Oo7
4974D1l70J50L8Q4J45M8m4j29J95m2l81L68k62K40j85L63m08J16P1J05l1j51J40
$$ plain form
4816 -28 -554 465 -100 387 526 385 -226 382 -431 122 102 500 102 -592 199 -254 152 939 202 -302
4836 -302 1346 479 -476 357 159 -537 512 451 205 -692 121 -117 12 417 -520 -531 -290 135 88 87 521
4857 521 109 253 251 115 -225 -476 -287 278 247 766 -519 -11 46 154 -54 -439 -28 -481 412 185 255
4878 255 203 -157 -100 -284 103 303 89 225 87 118 -207 54 199 55 -94 -299 -48 5 49 267 -141 -178
4900 -178 16 146 120 393 93 -96 103 99 144 -123 -19 78 -41 -167 97 104 74 69 75 -18 -43 -212 9 -2 -12
4925 -12 -7 -178 -73 -132 243 22 151 246 -16 -118 48 63 49 13 254 -50 -105 -103 -141 -137 8 162 -111 -71 -280
4950 -280 -133 32 90 60 -80 117 -104 -26 145 -145 23 97 -57 -52 7 71 -69 8 109 221 11 102 108 41
4974 41 -329 -179 -141 -57 88 136 92 -37 158 116 -265 103 -159 81 -104 259 -149 -33 38 143 112 -39 101
4997A01K79j41j46j90J54r8l1J77j5r2j71Q3Q7K57l87K33j25J93k30J7o1R4j0
5020b2J3M4j78K23k39J18r7q7K68k8J52m9j58J65l37M03j47r2J71j62p0J42K11
5043B44j04j84J29J14n8j35J55l40R9j3J86l6j82mQ7J70p8Lq1j08l2J70nJ56l06
5068a53P3M00k72J0L24l44K55l79K81m91L83l15J93o3K34n3J14r2O1L0k15R7J39
5091B17m55J91J07k27K65k63K94l43K33R6J08l04L2J11kj66L10j79m8k3k6J47
5113G5q2m4r9Q9L4K4q3l5K08j87K80j36k1N2n6J09k00K76j05l77N96j77j55K15
5137B01k36J74J54l39k20J83n07M42N32l25j14m58J30N15o69L55Q86m06p20Q6
5157c36M31L62n67k42J81K15K26l16M63j74o29O61K35r15J76k74L37j53K76Q1
$$ plain form
4997 101 380 239 93 -97 57 -41 -72 105 90 -2 -173 -90 -3 254 -133 100 -25 168 -62 -45 -106 -12 -22
5020 -22 -9 35 -143 80 -159 -41 -138 -225 43 15 167 118 -40 125 -212 191 44 -48 123 -39 -109 33 244
5043 244 140 -44 85 199 141 6 161 -179 -80 -93 93 57 -125 -129 -42 128 50 53 -28 -136 -168 2 -3 153 -153
5068 -153 -80 320 48 58 382 38 293 -86 195 -296 87 -228 -35 -98 136 83 197 105 166 196 -19 78 217
5091 217 -238 -47 60 -167 98 -165 129 -214 19 115 223 -81 -49 62 60 -106 204 25 -23 -46 -72 75
5113 75 -7 -51 -150 -61 -27 -3 -86 -121 87 -100 180 44 23 75 19 128 -72 204 99 -278 318 141 -14 201
5137 201 -35 139 293 -46 -266 -83 -590 -148 384 59 -55 -513 -383 132 -537 -182 704 298 -422 -336
5157 -336 95 457 -110 -352 -171 44 270 -46 417 243 -386 275 510 -405 -229 -503 -166 -319 -43 38
5177C8l3J04l62L13j38m04K49K81qo5J86J48J14r41r4K00N55j30k06J3r28R33
5199a75O71n30k84N88K60k73o91M19J92j94R8j87L07n38P60r03oR6M99K06l89
5220g4n8k66K32k27L18N63M2n92o8P5N27n41K76r1N1J51k70j00N52m16k31L29
5242A82J44L55p38N1O02k61N0o99P09n31QJ84l39m3N10n16L67M9q8r2O31o70R0
5265d5J01k01n0J36k2M49j00m03N39l41j49J38l16P37m66n6J98k28J94q2M3J81
5287B57j02L1l06P8j33k23O20j53L39l06j66J03k38J42m6R8l0L0l32M90j61k09
5309b17K24R7m6P6m6M4l08K68k47O2K64k33j74J90J2M0J78k30j58J52j02r3L9
5332b08J28N2J71j43O7k81K75J29l50L6M15m57J33K67l01M3J39o4K3j10O2J09
$$ plain form
5177 38 5 109 -253 60 -78 -482 -233 48 40 -25 161 309 423 -518 -612 -412 143 13 -193 -180 -1108 -175
5199 -175 496 -34 -318 270 530 257 -434 -15 177 -17 81 -106 201 -337 423 -480 -486 -390 109 315 -74
5220 -74 -132 -398 -166 -393 -75 488 530 -62 -130 -55 472 -69 207 116 167 318 48 -52 500 84 -147 182
5242 182 326 681 -57 -6 596 335 385 -314 395 -136 -128 56 -283 -326 184 -332 35 84 -4 -96 535 -135 -45
5265 -45 56 -145 -195 -59 -81 368 268 -135 404 63 -86 52 -264 473 7 -49 149 -79 115 33 76 257
5287 257 155 186 -120 -42 -175 -398 222 69 408 102 -64 39 -199 -57 -103 -5 -35 -5 -337 153 -8 -217
5309 -217 7 104 58 134 88 132 -176 92 -155 -93 171 -62 -236 -46 -34 6 184 -46 -204 -52 -154 -247 -208
5332 -208 -80 -28 143 0 67 -214 61 190 -160 -124 291 -166 -33 234 -67 -24 115 51 74 -36 26 135
5354A35K9J38m66O2J43j48K52p8k04R0L8j15o2K75j34j53K27j38K32j13J00q8
5376B2j18J87j8j0n%k2J29p0m4j39J30N2k02N1J55Qq7j46J43r9P2k00N10m61K42
5402H0q8qj02J30LP8k10J58J12o1j33J19k36o8j92M17m5J65j08o9J65K5j75K22
5426A79j19j08J08k17O4k53L65r1l3K77k30Jn2k0K70j34q3mn9L83j49k00K97l45
5450a53J98o5N7j47K60nj19J10r1j66PN9m0J30O2p4J64k07J82k8k27q3M64k56
5474C2j18j8P5mL8k82J65K08J08J7jp3j67j84M14m63M2M49n66N35k29p0k1mM73
5499C56J1j23m0k94M32o00K6L07j35k8j1l93N70J31m31M83j85K0r7J9o5K18L3
5522B04qn68O63k89l8R4L05j41m19L42j95K35n3k73J91M7k83J85O7j58n6P3p4
$$ plain form
5354 135 164 302 -164 -102 41 -107 145 67 -137 -47 -9 -124 -186 89 -45 -198 29 -109 123 10 110 22
5376 22 -96 91 73 63 58 58 36 165 95 51 -88 42 94 -108 -57 98 106 19 -127 16 -83 -11 -211 299 -162 80
5402 80 -8 -16 -118 12 15 93 -117 41 153 92 -41 78 -158 -226 -418 -1 -46 119 11 -58 107 132 -43 179
5426 179 60 -48 60 -157 -93 -346 19 -72 -105 172 -58 -57 -109 -129 141 7 -76 -80 -139 244 95 -105 192 -153
5450 -153 45 -20 37 -110 150 145 26 136 45 -121 -114 -55 -95 35 97 23 187 -20 162 134 -93 -176 288 32
5474 32 -86 -104 -29 -33 5 -277 -112 96 204 221 220 147 -20 -204 210 -253 -211 238 -328 207 -22 -92 -113 -117 356
5499 356 367 244 204 -90 342 -258 -232 75 -60 -88 -99 -492 78 209 -222 261 76 96 -1 18 -47 171 204
5522 204 196 -372 291 2 -36 58 363 222 -197 145 -50 185 132 -141 50 97 -186 -1 66 -92 -148 -75 -149
5545a49L23l57K23r0qj21L89N4k70K84m84j6K78k98L05l8j1r2o8M02j06k16M7
5568a9j98K25J66mj27M6l70J82n6M02k39K92m63J76J9J07m3k65K34j83J55k07
5590a70L06nj36j01K22q3J29L4k07Q0O1m48L70o4p2K49j17k31J16j48J95j82M67
5613B65l30J89m1j33K95k70M9j3lJ6k26%J50k29M51k42R9oq3K04l55O4M47k18
5637H0m14L13R0m98P53k96J63K7p3m34K81K56l99M21m44j38P11j04k71J47r7q4
5659a0N3J39j99p93N38n43P26M74m20k6M26m66L69p01M62j3j65n1K57k4k92M36
5681A77k31q8J5J48p4J47p2j10K16k18j5M6n3J07j71J88j03K48pN8k63J40J03
5704A88o7r5J51N3k52J85k87L0n4J12J01J71j90j26J17j78J81K38o7k16N4J3o7
$$ plain form
5545 -149 174 -183 40 -50 -58 -179 210 264 -6 278 -206 -222 56 -242 63 25 14 -78 -146 256 150 -66 -19
5568 -19 -217 8 174 170 43 89 -281 -99 -155 247 8 300 -163 13 32 139 96 -169 65 -118 37 -170
5590 -170 136 131 -5 -106 116 33 162 196 -11 69 130 -318 52 -12 -84 165 48 -183 -67 -215 -20 -202 265
5613 265 -65 124 83 -50 245 -25 24 11 8 24 -202 -202 -52 -281 170 -72 27 21 -62 142 -213 -149 298 80
5637 80 -334 -21 69 -429 324 28 191 218 145 -289 -8 248 -151 270 -174 -312 399 295 24 171 74 -10
5659 -10 43 182 -17 -810 -272 -815 -89 385 -35 -61 365 -101 268 -433 29 16 -149 -200 57 33 -259 177
5681 177 -54 -142 -127 21 -53 94 22 -88 128 -90 -105 -59 -112 -5 -176 12 -91 157 150 208 -55 85 188
5704 188 121 26 177 230 -22 163 -124 -94 -148 -36 65 236 46 -80 37 -141 40 278 211 -5 49 62 -5
5727eN7j34K60j96n8OJ16j27J55m0K2j36J78j55K3p0J15K4Q6j81j22L67l19o6
5751b00J93L2J15R2k06K54k63j85J08J37n6M8m8J61l18L00m62K90J4J5L9k1O3
5774A02k61L12k93K17k19j3K12P9j72J77j79n5L5K7l79N53J8j71k5J62j43l6K9
5797b3L7L3l90L70%j5J9j06K88r6L7l55L62l15K60J93m57%N1K43N4Rj43m69M77
5822F4q2N3l35L06j39K58j87J93k19Q4k6j42K98k88K52K5J77K10n84k35P28k72
5844A39l13L43k40K7J47o74J424r39n23J45J28R28k30k16m13n8n4R07o44l60O75
$$ plain form
5727 -5 52 -82 178 -18 -76 -70 46 -81 74 34 56 -80 98 -57 -34 -104 11 35 121 -60 -182 185 -134 -200
5751 -200 -7 25 140 232 26 280 17 -168 -60 77 21 69 21 182 -136 164 -298 -8 6 21 60 39 102
5774 102 -159 153 -140 77 -142 -155 57 136 -36 141 -38 -93 -58 -31 -410 143 161 -10 -35 127 -16 -52 -23
5797 -23 14 47 -343 27 27 12 31 -75 213 117 154 -201 161 -154 106 299 -158 -158 -107 136 190 199 56 -413 64
5822 64 -18 35 -300 6 -133 125 -62 131 -88 -4 -30 -172 126 -162 90 115 292 502 -82 -317 411 139
5844 139 -174 169 -71 -44 103 -571 853 -86 -609 -464 -336 592 362 146 -267 -325 -379 528 -116 -476 199
$$ [...]
8191F9
##END NTUPLES=NMR FID
##END=
