##TITLE=1H_SR62_m2
 CDCl3,8 sc, 
 3.02.2021
##JCAMPDX= 6.0         $$ Bruker NMR JCAMP-DX V2.0
##DATA TYPE= NMR FID
##DATA CLASS= NTUPLES
##ORIGIN= UXNMR, Bruker Analytische Messtechnik GmbH
##OWNER= root
$$ XWIN-NMR		Version 3.5
$$ Wed Feb  3 13:43:00 2021 Russian Standard Time (UT+4h)  she@DPX200
##.OBSERVE FREQUENCY= 200.1315066352
##.OBSERVE NUCLEUS= ^1H
##.DELAY= (6, 6)
##.ACQUISITION MODE= SIMULTANEOUS
##.ACQUISITION SCHEME= undefined
##.AVERAGES= 8
##.DIGITISER RES= 18
##SPECTROMETER/DATA SYSTEM= spect
##.PULSE SEQUENCE= zg30
##.SOLVENT NAME= D2O
##.SHIFT REFERENCE= (INTERNAL, D2O, 0, 15.7039)
##AUDIT TRAIL= $$ (NUMBER, WHEN, WHO, WHERE, WHAT)
$$ ##TITLE= Audit trail, XWIN-NMR		Version 3.5
$$ ##JCAMPDX= 5.01
$$ ##ORIGIN= Bruker BioSpin GmbH
$$ ##OWNER= she
$$ F:/spectra/data/she/nmr/H-F/1/audita.txt
$$ ##AUDIT TRAIL=  $$ (NUMBER, WHEN, WHO, WHERE, WHAT)
(   1,<2021-02-03 13:42:06.07 +0400>,<she>,<DPX200>,
      <created by zg, POWCHK disabled, PULCHK disabled
       configuration hash MD5:
       00 E9 B6 7A A2 85 ED C7 34 08 36 98 17 FE 4E 26
       data hash MD5: 16K
       F4 54 4A 9A 3A 28 20 7B 83 3F C4 85 51 91 F9 A5>)
$$ ##END=
$$ 
$$ hash MD5
$$ 20 85 C9 FF E4 25 5E 30 4F 80 F6 A9 1F 2F AA 44
##$RELAX= 
##$RELAX= 
##$RELAX= 
##$RELAX= 
##$RELAX= 
##$RELAX= 
$$ Bruker specific parameters
$$ --------------------------
##$DU= <F:/spectra>
##$EXPNO= 1
##$NAME= <H-F>
##$PROCNO= 1
##$TYPE= <nmr>
##$USER= <she>
##$AMP= (0..31)
100 100 100 100 100 100 100 100 100 100 100 100 100 100 100 100 100 100 
100 100 100 100 100 100 100 100 100 100 100 100 100 100 
##$AQSEQ= 0
##$AQ_mod= 1
##$AUNM= <au_zg>
##$AUTOPOS= <>
##$BF1= 200.13
##$BF2= 200.13
##$BF3= 200.13
##$BF4= 200.13
##$BF5= 200.13
##$BF6= 200.13
##$BF7= 200.13
##$BF8= 200.13
##$BYTORDA= 1
##$CFDGTYP= 0
##$CFRGTYP= 5
##$CHEMSTR= <none>
##$CNST= (0..31)
1 1 145 1 1 1 1 1 1 1 1 1 1 1 1 1 1 1 1 1 1 1 1 1 1 1 1 1 1 1 1 1 
##$CPDPRG= <>
##$CPDPRG1= <>
##$CPDPRG2= <>
##$CPDPRG3= <>
##$CPDPRG4= <mlev>
##$CPDPRG5= <mlev>
##$CPDPRG6= <mlev>
##$CPDPRG7= <mlev>
##$CPDPRG8= <mlev>
##$CPDPRGB= <>
##$CPDPRGT= <>
##$D= (0..31)
0 1.2 0 0 0 0 0 0 0 0.06 0 0.03 0 0 0 0 0.0002 0 0 0 0 0 0 0 0 0 0 0 0 
0 0 0 
##$DATE= 1612345325
##$DBL= (0..7)
120 120 120 120 120 120 120 120 
##$DBP= (0..7)
150 150 150 150 150 150 150 150 
##$DBP07= 0
##$DBPNAM0= <>
##$DBPNAM1= <>
##$DBPNAM2= <>
##$DBPNAM3= <>
##$DBPNAM4= <>
##$DBPNAM5= <>
##$DBPNAM6= <>
##$DBPNAM7= <>
##$DBPOAL= (0..7)
0.5 0.5 0.5 0.5 0.5 0.5 0.5 0.5 
##$DBPOFFS= (0..7)
0 0 0 0 0 0 0 0 
##$DE= 6
##$DECBNUC= <off>
##$DECIM= 32
##$DECNUC= <off>
##$DECSTAT= 4
##$DIGMOD= 1
##$DIGTYP= 9
##$DL= (0..7)
0 120 120 120 120 120 120 120 
##$DP= (0..7)
150 150 150 150 150 150 150 150 
##$DP07= 0
##$DPNAME0= <>
##$DPNAME1= <>
##$DPNAME2= <>
##$DPNAME3= <>
##$DPNAME4= <>
##$DPNAME5= <>
##$DPNAME6= <>
##$DPNAME7= <>
##$DPOAL= (0..7)
0.5 0.5 0.5 0.5 0.5 0.5 0.5 0.5 
##$DPOFFS= (0..7)
0 0 0 0 0 0 0 0 
##$DQDMODE= 0
##$DR= 18
##$DS= 0
##$DSLIST= <SSSSSSSSSSSSSSS>
$$ [...]
##$SUBNAM2= <"">
##$SUBNAM3= <"">
##$SUBNAM4= <"">
##$SUBNAM5= <"">
##$SUBNAM6= <"">
##$SUBNAM7= <"">
##$SUBNAM8= <"">
##$SUBNAM9= <"">
##$SW= 16.9725356469052
##$SWIBOX= (0..15)
0 0 2 0 0 0 0 0 0 0 0 0 0 0 0 0 
##$SW_h= 3396.73913043478
##$TD= 16384
##$TD0= 1
##$TE= 0
##$TE2= 300
##$TE3= 300
##$TEG= 300
##$TL= (0..7)
0 120 120 120 120 120 120 120 
##$TP= (0..7)
150 150 150 150 150 150 150 150 
##$TP07= 0
##$TPNAME0= <>
##$TPNAME1= <>
##$TPNAME2= <>
##$TPNAME3= <>
##$TPNAME4= <>
##$TPNAME5= <>
##$TPNAME6= <>
##$TPNAME7= <>
##$TPOAL= (0..7)
0.5 0.5 0.5 0.5 0.5 0.5 0.5 0.5 
##$TPOFFS= (0..7)
0 0 0 0 0 0 0 0 
##$TUNHIN= 0
##$TUNHOUT= 0
##$TUNXOUT= 0
##$USERA1= <user>
##$USERA2= <user>
##$USERA3= <user>
##$USERA4= <user>
##$USERA5= <user>
##$V9= 5
##$VALIST= <valist>
##$VCLIST= <CCCCCCCCCCCCCCC>
##$VD= 0
##$VDLIST= <DDDDDDDDDDDDDDD>
##$VPLIST= <PPPPPPPPPPPPPPP>
##$VTLIST= <TTTTTTTTTTTTTTT>
##$WBST= 1024
##$WBSW= 4
##$XGAIN= (0..3)
0 0 0 0 
##$XL= 0
##$YL= 0
##$YMAX_a= 408364
##$YMIN_a= -416609
##$ZGOPTNS= <>
##$ZL1= 120
##$ZL2= 120
##$ZL3= 120
##$ZL4= 120
##$ABSF1= 10
##$ABSF2= 0
##$ABSG= 5
##$ABSL= 3
##$ALPHA= 0
##$AQORDER= 0
##$ASSFAC= 0
##$ASSFACI= 0
##$ASSFACX= 0
##$ASSWID= 0
##$AUNMP= <proc_1d>
##$AZFE= 0.1
##$AZFW= 0.1
##$BCFW= 1
##$BC_mod= 2
##$BYTORDP= 1
##$COROFFS= 0
##$CY= 11.3945322036743
##$DATMOD= 1
##$DC= 2
##$DFILT= <>
##$DTYPP= 0
##$F1P= 15.9154993809931
##$F2P= -4.1035820241983
##$FCOR= 0.5
##$FTSIZE= 0
##$FT_mod= 4
##$GAMMA= 1
##$GB= 0.15
##$INTBC= 1
##$INTSCL= 1
##$ISEN= 128
##$LB= 0.24
##$LEV0= 0
##$LPBIN= 0
##$MAXI= 10000
##$MC2= 0
##$MEAN= 0
##$ME_mod= 0
##$MI= 1.114404
##$NCOEF= 0
##$NC_proc= 0
##$NLEV= 6
##$NOISF1= 3.799351
##$NOISF2= 2.8
##$NSP= 1
##$NTH_PI= 0
##$NZP= 0
##$OFFSET= 15.70392
##$PC= 1
##$PHC0= -10392.01
##$PHC1= 3.600952
##$PH_mod= 1
##$PKNL= yes
##$PPARMOD= 0
##$PSCAL= 0
##$PSIGN= 0
##$REVERSE= no
##$SF= 200.130013532006
##$SI= 16384
##$SIGF1= 3
##$SIGF2= 2
##$SINO= 400
##$SIOLD= 16384
##$SREGLST= <1H.CDCl3>
##$SSB= 0
##$STSI= 0
##$STSR= 0
##$SW_p= 3612.71676300578
##$SYMM= 0
##$S_DEV= 0
##$TDeff= 0
##$TDoff= 0
##$TI= <>
##$TILT= no
##$TM1= 0
##$TM2= 0
##$TOPLEV= 0
##$USERP1= <user>
##$USERP2= <user>
##$USERP3= <user>
##$USERP4= <user>
##$USERP5= <user>
##$WDW= 1
##$XDIM= 8192
##$YMAX_p= 0
##$YMIN_p= 0
$$ End of Bruker specific parameters
$$ ---------------------------------
##NTUPLES= NMR FID
##VAR_NAME=  TIME,          FID/REAL,        FID/IMAG
##SYMBOL=    X,             R,               I
##VAR_TYPE=  INDEPENDENT,   DEPENDENT,       DEPENDENT
##VAR_FORM=  AFFN,          ASDF,            ASDF
##VAR_DIM=   8192,          8192,            8192
##UNITS=     SECONDS,       ARBITRARY UNITS, ARBITRARY UNITS
##FACTOR=    0.0002944,     1,               1
##FIRST=     0,             0,               0
##LAST=      2.4114304,     0,               0
##MIN=       0,             -416609,         0
##MAX=       2.4114304,     408364,          0
$$ Real data points
##PAGE= N=1
##DATA TABLE= (X++(R..R)), XYDATA
$$ [...]
1936c42K59J2l9M93p0l14M39k83L04j74PQ5l60nN26k35K35j93j26L23R8k17J93
$$ -342 -83 -71 -110 383 313 -1 438 155 459 285 292 377 17 12 538 303 538 345 219 542 640 423 616
1959F16l00M7J41l40K37p8j06k0k7o9J53o9j64K07m00l4M1j62L0J32k08L07m87
$$ 616 316 363 504 164 401 323 217 197 170 101 254 185 21 228 -172 -206 -165 -327 -297 -165 -373 -66 -553
1982e53K01J51k77l4R1j11K02j62j02K05k16K02l2l4N31l78j47L93n24K87L39
$$ -553 -352 -201 -478 -512 -421 -532 -330 -492 -594 -389 -605 -403 -435 -469 62 -316 -463 -70 -594 -307 32
2003C2j82r2L90j07L72j93j28L40j68k22J56L5n97Q95R6m41J70J1K59J5K74p62
$$ 32 -150 -242 148 41 413 220 92 432 264 42 198 233 -364 531 627 186 356 367 626 641 915 153
2025A53K26r0J86l6m10N83J35k36m91L38m85N16P21r17j54K59m61L41k73K67L24
$$ 153 379 289 475 439 29 612 747 511 20 358 -127 389 1110 193 39 298 -163 178 -95 172 496
2046D96l01l68M41n86K95k91Q1m75L70L35k15k81j20K6J76m36p6J34j10l5P91
$$ 496 195 -173 268 -318 -23 -314 -233 -708 -338 -3 -218 -499 -619 -593 -417 -853 -929 -795 -905 -940 -149
2067a49m33n9J83j62J26l3J05j18M71o26K88K86m3L20O0j62J19k46j20J22L14
$$ -149 -582 -641 -458 -620 -494 -527 -422 -540 -69 -695 -407 -121 -164 156 216 54 173 -73 -193 -71 243
2088B43r5j09Q2j4M1K49n7O7m6O1N9K21qm03O40k60n1K19l97K99l45m8K34j38
$$ 243 148 39 121 107 148 397 340 407 361 422 481 702 694 291 931 671 620 839 442 741 396 348 582 444
2112D44j1J0k51L14l2k07l23K33k27j5Nj43L03k10N7%nK7k44m3N5j52j9J17k01
$$ 444 433 443 192 506 474 267 -56 177 -50 -65 -60 -203 100 -110 -53 -53 -58 -31 -275 -318 -263 -415 -434 -317 -518
2137e18J45r7l55J34L91l67L08N7l26J54j65J99J1j6J82j19K07k38K60j77P9J27
$$ -518 -373 -470 -825 -691 -300 -667 -359 -302 -628 -474 -639 -440 -429 -445 -263 -382 -175 -413 -153 -330 -251 -124
2159a24j8P9J08J82j32L08k81k9J56Q7q7J4JJ56l7J4J78l82J4R0o4n7L15m85M
$$ -124 -142 -63 45 227 95 403 122 93 249 336 249 263 264 420 383 397 575 193 207 297 233 176 491 6 10
2184A0j84Q9L57o96O18K41k04M24p40O40r4j25j14l12J73m52M88l55n03L51L97
$$ 10 -174 -85 272 -424 194 435 231 655 -85 555 461 336 222 -90 83 -369 119 -236 -739 -388 9
2205Ik93K24k71k6l1k82J00R7J00j7p6J10J37l90K51p8L98l55J04J17q7mK42j08
$$ 9 -284 -60 -331 -357 -388 -670 -570 -473 -373 -390 -466 -356 -219 -609 -358 -436 -38 -393 -289 -172 -259 -263 -21 -129
2229a29p0J13j59K02q2J47Q6J9P6j19j06N13m33O0N15j68j38M6M8Q2j56J85j91
$$ -129 -199 -86 -245 -43 -125 22 108 127 203 84 -22 491 58 118 633 465 327 373 421 503 347 532 341
2252C41J11j66L1K15k05k14K61j47P2J93l5J3k04j1j22j36O8j28R3K9j64N8l7
$$ 341 452 286 317 532 327 113 374 227 299 492 457 470 266 255 133 -3 65 -63 30 59 -105 -47 -84
2275h4j68J86K8j9j75j85J18J11r9k8k18J25m6p0K1n6J05l1Q8j39K11r9p9K28
$$ -84 -252 -66 -38 -57 -232 -417 -299 -188 -287 -315 -533 -408 -454 -524 -503 -559 -454 -485 -397 -536 -325 -424 -503 -275
2299b75R6O7n1pJM1N2J0o1M13k33k13rK34j97M02j0j50j77K30M13p0l21K14J91
$$ -275 -179 -112 -163 -170 -169 -128 -76 -66 -127 286 53 -160 -169 65 -132 270 260 110 -67 163 576 506 185 399 590
2324E90Ol64j00L25k01j05J91J54k59J13K3m8K27l86p5R3M1j83j3O8R4j82j82
$$ 590 596 232 132 457 256 151 342 496 237 350 373 325 552 166 91 184 225 42 29 97 191 9 -173
2347a73J5K19p7o08K6K61o4L51l84l20P86K04n35k91J90k47N99L9q9k86J41j96
$$ -173 -158 61 -16 -624 -598 -337 -401 -50 -434 -754 32 236 -299 -590 -400 -647 -48 -9 -98 -384 -243 -439
2369d39K34k36J05q5J97R8j83K02R2k55K27k19J72k42L16l6L04j30O4o7n2nK61
$$ -439 -205 -441 -336 -421 -224 -126 -309 -107 -15 -270 -43 -262 -90 -332 -16 -52 252 122 186 119 67 62 323
2392C23n2j90J83o9J36k52K10k2L0R7j27K8K35j19jO1l54K68K45m19N3k1J46j31
$$ 323 271 81 264 195 331 79 289 267 297 394 267 295 530 411 410 471 117 385 630 211 264 243 389 258
2416B58j37j30J48j24K35l09R2l6k93J38L22o38K97k30K16k49K40k75L53k23P
$$ 258 121 -9 139 15 250 -59 33 -3 -296 -158 164 -474 -177 -407 -191 -440 -200 -475 -122 -345 -338
2437c38J28k74J51L4J3J50l93r9L63o9K69q7j99J24J7j2J75q8k47L77j07Q4k9
$$ -338 -210 -484 -333 -299 -286 -136 -529 -628 -265 -334 -65 -152 -351 -227 -210 -222 -47 -135 -382 -5 -112 -28 -57
2460e7j40N09k53K01P2l88L24m0n7K28p0k9j98K89j49Q9lJ48k38MJ47Lj37K17
$$ -57 -197 312 59 260 332 -56 268 228 171 399 329 300 102 391 242 331 328 476 238 242 389 392 255 472
2484D72l30L70j37j70j72K4J87n5k0J1k80k51K96L4oJ77l47KJ68l48K3J64k49
$$ 472 142 512 375 205 33 57 244 189 169 180 -100 -351 -55 -21 -27 150 -197 -195 -27 -375 -352 -188 -437
2507d37N4Q7j44q7K55o4N3k0j47PK1K22l82J09L59k40K93j72p5K3K48k35K49N9
$$ -437 -383 -296 -440 -527 -272 -336 -283 -303 -450 -443 -422 -200 -582 -473 -114 -354 -61 -233 -308 -285 -37 -272 -23 36
2531C6m6J17j70P7J75k6Kj57J35J7R5l3k6j08L50l0m35L68J30k31K9N8J54J03
$$ 36 -10 107 -63 14 189 163 165 8 143 160 255 222 196 88 438 408 -27 341 471 240 269 327 481 584
2555E84m75L93l66J3M09k22J63j6k56LK7p5J95k13m6j62Q0j46Q6j04K71l72J75
$$ 584 109 502 136 149 558 336 499 483 227 230 257 182 377 164 118 -44 36 -110 -24 -128 143 -229 -54
2578e4j73n7J43n9j12Q7j65l07K99O0J66o2k18J7K89k6N4m4q5o2j60K88N7m1n1
$$ -54 -227 -284 -141 -200 -312 -225 -390 -697 -398 -338 -172 -234 -452 -435 -146 -172 -118 -162 -247 -309 -469 -181 -124 -165 -216
2603b16K47k32J02R6j38J81k2m3Q6k20L83k26J4J26J47j18L44m36L0K73j09p2
$$ -216 31 -201 -99 -3 -141 40 18 -25 61 -159 224 -2 12 138 285 167 511 75 105 378 269 197
2625A97N0J46r9O3j31J6q6k0J42j5j90J4K1j9R9n2q7L7O3q4J5l9j3m4j5j16K31
$$ 197 247 393 294 357 226 242 156 136 278 263 73 87 108 89 188 136 49 86 149 65 80 41 28 -16 -31 -147 84
2652H4k73j43J01k70L38k16R8L8k37K63j15j66L98r1k47m7J90O5K64m99M72m7
$$ 84 -189 -332 -231 -501 -163 -379 -281 -243 -480 -217 -332 -498 -100 -191 -438 -485 -295 -230 34 -465 7 -40
2674d0l58J41J64M1J94l71J12l5J70J73j33pP1k13K15K4O9N9j9K9j63J02N2K8
$$ -40 -398 -257 -93 -52 142 -229 -117 -152 18 191 58 51 122 -91 124 148 217 276 257 286 123 225 277 305
2698C05p1J5K95K5k10L7n9k53K54j44l9K24j38p3qJ27m11J23Q3KO2j65r2J83j12
$$ 305 234 249 544 569 359 396 337 84 338 194 155 379 241 168 160 287 -124 -1 82 84 146 -19 -111 72 -40
2723d0j13J4j30J58n9k1Mq2J97q4k5J37k57k05K40n4j2q8j7L3N6L9j13o0N4K76
$$ -40 -153 -139 -269 -111 -170 -191 -187 -269 -72 -156 -181 -44 -301 -506 -266 -320 -332 -420 -437 -404 -348 -309 -422 -482 -428 -152
2749a52n5j13J44k6M7M3r1l2K38N9Q0ln9R1j08K28N0j01j44J86j65K43r6K81k45
$$ -152 -207 -320 -176 -202 -155 -112 -203 -235 3 62 142 139 80 171 63 291 341 240 96 282 117 360 264 545 300
2774C00P4k03J79j88J61p8j04L41l65J59j41q0J72l4kR7k1r1m0p3k4J3o6q1m7
$$ 300 374 171 350 162 323 245 141 482 117 276 135 55 227 193 191 288 267 176 136 63 39 52 -14 -95 -142
2799a42K6k54M31l23K38j7k99m0K20m7j7j56N2J4P2j7J99k90J06K6j11m8j13L97
$$ -142 -116 -370 61 -262 -24 -41 -340 -380 -160 -207 -224 -380 -328 -314 -242 -259 -60 -350 -244 -218 -329 -377 -490 -93
2823i3j38J14J65k56L05l43pK97R1K3j02l1o9L7p3L72j44rM7J58n2J06l01q0M12
$$ -93 -231 -117 48 -208 97 -246 -253 44 135 158 56 25 -44 -7 -80 292 148 139 186 344 292 398 97 17 429
2848D29j19m1o8j00Q5J1P3L00j43j70j18J47%N0q0j22j00r1K71p2R8j91j0l5j50
$$ 429 310 269 201 101 186 197 270 570 427 257 139 286 286 336 256 134 34 -57 214 142 240 49 39 4 -146
2873a46J47k8p9j12J66j40J62j00j24m8r4J77j32n3M9L68m13K58j71K8j63J67
$$ -146 1 -27 -106 -218 -52 -192 -30 -130 -254 -302 -396 -219 -351 -404 -355 13 -400 -142 -313 -285 -448 -281
2895b81n9R5j48K54k04L60j36l4J90M0n5M0j8n0MkR6rM0o1M46m12K76l82J80l35
$$ -281 -340 -245 -393 -139 -343 17 -119 -153 37 77 22 62 44 -6 -2 -4 92 83 123 62 508 96 372 -10 170 -165
2921a65M16M8j4k88M4K25k01L41k43J36l28L81L8pk93K88O1k43n33M45L06J10
$$ -165 251 299 285 -3 41 266 65 406 163 299 -29 352 390 383 90 378 439 196 -337 108 414 524
2943E24j417O67N40N54l31j87m45L87m07L70n2m6k5r44j09J394n73L92k48m07
$$ 524 -893 -226 314 868 537 350 -95 292 -115 255 203 157 132 -812 -921 473 -100 292 44 -363
2963c63O35l93K7J59j22m93J58N91p78K29Q9M02q7K47j63k47J67k20Q4R1J4j16
$$ -363 272 -121 -94 65 -57 -550 -392 199 -579 -350 -261 141 54 301 138 -109 58 -162 -78 13 27 -89
2985h9J41j49N7L5K17n0J45k68j02M27j14l2J0R7L6p9p4j6J52k00J27n5l9Q4k42
$$ -89 52 -97 -40 -5 212 162 307 39 -63 364 250 218 228 325 361 282 208 192 344 144 271 216 177 261 19
3010A9K52j43j33K57O9k69o4R1k52P1J57R3j92r0j54p6J88mJ11k54j04L52j88
$$ 19 271 128 -5 252 321 52 -12 79 -173 -102 55 148 -44 -134 -288 -364 -176 -180 -69 -323 -427 -75 -263
3033b63o7J18L9J8nl76K27R3k43M25l07J41O6j01n6N07l19j37K94j01q8K0N6k6
$$ -263 -330 -212 -173 -155 -160 -536 -309 -216 -459 -34 -341 -200 -134 -235 -291 216 -103 -240 54 -47 -135 -115 -59 -85
3057h5k3K05J41k13p2P5J08j27J85N8ro0r4O2N8n6J18J07k21J92m5p5M7l52J42
$$ -85 -108 97 238 25 -47 28 136 9 194 252 243 183 89 151 209 153 271 378 157 349 304 229 276 -76 66
3082F6J01K14j77m0P3j86J69j59LJ12On8q8j5nk27J63m6K02j97K16q2m78L64k59
$$ 66 167 381 204 164 237 51 220 61 64 176 182 124 36 21 16 -211 -48 -94 108 -89 127 45 -433 -69 -328
3107c28J72J21r9p4p5l9K42l0n3j76PJ65qK10j52J77k39j7K07P5Jk60J77j04j8
$$ -328 -156 -35 -134 -208 -283 -322 -80 -110 -163 -339 -332 -167 -175 35 -117 60 -179 -196 11 86 87 -173 4 -100 -118
3132a18J06J44j72O1p2J74O2O4j3rJ08k94J68k25J16K1O2J72j17o4n1J40m0M1
$$ -118 -12 132 -40 21 -51 123 185 249 236 227 335 41 209 -16 100 121 183 355 238 174 123 263 223 264
3156B64L3q5N2n0M1j75j9q6J30l9l5Q4j88Rj4K3j37O8Q9Q8j26L1m7j6j14N9j43
$$ 264 297 212 264 214 255 80 61 -25 105 66 31 115 -73 -64 -78 -55 -192 -124 -35 53 -73 -42 -89 -105 -219 -160 -303
3183c03r8K73r9J7K9r6P2R1m4N9j50K09l43J20j17J02R8j83L22r7O4k57K21O8
$$ -303 -401 -128 -227 -210 -181 -277 -205 -114 -158 -99 -249 -40 -383 -263 -380 -278 -180 -363 -41 -138 -74 -331 -110 -42
3207d2J95l06K12l3j91J14j0K19j47K80N4l97K00R7J24k23l3O9K1o3MM6O9l4R6
$$ -42 153 -153 59 26 -165 -51 -61 158 11 291 345 -52 148 245 369 146 113 182 203 140 144 190 259 225 321
3232C21l04JM1K50j1j43P0k03J58K69l14q3O3k80m7M03K07k26o30O71m83l31R16
$$ 321 17 18 59 309 298 155 225 22 180 449 135 52 115 -165 -212 191 398 172 -458 213 -270 -601 315
3255C15o76K87l6J05l22l29N22j53j03j29K50q6N85l75J14j70n82N60n8k9Q8l1
$$ 315 -361 -74 -110 -5 -327 -656 -134 -287 -390 -519 -269 -355 230 -145 -31 -201 -783 -223 -281 -310 -222 -253
3277b53qK56l52k4M11M70j00l71k22L65K84j42j18lJ44k76K05k84J32o3J58J95
$$ -253 -261 -5 -357 -381 30 500 400 29 -193 172 456 314 196 193 337 61 266 -18 114 51 209 404
3299D04l93m60L46K23l33L28J13J53m43P8J26p0M7n2J64j36k13m7L31n7j93P8
$$ 404 11 -449 -103 120 -213 115 228 381 -62 16 142 72 119 67 231 95 -118 -165 166 109 -84 -6
3321fO2K03m81L99j15k14J68k59K08j97j27j33M18j08J5n0J07o1L28k34j20L1
$$ -6 56 259 -222 177 62 -152 16 -243 -35 -232 -359 -492 -74 -182 -167 -217 -110 -171 157 -77 -197 -166
3343a66K0J08j53P5m3M3J73k57K59k03K53k28J88K5j25J0j1K80J06j94n3L4j79
$$ -166 -146 -38 -191 -116 -159 -116 57 -200 59 -144 109 -119 69 94 -31 -21 -32 248 354 160 107 141 -38
3366c8K95j54m0O6q8M5K09j5J17j22j74p0J24k8Q0n0K80k36J71l14l9J15j17J64
$$ -38 257 103 63 129 41 86 295 280 397 275 101 31 155 127 207 157 437 201 372 58 19 134 17 181
3390A81j61J06j19rL8l44K85L6j12q6k5N1j1PQ5k0J7j29j81J03J20k6l5J74j99
$$ 181 20 126 7 -2 36 -308 -23 13 -99 -185 -210 -159 -170 -163 -78 -98 -81 -210 -391 -288 -168 -194 -229 -55 -254
3415b54K70j60J99k46q4K07l8n2K9L0R9k07K50l0l02J53J27P0k24L51j10j04R2
$$ -254 16 -144 55 -191 -275 -68 -106 -158 -129 -99 0 -207 43 13 -289 -136 -9 61 -163 188 78 -26 66
3438F6o2l9J3Q3K16l1P4j47M5N0j00p3K50j38n8q2J06J7O9q3j13K01j8l88J49
$$ 66 4 -35 -22 61 277 246 320 173 218 268 168 95 345 207 149 67 173 190 259 176 63 264 246 -142 7
3463Gn3J28j03P3J23o1K6k52K1J06J93j60J9j55n6J5p8j3J41p5n9J30k09J2M9
$$ 7 -46 82 -21 52 175 114 140 -112 -91 15 208 48 67 -88 -144 -129 -207 -220 -79 -154 -213 -83 -292 -280 -231
3488b31M9J63j94O3J42j20j69Q0K98l77J20M6o8J85J29l67R5J68r6L19j51k39
$$ -231 -182 -19 -213 -150 -8 -128 -297 -217 81 -296 -176 -130 -198 -13 116 -251 -156 12 -84 235 84 -155
3510a55j10K61j00K70j53K30j34j79K91k08Q3P4j11J61k9j30L0J48j92K02j93
$$ -155 -265 -4 -104 166 13 243 109 -70 221 13 96 170 59 220 191 61 91 239 47 249 56
3531E6J52k40n1J00j25M53m47j4J96Q2m3J4j97k1K4k0K28j18O6m57M23k47K21
$$ 56 208 -32 -83 17 -108 345 -102 -116 80 162 119 133 -64 -85 -61 -81 147 29 95 -362 61 -186 35
3554C5l03L73K37m13N12n6p98N25n81m95J174l42L82m54j52J36K4j11K33j90j13
$$ 35 -268 105 342 -71 441 385 -413 112 -469 -964 210 -132 250 -204 -356 -220 -196 -307 -74 -264 -377
3575c77K86Kk76j54J16m7N71M87k89l54M62j55l11M92k12J84J01j021R72o49M23
$$ -377 -91 -89 -365 -519 -403 -450 121 608 319 -35 427 272 -39 453 241 425 526 -495 477 -172 251
3596B51K22j28j00k66m02J37K95j44O23p00K32n23J17J076l96L64m89q52Q98m51
$$ 251 473 345 245 -21 -423 -286 9 -135 488 -212 20 -503 -386 690 294 658 169 -683 215 -236
3616b36J89K19N3J5l81j41p05J134J19o09L38P3p4j17K65Q4o31m40R05K85j4m83
$$ -236 -47 172 225 240 -141 -282 -987 147 266 -343 -5 68 -6 -123 142 226 -405 -845 60 345 331 -152
3638a52k51Q05j16l29r3j20K77l26M43K47j053N67k46J6L71m77O40k98nL84l04
$$ -152 -403 402 286 -43 -136 -256 21 -305 138 385 -668 -101 -347 -331 40 -437 203 -95 -100 284 -20
3659b0k45k12M03j95m11Q41k04N07o71J50K24o43N14j75J60Q8j33l71P33K10M01
$$ -20 -265 -477 -74 -269 -680 161 -43 464 -207 -57 167 -476 38 -137 23 111 -22 -393 340 550 951
3680I51m11j003L53O22J94j014p16J188k61o08J468k89k56m12Q54j547J479p40
$$ 951 540 -463 -110 512 706 -308 -1024 164 -97 -705 763 474 218 -194 660 -887 592 -148
3698a48N9q33P67M49l77K39q9j3k44O44o71J77j05L8k4J19K1m1l58mM37l05J60
$$ -148 -89 -922 -155 294 -83 156 67 54 -190 454 -217 -40 -145 -107 -131 -12 9 -32 -390 -394 43 -262 -102
3721a02K44j23m8J68k43o7K57n3k73R4O5J62L1L1P0m2j07K02j52L8J50q4j53j01
$$ -102 142 19 -29 139 -104 -171 86 33 -240 -146 -81 81 112 143 213 171 64 266 114 152 302 218 65 -36
3745c6J91j9q6l0J14J95k39r7K1J44j9j2J46p9p0J22j42r7J3M7J18j52p2J63k62
$$ -36 155 136 50 20 134 329 90 -7 14 158 139 127 273 194 124 246 104 7 20 67 185 33 -39 124 -138
3770a38M0R7o4k37K88Lr0K50k48M55k65m82L06l5j47L89k05N2k17K00p5J9J33
$$ -138 -98 -1 -65 -302 -14 -11 -101 149 -99 356 91 -391 -85 -120 -267 122 -83 -31 -248 -48 -123 -104 29
3793B9l1k24K16q4N5J7j26K98l69K90l4K38j09j18P3r8J48J39q6j8p9j67j7K70
$$ 29 -2 -226 -10 -94 -39 -22 -148 150 -219 71 37 275 166 48 121 23 171 310 224 206 127 -40 -57 213
3817B13k34J1k36N30oj65j37N8L36m57j1N66l12K86k71O5oJQ8N9K35m94j07J32
$$ 213 -21 -10 -246 284 278 113 -24 34 370 -87 -98 468 156 442 171 236 230 231 319 378 613 119 12 144
3841A44j87J68j90j73M21l43K41l98M73l31J67k01J1N8K3r1j65L53j50J67m5m2
$$ 144 -43 125 -65 -238 183 -160 81 -317 156 -175 -8 -209 -198 -140 -117 -208 -373 -20 -170 -3 -48 -90
3863i0q0j36L70K0m00K50J44m4k59J91K3j44P4J51m3j18M0J76k9P1p7J9J09k46
$$ -90 -170 -306 64 84 -316 -66 78 34 -225 -34 -11 -155 -81 70 27 -91 -51 125 96 167 90 109 218 -28
3887b8J43j3j83J9L82k62K0k73k28Q0j13M17M35l22n3P1J56J76j24J62j64j77
$$ -28 115 102 -81 -62 320 58 78 -195 -423 -343 -456 -39 396 74 21 92 248 424 300 462 298 121
3909A21j55J0k17J75R2Q1L7K21k16p9o1J42k09J26k47J54k40M2J08K1j82J77L7
$$ 121 -34 -24 -241 -66 26 107 144 365 149 70 9 151 -58 68 -179 -25 -265 -223 -115 -94 -276 -99 -62
3932f2j22J41j32L09l65J77k06K03J9k45K08J35j6M3l55K35J9R0k01J46r5j81
$$ -62 -184 -43 -175 134 -231 -54 -260 -57 -38 -283 -75 60 44 87 -268 -33 -14 76 -125 21 -74 -255
3954b55K54k8K7q7p7K71j28pk1r9K78k8o8j70K65R6p4j29K77k27J81j90J34q4
$$ -255 -1 -29 -2 -89 -166 105 -23 -30 -51 -150 128 100 32 -138 127 223 149 20 297 70 251 61 195 111
3978A11j27P2J08m9k79N30m51J06J22M2j73K38l07J87k3k43K48l28K39oJ01k88
$$ 111 -16 56 164 115 -164 366 -85 21 143 185 12 250 -57 130 107 -136 112 -216 23 17 118 -170
4000a70K20k59P0j20J01M04o76K87l02M06k20J12M3j25QK03%p0M2j15N49n20J0
$$ -170 50 -209 -139 -259 -158 246 -430 -143 -445 -39 -259 -147 -104 -229 -221 -18 -18 -88 -46 -161 388 -132 -122
4023a22l2O7j19K65j15J34J80l71J16K5J05j20K19j16kL3j99K81l47J03P5P4j41
$$ -122 -154 -87 -206 59 -56 78 258 -113 3 28 133 13 232 116 114 147 -52 229 -118 -15 60 134 -7
4046gJ83j35K63j83N9K2k42K87k94K10l28K12J50o0n8j76K42j60L9K4j87J03N4
$$ -7 176 41 304 121 180 202 -40 247 -47 163 -165 47 197 137 79 -97 145 -15 24 48 -139 -36 18
4069A8j35P9q9J86q0J93k21L3oj21J24l14L62j74J4o9O7L3K4J52k53R9Q9l27J25
$$ 18 -117 -38 -127 59 -21 172 -49 -16 -22 -143 -19 -333 29 -145 -131 -200 -133 -100 -76 76 -177 -78 11 -316 -191
4094a91OK6J09R2r8M9j49K49j54P5n0R5K8O7O2k26j24K44j15k22M02k4K57l90
$$ -191 -185 -159 -50 42 -56 -7 -156 93 -61 14 -36 59 87 154 216 -10 -134 110 -5 -227 175 151 408 18
4118A8K08j35j02Q6K50j06M2k73M3J18q2j3l9J63j62L9k65K47N5O3O0r6j3P3l8
$$ 18 226 91 -11 75 325 219 261 -12 31 149 67 54 15 178 16 55 -210 37 92 155 215 119 106 179 141
4143A41k31J1Q3j81J78j92J87k09J51j45r6K61l3O7p6o4J9Q5j1k0p0rq5K08j12
$$ 141 -90 -79 4 -177 1 -191 -4 -213 -62 -207 -303 -42 -75 -8 -84 -148 -129 -44 -55 -75 -145 -154 -239 -31 -143
4168a43K5JJ04l27J08p1K22J75k73K20l08M11J43l75n9R7N0J41n6j5j96J21J5
$$ -143 -118 -117 -13 -340 -232 -303 -81 94 -179 41 -267 144 287 -88 -147 -50 0 141 85 70 -126 -5 10
4191A0j79N92k83j5P5k9j86J22j31L04p9O2k66k03j31K21k00J55k42N50l6K65
$$ 10 -169 423 140 125 200 171 -15 107 -24 280 201 263 -3 -206 -337 -116 -316 -161 -403 147 111 376
4213C76j86k92j3K29j46J61k59J04o0O2n8m4J98j14p0R9n4J29j70K92k10r1l75
$$ 376 190 -102 -115 114 -32 129 -130 -26 -86 -24 -82 -126 72 -42 -112 -13 -67 62 -108 184 -26 -117 -492
4236d92K73K44o8rJ13k83L79P9j93J43k03j48k8L77l63PK0N1J3l0J57M4j17Q8
$$ -492 -219 25 -43 -52 61 -222 157 236 43 186 -17 -165 -193 184 -179 -172 -152 -101 -88 -118 39 83 -34 54
4260E4pn4j36L12o2k01L44k23R3J3k30J58j98R0P3M8K0J65l35J46Q3o7k10K33
$$ 54 47 -7 -143 169 107 -94 250 27 120 133 -97 61 -137 -47 26 74 94 259 -76 70 153 86 -124 109
4284A09p4k5K11k4j78m8J26o5j17J65lk20j6J74P6m1J13j80Q8j54j61K33l16K57
$$ 109 35 10 221 197 19 -29 97 32 -85 80 77 -143 -159 15 91 50 163 -17 71 -83 -244 -11 -327 -70
4308g0J01j77J76k96J22j40R8J9L83r6k00rj10L21m42K68J97K15n42J07R0k39
$$ -70 31 -146 30 -266 -144 -284 -186 -167 216 120 -80 -89 -199 122 -320 -52 145 360 -182 -75 15 -224
4330b24N18k78q8P4Q7k68J01R2j8k1m4L71m6l30K78j53K43k64J22n6l4K96n36
$$ -224 294 16 -72 2 89 -179 -78 14 -4 -25 -69 302 256 -74 204 51 294 30 152 96 62 358 -178
4353a78P7J5o9M90k12k46p3M3j71Q52m21K94j057N99M63p75L27j06k96N25p4l22
$$ -178 -101 -86 -155 335 123 -123 -196 -153 -324 528 107 401 -656 -57 406 -369 -42 -148 -444 81 7 -315
4375c15J55j96k69K76j10M30k29J36j94L15L43n93j05m0P94l98j25j17Q51q72
$$ -315 -160 -356 -625 -349 -459 -29 -258 -122 -316 -1 342 -251 -356 -396 398 0 -125 -242 609 -263
4395b63M70n46P13j21k24O5l60K54l32R22p04M06n08L76n82Q57m95J36l61Q19
$$ -263 207 -339 374 253 29 94 -266 -12 -344 578 -126 280 -228 148 -434 423 -72 64 -297 522
4415E22j258J128n40j18m05N36k70j20M87K34j17K72m22N1j60L25K6n0k8j49J13
$$ 522 -736 392 -148 -266 -671 -135 -405 -525 -38 196 79 351 -71 -20 -180 145 171 121 93 -56 57
4436E7J42N0k00n8j4N0j24q0j98O75k84N8J88o9j55l02L09J71n80M39j85j77J59
$$ 57 199 249 49 -9 -23 27 -97 -177 -375 300 16 74 262 193 38 -264 45 216 -364 75 -110 -287 -128
4459a28M02l39l77k96N65k06P36m89L63Q5p50L99J45o6J39l06j23K41n4K49l66
$$ -128 274 -65 -442 -738 -173 -379 357 -132 231 316 -434 -35 110 44 183 -123 -246 -5 -59 190 -176
4480a76p9j47L14m9J32k72K04p3L51l5R2j65k29K27l08p4J45N26o05L10j65O23
$$ -176 -255 -402 -88 -137 -5 -277 -73 -146 205 170 262 97 -132 95 -213 -287 -142 384 -221 89 -76 547
4502E47k63j16M6j287N30Q08n47k05OP91K16r75M01n00R16m36j86k55J438r67
$$ 547 284 168 214 -1073 -543 265 -282 -487 -481 310 526 -449 -48 -548 368 -68 -254 -509 929 -38
4522c8K15r80L50Q36j69n86M47n39J50L65l39J61lM98n29j89K58J66j03l23L07
$$ -38 177 -803 -453 383 214 -372 75 -464 -314 51 -288 -127 -130 368 -161 -350 -92 74 -29 -352 -45
4543d5L44n12K35JJ7k37P0J30J50j99P5O3k14r4L56k09J91k15J61k68K83q2J89
$$ -45 299 -213 22 23 40 -197 -127 3 153 -46 29 92 -122 -216 140 -69 122 -93 68 -200 83 1 190
4566A90n3k62K4PJ24L86n32j66Q69q33M06J94j44Q9J5l16Jn93O68o16P49k89n1
$$ 190 137 -125 -101 -94 30 416 -116 -282 587 -246 160 354 210 299 314 -2 -1 -594 74 -542 207 -82 -133
4589a33J07m54N12jj7j22K51k0l01K39j31P7q6M3k3k7J02p5j6R2q5J47j12l9p
$$ -133 -26 -480 32 31 14 -108 143 123 -178 61 -70 7 -79 -36 -59 -86 16 -59 -75 17 -68 79 -33 -72 -79
4614g9K8j7J13r5J50j49L8r3K14J6q2j21J19q4k9J28q2j55J84R9p2l12N51n05
$$ -79 -51 -68 45 -50 100 -49 -11 -104 110 126 44 -77 42 -42 -71 57 -25 -180 4 103 31 -281 270 -235
4638b35m4J75m69J030k60k16N85r9l42L97n06k92K10k0J65KR5n7q3K06k32R2p5
$$ -235 -279 -104 -573 457 197 -19 566 467 125 522 16 -276 -66 -86 79 81 176 119 36 242 10 102 27
4661B7LO9k10J8J40l1m4j26M0J4o6J45k60K34j8J34K04k34J08k37J41m39L73j09
$$ 27 30 99 -111 -93 47 16 -28 -154 -114 -100 -166 -21 -281 -47 -65 69 273 39 147 -90 51 -388 -15 -124
4685a24Q1L8k49N3J40j78J28J62p1j35n6J08k2Q7j88K22k0oj20K92o5r2P2J68
$$ -124 -43 -5 -254 -201 -61 -239 -111 51 -20 -155 -211 -103 -125 -38 -226 -4 -24 -30 -150 142 77 -15 57 225
4709B25k53m9J62j49O1m6J13mK04j76k48J37J22k60J38K45j77K8J7pJ83k62m6
$$ 225 -28 -77 85 -64 -3 -49 64 60 264 88 -160 -23 99 -161 -23 222 45 73 90 83 266 4 -42
4732d2K82k0k40L38j55k30P6J07l21M2r1L11p5%j21J86J25j00p6j23m2L22j66
$$ -42 240 220 -20 318 163 -67 9 116 -205 -163 -254 57 -18 -18 -139 47 172 72 -4 -127 -169 153 -13
4755a3j03M6j07R7R5j09K34l15J12r5J73J89l56L8n3J74j47J24r1R1j48j56M18
$$ -13 -116 -70 -177 -80 15 -94 140 -175 -63 -158 15 204 -152 -114 -167 7 -140 -16 -107 -16 -164 -320 98
4778I8n05M76l6J30k00J23J5j5j4k11J77J43n5l7j42K67J64n56J51O53q17l1P6
$$ 98 -407 69 33 163 -37 86 101 86 72 -139 38 181 126 89 -53 214 378 -178 -27 626 -191 -222 -146
4801a46J44O26j42o23L74O4mO9n08J38q7J64j3m5J65k16J18o0j23p3K74l53M09
$$ -146 -2 624 482 -141 233 297 293 362 -146 -8 -95 69 56 11 176 -40 78 18 -105 -178 96 -257 152
4824A52p8k16R4Q9j51k97L38j84L92k48J26O9j52l1q5J43p6J07m9j84K62k60J11
$$ 152 74 -142 -48 41 -110 -407 -69 -253 139 -109 17 86 -66 -97 -182 -39 -115 -8 -57 -241 21 -239 -128
4847a28R8J6K71j59m8k05R8j5J2N9J64K01l42M4Q5j97Q6q4J4R9K21j63k68J84
$$ -128 -30 -14 257 98 50 -155 -57 -72 -60 -1 163 364 22 66 151 -46 40 -44 -30 69 290 127 -141 43
4871D3l5O9j23j1K49j04Kj75j65K83J18j25K91k35J11k30J11j08%J06r7J20o9
$$ 43 8 77 -46 -57 192 88 90 -85 -250 33 151 26 317 82 193 -37 74 -34 -34 72 -25 95 26
4894B6L2J01j28j95K90P3k96j99J18K32k65L08j67kP1K16m16K4N4J27J5k05o7
$$ 26 58 159 31 -164 126 199 -97 -296 -178 54 -211 97 -70 -72 -1 215 -201 -177 -123 4 19 -186 -253
4917b53L03L2j63O3l7K54l22O8j5qR0j58J30J35j55K77l13k14L06N1j57J79p8
$$ -253 50 82 -81 -18 -55 199 -123 -55 -70 -78 12 -146 -16 119 -36 241 -72 -286 20 71 -86 93 15
4940A5j62K54j74J5K36j46q3J86k40O3kq7J47J2P3j00K00j29k4J5j02J86O3j34
$$ 15 -147 107 -67 -52 184 38 -45 141 -99 -36 -38 -125 22 34 107 7 207 78 54 69 -33 153 216 82
4964H2k34J56J01M5j06j67q4M48k18pJ26M6j98kj39J30K3j61K46p7q0j33R0K09
$$ 82 -152 4 105 150 44 -123 -207 241 23 16 142 188 -10 -12 -151 -21 2 -159 87 10 -70 -203 -113 96
4988I6k12k11L58J14j4l36%L00j38o6n5K11k60P0J44N7n7M1j67J96j9j24Q9J70
$$ 96 -116 -327 31 145 131 -205 -205 95 -43 -109 -164 47 -213 -143 1 58 1 42 -125 71 52 -72 17 187
5012A87n36M68n6j52J86J7p5M1o3l1J3oJ68l85L69J55j68k7k30r8J82Nm5K17j51
$$ 187 -349 119 63 -89 97 114 39 80 17 -14 -1 -7 161 -224 145 300 132 105 -125 -223 -41 -36 -81 136 -15
5037a5K33M7k89K02o9k75J04K25j18o5L6J59l19K42j69K3j25k8M4J91l35J11J34
$$ -15 218 265 -24 178 109 -166 -62 163 45 -20 16 175 -144 98 -71 -48 -173 -201 -157 34 -301 -190 -56
5060e6MM4k96L54j36Q4Np6o6N6Q6l5R5k21K10j14%P5l07L85k04R9J2n1J28J46
$$ -56 -52 -8 -304 50 -86 -2 3 -73 -139 -83 3 -32 63 -158 52 -62 -62 13 -294 91 -113 -14 -2 -53 75 221
5086B21j71r6J34L09l44KL2k23K21N6P4l35J87JM5R4j9j77j41K71Q6k2j06K9k05
$$ 221 50 -46 88 397 53 55 87 -136 85 141 215 -120 67 68 113 207 188 11 -130 141 227 205 99 128 -77
5111g7k5L91j70O0l5k49J31m2n3j4J60j32J98j36j66M6k8J97kj14j6J1p0J67k67
$$ -77 -102 289 119 179 144 -105 26 -16 -69 -83 77 -55 143 7 -159 -113 -141 56 54 -60 -76 -65 -135 32 -235
5136b35J57K9m6o2O4M1r9nL2J30j20K5J3l8P1J36o7J6j63J44k00K47j45O2J40
$$ -235 -78 -49 -95 -157 -93 -52 -151 -156 -124 6 -114 -89 -76 -114 -43 93 26 42 -121 23 -177 70 -75 -13 127
5161A27o6R3m95L11O1J6p4L08k45J26j21L4k7K0o4N5Jm0Q5R4k0Rj52n2m8l8J48
$$ 127 61 154 -341 -30 31 47 -27 281 36 162 41 75 48 68 4 59 60 20 105 199 179 188 36 -16 -64 -102 46
5188D6m8j20J50m9L8J01k04M48n22J90M1k17j52J47J03R3m9j2n3qNJ63j63l1q
$$ 46 -2 -122 28 -21 17 118 -86 362 -160 30 71 -146 -298 -151 -48 45 -4 -16 -69 -77 -72 91 -72 -103 -111
5213a11j34QJ76Q7j3L2n7J19m0r0p0J48k86L6J74j35J09J18P3j09j01j1J89m1
$$ -111 -245 -237 -61 26 13 45 -12 107 67 -23 -93 55 -231 -195 -21 -156 -47 71 144 35 -66 -77 112 71
5237G1l9J2lk99K20L5j12L10j98L0J15j70O9O7l23J35K10n8L3l0L1j12r0J56k03
$$ 71 32 44 41 -258 -38 -3 -115 195 -3 27 142 -28 41 108 -215 -80 130 72 105 75 106 -6 -96 60 -143
5262a43J74r4o9K21j13K08J36l03pk9q1J82j70OJ89k40R2j48L63j36n4j32J35
$$ -143 31 -63 -132 89 -24 184 320 17 10 -19 -100 82 -88 -82 107 -133 -41 -189 174 38 -16 -148 -13
5285a3j26o8P5K01K1j78Q5k5n2N1L4j00k11K9J19K52j59p1K40k13q5J01K1J03
$$ -13 -139 -207 -132 69 90 -88 -3 -28 -80 -29 5 -95 -306 -277 -158 94 -65 -136 104 -109 -194 -93 -72 31
5309C1R7Nl0p7k54K27J35J12l70J04L7K5R2n6k5k24L67j03p3R8J15j26l06n4K80
$$ 31 128 133 103 26 -228 -1 134 246 -124 -20 17 42 134 78 53 -171 196 93 20 118 233 107 -199 -253 27
5334B7m3P2J4j11R2P3O1k26K78l10J44j92M9M2n4P2n7J38j92m0L17j56j61M3j10
$$ 27 -16 56 70 -41 51 124 185 -41 237 -73 71 -121 -72 -30 -84 -12 -69 69 -123 -163 154 -2 -163 -120 -230
5359b30J78o6Q5J92k07N0j36J37k50J39m8K0j8k3L47o5q9o4J64R1j07k29P2Q8
$$ -230 -52 -118 -33 159 -48 2 -134 3 -247 -108 -156 -136 -154 -177 170 105 16 -48 116 207 100 -129 -57 31
5383C1j53J37K39j71k81N6J70M3m8l3J6QJ30j35j49L66j02l5o5m9K02j11k34L6
$$ 31 -122 15 254 83 -198 -142 28 71 23 -10 6 14 144 9 -140 226 124 89 24 -25 177 66 -168 -132
5407a32L39l10j24J5K53j40j30J14R8j34m4p0J65J71q4N6j96kK30j62j16K43K0
$$ -132 207 -103 -227 -212 41 -99 -229 -115 -17 -151 -195 -265 -100 71 -13 43 -153 -155 75 -87 -203 40 60
5430F0R2m80J27J43K85l92J0J85j03j13K97j78K39k70rO3o1L20j82k06O0J55M6
$$ 60 152 -328 -201 -58 227 -165 -155 30 -73 -186 111 -67 172 -98 -107 -44 -105 215 33 -173 -113 42 88
5453H8j92L47n92L23K05k7q2j30J46J87m70L47m9Mk84L14k6J72k61J40k05Q9K
$$ 88 -104 243 -349 -26 179 152 70 -60 86 273 -197 150 101 105 -179 135 109 281 20 160 -45 44 46
5476D6n02N77l06N39n6j24M3K61r63Q27o63M2L73R04j094p3K74k6J76o44K69m5
$$ 46 -456 121 -185 354 298 174 217 478 -485 342 -321 -279 94 998 -96 -169 105 79 255 -389 -120 -165
5498a65l4N92n22K4j1QK09k84L57m7k54k00J97K15j31j02om0R2Q1j34L88k49J86
$$ -165 -199 393 -129 -105 -116 -108 101 -183 174 127 -127 -327 -130 85 -46 -148 -154 -194 -102 -21 -155 233 -16 170
5522A70j41K9J31k13J17n6r0j48K23j18J85j50K25l02J68K09j07p6p7O8O3K6l00
$$ 170 29 58 189 -24 93 37 -53 -201 22 -96 89 -61 164 -138 30 239 132 56 -21 47 110 136 -164
5545a64M14j76j26j36J39J97qj68J57J17j25j6j00J8j3j21J50j25P1%K7J37l73
$$ -164 250 74 -52 -188 -49 148 140 -28 129 246 121 105 5 23 10 -111 39 -86 -15 -15 12 149 -224
5568b24R7R4K37l12J80j01KO2l1o8j04R4oJ02o2M4J86m72J44J06j20J95j29Q5
$$ -224 -127 -33 204 -108 72 -29 -27 35 4 -64 -168 -74 -80 22 -40 4 190 -282 -138 -32 -152 43 -86 -1
5592aL3j08l8N3l16J92K00j21K54L8Ok08m3K1J08j64J22r4J98j89j5O4j04Q5J28
$$ -1 32 -76 -114 -61 -377 -185 15 -106 148 186 192 -16 -59 -38 70 -94 28 -66 132 -57 -72 -8 -112 -27 101
5617A01j26p8K77j82r0L77l00K6J6J1o4J63Jj9R7k30J68j80L8J15q9J49l70J09
$$ 101 -25 -103 174 -8 -98 279 -21 5 21 32 -32 131 132 113 210 -20 148 -32 6 121 32 181 -189 -80
5641h0K55j90R1J19l23J93k02J30j21K53l41L84l77L1K08k07Q4j01K82k14l7O7
$$ -80 175 -15 76 195 -128 65 -137 -7 -128 125 -216 168 -209 -178 30 -177 -93 -194 88 -126 -163 -96
5663i6O4J41k73L07m0j44%l8N1QR6j29j18L1K30j4k5l6N4k04J16P2R6k78J49j5
$$ -96 -32 109 -164 143 103 -41 -41 -79 -28 -20 76 -53 -171 -140 90 76 51 15 69 -135 -19 53 149 -129 20 5
5689EJ25j38J01J7j1j59L57l77j8K30J3k27J5J31J24l46L48l12L5R5m8J12r1J45
$$ 5 130 -8 93 110 99 -60 297 -80 -98 132 145 -82 -67 64 188 -158 190 -122 -87 8 -40 72 -19 126
5713A26l49k2L02p9Q3p8L1p4J4o1M00j59l33J98J66l06P3K5j38M5K4O1K18j4l19
$$ 126 -223 -245 57 -22 61 -17 14 -60 -46 -107 293 134 -199 -1 165 -141 -68 -43 -181 -136 -112 -51 167 153 -166
5738a66P3k50K50K42j92O1j23k2K61k81N0K06k16K09j58L0J95r5j54N35m03K5
$$ -166 -93 -343 -93 149 -43 18 -105 -127 134 -147 -97 109 -107 102 -56 -26 169 74 -80 455 52 77
5760G7M3l5m86M48j99J98m0J27q2k1J93j70K00k34M4Q3l5j54k38L88P7l48K37
$$ 77 120 85 -401 47 -152 46 6 133 51 30 223 53 253 19 63 146 111 -43 -281 107 184 -164 73
5783G3l4K6J8k90N6J49r2J44l4J1r0j20J5L61k10K18mk50K38k67J43O8po9LJ09
$$ 73 39 65 83 -207 -151 -2 -94 50 16 27 -63 -183 -168 193 -17 201 197 -53 185 -82 61 129 122 53 56 165
5809A65m2l19J78q9J28r6J21j08K23k16L5K9p9M1Q0r3m7K1O3J8k9o0R6qMr0J81
$$ 165 123 -196 -18 -107 21 -75 46 -62 161 -55 -20 9 -70 -29 51 -42 -89 -68 -5 13 -16 -76 20 12 16 -74 107
5836A07j38J45j66j50K57L2k61K47r4RJ21k35K1J26N8J56j26l50L83j35N0M1j9
$$ 107 -31 114 -52 -202 55 87 -174 73 -21 -12 109 -126 -105 21 79 235 109 -241 142 7 57 98 79
5859G9j16J90r5J0op4r3K42L2j27k0m1J26K7n5j01j5Pl5J67j09J80l07R7R3j93
$$ 79 -37 153 58 68 62 -12 -105 137 169 42 22 -19 107 134 79 -22 -37 -30 -65 102 -7 173 -134 -37 56 -137
5885a37K18l02O9J92j57J41M3j67J40k17j03O5J24j6J31k06K36j86N7j8J8lJ38
$$ -137 81 -221 -152 40 -117 24 67 -100 40 -177 -280 -215 -91 -107 24 -182 54 -132 -75 -93 -75 -78 60
5908F0j10j11K17j18K5R2K0L5j13Pp2mK19J01k72rJ34j13K60l18K16q9Q2j37O3
$$ 60 -50 -161 56 -62 -37 55 75 110 -3 4 -68 -72 147 248 -24 -33 101 -12 248 -70 146 57 139 2 65
5933F5j71O2K52l32R7j62L19m5k27N5M0J90m18J43L91k37J17k01J76k4l00O5P3
$$ 65 -106 -44 208 -124 -27 -189 130 85 -142 -87 -47 143 -275 -132 259 22 139 -62 114 90 -210 -145 -72
5956g2j1K3Q1j67K5l8R4N7J24j52k26L38n1j40J0K8P4j71M4K21j32J03l28J29
$$ -72 -83 -60 21 -146 -121 -159 -65 -8 116 -36 -262 76 25 -115 -105 -77 -3 -174 -130 91 -41 62 -266 -137
5980a37qL7k01N86p8k13K3K6j03R3p5j9Q3j28L37k56J74l39L22j00J57k33J68
$$ -137 -145 -108 -309 277 199 -14 9 35 -68 25 -50 -69 14 -114 223 -33 141 -198 124 24 181 -52 116
6003A16j43j6J2Q9Q2j78J59m12J93K20j13j9J31p5j9n5KR7k60J38j5Q5M2j37N9
$$ 116 -27 -43 -31 58 140 -38 121 -291 -98 122 9 -10 121 46 27 -28 -26 71 -189 -51 -66 19 61 -76 -17
6028a7Q4k80K75NO6k23q7M05l79K3P8J69k09L3N3J15J43k15k5R6l56K11J52k28
$$ -17 67 -213 62 67 133 -90 -177 228 -151 -128 -50 119 -90 -57 -4 111 254 39 14 110 -246 -35 117 -111
6052a11n0j8J22M1r6L23j5j97M7K25j04l19J60L4j79J73k0j47J61M0j02J23J17
$$ -111 -161 -179 -57 -16 -112 211 196 -1 46 271 167 -152 8 42 -137 36 16 -131 30 70 -32 91 208
6075B08j71j33J17L7j91K61n4J69k02J62r7j61J00j64K70j4k87N02l18k1j04P7
$$ 208 37 -96 21 58 -133 128 74 243 41 203 106 -55 45 -119 151 137 -150 352 34 13 -91 -14
6097a4L7j54M19j91m94J01K88k75N19m05k22J69k50O62K29p22M17l20M5k3QL78
$$ -14 23 -131 288 97 -397 -296 -8 -283 236 -169 -391 -222 -472 190 419 -303 114 -206 -161 -184 -176 202
6119B02l68J28r3O25o8q0l10M22p95q0m3M94K30k2l70j44Q11l11k01k49P0L00
$$ 202 -166 -38 -131 494 426 346 36 458 -337 -417 -460 34 264 242 -128 -272 539 228 27 -222 -152 148
6141A48M6k45L1K15l13K36J47k41p6O1j82J93J21j55r8K76j38o2j08J01J32q3
$$ 148 194 -51 -20 195 -118 118 265 24 -52 9 -173 20 141 -14 -112 164 26 -36 -144 -43 89 6
6163FN4P2L5m1J61k30M4j22K41m2J43l83O9o4O6M6j14RQ1j29J42j53K35l96P1
$$ 6 60 132 167 126 287 57 101 -21 220 178 321 -62 7 -57 9 55 -59 -50 31 -98 44 -109 126 -270 -199
6188a99K16q1P9N3k62J33l9J65j71M3J46j45j66K62J89m01pJ79k74K93J57j25
$$ -199 17 -64 15 68 -194 -61 -100 65 -106 -63 83 -62 -228 34 223 -178 -185 -6 -280 13 170 45
6210D5k07J87M3l44L49j46L8Q3J11o2L6q3k28K27N9n6Nj74J47J16j21L1o4lo2
$$ 45 -162 25 68 -276 73 -73 -35 48 159 97 133 50 -178 49 108 52 57 -117 30 146 25 56 -8 -11 -73
6235g3k8Q9r3J46j12q2J05j22P3L78m31J59n5k80M17k45j07K07j24K38r4n0j10
$$ -73 -101 -12 -105 41 -71 -153 -48 -170 -97 281 -150 9 -46 -326 91 -154 -261 -54 -178 60 -34 -84 -194
6258a94R9K60m6j57K4n3j7O0j20J29j71P3N3K21k70J3n2K90n4q0j70J62J53k65
$$ -194 -95 165 119 -38 -14 -67 -84 -24 -144 -15 -186 -113 -60 161 -109 -96 -148 142 88 8 -162 0 153 -112
6282a12O6j15K34p6l77L23J79k76M09p3k66K82j2l63K16J28kk56L9J4L36k62J37
$$ -112 -46 -161 73 -3 -380 -57 122 -154 255 182 -84 198 186 -177 39 167 165 -91 -52 -38 298 36 173
6305A73j06n5J77k04JK72k32j04J88lq2j68K73k45R8l0j27M04r9m9J24k84K69
$$ 173 67 12 189 -15 -14 258 26 -78 110 107 25 -143 130 -115 -17 -47 -174 230 131 82 206 -78 191
6328A91k86Mn5J84J6m3l8o2P4J24j55k8L3k0Pj77L90J2k65P4m9L03k57j44J18
$$ 191 -95 -91 -146 38 54 11 -27 -89 -15 109 -46 -74 -41 -61 -54 -231 159 171 -94 -20 -69 234 -23 -167 -49
6353d9%l0K24k77N6J31k58J88J85n1k58J26qk2L3M0%j39J16O3J94k60m2l9j8O9
$$ -49 -49 -79 145 -132 -76 55 -203 -15 170 119 -139 -13 -21 -43 -10 30 30 -109 7 70 264 4 -38 -77 -95 -26
6379b6J15j0q9K8JK05j46M2k46K00k16L20P2j02k47P6R7N4l07L10j29J19j39j39
$$ -26 89 79 -10 18 19 224 78 120 -126 74 -142 178 250 148 -99 -23 74 128 -179 131 2 121 -18 -157
6403a57L7J07k14j45J60J80JK88j47k24k01K32M4N1j41j07j90L53m79N66Q7R3
$$ -157 -120 -13 -227 -372 -212 -32 -31 257 110 -114 -315 -83 -39 12 -129 -236 -426 -73 -552 14 101 194
6425A94j68l5M42j79n53N34k10J13l74M05m82k88R35k0m49j0J95l80R49o98K89
$$ 194 26 -9 433 254 -299 235 25 138 -236 169 -313 -601 334 314 -135 -145 50 -330 619 -79 210
6446B10P31j157j19m33M50L49p07R31o44o5q2Q81n08j35K46n2K13o89J65N94r25
$$ 210 941 -216 -335 -768 -318 31 -676 255 -389 -454 -536 345 -163 -298 -52 -104 109 -580 -415 179 -746
6467g46J079k23K98m00m11J50J30J98K8L4r42J376k11j00l48m21M92o19Q3M89
$$ -746 333 110 408 8 -403 -253 -123 75 103 137 -805 571 360 260 -88 -509 -17 -636 -553 -64
6487f4K08j23k51Q1J3P50q34k70J68P59r6k76o27QR08j40n10K34O3n09M35n5J18
$$ -64 144 21 -230 -149 -136 614 -220 -490 -322 437 341 65 -562 -554 354 214 -296 -62 1 -508 -73 -128 -10
6510a0k18M75K46r75M15J98l3m25o05P40L19J81k04j51R3l38K61l7J98Jj2k81
$$ -10 -228 247 493 -482 -67 131 98 -327 -932 -192 127 308 104 -47 46 -292 -31 -68 130 131 119 -162
6532a62j18K31k64Q8M56m08K25l1K7J47k03J43p2k49k7J50J59l07Q4K18l56L65
$$ -162 -280 -49 -313 -225 231 -177 48 17 44 191 -12 131 59 -190 -217 -67 92 -215 -131 87 -269 96
6554I6j84K54J62j06l05J89k54l3K81J20l56J92m02M63j92O0P7J38j67p5J10k62
$$ 96 -88 166 328 222 -83 106 -148 -181 100 220 -136 56 -346 117 -75 -15 62 200 33 -42 68 -194
6576a94M3M19m00L07m87J65J06l2O8O95m75n12K95J50k73mj70M98J62r4P4n62
$$ -194 -151 268 -132 175 -312 -147 -41 -73 -5 690 215 -297 -2 148 -125 -129 -299 199 361 267 341 -221
6598b21L65k18J71J63l45M0K70n49M50P0j79k7K1J62m51J08k34M43Q9o0j44p5
$$ -221 144 -74 97 260 -85 -45 225 -324 126 196 17 -10 11 173 -278 -170 -404 39 128 68 -76 -151
6620a51o8K00R3k78J03N8N3j26m2K44k09K72k41J70j15J5q1O4k61J29k49Q68n70
$$ -151 -219 -19 74 -204 -101 -43 10 -116 -158 86 -123 149 -92 78 -37 -22 -103 -39 -300 -171 -420 448 -122
6643a22K62L14p56O18j61k78j86L13K04o72J63L89l12M77L62J47k68p9l17k68
$$ -122 140 454 -302 316 155 -123 -309 4 208 -464 -301 88 -224 253 615 762 494 415 98 -170
6663a70K95m23l39J149m52o69J032Q32q78k50j23l88L92J75m85M13j62O45k09
$$ -170 125 -298 -637 512 60 -609 423 1255 377 127 4 -384 8 183 -302 111 -51 594 385
6682C85p7m20K58j35R8J03k15j77K89L0p0l5m28K33P27l34o0j89Kj74K92m90K86
$$ 385 308 -112 146 11 109 212 -3 -180 109 139 69 34 -394 -161 566 232 172 -17 -15 -189 103 -387 -101
6705a01J65j35O65M2j172J011o19K52j82j70l47j11O92m98N41j95J43k04P0%M05
$$ -101 64 -71 594 636 -536 475 -144 108 -74 -244 -591 -702 -10 -508 33 -162 -19 -223 -153 -153 252
6726B52l81J19m1l2K45k09K3K23k97J93j76p6P9M2JQ1K3Q8k91J08j6M4M18n13
$$ 252 -129 -10 -51 -83 162 -47 -24 199 -98 95 -81 -157 -78 -36 -35 46 69 157 -134 -26 -42 2 420 -93
6750i3N7l4M6m6P9J92o5q2K11m21K42J9P0Q0k49Q1k78M14o3Q0j37NJk08q9J02
$$ -93 -36 -70 -24 -70 9 201 136 54 265 -156 86 105 175 255 6 87 -191 223 160 240 103 108 109 -99 -188 -86
6776h6J19l25J86K63K0j76l25L04j31m8J07J26j12P0p6K69r7j73k10P6K06r4J84
$$ -86 33 -292 -106 157 177 1 -324 -20 -151 -199 -92 34 -78 -8 -84 185 88 -85 -295 -219 -13 -107 77
6799G7l28K53pJ06k66M9P6J79j95R1N4k84J61q0j48L06j80LJ86j4J0j71K24M9
$$ 77 -251 2 -5 101 -165 -116 -40 139 -56 35 89 -195 -34 -114 -262 44 -136 -133 53 39 49 -122 102 151
6823A51Q4n58L35j6M9J27k25J73m2k01K03L1k27J14P0n5K33n1l30K08j37j04K27
$$ 151 235 -323 12 -4 45 172 -53 120 78 -123 80 111 -116 -2 68 13 246 195 -135 73 -64 -168 59
6846E9J0l52K26J7q3K81k98R7n1Q2j52K73k29L88j23p7j3P4j95r5M31k48p5j07
$$ 59 69 -283 -57 -40 -123 158 -140 -43 -94 -12 -164 109 -120 268 145 68 55 129 -66 -161 270 22 -53 -160
6870a60P1p9j1J34P6j76J3J90r4r7M6k0k54K95O5Q7l08K97J8J1J94m32K56k95
$$ -160 -89 -168 -179 -45 31 -145 -132 58 -36 -133 -87 -107 -361 -66 -1 86 -222 75 93 104 298 -134 122 -173
6894a73K59P6l7o4J07J12k55l6O0l66N78n9q7j43R1j39J1J44l9q1J06K03j14j38
$$ -173 86 162 125 61 168 280 25 -11 49 -317 261 202 115 -28 63 -76 -65 79 40 -41 65 268 154 16
6918A6r5N3j28Q7M8J42Nj10l3j64K75jj79L33k86L8j02J35o3n2L2Q8n9O1M5j84
$$ 16 -79 -26 -154 -67 -19 123 128 18 -15 -179 96 95 -84 249 -37 1 -101 34 -29 -81 -49 39 -20 41 86 -98
6944i8N8N9j8Q1m00M18r0p6q1QJ37J25l5j01q3j25L72k8l56J86o3l80M36l73Q01
$$ -98 -40 19 1 82 -318 100 10 -66 -147 -139 -2 123 88 -13 -96 -221 151 123 -233 -47 -110 -490 -54 -427 374
6969C74j15J7j83p2K20l78O61k74l06j25M45J49M4k72k25J54j062J118k01p08
$$ 374 259 276 93 21 241 -137 524 250 -56 -181 264 413 457 185 -40 114 -948 170 -31 -739
6989g39R62m59O77q85J107o80o51K67L74K74l72K65q9j60L29l88J77p2J51j79
$$ -739 223 -236 441 -444 663 -17 -668 -401 -27 247 -125 140 51 -109 220 -168 9 -63 88 -91
7009i1P8k24M14m34K73k45J24K01J58l19J81j62J77l05J46j47Q3J36K0l12J50
$$ -91 -13 -237 177 -257 16 -229 -105 96 254 -65 116 -46 131 -174 -28 -175 -92 44 64 -248 -98
7030i8L41k35k36J62Q7N8L04l24m1k6n2m1k52K17K9R7K62k12N7k76L28j4j36J82
$$ -98 243 8 -228 -66 21 79 383 59 18 -8 -60 -101 -353 -136 -107 -10 252 40 97 -179 149 135 -1 181
7054A81p4J02j52K13j54N7J4J30k13j41n2J17L15l15K52L2m60j89l30O82o7K98
$$ 181 107 209 57 270 116 173 187 317 104 -37 -89 28 343 28 280 312 -148 -337 -667 15 -52 246
7076B46l70K34j37o1k6m21P15j07r7o3M62p89L92Q96j215O05l11N6J04n73M83
$$ 246 -124 110 -27 -88 -114 -535 180 73 -24 -87 375 -414 -22 874 -341 264 -47 9 113 -460 23
7097B3M44m11n9o0JK1q7L49q8l95m32M88j3L16l91M06K60k9o29K36J45P3m61K62
$$ 23 467 56 -3 -63 -62 -41 -128 221 133 -262 -694 -206 -219 97 -294 112 372 343 -286 -50 95 168 -293 -31
7121c1k86J094o47q77R74j075J71Q09J63q4k60j44j23N17l49k3N3L26n08K3QM03
$$ -31 -317 777 130 -747 227 -848 -677 132 295 211 -49 -193 -316 201 -148 -171 -118 208 -300 -277 -269 134
7143A34j17J4j04n27Q54p0m17M26M22q08Q67k34p90o0J189q07O74j087L38o1r6
$$ 134 17 31 -73 -600 254 184 -233 193 615 -193 674 440 -350 -410 779 -28 646 -441 -103 -164 -260
7164b60Q30l90J02K51n65m40P59k98J03p4p5Q9j07L4n6q6J76j10o4L52l98K20
$$ -260 570 180 282 533 -32 -472 287 -11 92 18 -57 32 -75 -41 -97 -183 -7 -117 -181 171 -227 -7
7186gJ18oO5j80J49j24P2j55R9O6o5j85J56J04M0k88K13q1m8Q3j27J31L1kk67
$$ -7 111 105 170 -10 139 15 87 -68 31 97 32 -153 3 107 147 -141 72 -9 -57 26 -101 30 61 59 -208
7211b08L73L2k67Q5j49J71m7N2r8P6p9j80j44M49j27L8jj53L41j27l36K68Q1r8
$$ -208 165 197 -70 15 -134 37 -10 42 -56 20 -59 -239 -383 66 -61 -23 -24 -177 164 37 -299 -31 50 -48
7235d8RRm7J53k99o4J71P2j1K09l69L82j13k05j65N5J63J38n6j42J48j95J04J11
$$ -48 -39 -30 -77 76 -223 -287 -116 -44 -55 154 -215 167 54 -151 -316 -261 -98 40 -16 -158 -10 -205 -101 10
7259A0R8j60N6J07j39n0l2N0j82J83J60K1k2j84K1J53p6N1j6Q3k62J16K4P3o9
$$ 10 108 -52 4 111 -28 -78 -110 -60 -242 -59 101 122 100 -84 -63 90 14 65 49 132 -130 -14 10 83 14
7284A4k02K00K9k04Ro1P49l28n93M85l1k14O62p71L54n6j15M46q89M30j49M10
$$ 14 -188 12 41 -163 -154 -215 534 206 -387 98 67 -147 515 -256 98 42 -73 373 -516 -86 -235 175
7306A75k90K94m92O7O6L6M40j6P2j444O80J14M28m51O7K43P3L33o98K66Q7j00
$$ 175 -115 179 -313 -246 -180 -144 296 280 352 -1092 -412 -298 130 -321 -254 -11 62 395 -303 -37 50 -50
7328e0k52N58l15j20K75l3k7m85O98m33K93m96M28o5J77j55J42l12k1P7M6J65
$$ -50 -302 256 -59 -179 96 63 36 -449 249 -184 109 -387 41 -24 153 -2 140 -172 -193 -116 -70 95
7350I5K6k48K51l29L07j76j69N97l52J16q4Q1m2L39k39L42o24L44Q5m01j09J31
$$ 95 121 -127 124 -205 102 -74 -243 354 2 118 34 115 73 412 173 515 -109 235 320 -81 -190 -59
7372e9K54J3l14kk4J60j04L41j73k29J12J25j67J74k61K52j17k07L35m0j56o0
$$ -59 195 208 -106 -108 -132 28 -76 265 92 -137 -25 100 -67 107 -154 98 -19 -226 109 69 -87 -147
7394a47K47LK7j44M8J67l29K28j71p8K00N4j77o1J83J25l51J62k41J42K63k26
$$ -147 100 103 130 -14 34 201 -128 100 -71 -149 51 105 -72 -133 50 175 -176 -14 -255 -113 150 -76
7416g6j40M14j47L8n1J6Q2k72J94J98p9J62j87l31K81%J71k49J05j28J55l57J83
$$ -76 -216 198 51 89 38 54 136 -136 58 256 177 339 152 -179 102 102 273 24 129 1 156 -201 -18
7439a8K25j45L56m65K93k14k34L08O8j60l23J3K51J57J57k23R2j68k19O08k33
$$ -18 207 62 418 -47 246 32 -202 106 174 14 -309 -296 -45 112 269 46 138 -30 -249 359 126
7460A26K26o09J36K03PR7P8m47M7K7j10j26J67M4K30K32m08J65j80K50m12L87
$$ 126 352 -257 -121 82 89 186 264 -183 -136 -109 -219 -345 -178 -134 96 328 -80 85 -95 155 -257 130
7482A30J21q1n4n9o6l17M25q6L12l33j84j10L67n4L2n9K88l94K94n5o6m0J32j92
$$ 130 251 170 116 57 -9 -326 99 13 325 -8 -192 -302 65 11 43 -16 272 -122 172 117 51 11 143 -49
7506d9j14M71q7J6l80K97n0j21J61k43J2p6J82k26M97j47m36L48O5J4n5L0M3l88
$$ -49 -163 308 221 237 -143 154 104 -17 144 -99 -87 -163 19 -207 290 143 -293 55 120 134 79 109 152 -236
7530b36J64q9N2K73k32L16n66M55l30K70p2PJ11q3k66J05O0jJ03J33k32j42M62
$$ -236 -72 -161 -109 164 -68 248 -318 137 -193 77 5 12 123 40 -226 -121 -61 -62 41 174 -58 -200 262
7553B62n12J09J15l6n3O6j7J6J0K14m76J70k3J51j01K16o4k70m1kK55M01m87J52
$$ 262 -250 -141 -26 -62 -115 -49 -66 -50 -40 174 -302 -132 -155 -4 -105 111 47 -223 -264 -266 -11 390 -97 55
7577E5l9J23j66j9K00K2k47K90j41r6M9R5k25K41l45L18k18J33J67k07L5p1n09
$$ 55 16 139 -27 -46 154 176 -71 219 78 -18 31 126 -99 142 -203 115 -103 30 197 -10 25 -46 -555
7600e55M60k02M17o38K50P8P32p17r8K60r6N46k03j28J38j35J0k22L8k6o7K22
$$ -555 -95 -297 120 -518 -268 -190 542 -175 -273 -13 -109 437 234 106 244 109 119 -103 -65 -91 -158 64
7622F4j24j38K94j21M8O4O2j54M6R6j97k7L94l51Q5k78N29k16%j%J9j15nQ9j86
$$ 64 -60 -198 96 -25 23 87 149 -5 41 137 -60 -87 307 -44 41 -237 292 76 76 75 75 94 -21 -26 63 -123
7648a23jJ02M5N9k90K47j83J37o8j21J64K18Jl07K0k0j38M66l34K80k19K39k66
$$ -123 -124 -22 23 82 -208 39 -144 -7 -75 -196 -32 186 187 -120 -100 -120 -258 208 -126 154 -65 174 -92
7671i2k5K18o7j32M6p1M5j63J83r7Q5r2PO6p4J96l67J93K22j69j6QM3J97k95L70
$$ -92 -117 101 34 -98 -52 -123 -78 -241 -58 -155 -70 -162 -155 -89 -163 33 -334 -141 81 -88 -104 -96 -53 144 -151 219
7697B19j93K81k96J41K27l33R9j42K7k33N28l97O10r07J39L15k99K00j76J63n5
$$ 219 26 307 11 152 379 46 145 3 30 -203 325 -72 538 -369 -230 85 -214 -14 -190 -27 -82
7718h2Q1%J95j59K05j58n2j58J75j05J4J40j2J95m30K65k33j80K45J25r9lk7j45
$$ -82 -1 -1 194 35 240 82 30 -128 47 -58 -44 96 84 279 -151 114 -119 -299 -54 71 -28 -31 -58 -203
7742b03L38j4j21K57n9k70Q7L65n53q4L38n5q5J89k9j80J89M1k30L15l9j9k64
$$ -203 135 121 0 257 198 -72 15 380 -173 -257 81 26 -59 130 101 -79 110 151 -79 236 197 178 -86
7765h6K14k01j25J5K1J05L50l59P7or5K91m06J12J05k22J15K31K82l45r4j6P2
$$ -86 128 -73 -198 -183 -162 -57 293 -66 11 5 -90 201 -205 -93 12 -210 -95 136 418 73 -21 -37 35
7788C5L8m9m8K97k16L6k0j39J43r4J3O7N4j69J61l11J79j64L39K1m2k33K34m05
$$ 35 73 24 -24 273 57 93 73 -66 77 -17 -4 63 117 -52 109 -202 -23 -187 152 173 131 -102 132 -273
7812b73L83o7k6j85J78j6J17j90K68k82J91mk61m2O4J95Qo9O5J5l07K65j25K31
$$ -273 110 43 17 -168 10 -6 111 -79 189 -93 98 94 -167 -209 -145 50 58 -11 54 69 -238 27 -98 133
7836A33k28K73q4k15Pn5L0jJ63k49M16k35q8j15R2P5J78l28J33L02m98K88k27
$$ 133 -95 178 94 -121 -114 -169 -139 -140 23 -226 190 -45 -133 -248 -156 -81 97 -231 -98 204 -294 -6 -233
7859b33L27o7j62L00l70J24L2j01P3P4l2k42J49L27m16K45o5%n7N1k07L48l3j14
$$ -233 94 27 -135 165 -205 -81 -49 -150 -77 -3 -35 -277 -128 199 -217 28 -37 -37 -94 -43 -250 98 65 -49
7883d9K50j06K8k27K56j12k51J75K15k46K08L5k93j7PJ25r3J72k20L1K10j69Q5
$$ -49 201 95 123 -104 152 40 -211 -36 179 -67 141 176 -117 -134 -127 -2 -95 77 -143 -112 98 -71 14
7906A4n1k9O8j06L44l01N8j67j7J07K98l42j13M45k33R2k83L84l00j15L60l6k94
$$ 14 -37 -66 2 -104 240 -61 -3 -170 -187 -80 218 -124 -237 208 -25 67 -216 168 -132 -247 113 77 -217
7929b17K31j03j82K81j58L85Jk70r9L23k28L31m89K06k08J58R2P3l73N81R7o55
$$ -217 14 -89 -271 10 -148 237 238 -32 -131 192 -36 295 -194 12 -196 -38 54 127 -246 335 432 -223
7951b23K06J47j90K34r5q9J04n16N11j29J37K79l38j96K13o3m9L33l83l36L96
$$ -223 -17 130 -60 174 79 -10 94 -422 89 -40 97 376 38 -158 55 -8 -57 276 -107 -443 -47
7972d7j29K01j26N2N44r47N07K99k62M8j32j27P20o72j6j64j11M10J3J55j080
$$ -47 -176 25 -101 -49 495 -452 55 354 92 140 8 -119 601 -71 -87 -251 -362 48 61 216 -864
7993h64N98N97k12p09K22L86M03l5j014J328J30j224J143m80R7k38K63r06M61
$$ -864 -266 331 119 -590 -368 18 421 386 -628 700 830 -394 749 269 366 128 391 -515 -54
8012e4l50N14k79O14J24k88k61J3L55p98N94j55K26J7n64J29K45l00J254j098
$$ -54 -404 110 -169 445 569 281 20 33 388 -410 184 29 255 272 -292 -163 82 -218 1036 -62
8032f2k85j41M39l26O35l13N61m67l49K40L85l41j78j86R30j293O65K81L7J30
$$ -62 -347 -488 -49 -375 260 -53 508 41 -308 -68 317 -24 -202 -388 542 -751 -86 195 232 362
8052C62n10j91K91j41O80m77m9J04k7Mj03K27j70j29j46K30J04k8K69p2k28L4
$$ 362 -148 -339 -48 -189 491 14 -35 69 42 46 -57 170 0 -129 -275 -45 59 31 300 228 0 34
8074C4k26K80l47M34l75K78n7k28J25j22k86R1P49O1l46P4j01j19K51j53R6L44
$$ 34 -192 88 -259 175 -200 78 21 -207 -82 -204 -490 -399 350 411 65 139 38 -81 170 17 113 457
8096D57l53K17R4o44l51K05J88N19m01k8L47q41O59j83M38K13l13l53K92J38j40
$$ 457 104 321 415 -229 -580 -375 -187 332 -69 -97 250 -591 68 -115 323 536 223 -130 162 300 160
8117A60j56P2p55N74j61j26L50OO9K13m82L90k68P5R7r1L75l86K44L8j36k89L64
$$ 160 4 76 -679 -105 -266 -392 -42 -36 33 246 -236 154 -114 -39 58 -33 342 -44 200 238 102 -187 177
8140A77L0j66n69Q09l27j77J26K06J26l77J86j39K83l98k28L95k5j41O26m9l93
$$ 177 207 41 -528 281 -46 -223 -97 109 235 -142 44 -95 188 -210 -438 -43 -68 -209 417 368 -25
8161b5K39L74n07k18N13k79l57N19k83J91L2L36r47M70k67j26L57J32K55q86M86
$$ -25 214 588 81 -137 376 97 -260 259 -24 167 199 535 -412 58 -209 -335 22 154 409 -477 9
8182In28P06l6m41O4J11k1o3L05
$$ 9 -519 187 151 -290 -226 -115 -136 -199 106
8191A06
$$ Imaginary data points
##PAGE= N=2
##DATA TABLE= (X++(I..I)), XYDATA
0@%%%%%%%%qJ6j6J6k4L2m0N5p0Q6j02J26j53J81k17K59l05L56m16M85n63O50p45
$$ 0 0 0 0 0 0 0 0 0 -8 8 -8 8 -16 16 -24 31 -39 47 -55 71 -82 99 -118 141 -164 192 -224 261 -302 348 -397
31c97Q51r70J102j248J411j590J784j998K234k494K778l087L423l789M192m634
$$ -397 454 -516 586 -662 749 -841 943 -1055 1179 -1315 1463 -1624 1799 -1990 2202 -2432
47b432N115n639O214o844P537q303R152j0096J1150j2337J3684j5230J7020j9124
$$ -2432 2683 -2956 3258 -3586 3951 -4352 4800 -5296 5854 -6483 7201 -8029 8991 -10133
61a0133K1642k4714K8557l3531M0262m9958O5344r4884K51493n11564M11991L13859
$$ -10133 11509 -13205 15352 -18179 22083 -27875 37469 -57415 194078 -317486 94505 408364
73D08364p55087O14327q9827l44968L28055n2453k55247J40735J12343j47255
$$ 408364 -346723 267604 177777 -167191 160864 108411 -146836 -6101 106242 -41013
83d1013J2298J19693k64312J52301K7454j53584K33851j24855K5896N6764l01846
$$ -41013 -28715 90978 -173334 -21033 6421 -147163 86688 -38167 -12271 44493 -257353
94b57353L52540p4369k70660L87833j88935j53059K56420j81405m5641K01575
$$ -257353 95187 20818 -249842 137991 -50944 -204003 52417 -128988 -174629 26946
104B6946k3296j92617J33617M7597k70660L04000n393k91547M13101j98665j92401
$$ 26946 3650 -188967 -55350 -7753 -278413 25587 20194 -271353 141748 -56917 -249318
115b49318L68221k49272M6010J70546k15499J36303o3326o7113J44747q3670O6319
$$ -249318 118903 -130369 -84359 86187 -129312 6991 -56335 -123448 21299 -62371 3948
126C948J3418p6039M3819j6827K4072j2152M2088Q575o7234R1395r9753J2790
$$ 3948 17366 -58673 -14854 -31681 -7609 -19761 22327 30902 -36332 55063 -44690 -31900
138c1900J47891j51548R3106K8229j54284J42510o1296k3210J23268j13141L7891
$$ -31900 115991 -35557 57549 85778 -68506 74004 12708 -10502 112766 -375 37516
149C7516K0489p9695N8905J0403o122J909K5906l3769o0723J05988o1985p393
$$ 37516 58005 -21690 37215 47618 41496 43405 69311 35542 -25181 80807 18822 11429
161A1429J21892j56254M7811O6916j50734J22923n290p2368R9251r1878J687M4158
$$ 11429 133321 -22933 24878 91794 -58940 63983 58693 -13675 85576 -6302 -4615 39543
173C9543o6412P7840r381n7300O0081l5814n3459P4547R258q3974Q6772J03j41680
$$ 39543 -26869 50971 41590 -15710 44371 8557 -44902 29645 38903 -45071 41701 41804 -99876
186i9876J44034r214j42342J98633n9491j43493J79622q4536q5538J69627o5735
$$ -99876 44158 34944 -107398 91235 31744 -111749 67873 -16663 -102201 67426 1691
197A691p4912J14660m8173p9332J06633j3858o8963R7304m0791o5423Q3235m7069
$$ 1691 -73221 41439 -6734 -86066 20567 6709 -62254 35050 -5741 -71164 12071 -34998
209c4998J30N8518n8688L5724j4245n0869Q2088m6812j3830R2703r1258r534R3091
$$ -34998 -34868 23650 -35038 686 -13559 -64428 17660 -29152 -42982 49721 -41537 -51071 42020
222D2020r9054P891J15113j05070p534J07608j22438K136J27158j15877J1705
$$ 42020 -57034 -49143 65970 -39100 -46634 60974 -61464 -59328 67830 -48047 -36342
233c6342J09975j26801P929R6237r6463K2961P9952q6409L826N7185o5111J3312
$$ -36342 73633 -53168 -45239 50998 -45465 -22504 57448 -28961 -25135 32050 -33061 -19749
245a9749N6392m5697Q013K3609m0705J4217J4000j0470K0129j0878m295P981k5362
$$ -19749 36643 -9054 -1041 22568 -18137 -3920 10080 -390 19739 8861 4566 12547 -12815
258a2815K0162J7852k6815K4549L418m3029K8944J2029l6194M1860N144m7758
$$ -12815 7347 25199 -1616 22933 26351 -16678 12266 24295 -11899 29961 35105 -12653
270a2653L5418n135l4544M5970k266k6935K7878j3685k1994K2336M030j2530J3787
$$ -12653 22765 17630 -16914 29056 26790 -145 27733 14048 -7946 14390 18420 5890 19677
283A9677K955k6143O908J1553j8149J6122J0766k5021L960N982j6203N534J8828
$$ 19677 22632 -3511 3397 14950 -3199 12923 23689 -1332 2628 8610 -7593 -2059 16769
296A6769j3972p706J8439k4350r512L5111k0983o409L2640l3785r256L1101k4579
$$ 16769 2797 -4909 13530 -10820 -20332 14779 -6204 -12613 20027 -13758 -23014 8087 -16492
309a6492j130L2320k4406j3295K7495k2627q466L6139k0363q191K6469k9184q97
$$ -16492 -17622 14698 -9708 -23003 4492 -18135 -26601 9538 -10825 -19016 7453 -21731 -22628
322b2628K2855j8099J1133O048j6331J0304q023p03J6089j2517O820R530k4644
$$ -22628 227 -17872 -6739 -691 -17022 -6718 -14741 -15444 645 -11872 -5052 4478 -20166
335b0166J0921J4884k4517J7775J7623l5022J5260J8536l9642K5294K3603m3156
$$ -20166 -9245 5639 -18878 -1103 16520 -18502 -3242 15294 -24348 946 24549 -18607
347a8607K4326J7456m6815K7547K1102m2068K8460J5847m5458K4896J6236l8286
$$ -18607 5719 23175 -23640 3907 25009 -17059 11401 27248 -18210 6686 22922 -15364
359a5364K8068J3736l7639K2752O445l0273K3952N906k1817J7837k384j5416J3408
$$ -15364 12704 26440 -11199 11553 17998 -12275 11677 17583 -4234 13603 11219 -4197 9211
372I211l367m419R246o483q69K988q626O929J234q548J0739m469j1642J3704m343
$$ 9211 5844 1425 10671 4188 3319 6307 -2319 4610 5844 -2704 8035 3566 -8076 5628 1285
387A285j0860J6460k531j5970J4998n11j9768K1188K33k2678K3312l108k4303
$$ 1285 -9575 6885 4354 -11616 3382 2871 -16897 4291 4524 -18154 5158 2050 -22253
400b2253K7854n103j9056K6012p830j7208K1756m918j4121J7895j554j4438J4380
$$ -22253 5601 498 -18558 7454 -376 -17584 4172 -746 -14867 3028 1474 -12964 1416
413A416K2j3161J3865J147j3248J2804r85r766J0560j007p204P426J054o121M762
$$ 1416 1438 -11723 2142 3289 -9959 2845 1860 -7906 2654 1647 -5557 1869 2923 -3198 1564
428A564J361n354N425J21m311O668n187O14N598r690Q814K86j1105J4033n799
$$ 1564 2925 -2429 2996 3117 -1194 5474 287 901 6499 -3191 5623 5909 -5196 8837 3038
443C038p220J4931j1501k001J2584j0843o40Q260o592k990O890k701o373R793
$$ 3038 -4182 10749 -752 -2753 9831 -1012 -1652 6608 16 -2974 3916 1215 -5158 4635
457D635j638j2236J3406k401j1990J5864n501r906J5693p939q292J5188n467q332
$$ 4635 2997 -9239 4167 1766 -10224 5640 139 -9767 5926 -2013 -10305 4883 -584 -8916
471h916J2535n914o804J2890p244n212J3186p418l188O931o461L061L422m667
$$ -8916 3619 -2295 -9099 3791 -3453 -8665 4521 -2897 -6085 846 -5615 -2554 868 -3799
485c799K563q52N97J90k695N496j311j139K642l396K741j004m3M667n576M712
$$ -3799 -1236 -2088 -1491 -1301 -3996 1500 189 -950 1692 -1704 1037 33 -10 4657 -919 3793
501C793q61q708J3227l468p339J3496r389l643J2985j1365k6J1640r123j035O478
$$ 3793 2932 -5776 7451 3983 -3356 10140 751 -2892 10093 -1272 -1298 10342 1219 184 6662
516F662p522J08P915n309j721O463o316j466N599m071k64M697l511k203K867j835
$$ 6662 -860 -752 7163 1854 133 6596 280 -1186 4413 342 78 4775 1264 -939 1928 93
532I3k384N243j478l934M788n109j566P506o387K415L785r091O074j153o048J0150
$$ 93 -2291 2952 1474 -2460 2328 -2781 -4347 3159 -3228 -813 2972 -6119 -45 -1198 -7246 2904
548B904m703j735N744q784L398M030n463N828o11l886K308j617R35J148M41Q29
$$ 2904 -1799 -3534 2210 -6574 -3176 854 -4609 1219 608 -3278 -970 -2587 -1652 -504 -63 766
564G66k728K427k470j370N877j566j371L752n190p31N569l058j59N512n129o61
$$ 766 -1962 465 -2005 -3375 2502 936 -435 3317 -1873 -2604 2965 -93 -252 5260 131 -530
580e30L647n851L618M770n716L176m81n285N052j288N57L099m365K98o11j743
$$ -530 3117 -2734 884 5654 -62 3114 2633 -2652 2400 1112 1669 4768 403 701 90 -1653
596a653L491j715J882P70l749J036k204M09L912k456Q30p52l670K851p40l85M321
$$ -1653 1838 123 2005 2775 -974 62 -2142 -1733 2179 -277 553 -199 -3869 -1018 -1758 -2143 2178
613B178l208m02J414m926K422L178k494K883p38n187K721J37m04M290j695j479
$$ 2178 -1030 -1432 -18 -4944 -2522 656 -1838 1045 307 -4880 -2159 -2022 -2426 1864 169 -1310
629a310R77k817J904J210P2L070k775j321O00k068L960J806j891J866k524j811
$$ -1310 -333 -3150 -1246 -36 36 3106 331 -990 -390 -2458 1502 3308 1417 3283 759 -1052
645a052L002o12O70K942k044r41l05j814K357J859l75Q13k715j530J067p20K941
$$ -1052 1950 1338 2008 4950 2906 1965 1660 -154 2203 4062 3687 4500 1785 255 1322 602 3543
662C543O92k137M70k648m90K063j316L114n38l590J288l073J145L364k247J679
$$ 3543 4235 2098 2568 -80 -570 1493 177 3291 2753 -837 451 -2622 -1477 1887 -360 1319
678A319j571l413J875j128N41K438j247o98j254j505N55J252J536m06k34j924
$$ 1319 -252 -3665 -1790 -2918 -2377 61 -1186 -1884 -3138 -4643 -4088 -2836 -1300 -1706 -1940 -3864
694c864j609J455M69J587P92j632J1k060Q97J515J33K954k011j878J351k643L358
$$ -3864 -5473 -4018 -3549 -1962 -1170 -2802 -2791 -4851 -3954 -2439 -2306 648 -1363 -3241 -1890 -4533 -1175
711a175K418k839L596k753j740L117j909K249K251k158P82j064m12J431Q90J108
$$ -1175 1243 -1596 2000 -753 -2493 624 -1285 964 3215 1057 1839 775 363 1794 2684 3792
727C792p60L34j731j134L420j826K086R52l986K257j158j523M215j088l9L14k247
$$ 3792 3032 3366 1635 501 3921 2095 4181 5133 1147 3404 2246 723 4938 3850 3811 4125 1878
744A878j103M97J373n70Q99O12n200K286O60l605N573j477l944L959m693N77L892
$$ 1878 775 1272 2645 2075 2974 3586 -1614 672 1332 -2273 3300 1823 -2121 1838 -2855 -2278 1614
761A614k665J561r67j362r48J5J235j300K068j190k042K485l021Q14L764l521
$$ 1614 -1051 510 -457 -1819 -2767 -2752 -1517 -2817 -749 -1939 -3981 -1496 -4517 -3703 61 -3460
777c460K248o13l613L448j011L02L152j530j618J46M41m14J148K156l027J629
$$ -3460 -1212 -1825 -5438 -1990 -3001 -2699 453 -1077 -2695 -2549 -2108 -2522 -1374 782 -2245 -616
793f16O70m528N101K20j915M112l395j783L673k457J878J922q90n98j168R55q81
$$ -616 54 -4474 627 847 -1068 3044 -351 -2134 1539 -918 960 2882 1992 1394 226 1181 300
810C00J662J717k605K282j531k749L726k124J406K243l599M98J79j882K085P64
$$ 300 1962 3679 1074 3356 1825 -924 2802 678 2084 4327 728 1226 1405 -477 1608 2372
826B372n92p06M19k118m84K773j616R46J544l947R83Q13k443K332R03j948o6K51
$$ 2372 1780 1074 1493 -625 -1109 1664 48 994 2538 -1409 -426 387 -2056 276 1179 -769 -835 -584
844e84j206N57J523j309j15J963m209J564K214l103M275r97l567L638k604j307
$$ -584 -1790 -1233 290 -1019 -1134 829 -3380 -1816 398 -2705 1570 573 -2994 644 -1960 -3267
860c267M882k265q2J928l391J4K309p22N91J915k442o67K370k589R00L734l249
$$ -3267 1615 -650 -732 1196 -2195 -2181 128 -594 -3 1912 -530 -1197 1173 -1416 -516 3218 -31
877c1M67J769m254J932K620k844J931J369m190J789N25k556L501J414m381K607
$$ -31 436 2205 -2049 -117 2503 -341 1590 2959 -1231 558 1083 -1473 2028 3442 -939 1668
893A668q40l363M764j146j799L771l573r74K727k287O62K495k580r6O94k522Q89
$$ 1668 828 -2535 2229 1083 -716 3055 -518 -1492 1235 -1052 -390 2105 -475 -571 123 -2399 -1510
910a510K316j387j87P24k237K45J641j354R47Q82j729o8J078k421K056J725k701
$$ -1510 806 -581 -768 -44 -2281 -2036 -395 -1749 -802 80 -1649 -1717 -639 -3060 -1004 721 -1980
927a980J894n29k539L502l99j621K971j579j454K287j593q9L203j816J06M85o40
$$ -1980 -86 -615 -3154 348 -51 -1672 1299 -280 -1734 553 -1040 -1129 2074 258 364 849 209
944B09J37j83N20K80m32P63j148R97J178k131J643N19j843J668j012j463L066
$$ 209 346 163 683 963 531 1294 146 1143 2321 190 1833 2352 509 2177 1165 -298 2768
961B768J0k283J867j987q20K461j337k76J521j633j03P19j675J200J09l90n64
$$ 2768 2778 495 2362 375 -445 2016 679 403 1924 291 188 907 -768 432 541 151 -413
978d13J45r60K53J098o40p69J376k729J222J454k442J241J529l812K732o80l072
$$ -413 -268 -1228 -975 123 -517 -1286 90 -2639 -1417 37 -2405 -1164 365 -3447 -715 -1395 -4467
995d467M362O3l100L336j815k669N002k043j967M412l041j64L048l650J079K554
$$ -4467 -105 -42 -3142 194 -1621 -4290 712 -1331 -3298 1114 -1927 -2091 957 -2693 -1614 940
1011I40k033P45P68j771J042J353q38m8P43r34j78K189j642L55J727k347K233
$$ 940 -1093 -348 420 -1351 -309 1044 206 158 901 -33 -211 1978 336 691 2418 71 2304
1028B304K59l712L733l6k402L108j194k366L721j407k273M342l064l79L338l609
$$ 2304 2563 -1149 2584 2548 146 3254 2060 -306 3415 2008 -265 4077 1013 634 3972 363
1044C63p28L319k833O00K177m058J717R86k253J548k42j174N95L52j197j93J175
$$ 363 -365 2954 121 721 2898 -1160 557 1543 -710 838 596 -578 17 369 -828 -1021 154
1061A54r38o27K007k806J39K067k430J526L33k729K480m16j290J788j066j25P64
$$ 154 -784 -1411 596 -2210 -2071 -4 -2434 -908 -575 -3304 -824 -1240 -2530 -742 -1808 -1933 -1169
1078a169n18l35R20k85p2R47j043q7J046r55N21J375j600J116J78q77O19K10J9
$$ -1169 -1687 -2022 -1102 -1387 -1459 -512 -1555 -1642 -596 -1551 -1030 345 -1255 -139 39 -838 -219 -9 10
1097A0J85O30k03j016K046j118p84L060k433j0K576k921P58K263k689J467M16
$$ 10 195 825 622 -394 1652 534 -250 2810 377 367 2943 22 780 3043 354 1821 2237
1114B237j967Q56N01n17j32Q56j064k66J553k039K63J820k244R53L91j807J275
$$ 2237 270 1126 1627 1110 978 1834 770 504 2057 18 281 2101 -143 810 1201 -606 669
1131F69k37j051J065k1o02j63L46r60P34k26j426J851o45j825K769j535o74L344
$$ 669 432 -619 446 425 -177 -340 6 -954 -220 -446 -1872 -21 -666 -2491 278 -1257 -1931 1413
1149A413l617Q63J847k715K059R9k116J527L91j666J330J84r81M47J490k574R42
$$ 1413 -2204 -1341 506 -2209 -150 -51 -2167 -640 -249 -1915 -585 -401 -1382 -935 555 -2019 -1077
1166a077K555l332K746n13k932K787J88j215K051r26oR33r47k55J094M8j587J884
$$ -1077 1478 -1854 892 379 -2553 234 422 -793 1258 332 326 1259 312 57 1151 1199 -388 1496
1184A496r2j498J939r95j262K695l036J456Q20j890R41P82k213K562q82r40O32
$$ 1496 1404 -94 1845 850 -412 2283 -753 703 1523 -367 574 1356 -857 1705 823 -117 515
1201E15m07J12o72K41p75J039Q72j811O36q5j452K150m22j449K090j451p09J637
$$ 515 108 220 -452 -211 -986 53 925 -886 -250 -335 -1787 363 -59 -1508 582 -869 -1578 59
1219E9j375K18P73o28n02O16P08j430J493M51k351J773j205L68J114j435R56O68
$$ 59 -1316 -1098 -325 -953 -1455 -839 -131 -1561 -68 383 -1968 -195 -1400 -1032 82 -1353 -397 271
1237B71j082P01N12K2k99j86L9o3LM33M7M25p3J36L39j170O97M56n94P78k70n11
$$ 271 -811 -110 402 424 125 -61 -22 -85 -82 351 398 823 750 886 1225 55 752 1208 614 1392 1122 611
1259F11O57m74L78o6O6o36N59L81j755J764n37r73J654j483o36J208m88k21Q98
$$ 611 1268 794 1172 1106 1172 536 1095 1476 -279 1485 948 -25 1629 146 -490 718 230 9 907
1278I07j248n41O85J29q23M58j53m30Q56r14l53R83n30k40P13m42r52Q46p81P96
$$ 907 -341 -882 -197 -68 -891 -433 -586 -1016 -160 -1074 -1427 -444 -974 -1214 -501 -943 -1895 -1049 -1830 -1034
1298a034P11q14k92M86l1l23L64j69O31k1o52L37P65o01J328j564L26M16o7K1
$$ -1034 -323 -1137 -1429 -943 -974 -1297 -933 -1102 -471 -492 -1144 -807 -42 -643 685 -879 -553 -137 -204 -183
1318a83L52K10p93J850j310o9O23l01k33J841q63j095J387j366P07O29p62M43
$$ -183 169 379 -414 1436 126 57 680 379 146 1987 1124 29 1416 50 757 1386 624 1067
1336A067J961k481k7J220q19p70J417j54q22P86j077L47O45l98j54n58k54K54
$$ 1067 3028 547 520 1740 921 151 1568 1414 592 1378 301 648 1293 895 741 183 -71 183
1354A83M7p75P72l86q64J027k89m75J188n39r03L48j76n62J402j137L56O87j227
$$ 183 230 -545 227 -159 -1023 4 -285 -760 428 -111 -1014 -666 -842 -1404 -2 -1139 -783 -96 -1323
1373a323N65L35j071R44l70j37N25l50p6m19J105n17K80k67l17P3Q97k12M73j90
$$ -1323 -758 -423 -1494 -550 -920 -1057 -532 -882 -958 -1377 -272 -789 -509 -776 -1093 -1020 -123 -335 138 -52
1393e2q7l9L87q10J037M07p05J44O2j99M26J63j36M92m26J06km33P49J64l33r0
$$ -52 -139 -178 209 -601 436 843 138 282 344 145 571 734 598 1090 664 770 768 335 1084 1248 915 825
1415H25l01RL44m51O84j63n83M03p98K36K52n12M54j10q64P00n01J08L02k49o4
$$ 825 524 533 877 426 1110 947 364 767 -31 205 457 -55 399 289 -575 125 -376 -268 34 -215 -279
1436b79K11q80L95K01l38L73k10m55J28n7J1M64k19l0J37k25m3k24M81J61k11
$$ -279 -68 -948 -553 -352 -690 -317 -527 -982 -854 -911 -900 -436 -655 -685 -548 -773 -816 -1040 -559 -398 -609
1457f09J80l94%J29K84N01K20o38j43N69m45M95M24o18P59n74k66O19r8L77L96
$$ -609 -429 -823 -823 -694 -410 91 311 -327 -470 99 -346 149 573 -45 714 140 -126 493 395 772 1168
1478A168q07L62j8l33Q59k18p5L12q94N49m23J8O81o26M55k31o12L98J11p1K37
$$ 1168 361 723 705 372 1231 1013 938 1250 356 905 482 500 1181 555 1010 779 167 565 676 605 842
1499H42p12K17K4o37N15r2m29M83l38l51L4%R4K85l04o19O02n51L36L09m49K04
$$ 842 130 347 371 -266 249 157 -272 211 -127 -478 -444 -444 -350 -65 -369 -988 -386 -937 -601 -292 -741 -537
1521e37k17l58M25n15M98K16m37M98n47j23N56m46J075l99n84Q82l65k76N80l95
$$ -537 -754 -1112 -687 -1202 -704 -488 -925 -427 -974 -1097 -541 -987 88 -311 -895 -13 -378 -654 -74 -469
1541d69O73R7o95P56m46J74O59m12Q4j24N2K07J74J79k51J24j25j08K29j37L24
$$ -469 204 301 -394 362 -84 90 749 337 421 297 349 556 730 909 658 782 657 549 778 641 965
1562I65p8j44jl00%K95j48M78o30j90K67o02O62l4n59O33o18j68M23r04O82o2
$$ 965 887 743 742 442 442 737 589 1067 437 247 514 -88 574 540 -19 614 -4 -172 251 -653 29 -33
1584c3j65j23m02J48L01n73O33m48l51N15k63J03J9M2J37L4p07J33M53j19K12
$$ -33 -198 -321 -723 -575 -274 -847 -214 -662 -1013 -498 -761 -658 -639 -597 -460 -426 -1133 -1000 -547 -666 -454
1605d54K20l85L81l34M9N85m85K43K54m02L36k18K62M71j3k89J20j16J48K18l9
$$ -454 -234 -619 -238 -572 -523 62 -423 -180 74 -328 8 -210 52 523 510 221 341 225 373 591 552
1626E52J23m50K17L53n88M37j81J61K04j28k25N26m32K09k1k8k23K16p24N04j77
$$ 552 675 225 442 795 207 644 463 624 828 700 475 1001 569 778 757 729 506 722 -2 502 325
1647C25j54M78n65m56O86n24M48j44M0m29k32m1J79l1K8J50o81M01p04P84k69
$$ 325 171 649 84 -372 314 -210 238 94 134 -295 -527 -568 -389 -420 -392 -242 -923 -522 -1226 -442 -711
1668g11L9M43q61L88R6j54n14Q97R9q72L12K05J29K73J49j52j59J27k57N45l79
$$ -711 -672 -229 -1090 -702 -606 -760 -1274 -377 -278 -1150 -838 -633 -504 -231 -82 -234 -393 -266 -523 22 -357
1689c57L59J02k49J38J44n2N0K26J04J55k32K9J9K36j60K59M2j52P8j45J97J33
$$ -357 2 104 -145 -7 137 85 135 361 465 620 388 417 436 672 512 771 813 661 739 594 791 924
1711I24n5j52J01m1k3r0K13l56K45k75k05lk2K5J93o04K24Qk77K61n7k54K25q6
$$ 924 869 717 818 777 754 664 877 521 766 491 286 283 261 286 479 -125 99 107 -170 91 34 -220 5 -81
1735h1n26L02k23J84k54K79m06p3N65o71L72j00p9J59m5j56L75k20m6K26L4k77
$$ -81 -607 -305 -528 -344 -598 -319 -725 -798 -233 -904 -532 -632 -711 -552 -597 -753 -378 -598 -644 -418 -384 -661
1757f61J38k31L3K94K76k52K18j27L72n3J44r8K9j39K72K03k96L64j08L9O0K47
$$ -661 -523 -754 -721 -427 -151 -403 -185 -312 60 7 151 53 82 -57 215 418 122 486 378 417 477 724
1779G24m26M14Q4k39k7K88n03N10j35k01K58qj07k91N0J46K42l22l33J76K0j33
$$ 724 298 712 796 557 530 818 315 825 690 489 747 739 632 341 391 537 779 457 124 300 320 187
1801A87q1L6k3M2k22j74M5N4o7K47m49L1L1K08l41J59j95l7R5l23J55J35l32L07
$$ 187 106 142 119 161 -61 -235 -190 -136 -203 44 -405 -374 -343 -135 -476 -317 -512 -549 -454 -777 -622 -487 -819 -512
1825e12L9j98J01r7RK78j12J9M80l73k02L65J4J71k49J81L56j13M5k89L00J14
$$ -512 -473 -671 -570 -667 -658 -380 -492 -473 7 -366 -568 -203 -189 -18 -267 -86 270 157 202 -87 213 327
1847C27l0K08K0l56M03l9j44L73p9k21K5K41j10J17l96N17m5k67j48L94j60k30
$$ 327 297 505 525 169 572 533 389 762 683 462 487 728 618 735 339 856 811 544 396 790 630 400
1869D00k8J0j2KJ5k10J07k91kR9k40n6M48l60j51j36j89J32P1l53L94M4m64K97
$$ 400 372 382 370 372 387 177 284 -7 -9 90 -150 -206 242 -118 -269 -405 -594 -462 -391 -744 -350 -306 -770 -473
1893d73L19m09L06m03P0L59l07J9P0k36M14k12j1K63k67l2K63j20J20p5OK96J08
$$ -473 -154 -563 -257 -660 -590 -231 -538 -519 -449 -685 -271 -483 -494 -231 -498 -530 -267 -387 -267 -342 -336 -40 68
1916F8j21P2r3K49j29j05M89n34L81M32q64M38J89j68K79p4j59L84j16k54P4R9
$$ 68 -53 19 -74 175 46 -59 430 -104 277 709 -155 283 472 304 583 509 350 734 618 364 438 537
1938E37l74L80k46J59Lj76R2j06R2L16p90M91J78m50N4j41m5Q6k31k4J0j53M47
$$ 537 163 543 297 456 459 283 375 269 361 677 -113 378 556 106 160 19 -26 60 -171 -195 -185 -338 109
1961A09o21L47K45p03K87J49p12M13J33k46L79l66J8M06l36O1o3j7J74J5j77J66
$$ 109 -512 -165 80 -623 -336 -187 -899 -486 -353 -599 -220 -586 -568 -162 -498 -437 -500 -517 -343 -328 -505 -339
1983c39m7L47J02k73K75n4j86K28l5l6M00k30K45L9l64K14J42l75P23n37l8M25
$$ -339 -386 -39 63 -210 65 11 -175 53 18 -18 382 152 397 436 72 286 428 53 776 239 201 626
2005F26l73L64J26l71M63m49J63J17m47PK86j63K18j29L8k2k35N63p51k43N72
$$ 626 253 617 743 372 835 386 549 666 219 226 512 349 567 438 476 454 219 782 31 -212 360
2026C60j91j21k3j43M73o93L23p3o91l81J214n06k37K92m06K88J36m06L16j23
$$ 360 169 48 25 -118 355 -338 -15 -88 -779 -1160 54 -452 -689 -397 -803 -515 -379 -785 -469 -592
2046e92J17K11j11j57p4k4p0O50o64O50k80O0j63N99j20k69m3L01p7K58l05M2
$$ -592 -475 -264 -375 -532 -606 -630 -700 -50 -714 -64 -344 -284 -447 152 32 -237 -280 21 -56 202 -103 -61
2068f1K53k07J81M4K09rK07k49J01j77J16J14K05m26M82k56L86o76L68k0J37l27
$$ -61 192 -15 166 210 419 410 617 368 469 292 408 522 727 301 783 527 913 237 605 585 722 395
2090C95k26L26K10k20j02k9L8j43l94N88j92r8k25p6K82k60j39R1R3k32mj9J4
$$ 395 169 495 705 485 383 354 392 249 -145 443 251 153 -72 -148 134 -126 -265 -174 -81 -313 -317 -336 -322
2113c22J21j23j87M06l80K6j21j20J96K7k07K02l06L85l57M64R8l60Q9J17j04
$$ -322 -201 -324 -511 -105 -485 -459 -580 -700 -504 -477 -684 -482 -788 -403 -760 -296 -198 -558 -469 -352 -456
2134d56l8p6L89J70k14Q1M63k52K53l18m0K16lP8k79M73r7j85n0K87k6J16k43
$$ -456 -494 -570 -181 -11 -225 -144 319 67 320 2 -38 178 175 253 -26 447 350 165 115 402 376 492 249
2157B49M09l33K04n0p1J49J5j39r1J02q0p5N6k1l19M05k8l36R5R7R3k81m65P93
$$ 249 658 325 529 479 408 557 572 433 342 444 364 289 345 324 5 410 382 46 141 238 331 50 -415 378
2181C78n73l6N40p37L59l43M41m17J15K72p78j69M1J281o83p03P67Nk85QJ96K45
$$ 378 -195 -231 309 -428 -69 -412 29 -388 -273 -1 -779 -948 -907 374 -309 -1012 -245 -240 -525 -517 -321 -76
2203g6l03K83k69K39m7K9j17j3K54j11K33Q9k37K59l01K36R6k36N8M23j27j13
$$ -76 -379 -96 -365 -126 -173 -144 -261 -274 -20 -131 102 191 -46 213 -88 148 244 8 66 489 362 249
2225B49P6Q1J55k59L61j80r8p3J47n3L1p5j04K14j41K38k82O3p9j88nj16J97n1
$$ 249 325 406 561 302 663 483 385 312 459 406 437 362 258 472 331 569 287 350 271 83 78 -38 159 108
2249A08n4R2k24j4j67J75j30Mj29J08n8K1L5j9j48O9l4Q6j84J75j23J6J2K08m07
$$ 108 54 146 -78 -92 -259 -84 -214 -210 -339 -231 -289 -268 -233 -252 -400 -331 -365 -279 -463 -288 -411 -395 -383 -175 -582
2274e82O1N8K27j1k46J18jK43j53K11l70J26R4O5J56J12l7l1J35N0j1r3K94j60
$$ -582 -521 -463 -236 -247 -493 -375 -376 -133 -286 -75 -445 -319 -225 -160 -4 108 71 40 175 225 214 121 415 255
2298B55L66l61k67L57M5j21q3J51L15j51j78J4rK88n3j76K2J90l77j05K38k39
$$ 255 621 260 -7 350 395 274 191 342 657 506 328 342 333 621 568 392 414 604 227 122 360 121
2320A21J51j4q9l4o8K87m40%l1J68k5m20L41p9k42K35p0J01j13j53q7j62J09J55
$$ 121 272 258 169 135 67 354 -86 -86 -117 51 26 -394 -53 -132 -374 -139 -209 -108 -221 -374 -461 -623 -514 -359
2344c59j08J71k86K45L06n01J92k13J39l65O09n71R03L08j284M64M73k42K85J62
$$ -359 -467 -296 -582 -337 -31 -532 -340 -553 -414 -779 -170 -741 162 470 -814 -350 123 -119 166 328
2364C28l05L79o46J88J46o4J82k51K73J31k1M8j21j60L35l4m34K61J33J05J03
$$ 328 23 402 -244 -56 90 26 208 -43 230 361 340 388 267 107 442 408 -26 235 368 473 576
2385E76j28l14L25k41N3K08l29L37k98K7K18j60r8j2q4J23k9q8j4l5k53P7J5n7
$$ 576 448 134 459 218 271 479 150 487 189 216 434 274 176 164 80 203 174 86 72 37 -216 -139 -124 -181
2409a81rM9j83J58K3o2K23m37J30k02N4J39k19J39m8J20J98o0J1k01J74l8N2k0
$$ -181 -190 -141 -324 -166 -143 -205 18 -419 -289 -491 -437 -298 -517 -378 -426 -306 -108 -168 -157 -358 -184 -222 -170 -190
2433a90M1j4J27N4J09k21L42k09RJ56l14M21j49Q2R5l18K24J49p7J79l15J13J22
$$ -190 -149 -163 -36 18 127 -94 248 39 48 204 -110 311 162 244 339 21 245 394 317 496 181 294 416
2456D16j17j82L79M2j07j95J36k6o8N3n13M69P4p4q9R3l89K58R0m2k10o2q3j19
$$ 416 299 117 496 538 431 236 372 346 278 331 -182 287 361 287 198 291 -98 160 250 208 -2 -64 -147 -266
2480b66J06L7P5k77K90Pl76J5K11n44L40l6M9q4P9K36l98K17j72N79m28O5N7k2
$$ -266 -160 -123 -48 -325 -35 -28 -404 -389 -178 -722 -382 -418 -369 -453 -374 -138 -536 -319 -491 88 -340 -275 -218 -240
2504b40p5J06p1L20k16K9K42j80K8k46J84N48m94J11L5J73l5j03J92r2R3K35k26
$$ -240 -315 -209 -280 40 -176 -147 95 -85 -57 -303 -119 429 -65 46 81 254 219 116 308 216 309 544 318
2527C18J27q1M5J62q8k02J68l7j96J22l6r5j30J65j11M62m23K04Pl22J65O7j43
$$ 318 445 364 409 571 483 281 449 412 216 338 302 207 77 242 131 593 170 374 381 59 224 291 148
2550A48rk8j53N7o2j41J96j44j40J32q3o9J06l2m2k46q6K26j99K05q5l6K57j48
$$ 148 139 111 -42 15 -47 -188 8 -136 -276 -144 -227 -296 -190 -222 -264 -510 -596 -370 -569 -364 -449 -485 -228 -376
2574c76J18k06j4K21k9J52q2Rj8l6k34M55J47k10j3r8J95l2k7K06P9L3J38l47
$$ -376 -258 -464 -478 -257 -286 -134 -216 -207 -225 -261 -495 -40 107 -103 -116 -214 -19 -51 -78 128 207 240 378 31
2598C1o9N18n1q1o8j70J60j44O8lR9J85M7j19R8k24J5M0Lj05l3oj07K12l03Q0
$$ 31 -38 480 429 348 280 110 270 126 194 191 290 475 522 403 501 277 292 332 335 230 197 191 84 296 -7 73
2624G3k71K50k08K15J36k83l8R4m6j37j2M3l2l2K79l78k7M83j88l16J77J06J8
$$ 73 -198 52 -156 59 195 -88 -126 -32 -78 -215 -227 -184 -216 -248 31 -347 -374 109 -79 -395 -218 -112 -94
2647i4k21N2k00K30j2Q5j5n2j41o6K25L3r0J07J33J00k49J13K24q3L7O1o0RJ45
$$ -94 -315 -263 -463 -233 -245 -160 -175 -227 -368 -434 -209 -176 -266 -159 -26 74 -175 -62 162 79 116 177 117 126 271
2672B71K56k81J7PN3%j64q7m9N68k13j35j59K07K91k99Q4k54o0K58J12j35j66
$$ 271 527 246 263 270 323 323 159 72 23 591 378 243 84 291 582 283 367 113 53 311 423 288 122
2695A22K10k24o6K42j62%m3K4n8l03K84j63J58l53L01m04M30k34J81k17j86l2
$$ 122 332 108 42 284 122 122 79 103 45 -258 26 -137 21 -332 -31 -435 -5 -239 -58 -275 -461 -493
2717d93N1K30qk58K56k04N0P7j41J03J57K9j47J76k79M62j92n5j24K08P2L9l2
$$ -493 -442 -212 -220 -478 -222 -426 -376 -299 -440 -337 -180 -151 -298 -122 -401 61 -131 -186 -310 -102 -30 9 -23
2740b3j40J56K93r6j93N8J76o2o8J87o2OJ22p6j16J12L3J84n42L98l8K10j42q7
$$ -23 -163 -7 286 190 -3 55 231 169 101 288 226 232 354 278 162 274 307 491 -51 347 309 519 377 290
2764B90k14p6J93J09k7k5K27l48K47l42QL4k6O5L1q4k05k58N55k98Qj1m0j08L4
$$ 290 76 0 193 302 275 250 477 129 376 34 42 76 50 115 146 62 -143 -401 154 -144 -136 -147 -187 -295 -261
2789b61J18j07K47l46q3M12m08p1N13l01j02j35K31M7j1J33kq0J09l4J46j83J45
$$ -261 -143 -250 -3 -349 -432 -20 -428 -499 14 -287 -389 -524 -293 -246 -257 -124 -126 -206 -97 -131 15 -168 -23
2812b3p2Q5J6N8j05K84j59R8m5O4O5nj80J52n3j03K89j99O5O3M5kj02q5K69k02
$$ -23 -95 -10 6 64 -41 243 84 182 137 201 266 261 81 233 180 77 366 167 232 295 340 338 236 151 420 218
2838B18J90j26p9J18m1l6k01K8L3K37q2l28K49k17O3k0p3q9j14L20m40P1J72p8
$$ 218 408 282 203 321 280 244 43 71 104 341 259 -69 180 -37 26 6 -67 -156 -270 50 -390 -319 -147 -225
2862b25j40J17J58k34O9P5N7j37P2L7j14M2J8j24L32j13j42j48J33L23p5j51O6
$$ -225 -365 -248 -90 -324 -255 -180 -123 -260 -188 -151 -265 -223 -205 -329 3 -110 -252 -400 -267 56 -19 -170 -104
2885a04N3j5K4L7J93M5k67o4J89j23J28K00j65R7j3J28j77N9j74J24R2M7j02n3
$$ -104 -51 -66 -42 -5 188 233 -34 -98 91 -32 96 296 131 228 215 343 166 225 51 175 267 314 212 159
2909A59M2j27J89J8k74L48k1j03mj14l6K52l25L72l48p4M5nN6j66k25L95m91K16
$$ 159 201 74 263 281 7 355 334 231 227 113 77 329 4 376 28 -46 -1 -6 50 -116 -341 54 -437 -221
2933b21L7j03J98M88j183K35L29l18Q76p62J65P0K85J49m55l61K55L10L72m50
$$ -221 -184 -287 -89 399 -784 -549 -220 -538 338 -424 -259 -189 96 245 -210 -571 -316 -6 366 -84
2953h4j51k31J31j55J00J14K66q76Q08O42q82N88M8J34q64O38J20l99j01L75M63
$$ -84 -235 -466 -335 -490 -390 -276 -10 -886 -78 564 -318 270 318 452 -412 226 346 -53 -154 221 684
2974F84o79K06M53l63m75J91J67J2qJQ2j50J14R3j20j4j7K1ll7r2LR4k57J18k6
$$ 684 5 211 664 301 -174 17 184 196 188 189 271 121 235 328 208 194 177 198 195 158 66 69 163 -94 24 -2
3000bj25K25l4j32J77m02L00P5j86J54l3k7l44J82L03o06J83J66j66q4K05k56
$$ -2 -127 98 64 -68 109 -293 7 82 -104 50 17 -10 -354 -172 131 -475 -292 -126 -292 -376 -171 -427
3022d27K97j48K2J86J8j22j31L40l89L08k58J90J55Q5l60J0R7L7J89m0L27l32
$$ -427 -130 -278 -256 -70 -52 -174 -305 35 -354 -46 -304 -114 41 126 -234 -224 -127 -90 99 59 386 54
3044E4jm6K29j51J84j67J29j01K52K5j09j26p4L09l46L69k99K77j38j47Q8O5k76
$$ 54 53 7 236 85 269 102 231 130 382 407 298 172 98 407 61 430 131 408 270 123 211 276 0
3067@M37n0qn83L94l1j65k0J9J01M9j81j77n9L02K03l46j48K55r7j23Kj6J55J01
$$ 0 437 387 379 -204 190 159 -6 -26 -7 94 143 -38 -215 -274 28 231 -115 -263 -8 -105 -228 -226 -242 -87 14
3092A4k34o2k3R8J27l16K65j32Q0J57j45K00mj81j54N04k76J94j7J3P6l41K83
$$ 14 -220 -282 -305 -207 -80 -396 -131 -263 -183 -26 -171 29 25 -156 -310 194 -82 112 95 108 184 -157 126
3115A26j26L5J38j05j25L96j59m4k0J61j20M6J81k14j6j0l9O5M9R6k42K11O5l8
$$ 126 0 35 173 68 -57 339 180 136 116 277 157 203 384 170 154 144 105 170 219 315 73 284 349 311
3139C11o6k44J15r9Q7r2K48k0k84N4oQ4j07J1K24r0n22L41P4k10J88k27J66k61
$$ 311 245 1 116 17 104 12 260 240 -44 10 4 88 -19 -8 216 126 -396 -55 19 -191 -3 -230 -64 -325
3163c25m3R6J16n5O6J3k2J11r6k14J36j08K73o7j52K45l9j46K7J39J07m9j21J49
$$ -325 -368 -272 -156 -211 -145 -132 -154 -43 -139 -353 -217 -325 -52 -119 -271 -26 -65 -211 -184 -45 62 13 -108 41
3187D1J15k10o7K80j20p2j0K38j40O7L35k40Q7rP6l30k0J98k30Q2J43k89K57j1
$$ 41 156 -54 -121 159 39 -33 -43 195 55 122 457 217 304 295 371 41 21 219 -11 71 214 -75 182 171
3211A71K4J11l12l3J65Q7j09Kj2J23l21K85N6j06k39J71o8j51M3n2K33J10j95
$$ 171 195 306 -6 -39 126 213 104 106 94 217 -104 181 237 131 -108 63 -5 -156 -113 -165 68 178 -17
3234a7K88l40k06L59l74J12nk74K85JJ82k14k88L39q6N77p89N16n1q82Q72R6J01
$$ -17 271 -69 -275 84 -290 -178 -183 -457 -172 -171 11 -203 -491 -152 -238 339 -450 66 15 -867 5 101 202
3257B02k11R8J22n21l7M6k0L61N77m33m0O62p56P31p75l46N86qr2P29l51p50J95
$$ 202 -9 89 211 -310 -347 -301 -321 40 617 184 144 806 50 781 6 -340 246 238 146 875 524 -226 -31
3280c1J70L71l31J32n59J8N48J88j29p24O73o12M77l40M07m08j21L16R7m60L27
$$ -31 139 510 179 311 -248 -230 318 506 377 -347 326 -286 191 -149 258 -150 -271 45 142 -318 9
3301IK45j58k65j82K05J18j40k53L99n7j18l8L3r7pK5J73o2j48qJ99k34Q6L12
$$ 9 254 96 -169 -351 -146 -28 -168 -421 -22 -79 -197 -235 -202 -299 -306 -281 -108 -170 -318 -326 -127 -361 -275 37
3325C7k54R6J10k50J73M6k08N3K55k56J24L41k97K61r6q4J9m6J69J45l46K65j78
$$ 37 -217 -121 -11 -261 -88 -42 -250 -197 58 -198 -74 267 -30 231 135 51 70 24 193 338 -8 257 79
3348G9j03j6J13OJ01m3K18k84J46K8k51n6J16J29K09k30n8J3r5l50N40k20PJ22
$$ 79 -24 -40 73 79 180 137 355 71 217 245 -6 -62 54 183 392 162 104 117 22 -328 212 -8 -1 121
3372A21j77K54j79O4j50j0P0j08K37K7%k44o9j7j81L99k19J7P9j83o4Q1L1K4k47
$$ 121 -56 198 19 83 -67 -77 -7 -115 122 149 149 -95 -164 -181 -362 37 -182 -165 -86 -269 -333 -252 -221 -197 -444
3397d44J64J33q4o8K59k67J81n1j41K95m1j34J06K66j99N3ro3O3M5k84N68m19
$$ -444 -280 -147 -231 -299 -40 -307 -126 -177 -318 -23 -64 -198 -92 174 -25 28 19 -44 19 64 -220 348 -71
3420g1L44k01L2J31k5m6L4Ml5Pn4O0nJ72m69L84j25K47k77P9p3L1r3n8KJ14j6
$$ -71 273 72 104 235 210 164 198 202 167 174 120 180 175 347 -122 262 137 384 107 186 113 144 51 -7 -5 109 93
3447I3j62L48j97O7j43k8O1j27K29l12J47j0j8k4p1Qj86J67OL14m56K94n4LM1
$$ 93 -69 279 82 149 6 -22 39 -88 141 -171 -24 -34 -52 -76 -147 -139 -325 -158 -152 162 -294 0 -54 -51 -10
3472a0l6k47J84O0q4P5m07L83p1k0K00k65L63j11j1L9j53P1n3K8K16J73j27j64
$$ -10 -46 -293 -109 -49 -133 -58 -465 -82 -153 -173 27 -238 125 14 3 42 -111 -40 -93 -65 151 324 197 33
3496C3m6j42J92l4K03N7j1J71j60l98K65r3q9J45q1O6J14R3j15j42L09k27m1J1
$$ 33 -13 -155 37 3 206 263 252 423 263 -135 130 37 -52 93 12 78 192 285 170 28 337 110 69 80
3520H0j02M7q8O7N2j87J74Q6j48J83r7lj04j8j05K45j91J27J05m07j5N75m98q7
$$ 80 -22 25 -63 4 56 -131 43 129 -19 164 67 64 -40 -58 -163 82 -109 18 123 -284 -299 276 -222 -309
3544c09L66P7n65M81k33J74K96k45k50j04N47l29j2k35O13k55O6k94j53M24L99
$$ -309 57 134 -431 50 -183 -9 287 42 -208 -312 235 -94 -106 -341 272 17 83 -211 -364 60 459
3565D59j63q09R19m89P3O57n46pP1k84P4L41K40k13m34J192o75n34L94m08K75
$$ 459 296 -513 406 -83 -10 647 101 94 165 -119 -45 296 536 323 -111 1081 406 -128 266 -142 133
3586A33M66o33J78k91K42K82K98j07j94k37n70J011q50N6l46O72O94q16M72o44
$$ 133 599 -34 144 -147 95 377 675 568 374 137 -433 578 -272 -216 -562 110 804 -12 460 -184
3606a84N30O2m42R7N31q90L34r81N60L85L63K29m55o2m59J75o80P23r0K32m60
$$ -184 346 408 -34 63 594 -296 38 -943 -383 2 365 594 139 77 -382 -207 -887 -164 -254 -22 -482
3627d82Q92k69n59M3L49n53J056L45j475J611l96q2n55L54r49Q60P7M00m08j204
$$ -482 410 141 -418 -375 -26 -579 477 822 -653 958 562 480 -75 279 -670 190 267 667 259 -945
3647i45J242K8m88q98J754k3m75K71j79n82K27L45J64m06L99j78l08K69l06K22
$$ -945 297 325 -163 -1061 693 670 195 466 287 -295 -68 277 441 35 434 256 -52 217 -89 133
3667A33J89k11m22Q24j24j58j82p26O60P0q36J594q67L7k34n78Q19j27P09m80
$$ 133 322 111 -311 513 389 231 49 -677 -17 53 -783 811 -56 -19 -253 -831 -12 -139 570 90
3687I0o91O14J01L55L95p00L42k34O30j022J87l17j55O79o10N38l43k08O56l95
$$ 90 -601 13 114 469 864 164 506 272 902 -120 67 -250 -405 274 -336 202 -141 -349 307 -88
3707h8L84m19J06j37M8J21o0N0R3J19L16n96Q9J64n18L34K16m7Q0j29k24K88o9
$$ -88 296 -123 -17 -154 -106 15 -45 5 98 217 533 -63 26 190 -328 6 222 175 255 126 -98 190 121
3730A21O0J05jj70j4K3k55J97%l6R0o2O8m9m1j00J3J45J31j97l09L33j6n9j19
$$ 121 181 286 285 115 101 124 -131 66 66 30 120 58 126 77 36 -64 -51 94 225 28 -281 52 36 -23 -142
3755a42P3J90l81J19kQ2O4k90J49l7j04K13k7j61J02n9j09k8K00l19L67k15M11
$$ -142 -69 121 -260 -141 -143 -61 3 -287 -138 -175 -279 -66 -93 -254 -152 -211 -320 -348 -148 -467 -100 -315 96
3778I6P1k27Q1j91J79k28J08K70l92K06K01l9j84K07l3j94K14K4k08k8J83J00
$$ 96 167 -60 21 -170 9 -219 -111 159 -233 -27 174 135 -49 158 125 -69 145 169 -39 -67 116 216
3800B16J82k75J38j19k9J78j56N4j76L92K69k65l53J46n42N93j09J72m25L23j9
$$ 216 398 123 261 142 113 291 135 189 13 405 674 409 56 202 -340 253 144 316 -109 214 195
3821A95o0j67j40J20l1R8J87k20K02k78K14k36j4k78K78J82l62K28j11k6K15L15
$$ 195 135 -32 -172 -52 -83 15 202 -18 184 -94 120 -116 -130 -408 -130 52 -310 -82 -193 -219 -4 311
3843C11m89OK40k36K51j63l4l64M29j38Q1L4L34k45K65j85j27K0M05l95J28j44
$$ 311 -178 -172 68 -168 83 -80 -114 -478 -49 -187 -106 -72 262 17 282 97 -30 -10 395 0 128 -16
3865a6l5j23L41j68M4Q5k33L29k25j2RJ44j18K38j66qK24m3k07K21j47K5j8N5
$$ -16 -51 -174 167 -1 43 128 -105 224 -1 -13 -4 140 22 260 94 86 310 267 60 281 134 159 141 196
3889A96k43p5O5N27k21p2l59J19J76l19J04k99J97M05k52q6j02N2k70O21l27L54
$$ 196 -47 -122 -57 470 249 177 -182 -63 113 -206 -102 -401 -204 201 -51 -137 -239 -187 -457 164 -163 191
3911A91L6k90j45J39k70K22L4pK9m6N8p4j32j9M3M0j43M40j76L7R5j35j48K57
$$ 191 227 -63 -208 -69 -339 -117 -83 -90 -61 -107 -49 -123 -255 -274 -231 -191 -334 106 -70 -33 62 -73 -221 36
3935C6P2j04k0O2L25k30j85Q3N6K00l6n2k15K33j03J10k92J53k6L43m7l63K24
$$ 36 108 4 -16 46 371 141 -44 39 95 295 259 207 -8 225 122 232 -60 93 67 410 363 0 224
3958B24j52R0r0j2j4O5qN6K6r9k64K08j70J76Q0p8j26L4J32l6k47P3j55L00k80
$$ 224 72 162 72 60 46 111 103 159 185 86 -178 30 -140 36 116 38 -88 -54 78 42 -205 -132 -287 13 -267
3983b67K45K34k04l22K99k8m53M55N7j12o4J1j5j7K86j84R9k49J29l6N4J10Q0
$$ -267 -22 212 8 -314 -15 -43 -496 -41 16 -96 -160 -149 -164 -181 105 -79 20 -229 -100 -136 -82 28 108
4006A08Oq2o88P91j49j59J35N9j53J86j07L36l50n6M80l25j0l3oJ19LM5R7k06
$$ 108 114 32 -656 135 -14 -173 -38 21 -132 54 -53 283 -67 -123 357 32 22 -11 -17 102 105 150 247 41
4030D1O1R9O4k59J56K91l68J28j12j95L78j87r0O3J75l95K40p7j70K42j50L89
$$ 41 102 201 265 6 162 453 85 213 101 -94 284 97 7 70 245 -150 90 13 -157 85 -65 324
4052C24l37j4j63qJ23o8K3k03L40n1L2J20j66o0q2K8J07k05qJ10p2K0J87j66k0
$$ 324 -13 -27 -190 -198 -75 -143 -120 -323 17 -34 -2 118 -48 -108 -190 -162 -55 -260 -268 -158 -230 -210 -23 -189 -209
4077b09K24k38K71l04J8L60j44Q9j58J06J40Rk61l0N8L53N6k44Qm75K57O9k60
$$ -209 15 -223 48 -256 -238 122 -22 67 -91 15 155 164 -97 -127 -69 284 340 96 104 -371 -114 -45 -305
4100c05N18j3j25J17k67K22K2N2k38l4J34R0m9P4j27K04j22k01J33j06J47k52
$$ -305 213 200 75 192 -75 147 169 221 -17 -51 83 173 124 198 71 275 153 -48 85 -21 126 -126
4122a26L1qK87k16nn7J94K0k04o9Q9J45J2k08k8J1j52N42l85l3P6j34l0J63j94
$$ -126 -95 -103 184 -32 -37 -94 100 120 -84 -153 -64 81 93 -115 -143 -132 -284 258 -127 -160 -84 -218 -248 -85 -279
4147b79j31K88o7P2j31K54j19R2J1o7P5j65J98o4J37l12K55n6jK7J64j93K10j73
$$ -279 -410 -122 -189 -117 -248 6 -113 -21 -10 -77 -2 -167 31 -33 104 -208 47 -9 -10 17 181 -12 198 25
4171B5j24K81j80J85J93k84N7j0L3k32P1K3q1J33KqP2l08J54P3J52k67K21m5l67
$$ 25 -99 182 2 187 380 96 153 143 176 -56 15 38 -43 90 92 84 156 -152 2 75 227 -40 181 136 -231
4196b31M94k60l0K8J00k57M0K8N93l75J4K87l11j90k74N31k60k02K93k08J23n4
$$ -231 263 3 -27 1 101 -156 -116 -88 505 130 144 431 120 -70 -344 187 -73 -275 18 -190 -67 -121
4218a21J12n2P5R5j36o2MJ55O3l85j08L55Q0n7m1j40J65J68r1r5k0K32r7n6l0
$$ -121 -9 -61 14 109 -27 -89 -85 70 133 -252 -360 -5 75 18 -23 -163 2 170 79 -16 -36 196 99 43 13
4243A3J25j25K34N4k13J1m9J09mq8J20j6j50M4K0M0l39K17R8O2J72n14O9j16K74
$$ 13 138 13 247 301 88 99 50 159 155 67 187 171 21 65 85 125 -214 3 101 163 335 -179 -110 -226 48
4268D8j31O6K0J0j85r6K06J20j09q8J06j28O3o5J26M8j61J92k32K7K85l47J31
$$ 48 -83 -17 3 13 -172 -268 -62 58 -51 -139 -33 -161 -98 -163 -37 11 -150 42 -190 -163 122 -225 -94
4291i4L8j14m0J52J5p3J91j43J98k36l15P2K28M38m75j03K44o3j53K56K16j83
$$ -94 -56 -170 -210 -58 -43 -116 75 -68 130 -106 -421 -349 -121 317 -158 -261 -17 -80 -233 23 239 56
4313E6o7K45k16K31m1k28K74k25k44N10m31n0L90k62K81l33J83L4m00M35J26j4
$$ 56 -11 234 18 249 208 -20 254 29 -215 295 -136 -186 204 -58 223 -110 73 107 -293 142 268 254
4335B54K05j86k08L4p5K73m02k5m3p2L12N3k87k81O11l78K96r1K63k59M15p62
$$ 254 459 273 65 99 24 297 -105 -130 -173 -245 67 120 -167 -448 163 -215 81 -10 253 -6 409 -353
4357c53k27M17L81j99k18L21R2k26KJ29k49M12k97K09M8q11M88J38j09m7P07m89
$$ -353 -580 -163 218 19 -199 122 214 -12 -10 119 -130 282 -15 194 242 -569 -81 57 -52 -99 608 119
4379A19J38o80J24j59L68L44j26m8M1j78N39n35K88p3r64R26K96m53Q9J63n41
$$ 119 257 -423 -299 -458 -90 254 128 80 121 -57 482 -53 235 162 -802 124 420 -33 56 219 -322
4400c22O43o03M00N47q17J18j13L8R07j335J47L00M45m87n77J058m23J51m19j73
$$ -322 321 -282 118 665 -152 -34 -147 -109 798 -537 -390 -90 355 -132 -709 349 -74 77 -342 -515
4420e15N86jJ36l12K29K50p0l63m75O83R7o13J08J1L15Q1K20k47q3N5l30J23L7
$$ -515 71 70 206 -106 123 373 303 -60 -535 148 245 -368 -260 -249 66 147 367 120 37 92 -238 -115 -78
4443g8M20l76J23j97K34P4k38J02j21k36L68k44M24m20K21j92O91p34L21k24j44
$$ -78 342 -34 89 -108 126 200 -38 64 -57 -293 75 -169 255 -165 56 -136 555 -179 142 -82 -226
4464b26J59j49Q70k00o22M74K01j82j86j68J75j96L2K98m66j36K91J66Q0k50K67
$$ -226 -67 -216 654 454 -168 306 507 325 139 -29 146 -50 -18 280 -186 -322 -31 135 215 -35 232
4485B32q2j55k45K48L08k67j78R7J56m74K05J2m77R67p72P60j72n95N21o71N30
$$ 232 150 -5 -250 -2 306 39 -139 -42 114 -360 -155 -143 -620 347 -425 335 163 -432 89 -582 -52
4506e2M19p49l77J047j33l68l17J33P56k79O5J61l72j48k31P6k05N39j66K13L1
$$ -52 367 -382 -759 288 155 -213 -530 -397 359 80 145 306 -66 -214 -445 -369 -574 -35 -201 12 43
4527D3l99m75M19N93p43N67M55n94N79p72O88o08O8K35J48m94L82n3q1N37n86
$$ 43 -356 -831 -412 181 -562 5 460 -134 445 -327 361 -247 -179 56 204 -290 92 39 -42 495 -91
4548i1K22n5qO1o1o8K01m5k37J42p5j00K29j56J72J61k05J98j69o1k01K25Q4P
$$ -91 131 76 68 129 68 0 201 156 -81 61 -14 -114 115 -41 131 292 87 285 116 55 -146 79 163 170
4572A70k63q2J6K87J6J27Q8j16K42j85r99O25K58p46K30O97k12r3r4J23r2J9k64
$$ 170 -93 -175 -159 128 144 271 359 243 485 300 -699 -74 184 -562 -332 365 153 60 -34 89 -3 16 -248
4595b48R7L1m1K71l43J26J19J03p4q1Qm1j05jK47L1k81J86Q3m3k35K0K75L4r0
$$ -248 -151 -120 -161 110 -233 -107 12 115 41 -40 -32 -73 -178 -179 68 99 -182 4 87 44 -191 -171 104 138 48
4620D8r2K46j31j75J3J71j81jl1K64r4qq7L3j79Q04n03M0K77o28Q15p19L88m65
$$ 48 -44 202 71 -104 -91 80 -101 -102 -133 131 37 29 -58 -25 -204 600 97 137 414 -214 601 -118 270 -195
4644a95L04k99j1O75l98K49k55q6l1K86n30K93Q2k34j26L41j39J93k87K01k11
$$ -195 109 -190 -201 474 76 325 70 -16 -47 239 -291 2 84 -150 -276 65 -74 119 -168 33 -178
4665a78J79P5m7p2J03l9J11k93M4k17L08j50J36k16J58q3M2O8j34L66k10L7k9
$$ -178 1 76 29 -43 60 21 132 -161 -117 -334 -26 -176 -40 -256 -98 -181 -139 -71 -205 161 -49 -12 -41
4688d1m2P8j18K27L0n9J90k30n3J05q9K27k92Q0qJ38o0K73k37j95J88j27P0o2
$$ -41 -83 -5 -123 104 134 75 265 35 -18 87 -2 225 -67 13 5 143 83 356 119 -76 112 -15 55 -7
4712gk9LK13j48MO8M9j37m0k18K43j75R5P1l3J8k28J24J33J56j94l0k55k6J92
$$ -7 -36 -33 180 32 36 104 153 16 -24 -242 1 -174 -79 -8 -41 -23 -251 -127 6 162 -32 -62 -317 -343 -151
4737a51J99r6j65k2J27p0q6K30j70K31J45l06j71oJ88N7J33Qk14J64N4j58L5p0
$$ -151 48 -48 -213 -235 -108 -178 -264 -34 -204 27 172 -134 -305 -311 -123 -66 67 75 -139 25 79 -79 -44 -114
4761a14K12j53mJ23j8p8J89r9o5J6K73m2l59OK73k06J65O7j97J57l55K86K0j02
$$ -114 98 -55 -59 64 46 -32 157 58 -7 9 282 240 -119 -113 160 -46 119 186 -11 146 -209 77 97 -5
4785eK1J53k80K18J17k79O6K85l46j05K64l91N40l71M2j75M32L91o51J96l28R26
$$ -5 16 169 -111 107 224 -55 11 296 -50 -155 109 -282 258 -113 -71 -246 186 577 -74 122 -206 720
4807G20o08k80J36l24O3J32PK41j74J87p4M5R2m69J68J66l13J28L22l65K56k16
$$ 720 112 -168 -32 -356 -293 -161 -154 87 -87 100 26 71 163 -306 -138 28 -285 -157 165 -200 56 -160
4829a60J14k51K42m5K01J12k70Q2L6j41Q4j08M8L39l20J39j2j45J15m6P0o3j80
$$ -160 -46 -297 -55 -100 101 213 -57 25 61 -80 4 -104 -56 283 -37 102 90 -55 60 14 84 21 -159
4852a59M69k71M3q3orj17k62K21L60l5k09K6j2l0rJ39Mr3j30J53J21m1r7P0P4
$$ -159 310 39 82 -1 -7 -16 -133 -395 -174 186 151 -58 -32 -44 -74 -83 56 60 -33 -163 -10 111 70 -27 43 117
4878A17l54L00J4l95M21OJ50m17O5J3p3J20k09O3K12k59J88P0j57M13l10k67N
$$ 117 -237 63 77 -318 103 109 259 -158 -93 -80 -153 -33 -242 -179 33 -226 -38 32 -125 288 -22 -289 -284
4901b84K14J2J23r7j65K00j12j38K74m3o7K16k65J91J23m08K35K35j48k34J46
$$ -284 -70 -58 65 -32 -197 3 -109 -247 27 -16 -83 133 -132 59 182 -226 9 244 96 -138 8
4922HOJ4Ll9K44j35%K4m0k83K02N3J35j46m9M2M3j98J54J56k94L01L8k26L05l63
$$ 8 14 28 31 -8 236 101 101 125 85 -198 4 57 192 46 -3 39 82 -116 38 194 -100 201 239 13 318 -45
4948d5K90m64L32J11l24J22J94k70J39k40j09K11L35l28Jj53K85n0l51M41m15
$$ -45 245 -219 113 224 -100 22 216 -54 85 -155 -264 -53 282 -46 -45 -198 87 37 -314 127 -288
4969b88L39j76oO2N5j93L53j22m1J28j62J06M4o7J18j90P5j6J84m06J79Mk6J92
$$ -288 51 -125 -131 -69 -14 -207 146 24 -17 111 -51 55 99 32 150 -40 35 19 203 -203 -24 -20 -46 146
4993A46k4k32P7O8k29K71N4m0Q2j41J7J29k91J85j13K63J6j19o1j85K96j86K62
$$ 146 122 -110 -33 35 -194 77 131 91 173 32 49 178 -113 72 -41 222 238 119 58 -127 169 -17 245
5016B45j26k14K41K89k75j81Nk4k25J93K55l35R4j07J77J66k64k2m3o4O7R2j24
$$ 245 119 -95 146 435 160 -21 -16 -40 -265 -72 183 -152 -58 -165 12 178 -86 -108 -151 -215 -148 -56 -180
5039a80J20J19k21J84n3p2J01o2o5L13l41j84O6L11J0k15O9K26O3k92J46q2j6
$$ -180 -60 59 -162 22 -31 -103 -2 -64 -129 184 -157 -341 -275 36 46 -169 -100 126 189 -103 43 -39 -55
5062e5J61k58j05K35R3j66K56K1l71M11k01Q2Pj80P1J17K81l30j2j73RL51j91
$$ -55 106 -152 -257 -22 71 -95 161 182 -189 222 21 103 110 -70 1 118 399 69 57 -116 -107 244 53
5085E3r0J74L6k6J1l40K65j86K16J52k97J98l67J83O3P8l04K88o4k2j15P9n6K99
$$ 53 -37 137 173 147 158 -182 83 -103 113 265 -32 166 -201 -18 45 123 -181 107 43 21 -94 -15 -71 228
5109B28j98j17L0J8j99J05J80l89K78J76j12J0K5k19J94j9k42J56l5lJ25Lk86
$$ 228 30 -87 -57 -39 -238 -133 47 -342 -64 112 0 10 35 -184 10 -9 -251 -95 -130 -133 -8 -5 -291
5132b91L21j11o5J53j47R7N6N4k86L56k19K50j96j31K76N0L1k13LQ2nj97K51j97
$$ -291 30 -81 -146 7 -140 -43 13 67 -219 137 -82 168 -28 -159 117 167 198 -15 -12 70 65 -132 119 -78
5156g8K96k16j59K88p0r1Q1K69j31k05rq5K51p3n2J38j03m9O1r7P9k33L53l33
$$ -78 218 2 -157 131 61 -30 51 320 189 -16 -25 -110 141 68 16 154 51 2 63 -34 45 -188 165 -168
5180a68K36j46J60r2N9O1p4R4o0j18j7M6N0K42m74J65q1L23J56m61r8J71j45K32
$$ -168 68 -78 82 -10 49 110 36 130 70 -48 -65 -19 31 273 -201 -36 -117 206 362 -99 -197 -26 -171 61
5204F1Q9k60K19m0j14Lk7K27k14n9j53R7P7K89k6Nk88J09K01j10K18rm3j26l03
$$ 61 150 -110 109 69 -45 -42 -69 158 -56 -115 -268 -171 -94 195 169 174 -114 -5 196 86 304 295 252 126 -177
5229a77L36j5k93J40p2L94m51j83K97J91l85J90N4m7k73L90N5o6M0O3l30K3K51
$$ -177 159 144 -149 -9 -81 313 -138 -321 -24 167 -218 -28 26 -21 -294 96 151 85 125 188 -142 -119 132
5252A32q1j01Pl2MK77l06l5L03l54M5Q4J22k3L6m2r5Q2J24k43q9J91J88l38J00
$$ 132 51 -50 -43 -75 -71 206 -100 -135 168 -186 -141 -57 65 42 78 36 -59 23 147 -96 -185 6 194 -144 -44
5277d4J09j63K19j43J38r4p2N0r9J50Q7j20j65K04N8q4Mn0Q0k07J4K59l3J01k21
$$ -44 65 -98 121 -22 116 22 -50 0 -99 51 138 18 -147 57 115 31 35 -15 65 -142 -128 131 98 199 -22
5302b2K18P7j33ml03K62l33K20J16l7L64j42l02J43J13k80J50j30r5J28l2N7j37
$$ -22 196 273 140 136 -167 95 -238 -18 98 61 425 283 -19 124 237 -43 107 -23 -118 10 -22 35 -102
5325a02L21q3l2j33q6P9R2r5o8m2M25l58J78j46j67P9J36q1K09k32J78k61K17
$$ -102 219 136 104 -29 -115 -36 56 -39 -107 -149 276 -82 96 -50 -217 -138 -2 -83 126 -106 72 -189 28
5348B8j21N3m9N0P4K46l13J76j64j36J01O5l8j52K81L1l36J82j03J38K46k43L7
$$ 28 -93 -40 -89 -39 35 281 -32 144 -20 -156 -55 10 -28 -180 101 132 -204 -22 -125 13 259 16 53
5371E3k26L59k02o0J5M92j96k07m4N9k2m1L3K69k67L6p8p2nLk4K93j76N2k3r4
$$ 53 -173 186 -16 -76 -61 431 235 28 -16 43 21 -20 13 282 15 51 -27 -99 -104 -101 -125 168 -8 44 21 -73
5397g3J14R8k13J49k31J11J90k87K86l02K14k01N5nJ09O6P9p5j08l13M09nk22
$$ -73 41 139 -74 75 -156 -45 145 -142 144 -158 56 -145 -90 -95 14 80 159 84 -24 -337 72 67 -155
5420a55N9Qj73K37j98j29L02OJ04J36k69J61j59J40J2J1O0j02M5j96K13j09M7
$$ -155 -96 -88 -261 -24 -222 -351 -49 -43 61 197 -72 89 -70 70 82 93 153 51 96 -100 113 4 51
5443E1m0P0n1o6j9jp7J42j52K49K24m03K3JK92j31Q6q4Q9l64L66l1k63K12j47
$$ 51 11 81 30 -36 -55 -56 -133 9 -143 106 330 -73 -50 -49 243 112 198 114 203 -161 205 174 -89 123 -24
5468b4P0J26r0j84J73m0J90k22N26o75j09J76k30j41J51l06J42K6L74k01N15m39
$$ -24 46 172 82 -102 71 31 221 -1 525 -150 -259 -83 -313 -454 -303 -609 -467 -441 -67 -268 247 -192
5490a92k3j28K18j07J98J95j40l4k1P0K9L9j70L31p6o7j15K0j08j78Q0K72l1j63
$$ -192 -215 -343 -125 -232 -34 161 21 -13 -34 36 65 104 -66 265 189 122 7 27 -81 -259 -179 93 62 -101
5514a01P1L9J17k52j16N49l94K61k79K30n8m8J31Kl11M18k36jq7o1J08Q0o0J47
$$ -101 -30 9 126 -126 -242 307 -87 174 -105 125 67 19 150 152 -159 259 23 22 -65 -126 -18 62 2 149
5538A49k09j9o5j20L28j30o4j28L18j19P4p3J03o5j05O7J94j42o0K05l13j14L39
$$ 149 -60 -79 -144 -264 64 -66 -130 -258 60 -59 15 -58 45 -20 -125 -58 136 -6 -66 139 -174 -288 51
5561E1lj81Q4p6P2L7j47J76K06k56j2k15K98j8k7p1j05O9r6J67R8m9n4j11J97
$$ 51 48 -133 -49 -125 -53 -16 -163 13 219 -37 -49 -264 34 16 -11 -82 -187 -118 -214 -47 51 2 -52 -163 34
5586C4j85K17m40N21l23J98Q8J7j30O5o2n6J44j25M9J06p1n9l4%K4Pn4L92j83
$$ 34 -151 66 -374 147 -176 22 110 127 -3 62 0 -56 88 -37 12 118 47 -12 -46 -46 -22 -15 -69 323 140
5611A40j02j00J4J5J99k59m5J87l5p4l2P2K58j36m6O1j21J66r4j81J14p3M4j20
$$ 140 38 -62 -48 -33 166 -93 -138 49 14 -60 -92 -20 238 102 56 117 -4 162 68 -113 1 -72 -28 -148
5635a48J01Q0q7K8j39RL55j36k78L15k61K33j61R5K34l93J52P5P8k02j73L23L4
$$ -148 -47 33 -54 -26 -165 -156 199 63 -215 100 -161 72 -89 6 240 -153 -1 74 152 -50 -223 100 134
5658A34j57j08L91j58j5l7l6R8k27M4Q7Rj96K11p6k4k53L65qj6J04j5m9j2k41
$$ 134 -23 -131 260 102 87 50 14 112 -115 -71 16 25 -171 40 -36 -60 -313 52 44 28 132 117 68 56 -185
5683a85L96k81R7K08k53l3O3r6J27j71L93j78QJ59j97j1j15M4K33L6m52L65l20
$$ -185 211 -70 27 235 -18 -51 12 -84 43 -128 265 87 95 254 57 46 -69 -25 208 244 -208 157 -163
5706a63M4K11p5K89l19j7J71M9n2j54L6r7J3k4K07j04J5k67nJ84O4j05j4M4K15
$$ -163 -119 92 17 306 -13 -30 141 190 138 -16 20 -77 -64 -88 119 15 30 -237 -242 -58 6 -99 -113 -69 146
5731A46jk40J3N0N8OM9k12M6J03K3j79Q2K8P0j88J74K40l26J54j35J0Q8J00m70
$$ 146 145 -95 -82 -32 26 32 81 -131 -85 18 41 -138 -56 -28 42 -146 28 268 -58 96 -39 -29 59 159 -311
5756c11M93j20p8M7K2O9j83K93p2k46K10j96k6L94l71J16j13j46M23j06k71K19
$$ -311 182 62 -16 31 53 122 -61 232 160 -86 124 -72 -98 296 -75 41 -72 -218 205 99 -172 47
5778D7N6k34J96o4k08j2J15J64J46o1m3j26k85K57P1J03q8j29K29J00n22L06L6
$$ 47 103 -131 65 1 -207 -219 -104 60 206 145 102 -24 -309 -52 19 122 34 -95 134 234 -288 18 54
5801E4j63O6J7r5n4K57j80K23k30oK28j80pK13O6k77k7J30J40O0k8k62j8K0J02
$$ 54 -109 -43 -26 -121 -175 82 -98 125 -105 -111 117 -63 -70 143 209 -68 -95 35 175 235 207 -55 -73 -53 49
5826D9K8j26m0r7L61l18J1L95j75N0j03j2kk49K72m6J22L3k63k42N72j96P1k12
$$ 49 77 -49 -89 -186 175 -143 -132 263 88 138 35 23 21 -228 44 -2 120 153 -110 -352 220 24 95 -117
$$ [...]
8191D97
##END NTUPLES=NMR FID
##END=
