##TITLE=1H_SR62_k
 CDCl3,8 sc, 
 2.02.2021
##JCAMPDX= 6.0         $$ Bruker NMR JCAMP-DX V2.0
##DATA TYPE= NMR FID
##DATA CLASS= NTUPLES
##ORIGIN= UXNMR, Bruker Analytische Messtechnik GmbH
##OWNER= root
$$ XWIN-NMR		Version 3.5
$$ Tue Feb  2 12:15:04 2021 Russian Standard Time (UT+4h)  she@DPX200
##.OBSERVE FREQUENCY= 200.1315066352
##.OBSERVE NUCLEUS= ^1H
##.DELAY= (6, 6)
##.ACQUISITION MODE= SIMULTANEOUS
##.ACQUISITION SCHEME= undefined
##.AVERAGES= 8
##.DIGITISER RES= 18
##SPECTROMETER/DATA SYSTEM= spect
##.PULSE SEQUENCE= zg30
##.SOLVENT NAME= CDCl3
##.SHIFT REFERENCE= (INTERNAL, CDCl3, 0, 15.7039)
##AUDIT TRAIL= $$ (NUMBER, WHEN, WHO, WHERE, WHAT)
$$ ##TITLE= Audit trail, XWIN-NMR		Version 3.5
$$ ##JCAMPDX= 5.01
$$ ##ORIGIN= Bruker BioSpin GmbH
$$ ##OWNER= she
$$ F:/spectra/data/she/nmr/H-F/1/audita.txt
$$ ##AUDIT TRAIL=  $$ (NUMBER, WHEN, WHO, WHERE, WHAT)
(   1,<2021-02-02 12:13:22.95 +0400>,<she>,<DPX200>,
      <created by zg, POWCHK disabled, PULCHK disabled
       configuration hash MD5:
       00 E9 B6 7A A2 85 ED C7 34 08 36 98 17 FE 4E 26
       data hash MD5: 16K
       F1 E2 A1 74 5C 65 41 82 56 13 CD 8C B5 41 AE 76>)
$$ ##END=
$$ 
$$ hash MD5
$$ CA 2B F8 B2 91 21 13 29 85 47 22 BB EB CD 0F 30
##$RELAX= 
##$RELAX= 
##$RELAX= 
##$RELAX= 
##$RELAX= 
##$RELAX= 
$$ Bruker specific parameters
$$ --------------------------
##$DU= <F:/spectra>
##$EXPNO= 1
##$NAME= <H-F>
##$PROCNO= 1
##$TYPE= <nmr>
##$USER= <she>
##$AMP= (0..31)
100 100 100 100 100 100 100 100 100 100 100 100 100 100 100 100 100 100 
100 100 100 100 100 100 100 100 100 100 100 100 100 100 
##$AQSEQ= 0
##$AQ_mod= 1
##$AUNM= <au_zg>
##$AUTOPOS= <>
##$BF1= 200.13
##$BF2= 200.13
##$BF3= 200.13
##$BF4= 200.13
##$BF5= 200.13
##$BF6= 200.13
##$BF7= 200.13
##$BF8= 200.13
##$BYTORDA= 1
##$CFDGTYP= 0
##$CFRGTYP= 5
##$CHEMSTR= <none>
##$CNST= (0..31)
1 1 145 1 1 1 1 1 1 1 1 1 1 1 1 1 1 1 1 1 1 1 1 1 1 1 1 1 1 1 1 1 
##$CPDPRG= <>
##$CPDPRG1= <>
##$CPDPRG2= <>
##$CPDPRG3= <>
##$CPDPRG4= <mlev>
##$CPDPRG5= <mlev>
##$CPDPRG6= <mlev>
##$CPDPRG7= <mlev>
##$CPDPRG8= <mlev>
##$CPDPRGB= <>
##$CPDPRGT= <>
##$D= (0..31)
0 1.2 0 0 0 0 0 0 0 0.06 0 0.03 0 0 0 0 0.0002 0 0 0 0 0 0 0 0 0 0 0 0 
0 0 0 
##$DATE= 1612253602
##$DBL= (0..7)
120 120 120 120 120 120 120 120 
##$DBP= (0..7)
150 150 150 150 150 150 150 150 
##$DBP07= 0
##$DBPNAM0= <>
##$DBPNAM1= <>
##$DBPNAM2= <>
##$DBPNAM3= <>
##$DBPNAM4= <>
##$DBPNAM5= <>
##$DBPNAM6= <>
##$DBPNAM7= <>
##$DBPOAL= (0..7)
0.5 0.5 0.5 0.5 0.5 0.5 0.5 0.5 
##$DBPOFFS= (0..7)
0 0 0 0 0 0 0 0 
##$DE= 6
##$DECBNUC= <off>
##$DECIM= 32
##$DECNUC= <off>
##$DECSTAT= 4
##$DIGMOD= 1
##$DIGTYP= 9
##$DL= (0..7)
0 120 120 120 120 120 120 120 
##$DP= (0..7)
150 150 150 150 150 150 150 150 
##$DP07= 0
##$DPNAME0= <>
##$DPNAME1= <>
##$DPNAME2= <>
##$DPNAME3= <>
##$DPNAME4= <>
##$DPNAME5= <>
##$DPNAME6= <>
##$DPNAME7= <>
##$DPOAL= (0..7)
0.5 0.5 0.5 0.5 0.5 0.5 0.5 0.5 
##$DPOFFS= (0..7)
0 0 0 0 0 0 0 0 
##$DQDMODE= 0
##$DR= 18
##$DS= 0
##$DSLIST= <SSSSSSSSSSSSSSS>
$$ [...]
##$SUBNAM2= <"">
##$SUBNAM3= <"">
##$SUBNAM4= <"">
##$SUBNAM5= <"">
##$SUBNAM6= <"">
##$SUBNAM7= <"">
##$SUBNAM8= <"">
##$SUBNAM9= <"">
##$SW= 16.9725356469052
##$SWIBOX= (0..15)
0 0 2 0 0 0 0 0 0 0 0 0 0 0 0 0 
##$SW_h= 3396.73913043478
##$TD= 16384
##$TD0= 1
##$TE= 0
##$TE2= 300
##$TE3= 300
##$TEG= 300
##$TL= (0..7)
0 120 120 120 120 120 120 120 
##$TP= (0..7)
150 150 150 150 150 150 150 150 
##$TP07= 0
##$TPNAME0= <>
##$TPNAME1= <>
##$TPNAME2= <>
##$TPNAME3= <>
##$TPNAME4= <>
##$TPNAME5= <>
##$TPNAME6= <>
##$TPNAME7= <>
##$TPOAL= (0..7)
0.5 0.5 0.5 0.5 0.5 0.5 0.5 0.5 
##$TPOFFS= (0..7)
0 0 0 0 0 0 0 0 
##$TUNHIN= 0
##$TUNHOUT= 0
##$TUNXOUT= 0
##$USERA1= <user>
##$USERA2= <user>
##$USERA3= <user>
##$USERA4= <user>
##$USERA5= <user>
##$V9= 5
##$VALIST= <valist>
##$VCLIST= <CCCCCCCCCCCCCCC>
##$VD= 0
##$VDLIST= <DDDDDDDDDDDDDDD>
##$VPLIST= <PPPPPPPPPPPPPPP>
##$VTLIST= <TTTTTTTTTTTTTTT>
##$WBST= 1024
##$WBSW= 4
##$XGAIN= (0..3)
0 0 0 0 
##$XL= 0
##$YL= 0
##$YMAX_a= 46219
##$YMIN_a= -54258
##$ZGOPTNS= <>
##$ZL1= 120
##$ZL2= 120
##$ZL3= 120
##$ZL4= 120
##$ABSF1= 10
##$ABSF2= 0
##$ABSG= 5
##$ABSL= 3
##$ALPHA= 0
##$AQORDER= 0
##$ASSFAC= 0
##$ASSFACI= 0
##$ASSFACX= 0
##$ASSWID= 0
##$AUNMP= <proc_1d>
##$AZFE= 0.1
##$AZFW= 0.1
##$BCFW= 1
##$BC_mod= 2
##$BYTORDP= 1
##$COROFFS= 0
##$CY= 11.3945322036743
##$DATMOD= 1
##$DC= 2
##$DFILT= <>
##$DTYPP= 0
##$F1P= 15.9154993809931
##$F2P= -4.1035820241983
##$FCOR= 0.5
##$FTSIZE= 0
##$FT_mod= 4
##$GAMMA= 1
##$GB= 0.15
##$INTBC= 1
##$INTSCL= 1
##$ISEN= 128
##$LB= 0.24
##$LEV0= 0
##$LPBIN= 0
##$MAXI= 10000
##$MC2= 0
##$MEAN= 0
##$ME_mod= 0
##$MI= 1.114404
##$NCOEF= 0
##$NC_proc= 0
##$NLEV= 6
##$NOISF1= 3.799351
##$NOISF2= 2.8
##$NSP= 1
##$NTH_PI= 0
##$NZP= 0
##$OFFSET= 15.70392
##$PC= 1
##$PHC0= -10759.46
##$PHC1= 10.00095
##$PH_mod= 1
##$PKNL= yes
##$PPARMOD= 0
##$PSCAL= 0
##$PSIGN= 0
##$REVERSE= no
##$SF= 200.130013532006
##$SI= 16384
##$SIGF1= 3
##$SIGF2= 2
##$SINO= 400
##$SIOLD= 16384
##$SREGLST= <1H.CDCl3>
##$SSB= 0
##$STSI= 0
##$STSR= 0
##$SW_p= 3612.71676300578
##$SYMM= 0
##$S_DEV= 0
##$TDeff= 0
##$TDoff= 0
##$TI= <>
##$TILT= no
##$TM1= 0
##$TM2= 0
##$TOPLEV= 0
##$USERP1= <user>
##$USERP2= <user>
##$USERP3= <user>
##$USERP4= <user>
##$USERP5= <user>
##$WDW= 1
##$XDIM= 8192
##$YMAX_p= 0
##$YMIN_p= 0
$$ End of Bruker specific parameters
$$ ---------------------------------
##NTUPLES= NMR FID
##VAR_NAME=  TIME,          FID/REAL,        FID/IMAG
##SYMBOL=    X,             R,               I
##VAR_TYPE=  INDEPENDENT,   DEPENDENT,       DEPENDENT
##VAR_FORM=  AFFN,          ASDF,            ASDF
##VAR_DIM=   8192,          8192,            8192
##UNITS=     SECONDS,       ARBITRARY UNITS, ARBITRARY UNITS
##FACTOR=    0.0002944,     1,               1
##FIRST=     0,             0,               0
##LAST=      2.4114304,     0,               0
##MIN=       0,             -54258,          0
##MAX=       2.4114304,     46219,           0
$$ Real data points
##PAGE= N=1
##DATA TABLE= (X++(R..R)), XYDATA
0 0 0 0 0 0 0 0 0 0 0 0 0 0 0 0 0 0 0 4 -8 8 -8 8 -8 9 -16 16 -17 24 -24 28 -32 36 -41 48 -53 58 -66 74 -82
39 -82 93 -104 115 -126 140 -155 172 -189 209 -230 252 -279 306 -338 373 -413 458 -507 570 -638
59 -638 720 -819 945 -1102 1312 -1604 2034 -2734 4060 -7367 31767 29540 -54258 38140 16613
74 16613 -45040 37288 11850 -39549 38809 3754 -29589 34791 -2790 -20618 33510 -11469
86 -11469 -10621 30619 -18437 -1747 27947 -25868 7674 23610 -31560 14354 20575 -35011 19260
99 19260 16745 -36428 21666 13223 -36592 22815 10301 -34594 22675 6748 -31731 21102 2745
112 2745 -26376 19323 -1174 -20122 15907 -5337 -13130 12142 -8254 -5972 8900 -11028 -768
125 -768 6326 -12740 4214 4676 -14447 7666 3580 -15459 10364 3414 -15003 11205 3036 -14134
139 -14134 10614 3102 -11674 9237 3668 -9257 6614 4147 -6427 4203 4745 -3482 1516
152 1516 4949 -881 -1188 4783 1698 -2928 4450 3564 -4633 4055 4641 -5082 3635 4512 -5337 3051
168 3051 3183 -4361 3005 1465 -2348 2233 -1457 -419 1877 -3963 1732 1496 -7189 3312 1377
183 1377 -9773 5634 1633 -11818 7662 1735 -14034 8681 1079 -14604 9900 471 -14330
196 -14330 10460 -580 -13305 11163 -1587 -11411 10676 -3659 -8497 10004 -4638 -5522 10179
209 10179 -6836 -1986 9771 -9391 1570 9190 -11757 5090 7538 -12302 8562 6411 -13860
222 -13860 10884 5672 -14215 13614 3743 -14031 15274 2441 -13458 15924 453 -12109
234 -12109 15933 -1630 -9797 15188 -3816 -7392 13956 -5682 -4728 12651 -7652 -1934 10610
247 10610 -9736 703 8856 -11093 3506 7016 -12577 5710 4798 -13067 7565 2927 -13521
260 -13521 8876 908 -13227 9651 -724 -12510 9945 -2426 -11017 10116 -3771 -9164 9519
273 9519 -4972 -7220 8564 -5586 -4942 7763 -6100 -2729 6911 -6679 -302 5745 -6657 1531
287 1531 4820 -6755 3367 3605 -6427 4471 2834 -5897 5416 2006 -5354 5630 1516 -4471
301 -4471 5864 1036 -3641 5616 852 -2827 5181 256 -2380 4591 12 -1503 3877 -159 -802
316 -802 2881 -381 -803 2268 -496 -387 1849 -817 -388 1237 -949 -342 1077 -1157 -874 1009 -1346
333 -1346 -1148 876 -1533 -1498 747 -1805 -1701 1176 -2064 -2228 1281 -1959 -2045 1856 -2145 -1892 2173
350 2173 -2497 -1421 1973 -2655 -1541 2670 -2689 -781 2611 -2721 107 2740 -2677 543 2821
365 2821 -3178 1553 2291 -2732 2445 2132 -3078 2856 1420 -3613 3988 1059 -2402 4494 568 -2503
381 -2503 4521 -386 -2710 4581 -1144 -1324 4943 -1153 -1689 4738 -1971 -911 4306 -2545 -618 3781
397 3781 -3153 -209 3739 -3865 404 2902 -3927 799 2171 -4154 1562 1510 -3943 1559 547 -4236
413 -4236 1256 -329 -4354 1770 -946 -3641 2180 -636 -3301 2690 -1871 -2781 2888 -2216 -2082 2377
429 2377 -2392 -1378 3117 -1947 -844 2967 -2365 -319 3083 -2149 -481 2673 -1753 734 2141
444 2141 -2193 1326 2294 -1531 1675 1481 -1943 1848 1380 -1594 2188 1253 -1465 2206 366 -1630
460 -1630 2267 502 -819 2617 593 -900 2387 -327 -1168 2002 -557 -1080 2141 -937 -544 1234
476 1234 -946 -641 2076 -1689 -887 1154 -1758 -522 685 -2177 -243 1275 -2175 269 147 -1864
492 -1864 -591 -108 -1729 -58 145 -1517 333 497 -1498 547 713 -808 436 56 -1454 1118
508 1118 117 -735 1644 523 -729 1159 798 -520 966 -106 -717 1452 351 80 1260 634
524 634 304 1565 -495 463 2267 44 549 1050 480 741 1853 578 311 547 -222 651 1552 74
542 74 478 556 303 263 2074 -910 332 1151 -642 247 675 -739 513 251 -1087 490 809 -785
560 -785 43 -463 -1260 575 -377 -1407 -169 -208 -1353 -285 -1107 -780 -594 -653 -1276 19 -369 -392 608
579 608 -507 -150 614 -705 -488 955 -258 -298 72 -1243 -213 801 -51 552 772 96 504 1302
597 1302 256 509 1413 534 694 286 883 185 467 87 829 546 949 331 1268 198 1060 423 -38
616 -38 648 724 83 294 5 -172 489 -196 -545 -36 -381 -420 243 -1037 -731 -87 -817 -852 -453 -600 -308
637 -308 -533 -1077 -459 -474 -663 -588 -561 -625 -495 132 -856 -224 -192 -711 -316 -155 -342 -180 -336 -882 -15 -192
659 -192 -14 269 106 63 222 171 -409 251 -43 239 232 916 -9 310 509 589 1123 386 446 415 554 95 573
682 573 896 -313 570 690 692 -62 580 88 568 318 14 580 370 -85 -231 61 -482 -313 692 167
702 167 12 -424 -353 -59 -297 -479 -187 -847 98 -4 -593 -499 -181 -197 -1149 -982 31 -38 344 -890 -363
723 -363 326 -265 -713 778 92 -503 62 170 -192 88 -289 -221 550 -654 -797 227 -373 -776 -30 357
743 357 -178 551 -187 -41 -319 -164 910 1379 -952 -492 806 -156 486 1344 393 1165 603 -6 740
762 740 711 103 602 192 47 1154 -3 -481 398 -109 -67 904 366 -293 667 671 -1031 768 -104 -576
782 -576 -159 -360 73 305 173 -203 151 -740 -680 -503 -768 602 -364 -961 -686 831 -894 -981 6 -223
802 -223 -81 177 -347 -199 436 -568 -121 -47 -204 -49 549 22 1054 196 -482 996 662 -814 1129
821 1129 -252 732 417 -190 101 523 117 -59 1012 -221 87 966 150 161 666 227 -327 889 -1193
840 -1193 400 980 148 30 950 -207 589 1148 -225 720 459 -691 351 -67 -588 -106 -339 -1214
858 -1214 -11 -153 -549 -54 -252 -1276 -25 284 -796 374 -94 -374 91 -85 -398 11 -211 -474
876 -474 440 -501 -54 406 -516 -387 481 159 -187 190 -596 185 -197 -172 -66 1259 22 38 510 126
896 126 734 783 -272 391 836 -378 405 1055 -132 367 672 -40 599 324 -218 189 541 -177 377 432
916 432 -277 657 199 -321 1095 35 -783 250 -603 -313 44 -130 -538 563 -588 -109 89 -125 -119
935 -119 398 -698 -1064 -122 -780 -403 295 -785 131 67 -1004 594 -124 -1125 407 305 -1099 531
953 531 409 -140 436 323 -578 581 -639 -489 363 165 -796 685 409 238 811 -411 -120 647 -273
972 -273 -363 739 559 152 1001 -961 142 1368 -492 -613 1476 265 -258 895 -393 664 -10
989 -10 -193 -427 -560 -118 378 758 108 -290 248 -455 1442 654 -994 384 -494 -848 147 -279 -880 304
1009 304 -188 -552 -204 -1132 -320 -410 -38 -12 -307 -956 -704 -62 -57 -278 -197 -510 109 488 -47 -16 577 -49
1031 -49 306 -105 -889 -303 131 277 1129 780 362 193 927 157 201 748 304 523 915 -357 576 614 23
1052 23 713 110 21 347 -1 -472 284 392 -9 589 -201 -890 207 -12 505 14 89 -487 950 -858
1072 -858 -610 652 -330 128 443 411 -289 594 -548 -512 -690 38 18 771 -873 -425 819 -328 31
1091 31 88 87 182 -208 -1577 -220 522 -1152 413 -145 -1034 416 283 -907 791 635 -347 595 -225
1110 -225 -435 710 11 -257 130 89 22 883 -212 -61 648 130 321 714 -166 123 615 -14 443 696
1130 696 -54 165 1026 134 281 583 -521 321 358 -255 669 470 -505 335 219 -409 189 110 -160 228
1150 228 315 -343 -262 -216 -465 226 -514 -803 -3 -201 -342 381 -223 -763 -142 -415 -352 224 -98 -219 141
1171 141 207 146 313 -355 55 -176 -668 -585 458 -124 -240 -262 -218 357 -27 -354 305 562 -450 417 442
1192 442 -74 176 102 -49 74 257 -258 547 672 249 -53 -106 -95 367 636 493 693 16 178 -321 -787
1213 -787 -604 45 -127 291 111 -279 -206 -125 116 -303 285 -320 500 -165 -566 -466 595 324 588 -36
1233 -36 136 -594 23 -352 -667 467 -581 -136 198 17 -1104 212 -1329 497 -155 852 336 892
1251 892 -316 131 65 37 -157 -131 179 -82 110 -68 299 -322 289 -27 559 436 344 -128 -131 218 -246 924
1273 924 430 220 -372 278 598 807 532 35 428 290 -54 1003 -26 -911 544 32 -171 -279 101
1292 101 -625 407 448 -821 227 -283 207 -30 107 -160 327 -544 -824 397 -667 -467 -160 -414 89
1311 89 466 -392 466 -600 142 -793 43 -705 -206 600 -863 -594 259 -365 948 25 294 73 33 38
1331 38 -313 -368 -21 -204 -280 -523 89 524 661 35 182 -624 388 401 -630 11 86 -79 893 667 -46
1352 -46 789 566 731 -481 -92 512 189 200 -82 -360 -157 -181 535 264 37 406 -344 122 -61 -39 27
1373 27 -307 -295 104 108 -89 -676 16 -171 86 76 -537 -244 -369 -71 -319 -147 -323 399 -384 392 980 -807
1395 -807 255 716 -25 -465 207 -382 -229 -225 -277 133 128 406 244 50 -396 -235 120 263 255 87 -322 79
1417 79 125 -511 495 -150 191 135 400 190 297 975 -25 348 187 -196 432 465 583 -69 524 -363 609
1438 609 79 -48 221 80 -294 -214 436 -306 104 -89 365 168 557 -734 346 -504 351 -94 174 160
1458 160 -749 89 -267 -205 31 -61 -220 -540 -857 -569 72 719 -41 -94 -291 162 -72 101 -10 -484 -147
1479 -147 -83 55 -26 -343 -32 -182 573 -43 166 142 334 222 255 50 173 171 137 -426 -501 433 335 33 -9
1502 -9 350 295 -187 101 214 642 295 236 364 -208 461 -471 531 -18 -348 454 -59 164 -214 431 -474
1523 -474 -289 -176 -187 -127 116 516 -178 225 -78 -199 -76 -216 64 -677 230 -186 73 -624 -50 -44 13 -231
1545 -231 -37 -197 283 -261 -334 -58 -173 -261 -43 33 46 297 -206 165 -47 81 8 196 -104 420 118 154
1567 154 358 68 109 151 269 -69 69 261 -73 202 -196 150 378 338 181 -161 363 657 403 225 -241
1588 -241 350 -7 544 292 -585 -63 -61 79 137 -385 -232 385 -25 16 -76 -209 187 -222 684 350 -40 -117
1610 -117 -92 -116 222 -16 -369 -266 -105 -583 161 -377 -313 28 -283 101 576 -169 254 22 -262 398 503
1631 503 -373 59 71 -737 128 9 -120 385 101 161 217 268 419 58 70 452 442 144 833 285 380 -297
1653 -297 4 -366 245 -287 583 248 -53 134 269 611 -59 699 216 602 138 -225 51 167 713 -393
1673 -393 20 259 -725 415 -348 146 110 -431 -73 -220 44 -1112 -508 -848 -177 288 25 -281 -360 471
1693 471 -156 -316 137 -180 741 -83 532 -109 -72 232 -171 58 218 416 -84 70 264 -394 -266 682
1713 682 -67 289 313 -101 280 58 -235 62 765 296 -90 -152 441 -30 -160 95 668 225 -994 104
1733 104 503 589 148 -167 -375 65 -147 -432 -216 347 -443 142 -213 -202 244 -485 -118 -352 267 -134 647
1754 647 -360 855 452 -638 361 -124 -479 117 -97 -466 175 191 31 77 119 -163 237 94 -486 -180
1774 -180 -181 161 372 122 622 206 -126 273 -157 -604 843 -797 441 207 -825 490 501 298 -365
1793 -365 -113 89 938 478 7 -186 -78 -369 152 981 317 348 589 748 60 498 -57 81 367 -147
1813 -147 785 445 -163 410 303 196 297 -334 662 -27 -1 55 976 -120 -334 -230 378 357 159 -313 -454
1834 -454 337 287 -164 -82 -19 -78 326 -254 -581 35 -644 -31 105 -216 272 -78 103 148 1 -217 450 520
1856 520 251 49 74 182 98 429 119 668 136 -39 1 27 93 331 306 -187 581 26 45 -32 390 -131 -55
1879 -55 79 482 -546 -57 -348 750 -225 157 -516 135 127 319 -377 637 -531 330 296 -414 255 -479
1899 -479 -770 -100 -156 459 -206 -300 320 102 -267 222 313 136 -1023 148 917 -14 285 -328 288 342 -355
1920 -355 146 467 -614 258 11 -226 184 -785 -460 143 -710 492 -109 235 495 124 387 230 -288
1939 -288 -23 -80 203 53 -72 -80 78 -189 163 190 -369 43 147 220 108 121 74 248 -105 -197 192 283 141
1962 141 -137 274 -100 -172 151 175 40 -53 -115 100 -12 46 -39 -51 195 -118 -259 -104 -141 -51 -42 61 26 -32
1986 -32 29 62 51 -72 513 -207 18 57 -302 -80 -421 -160 -37 -40 62 173 -15 -169 -13 -389 67 245
2008 245 -209 -147 -6 -184 -266 -8 -40 356 72 159 166 -64 68 139 164 58 376 -5 -101 -1 -69 237 284 176
2032 176 42 -43 77 -114 56 -24 -83 -183 -39 170 163 -251 43 40 -81 -96 -177 -120 270 -72 -141 159 217 -276
2056 -276 173 -50 -93 -68 15 81 -187 -36 -141 -170 -136 -71 -119 -179 -176 -383 -296 -108 -116 -236 12 85 6 -44 -188 -232
2082 -232 144 270 215 355 174 333 31 131 -14 201 -116 21 -5 -41 23 -103 1 -419 -492 265 -184 383
2104 383 32 67 236 485 115 -345 462 -388 -81 -268 26 -150 281 347 42 14 522 413 77 273 136
2125 136 -52 -56 45 0 -351 -65 2 -8 -227 28 -119 -7 289 158 -209 93 -218 -95 288 -63 -31 -64
2147 -64 232 -317 -332 95 -58 -138 -113 181 -477 -712 -371 -354 234 -128 -420 -6 550 380 3 -21 360 422
2169 422 -379 603 -237 -58 -190 -26 -133 -42 -114 -2 -118 -310 -611 -17 -658 -18 592 324 197 -515 369
2190 369 -220 220 -217 3 -158 77 -320 -162 179 -204 146 -235 118 -44 -155 -290 -276 205 -195 -53
2210 -53 -166 -18 -49 330 -389 -212 219 -700 -364 -442 427 3 -487 -178 465 61 200 692 232 194 -43
2231 -43 80 -259 412 4 200 188 143 267 584 79 79 116 133 142 -107 -427 96 -7 11 44 -240 -140 109 92
2255 92 -320 436 227 141 41 150 -36 -214 -61 -47 369 -6 159 65 -384 290 -98 210 384 -91 -24 -5
2277 -5 148 -11 63 -145 -344 -9 -249 -99 117 -82 -309 21 -203 -73 88 -117 -229 142 111 -215 101
2298 101 -92 91 -269 -128 -315 -42 -30 130 -158 103 213 -36 25 -48 -70 -12 -83 -116 138 89 91 -130 -119 42
2322 42 101 90 109 -101 114 -144 150 197 -77 10 293 219 71 211 -90 -27 77 -90 176 163 -126 -30 210
2345 210 3 -129 47 -94 -94 -136 25 33 -159 66 -218 -47 -25 -209 -7 113 -11 -83 -70 -87 -122 12 -129
2368 -129 -142 -7 -179 -23 -86 91 -88 -240 65 166 85 -41 -167 -45 -200 66 -1 178 180 153 221 -78 87
2391 87 170 256 -91 -219 21 296 128 -89 -90 -15 -1 485 -166 -7 -107 100 265 94 -71 23 27 46 316 4
2415 4 -186 -77 74 42 -47 137 71 148 7 10 -12 48 148 -225 193 377 294 -44 122 -216 1 271 -305 -279
2439 -279 49 312 460 -624 -372 -417 -74 860 902 -626 -224 255 8 353 625 528 532 1354 1013 283 -142
2460 -142 468 -369 42 -97 -68 434 44 -540 -74 -597 1797 -289 407 294 -388 863 37 437 -38
2479 -38 -291 680 -621 -600 -383 -407 -273 -118 -211 -104 411 1626 -90 1145 83 854 -538 -1039 878
2498 878 478 -32 235 -562 83 601 547 525 340 267 78 899 -1252 367 129 128 -337 324 -33 369 -345
2519 -345 388 3 -399 -368 13 631 255 480 52 93 -304 565 138 317 269 724 494 -368 -588 228 378
2540 378 564 -254 94 132 282 112 514 -522 -39 -11 78 -200 342 521 82 268 555 -12 129 4 -51
2561 -51 -274 55 24 340 -40 -130 248 -65 57 -416 122 305 180 158 168 330 -270 -335 168 -232 136 -203
2583 -203 121 -368 -309 -93 -213 104 207 183 253 610 -294 91 -345 203 -102 35 33 -127 313 -285 296 -345
2605 -345 -247 -419 -79 -552 240 -29 -160 -49 168 6 195 -29 -190 260 673 -506 213 -352 -47 437
2625 437 -243 254 -130 258 -62 563 -105 190 266 209 -86 196 151 310 -2 -119 99 -40 -47 60 266 54
2647 54 -177 56 -283 162 -289 -241 -67 49 177 -83 -216 98 65 126 98 -25 -208 34 186 459 -415 185
2669 185 401 285 -480 171 -96 -19 39 713 337 -563 -536 -439 107 -545 -23 -665 -489 100 -348 161 -249
2690 -249 -552 -199 -109 136 356 -12 145 16 115 -173 -65 226 85 -254 -359 259 31 581 -60 -298 101
2711 101 290 490 241 -21 -31 180 -57 13 19 -274 245 197 91 97 215 -25 -318 -253 120 -69 -256 -56 -362
2734 -362 -24 -224 46 -182 140 -246 283 125 -151 233 83 -313 -166 87 -329 160 -135 -41 -28 241 -10
2755 -10 157 233 -207 463 -56 -255 -321 -4 -1 43 -152 13 171 -96 30 -217 479 -63 268 114 47 -9 71
2778 71 62 50 -190 145 133 249 -41 -141 126 391 417 63 20 55 -35 428 38 -106 179 431 -114 -32 289
2801 289 309 -127 -511 -183 -196 -576 -35 -127 -207 -79 -2 -392 94 390 196 376 149 62 2 397 -77 171
2823 171 -6 -63 -430 -67 305 -369 414 67 178 322 411 172 394 16 548 575 -521 127 -301 637 84
2844 84 -228 248 -534 115 -240 -150 158 307 428 168 58 -184 267 201 331 -17 -354 -293 -284 -420 280 -229
2866 -229 -273 195 -163 101 -441 -315 -27 -174 -409 -27 103 -253 -108 165 -110 14 -103 62 -107 -111 -21
2887 -21 -228 -137 -79 82 -129 -117 -115 -60 173 242 -75 -19 -1 -81 -113 199 135 75 172 -35 -75 43 -37 -68 -3 36 -87
2914 -87 -153 127 -78 109 114 2 106 46 38 136 162 220 91 123 76 -284 101 -82 19 -143 58 197 74 283
2938 283 -202 -69 64 201 581 -773 406 -45 -234 301 -384 -293 -203 125 -52 -300 40 61 149 154 414
2959 414 216 372 -113 -62 -62 -43 -4 407 -498 -432 442 -139 -129 -139 -132 330 -82 -132 -97 -42 73 -48 -27 321 112
2984 112 272 82 -60 149 239 34 166 -92 -204 1 220 -87 -71 127 -43 165 -97 48 -101 107 283
3005 283 -75 14 -54 -118 106 -165 -44 56 -14 -205 133 -63 56 20 140 151 -235 16 275 58 -112 -82
3027 -82 -204 -29 -149 101 -23 -176 -121 -61 90 -37 128 -108 126 70 -22 -56 142 8 -182 -55 -27 -11 54
3050 54 -102 44 -72 -95 103 -133 -41 46 -98 -18 17 -86 -177 80 -44 -68 116 154 120 158 81 249 -115 -75
3074 -75 -141 188 40 -3 69 3 237 -114 98 -78 -12 -100 -38 -29 7 -15 -228 -18 7 72 -35 201 142 200 -212
3099 -212 -8 -5 -85 37 -1 -85 -398 84 -168 -459 -297 -443 -21 -15 191 -29 -221 121 -159 18 -494 -55
3121 -55 -206 319 74 550 -297 -142 -104 313 139 -642 -64 52 191 -206 -13 -158 -215 -683 -342 144 -260
3142 -260 -97 -57 511 219 227 390 -368 85 143 98 -9 196 68 78 -164 -74 32 -100 123 52 181 37 -70
3165 -70 -236 219 24 29 136 -310 -656 -408 137 254 -115 111 -87 297 -256 -843 554 -88 -511 -1 -186
3186 -186 201 -404 -206 87 -534 402 -716 172 126 -46 42 -80 46 48 67 309 177 -1 106 -321 265
3207 265 52 -92 284 68 49 -85 -6 -373 -151 120 116 -116 -23 52 34 -180 -89 269 39 20 217 22 -89
3230 -89 -4 -150 -7 190 5 87 28 -45 44 39 19 225 -84 -121 -115 -3 5 118 4 -50 -97 -131 156 -234 -178 19
3256 19 104 -16 -168 193 306 79 -74 -157 193 -25 -70 109 201 -100 36 135 -339 86 -110 6 -87 -4 26
3279 26 -11 4 173 208 162 -64 -85 208 122 -90 120 151 -302 -121 35 -66 -150 24 -281 148 -1 303 192
3302 192 682 698 208 -340 94 296 340 -143 577 520 -742 -54 177 223 56 679 -417 -71 -55 -20 170
3323 170 -79 -50 -64 157 71 107 257 -345 -206 -78 25 253 -67 94 -20 -22 -89 -112 -79 64 -132 127 110
3346 110 -221 -200 -176 -19 108 141 33 -55 135 99 -77 99 51 -132 307 7 116 225 122 165 -236 121
3368 121 -19 -37 106 -26 -84 200 -25 -164 118 117 56 -152 -116 87 21 126 -229 -82 -124 36 -67 -230 -85
3391 -85 -13 104 132 60 -53 -28 -118 -30 116 -164 -164 -354 -19 -28 5 -98 -198 -214 -88 -65 82 -110 -276 -97 -1
3416 -1 57 -154 -92 169 214 10 -258 94 -98 235 170 -199 62 -35 -2 -151 402 210 32 -220 138 71 -304
3439 -304 6 29 -21 -69 97 -625 -135 -78 -488 35 313 -164 -423 -297 399 230 306 -467 -417 58 236 16
3461 16 -40 6 104 147 -25 257 185 -94 34 190 -7 -2 -117 62 -167 -151 -197 -19 -143 166 -28 -16 -12 120
3485 120 162 65 -71 -2 230 1 -153 -11 158 -92 10 -207 -17 52 -90 -68 -37 111 63 152 -182 -177 190
3508 190 268 167 174 -77 268 194 -16 226 84 261 306 -110 90 -367 142 -300 119 88 -78 334 17 -364
3530 -364 58 423 98 110 -145 71 -82 54 -194 -174 -24 -97 -148 112 -2 -150 72 -114 -189 -115 190 36
3552 36 77 -22 246 56 -56 -90 -178 -78 68 -348 -71 -326 -74 -60 154 128 -33 296 -315 53 -646 248
3574 248 556 247 301 -164 126 165 111 -49 -169 82 -151 119 -274 -44 9 -72 5 103 -260 -86 -252 -97
3596 -97 -178 49 78 -7 144 -94 71 -48 125 -56 118 -41 -116 -232 60 265 55 -29 98 101 -210 45 2
3619 2 342 -172 140 154 127 110 46 98 -105 -31 -14 38 -126 156 118 87 55 -248 -44 -17 42 282 185 -57 -187
3644 -187 -52 176 17 -232 -83 55 7 159 28 5 -88 53 112 89 -19 -11 -102 92 6 8 -54 28 -170 -109 -64
3669 -64 78 47 -28 17 194 -23 79 234 66 63 119 60 -47 -94 -166 289 -181 118 89 -85 -10 38 -126 -175 -186
3694 -186 -45 -12 -68 -89 -203 -45 -45 57 -41 -25 97 -147 5 -84 -185 -109 92 -111 12 -135 -22 -8 49 -175
3718 -175 164 -36 -139 -32 -207 0 -213 165 -35 -60 -87 -24 55 -45 166 2 -64 2 -32 97 289 -58
3740 -58 295 216 -3 -42 -25 -33 66 184 112 -67 148 -47 16 212 -15 -87 230 71 134 41 8 141 -24 -11 -48
3765 -48 100 -40 -20 97 -163 -118 -179 153 -142 30 171 -67 -87 -26 -28 166 -75 300 100 271 -47 92 199
3788 199 -61 -73 -34 -57 -11 39 -163 -68 52 -95 -51 97 -203 268 16 -236 -30 -64 291 -12 212 67 63
3811 63 -41 66 -74 -143 1 221 -142 -368 -139 -204 -36 -201 161 -275 -4 -96 -134 -160 -171 71 29 -65 -121
3834 -121 -60 13 -115 100 118 9 -113 -66 162 -60 -138 170 109 -89 -73 -227 -90 144 173 180 75 128 -12 -129
3858 -129 -96 -33 160 266 -19 74 -64 -26 16 -136 -76 33 -9 -88 101 -53 -116 149 -69 10 -74 -6 123 -58
3882 -58 52 -76 4 20 -117 37 145 -29 -5 -33 217 8 26 -89 -26 -88 -131 -27 80 -129 -24 -71 43
3905 43 272 148 -5 -131 14 114 -96 -73 -42 -82 -173 -127 6 -14 218 31 17 -189 149 -57 18 26 -95 129
3929 129 -30 129 -66 38 -132 -128 -140 -244 -154 -175 85 12 61 -2 54 -73 -96 -64 -117 147 -134 152 -6 133
3953 133 127 -13 -174 -106 -136 -24 -10 -74 -11 78 -27 -64 52 37 65 58 45 33 -19 -81 134 -97 114 -271 -64 -109
3979 -109 23 -4 36 16 -7 118 -183 237 30 -50 44 208 199 -67 81 162 -26 -74 -122 -200 181 -2 48 31 -107
4004 -107 41 102 12 29 144 -122 148 74 68 -110 150 -36 -62 202 162 -214 25 -107 126 -81 224 9 -175
4027 -175 40 -14 49 -4 117 11 -96 32 -107 1 222 115 120 38 123 -62 -88 -170 107 -29 80 -58 -31
4050 -31 -116 153 197 196 104 108 -189 227 68 -16 206 59 43 -28 130 363 -92 245 147 -194 32 39 181 121 -238
4075 -238 75 -42 88 -13 -26 154 -71 154 -135 120 72 -101 76 -77 -260 -118 -260 -22 -28 127 -254
4096 -254 -27 53 67 236 -48 125 -121 -53 -46 -48 -81 44 -38 -12 -77 38 -56 -252 138 65 229 166 -148 227 34
4121 34 -26 -53 -172 55 63 65 -228 -18 -84 114 167 -81 229 110 -7 7 -98 18 -126 16 20 -12 -22 -48 -185
4146 -185 88 -119 20 99 -2 27 -85 166 -190 176 -127 41 47 -112 -115 125 -20 230 -20 -136 -280 -13
4168 -13 191 136 -183 -82 -125 -63 28 -83 92 -136 21 -140 -72 20 -28 -182 97 -94 190 138 -224 49 0
4191 0 -369 407 -190 -183 40 159 729 -109 -41 -289 101 -67 -97 -182 100 -489 -92 466 385 153 -408 710
4213 710 -263 121 -31 152 145 -21 -240 -206 -74 50 -276 20 -68 -60 -202 -120 260 91 -18 71 -60 116 27
4236 27 209 69 126 88 16 -5 -39 -88 -190 -120 75 -37 30 3 -270 -63 -199 -126 -13 41 -69 -58 189 -3
4260 -3 -38 -122 188 96 50 79 -22 -4 63 -206 -103 24 -32 -37 128 37 -35 291 -113 198 166 -32 -97 -136 33 7
4286 7 -91 78 -43 -274 -220 176 -370 -99 -82 -271 -32 -456 160 65 -3 52 42 235 42 60 -106 182 -76
4309 -76 -58 -184 -41 -262 -268 107 -370 262 519 209 -511 263 -474 -440 -186 -127 119 -408 429 784 297 186
4331 186 -8 239 -71 78 63 -278 -279 -257 -3 -300 -63 -40 -18 155 -141 87 45 -165 -19 -56 -39 23 -74 167
4355 167 -81 82 -126 -25 5 -4 -164 132 -81 -188 -256 120 279 -16 25 -171 37 -152 2 -67 -38 -24 -207
4378 -207 -99 173 -95 -10 49 11 -350 -63 -15 -52 -26 -84 -14 -83 -87 -71 172 -56 -52 -9 -113 -139 -38 59 -61 233
4404 233 -9 -230 -132 -16 -52 290 -92 -39 -5 -20 27 -90 63 -146 113 200 22 84 -12 -99 265 209 134 -222
4428 -222 -36 85 -63 305 39 -16 -36 -104 198 -289 37 30 -49 63 -9 27 501 289 102 -3 -183 -24 228
4451 228 367 263 -73 368 39 293 204 -225 88 -90 373 425 244 114 48 292 50 -262 160 148 491
4472 491 703 -198 43 175 -183 -338 216 -53 -135 229 -83 360 -379 675 -308 -280 -244 4 77 304 -170
4493 -170 42 -177 655 156 -888 -462 -425 272 -20 -247 358 -478 -429 -5 -472 122 39 158 -128 -154 -73
4514 -73 -331 -45 -367 -137 463 -220 -253 272 153 -116 49 -154 -1 -152 397 28 -152 -28 -232 588 359
4535 359 29 -197 -523 -290 383 622 98 -138 173 475 -118 -242 291 -273 -260 587 -46 -223 243 342 -79
4556 -79 -648 -141 -1 -168 11 155 92 122 31 -129 100 82 -173 -167 106 148 -290 -283 63 6 -40 56 49 -44 -52 -38
4582 -38 185 -236 -45 -49 -94 -166 -15 154 -64 33 207 -152 79 -179 -210 123 54 275 -154 -36 -124 69 -44
4605 -44 166 84 50 73 -137 -26 0 58 -72 250 -43 -54 -114 168 -106 -47 17 33 45 21 91 147 -88 -225 76
4630 76 11 98 37 60 60 248 -28 122 92 192 -75 -25 -58 19 24 26 139 113 -22 -72 -83 -41 -109 86 121 102 -51
4657 -51 -91 9 253 111 11 56 91 40 -39 47 200 -98 111 -10 91 -89 -112 -10 198 232 283 44 -138
4680 -138 180 -281 33 -201 45 46 -6 184 116 318 -110 -113 75 135 -44 -64 -122 43 93 -108 70 -13 137 36
4704 36 217 109 -86 194 -118 -238 64 -3 -12 -34 -171 110 -16 10 44 -16 -27 -42 -102 117 65 117 -2 135
4728 135 8 195 -128 -54 189 24 -140 -36 -31 -73 26 -39 -124 13 181 -98 59 33 -16 211 192 -18 -23 -108
4752 -108 -104 174 -136 9 33 214 -89 -84 -40 5 9 -304 49 215 85 215 34 130 -197 105 -254 -372 626
4775 626 187 -267 -613 -66 -128 282 70 357 17 71 -210 -40 -5 43 -128 62 -50 8 -55 -57 -79 -149 58
4798 58 35 68 142 -1 -68 -267 -115 -43 -180 -118 -80 -124 127 -440 -123 -38 228 -196 -289 -143 -447 -163 -462 117
4822 117 80 15 -102 282 -55 238 -1 73 97 -61 60 5 -178 22 238 -115 -323 -250 63 14 9 -6 -101 100
4846 100 -86 -152 -94 -45 -175 -185 121 90 180 -191 18 -68 263 160 135 187 -175 -76 83 8 268 210 -34 7
4870 7 -77 61 -28 -90 87 -159 -3 -164 66 99 118 -49 156 171 -30 32 101 77 17 -124 196 -171 250 191
4894 191 130 52 -33 2 10 18 -52 87 -42 91 -158 91 123 -62 -90 58 -33 60 80 -63 99 -52 5 112 106 -108
4920 -108 -8 171 63 147 36 -57 -8 125 -157 9 -93 -76 53 19 25 3 -88 35 195 136 84 -70 136 72
4944 72 147 -53 187 -18 -211 -88 1 2 105 -111 148 -99 207 63 92 -17 55 65 -107 42 -320 37 -143
4967 -143 -14 63 2 -143 147 -144 72 -183 -184 97 -88 -26 -67 -123 431 169 69 324 -98 354 310 -180 183
4990 183 -167 -105 -190 25 -131 -263 -227 197 136 -211 417 -44 -199 -87 -58 395 76 136 -136 -69 143 106 135
5013 135 -125 141 314 326 -100 51 -75 229 -28 -119 -22 -192 218 -128 180 -4 272 91 -245 -29 -219
5034 -219 173 -101 58 81 -383 -36 88 41 198 -86 2 87 137 42 -204 -55 98 -62 146 59 92 -107 51
5057 51 124 -100 114 75 10 245 206 -86 -145 -68 138 56 -316 -99 -165 79 -48 109 83 -143 5 50 73 56
5081 56 140 -28 -132 96 109 -174 351 46 -120 155 -71 -170 -164 -143 198 -103 -109 229 175 -15 14 -57 26 -74
5105 -74 -159 282 -8 -164 -250 205 -89 34 -14 -188 -134 -25 10 -6 -103 152 73 87 -191 68 -152 5 -60 125
5129 125 54 120 83 -31 -61 -143 -286 280 236 251 -271 -275 -58 29 142 -64 -31 -20 384 -222 -168 -662 -452 143
5153 143 -162 -598 -1066 -184 542 -126 379 -324 220 -339 189 6 -23 91 211 -188 140 214 68 -206 85
5174 85 -72 63 84 -22 -113 -262 218 -40 180 281 121 -31 -82 173 -37 -107 -60 36 76 355 -11 112 -573
5197 -573 -117 -162 694 -157 458 373 663 -15 100 -298 526 -123 143 -313 -394 238 -1080 -4 -575 -667 83
5218 83 727 286 379 -104 172 0 50 167 34 -311 38 -190 31 75 23 94 -71 -64 81 8 11 -271 311 -245
5242 -245 -121 90 1 -4 91 -81 -21 13 -118 13 -97 -71 211 29 -53 18 -64 -66 45 115 -355 -28 46 -44 7
5267 7 -145 32 99 -15 19 -192 -53 -115 236 -222 -158 43 18 -268 -167 -429 -165 365 -312 -180 -287 361
5289 361 -400 44 -175 287 -526 58 613 -145 81 5 -316 -167 125 48 278 90 -221 160 -194 121 -27
5310 -27 214 -289 -119 250 34 -6 100 -13 -27 -50 175 -87 -269 -220 25 -108 53 -186 45 57 42 242
5332 242 -149 -50 47 149 24 100 -78 154 60 125 -246 305 195 152 -96 40 -26 -334 86 53 -86 52 -12
5355 -12 -68 -78 120 -174 -103 -125 -52 82 20 169 -169 102 -143 175 -65 176 333 43 73 91 -22 -64 70
5378 70 141 -68 39 305 -181 -10 205 139 -240 123 -104 -134 86 -43 -113 97 60 75 -41 92 -1 -163 -108
5401 -108 29 -216 -16 -62 -85 63 4 2 140 -127 -24 162 198 -230 -29 64 -107 8 181 80 37 -33 -111
5424 -111 213 -125 38 -17 -83 22 -48 -2 -191 -185 -80 -104 -7 125 105 -24 145 191 26 -122 -251 -69 -42 46
5448 46 292 44 -7 73 -56 139 -106 -55 -141 -14 -68 149 153 -57 -122 4 -11 131 -199 -378 65 -169 -42
5471 -42 203 -16 50 32 -43 72 -55 -199 -141 20 -101 53 -45 201 130 -11 36 5 -141 370 51 118 -144
5494 -144 -9 39 -218 6 13 388 63 204 -125 -32 -10 -124 -54 23 135 47 -94 -38 107 -22 475 -169 -97
5517 -97 181 -178 165 67 -48 -26 -72 47 23 -55 -342 14 123 -57 76 -195 -68 8 0 135 67 78 -48 141
5541 141 -75 -84 -72 -17 73 222 99 89 60 15 81 31 -97 -44 -63 40 65 164 -64 -88 -166 84 52 22 131 -154
5567 -154 91 75 49 -35 124 -34 178 -139 -22 47 13 70 251 -38 -73 296 -123 218 34 126 -27 57 -13
5590 -13 -81 11 41 -40 72 -21 196 -59 -3 -39 -83 -150 -26 -4 99 117 -22 41 -94 82 30 -189 55 -137 -142
5615 -142 131 106 175 -76 66 91 87 -191 -122 135 63 -131 -37 86 67 -60 199 -6 -21 -117 212 -93 -135 235
5639 235 139 -89 -38 -362 134 -54 -154 6 -21 157 -65 -82 23 173 -70 98 -74 -9 -200 -175 -237 194
5661 194 49 -118 -183 -68 103 97 -137 -142 32 -143 -1 -16 -179 78 -66 119 -25 175 38 49 33 -82 -61
5684 -61 340 -176 373 -70 -218 -263 -225 136 -186 1076 218 245 228 405 254 51 257 42 -65 13 251 59
5706 59 49 20 52 -58 164 50 83 -91 48 -25 139 200 105 -79 50 31 135 -47 86 6 -135 75 -64
5729 -64 205 -30 -142 -1 138 126 34 47 -22 7 -11 94 18 -84 78 78 -127 59 18 138 -201 137 149 65
5753 65 -91 114 25 122 -29 -112 -188 200 -238 -135 -87 36 -16 -221 -32 -52 -20 45 98 -301 -37 -174 92 5
5777 5 141 -15 60 -27 -73 -191 111 -45 54 74 -11 -144 -86 180 -208 -26 149 -30 152 142 215 -31 108 -24
5801 -24 163 -230 32 -79 84 143 -166 -179 -123 97 -85 -142 -195 8 28 1 -115 -36 -50 -107 0 -89 215 -24
5825 -24 14 24 47 -35 -4 74 74 36 15 -3 -92 -87 -107 82 -27 -120 -197 72 201 -61 -221 300 8 -66 135 207 91
5852 91 -172 -270 130 -49 0 254 -42 439 -104 123 -85 106 267 -268 -166 -114 279 51 37 57 -111 21
5874 21 62 -48 -171 -318 9 25 -110 87 36 -139 -125 -92 47 141 158 -94 27 17 -101 -10 85 -165 183 82
5898 82 -125 60 -125 -59 152 192 106 57 80 84 -98 18 -49 -93 68 -32 50 125 45 30 90 -1 190 117 -77 -43
5924 -43 139 197 262 -48 -166 -146 125 -23 126 -77 98 173 40 -57 -149 -12 -217 137 28 -81 288 81
5946 81 -45 -12 -36 -179 -41 116 -119 -41 62 -210 37 225 43 184 -278 200 -80 77 -132 -92 94 -90
5968 -90 -345 36 199 -84 134 -25 31 -110 63 -278 -97 -185 -235 49 138 -44 -95 29 1 -47 141 -10 250
5991 250 -63 48 155 -17 -207 -240 55 46 -263 -94 217 -14 -64 27 -6 182 -147 -9 -130 122 63 60 289
6014 289 -50 -120 142 119 -184 158 -31 36 -216 -186 94 155 181 -68 -107 154 66 -83 -16 -6 125 -74 -177
6037 -177 53 142 53 -110 39 0 -74 -357 92 -193 187 -209 -150 17 66 -9 153 -26 377 211 -121 -217 -158
6060 -158 242 148 280 17 105 -64 -26 100 64 139 -165 -180 -269 290 -29 -56 -131 -44 9 -83 -130 141 -183 284
6084 284 276 225 -109 -47 72 223 -294 -89 58 -154 341 -102 137 -73 -186 2 230 425 -6 106 -170
6105 -170 249 -38 427 -150 316 128 71 -1 634 167 446 -360 79 -329 -43 160 314 129 -477 340 251
6126 251 -130 233 108 337 -307 -352 512 -346 490 -320 -92 289 165 -2 -163 -47 17 68 -10 -90 126 107
6148 107 177 -150 -98 105 18 40 -101 -64 176 43 -118 -56 -62 58 -18 -246 61 55 -184 -134 9 125 -82 79
6172 79 9 232 -78 -32 -100 9 -225 25 191 -144 -47 283 -347 -258 144 166 281 309 752 -133 452 10 56
6195 56 -209 216 -74 32 -134 -12 -50 -130 -242 -55 -194 113 21 67 -59 275 111 13 31 -37 -3 -126 65
6218 65 -18 -99 -183 177 72 14 -148 -105 231 96 -46 217 48 45 -38 -40 99 -151 -14 6 281 35 24 21 24 37
6244 37 -26 -184 70 155 -62 -137 -86 10 -133 93 -184 121 455 -308 283 -66 -18 566 -1060 313 -57 -246
6266 -246 -241 -137 387 -398 -728 -54 238 169 340 -133 315 244 -12 233 387 48 246 -193 -100 277 104 523
6288 523 -213 -431 70 141 57 -66 -90 -59 -60 224 -20 -113 25 -4 207 172 98 14 -61 283 204 -68 46 14 -281
6313 -281 -193 154 -86 109 -167 -29 -4 -242 -8 -73 166 136 111 43 -73 -82 -31 123 1 158 -56 -14 30 63
6337 63 -109 81 61 -194 -14 109 -22 -122 149 -83 -9 -121 -18 -72 64 -180 -61 -13 20 50 50 58 -114 -53
6361 -53 76 -26 -9 -91 -183 -6 -48 22 181 -81 90 -46 -166 -243 206 -236 40 216 -29 105 48 -75 150
6384 150 -138 5 135 33 65 162 -28 112 68 -5 -143 99 313 176 136 -72 -168 -18 230 -212 -35 115
6406 115 -7 -116 14 332 -60 275 -159 42 -47 87 45 100 307 -70 116 138 26 102 215 60 -101 27
6428 27 -159 28 90 -118 -93 77 -130 -35 -140 -98 25 -83 -15 0 61 -227 -235 118 59 -27 -172 68 -96 -16
6452 -16 23 -61 28 -217 -20 20 168 91 -127 136 -39 -170 49 -182 160 220 40 -56 -12 222 -232 203 17
6475 17 89 179 -13 -69 180 5 287 -142 -89 23 81 85 -54 -177 -20 62 -197 133 129 73 -63 13 1 92 -93
6500 -93 145 149 47 259 -146 -327 86 -279 143 -164 -144 -136 -12 -178 19 65 192 160 75 -50 -118 -62 -96 41
6524 41 -163 6 -44 18 31 205 63 29 6 -134 88 84 203 17 -247 12 -51 48 -89 94 68 -45 122 -214
6548 -214 -141 28 174 4 -79 -64 26 -31 101 43 96 69 -160 -100 -90 293 -94 -114 -53 26 -31 227 -54 -273 -4
6573 -4 63 179 54 -71 -3 -117 43 320 -203 117 -158 -130 319 141 192 -41 232 153 4 86 -90 -199 20
6596 20 81 -89 248 165 104 62 -98 214 133 -145 -144 306 -143 -94 -117 -102 80 -47 176 -27 31 -90 -31 -9 16
6621 16 -89 61 162 -69 123 -15 -95 201 -161 108 127 46 -45 48 169 -2 126 26 -258 -187 -156 96 -73
6644 -73 -25 -122 266 -9 -189 198 218 -73 -14 -64 91 247 127 112 -61 -34 154 -31 162 133 5 36 40 122
6668 122 -199 68 -87 2 -209 -138 -236 -41 182 250 32 -53 166 -4 -174 15 23 160 -207 -64 291 124
6690 124 27 70 -34 45 73 -82 75 28 100 -205 -28 177 105 -129 191 -102 -29 -83 -127 -41 78 11 16 90 -116
6715 -116 -128 -38 165 110 324 -26 40 20 49 12 -202 -21 -12 -144 10 59 160 121 67 81 -102 -91 12 -20 279
6740 279 113 -254 209 -47 207 -44 -22 -118 -390 24 186 39 -2 103 20 140 15 81 185 -118 163 -86
6762 -86 216 145 201 5 -147 -354 -119 -142 129 199 284 -96 396 -173 -51 65 -198 -59 -49 315 -19 -32 162
6785 162 255 199 -8 -162 93 74 45 -8 269 211 209 -40 -5 161 176 -29 -146 87 -89 271 108 -9 71 91
6809 91 -67 -167 221 -177 -221 -62 -171 144 -23 68 200 -43 -256 -9 60 -44 -22 -384 -44 160 80 -95
6831 -95 82 -276 -262 -11 55 144 90 -217 -115 -113 174 -41 -49 168 -14 70 -113 -19 -24 7 -113 -63 20 85 -198 115
6857 115 -30 -184 -17 21 109 -74 26 5 157 -87 -36 118 -16 -21 -47 13 -72 115 60 -220 70 -55 -92 102
6881 102 133 -144 40 83 -54 -86 -4 190 427 58 2 138 -56 106 75 230 65 2 20 93 -46 198 -4
6904 -4 -183 372 119 -94 -108 255 14 17 -31 -48 -4 87 76 104 -179 -18 103 -46 96 17 37 143 144 -70 -50
6929 -50 -47 19 24 -20 40 -48 -113 137 140 -20 -126 -109 -202 -32 358 -224 132 1 35 97 23 -16 -97 -37 -85 -64 -112 5
6957 5 -3 -124 -27 -52 -34 -89 96 19 77 -192 -54 -24 -90 66 71 249 -290 -4 -9 329 -50 -8 -2 -41 172 130 112
6984 112 46 -60 -9 -307 34 299 -224 -26 -73 -79 -117 45 169 -83 -91 18 -55 7 -125 209 -72 114 82 65
7008 65 43 66 188 16 158 -219 472 -172 162 124 -358 -276 -156 152 140 185 -25 -198 -16 11 46 -103 -35
7031 -35 -110 133 -66 203 -39 25 -42 -36 -66 172 392 -167 317 14 -169 -84 -30 -52 157 104 130 -156 121 -351
7055 -351 -79 -139 223 -245 -55 -38 216 144 181 47 177 551 46 -31 -193 -129 -92 -493 389 -570 346 -215
7077 -215 370 997 -726 -925 1234 155 162 -63 -259 377 232 -205 -88 149 227 -39 -77 367 75 61 -288
7098 -288 -7 -88 191 45 258 -62 142 95 82 -191 -166 207 -205 42 -56 192 -95 246 -45 192 -24 -310
7120 -310 -94 99 -44 149 176 -349 7 0 46 179 -36 -164 -269 -60 -441 152 -35 -157 -247 -316 -225 -32
7142 -32 99 313 225 493 -239 -130 -111 -284 -159 -149 -313 -348 -269 -144 -92 636 -15 -208 628 36 1551 153
7164 153 86 299 308 176 -389 -228 286 -210 -102 12 148 -258 96 -34 92 18 9 -36 74 148 98 -190 -211
7187 -211 103 30 -70 -19 9 387 3 64 20 23 -38 -72 181 -130 141 85 -99 -185 -101 -145 -169 59 -240 -150 -3
7212 -3 167 -67 -74 -61 -61 230 -26 -61 77 -190 283 -73 -371 -96 122 176 -132 -65 -22 -65 -44 -43 -143 9 426
7237 426 89 179 39 248 24 -19 -91 6 133 -273 161 -130 -107 -4 -114 -75 -63 72 -19 -55 62 185 -6
7260 -6 -53 157 84 -12 60 283 -66 -55 106 68 -74 -100 -122 12 79 -141 -39 101 96 -124 -17 72 3 267 87
7285 87 201 21 -234 -67 1 40 -9 -69 -5 307 153 -62 141 -94 -32 189 -4 31 -232 -178 -95 149 19
7308 19 -197 -109 108 -24 -32 -47 33 -27 75 -97 132 13 20 165 -47 201 -22 72 -81 -135 112 -91 1 -186
7332 -186 -327 -122 -56 -39 18 84 181 -55 143 131 -9 -237 30 -7 -83 35 133 -179 -22 268 -132 187 -20
7355 -20 -65 8 -102 -151 135 -71 -158 9 -66 18 223 -50 172 -42 165 -45 -91 310 69 -71 63 -155 -416
7378 -416 -8 172 20 -122 152 -89 -119 142 -41 207 139 39 132 83 -142 13 -318 -177 -158 41 78 -46
7400 -46 -125 219 164 154 87 -9 -266 64 253 156 183 120 117 96 -93 277 -6 112 108 124 9 -43 97 27 -137 21
7426 21 87 0 -31 220 -232 30 143 114 -163 8 61 -121 79 -23 -79 3 -39 111 188 -31 35 37 -168 -78 91
7451 91 15 83 -59 -52 20 -27 -259 -5 -124 -35 48 -201 139 132 -26 -141 69 -53 -119 -16 -95 72 96 129 -50
7476 -50 -43 -12 197 68 54 123 7 81 166 -45 267 24 137 -188 118 71 53 -33 -6 -349 -21 71 111 -10 18
7501 18 -265 -10 190 17 -12 -158 150 -122 29 81 58 76 -224 165 185 -21 18 79 219 -106 -33 -4 66 98
7525 98 -267 75 -151 86 -37 -89 31 -217 274 173 -42 113 158 -50 196 59 -175 -93 247 6 -233
7546 -233 -39 200 -192 17 -21 104 -157 240 -94 -27 310 91 -52 149 8 -166 114 -111 33 35 111 22
7568 22 -58 -144 94 -91 -115 64 -32 -185 -56 -96 -230 125 -162 -159 -319 -179 -10 92 -119 -25 116 47 199
7591 199 84 -59 242 19 -138 -198 49 -73 -150 134 102 113 -79 58 -31 -38 13 7 326 -420 -136 -285 -161
7614 -161 169 78 -104 -321 315 96 169 -301 386 203 -719 -16 -1 525 106 -35 115 -587 -274 13 22 7
7636 7 -41 361 -285 -508 241 -93 -58 628 519 -180 158 9 -557 415 389 22 369 -91 -124 -166 -247 111 190
7659 190 480 150 173 -1 -126 -92 51 39 -44 101 118 395 -466 135 -291 242 228 -385 478 -308 280 -572
7681 -572 -187 356 300 50 -354 -306 86 -125 -213 59 130 12 -92 -107 -80 48 124 -323 -186 -65 -5 -24 212
7704 212 129 -76 131 57 -376 -15 53 -58 290 188 371 111 -47 97 -24 542 -262 38 -211 83 -337
7725 -337 -149 925 -48 324 73 219 580 24 501 -43 -401 -259 591 -96 -146 -148 11 -65 -93 -184 85 526
7747 526 -181 27 -399 3 245 681 502 -7 335 -196 -36 88 -233 122 639 222 256 51 331 -299
7767 -299 69 -372 381 -38 -178 8 92 119 23 39 -103 -48 35 29 -162 37 -188 31 -77 21 -85 -47 -152
7790 -152 -109 216 -113 60 -25 110 84 -103 159 -33 -46 256 -143 -92 -12 -71 3 -83 -141 7 1 23 -103 -62 -81
7815 -81 -9 -78 210 -103 -95 -20 -4 13 -30 98 107 -166 -107 130 -108 -56 -311 -135 171 -7 199 87 0 -132 -39
7840 -39 -120 -37 37 19 188 -7 42 -157 174 125 89 -28 -13 -65 -184 -12 -47 -62 138 140 136 73 179 47 141 -59
7866 -59 72 -77 115 -17 10 135 57 -321 -22 31 -4 15 -101 -202 133 -60 -88 -255 -35 103 -9 93
7888 93 21 17 -150 18 206 -129 -88 -416 -54 51 85 -100 -46 61 102 -123 -32 20 110 68 -5 -252 -104 -87 -102
7913 -102 102 -161 -5 204 -62 -12 -136 125 -10 48 170 60 130 218 -132 -142 -47 -35 149 112 366 -91 1
7936 1 105 136 151 29 31 -347 184 69 135 -10 -117 22 59 177 227 -14 -42 177 44 16 121 -54 -6 -163
7960 -163 40 347 258 125 96 -39 -105 348 -96 -158 178 151 -411 461 18 139 174 195 35 284 587 -210
7982 -210 94 487 -117 -302 -321 -31 -51 -419 16 -81 -48 67 0 66 39 58 152 59 101 39 -42 -71 269 217 57
8007 57 0 -41 -125 99 -31 105 -146 9 50 99 2 -31 -61 -43 4 59 -80 170 33 -78 -185 -65 85 -117
8031 -117 -153 -17 -26 -122 -39 -32 86 164 -47 -190 88 88 195 -287 2 -106 -19 -222 462 -90 27 -335 -141 76
8055 76 -324 21 -95 -203 -9 -118 166 -144 -5 349 97 -152 -221 351 699 424 615 13 354 -298 -42
8076 -42 138 413 -8 -356 410 73 16 209 -319 -818 45 536 456 148 760 368 -167 -437 749 -501
8096 -501 185 150 -178 309 -234 -668 348 25 -950 -784 936 513 396 -903 -237 -301 212 -241 -433 -58
8116 -58 -156 290 -310 184 133 -402 -396 64 -126 -11 383 137 353 -330 -204 -48 -272 -107 461 84 119 -269
8138 -269 -235 137 147 273 -131 -93 -514 -169 -166 50 -564 -118 194 -472 485 -315 -37 51 260 251 -510 10 -75
8161 -75 -265 130 -34 442 -32 211 134 89 -42 276 33 -89 -130 -126 138 -9 111 404 160 -251 16 110
8183 110 -364 442 -175 1 -258 55 137 50
8191E0
$$ Imaginary data points
##PAGE= N=2
##DATA TABLE= (X++(I..I)), XYDATA
0 0 0 0 0 0 0 0 0 0 0 0 0 0 0 0 0 0 0 8 -8 8 -8 8 -8 16 -16 16 -23 24 -26 32 -37 40 -48 56 -61 69 -77 87 -97
39 -97 108 -121 134 -148 164 -182 201 -222 246 -271 298 -328 362 -399 439 -485 537 -593 659 -737
59 -737 825 -930 1056 -1213 1413 -1674 2040 -2578 3478 -5358 22297 -40626 3947 46219 -50486
74 -50486 16316 32593 -43426 16690 25984 -41340 20582 14217 -33169 21970 4571 -28248 25717
87 25717 -6863 -21256 27310 -15728 -14697 28543 -25475 -7930 29099 -31221 -3295 28794
99 28794 -34910 845 26858 -36364 3956 25589 -35705 5926 22105 -33593 7797 18494
111 18494 -29575 9881 13023 -24179 10638 7243 -17791 11217 1641 -11040 11386 -3555 -5389
124 -5389 11576 -6910 -749 11846 -10164 2116 12399 -12424 4926 12554 -13259 6096 11924
137 11924 -13287 6176 11167 -11581 5625 9950 -9322 3547 8439 -6573 1318 6948 -3439
150 -3439 -967 5009 -834 -2629 3114 1642 -4175 941 3099 -5240 -228 4617 -6047 -1336 4912
165 4912 -6294 -1587 4212 -5661 -856 2146 -4603 -127 -681 -3237 1306 -3317 -1726 2862 -6293
180 -6293 -705 4489 -8378 939 6684 -10989 2396 7613 -12658 3667 8821 -13722 5216
193 5216 8976 -14278 6559 8576 -13724 7570 7449 -12508 8518 5198 -11271 9070 2803
206 2803 -8264 10490 -25 -6075 11809 -3021 -3979 11619 -6571 -1515 12718 -9311 1056
219 1056 12808 -11966 3373 11605 -14140 5771 10870 -16203 6939 9875 -16681 7258 7885
232 7885 -16604 8761 5687 -15430 9682 2811 -14064 10015 -25 -11951 10720 -2776 -9793
245 -9793 10058 -6088 -7100 9901 -8613 -4495 9817 -10618 -1932 9512 -12025 833 8780
258 8780 -13209 2713 7901 -13479 4545 6853 -13347 6275 5784 -12774 7158 4383 -11149
271 -11149 8209 2634 -9228 8556 1263 -7246 8842 -348 -5466 8763 -1677 -3078 8521
284 8521 -3110 -1370 7993 -4132 272 7457 -5125 1495 6347 -5293 2487 5723 -5688 3201
298 3201 4423 -5547 3114 3616 -5406 3235 2687 -4791 2740 1758 -4210 2428 791 -3823 1779 241
314 241 -3262 1401 -546 -2916 817 -883 -2320 476 -886 -2098 159 -1095 -1857 339 -905 -1700
330 -1700 377 -1210 -1922 743 -1108 -1735 903 -448 -1928 1424 -309 -2211 1901 100 -1994 2119
346 2119 71 -1677 2868 -173 -1864 3244 -50 -1423 3997 -45 -1166 3658 -468 -630 3843
361 3843 -1017 -378 3926 -1932 6 4009 -2197 406 3669 -2194 1164 3071 -3127 1275 2471
376 2471 -3395 1795 2276 -3897 2419 1675 -4339 3133 518 -4387 2778 33 -4348 2950 -1096 -3744
392 -3744 3052 -1692 -3575 3072 -2413 -3131 3331 -3122 -2515 3205 -3368 -1857 3124 -3710 -1064 2904
408 2904 -3385 -321 2590 -3487 523 2006 -3549 1048 2619 -3473 2007 1450 -3491 2783 1735
423 1735 -2766 3049 918 -2525 3938 707 -2421 3902 257 -1539 3915 130 -1573 3598 -501
438 -501 -649 3679 -797 -338 3202 -830 -648 2925 -1165 256 2469 -1901 566 2008 -2384 649
454 649 1783 -2382 681 859 -2199 956 738 -2458 1150 523 -2431 684 -167 -2401 482 -302 -2209
471 -2209 1050 -662 -2109 936 -1350 -1990 1413 -269 -1495 1156 -1047 -1072 728 -1328 -1128 1623
487 1623 -1127 -713 1086 -1040 -214 1167 -738 0 1576 -842 -123 411 -373 -95 1378 -404 246
504 246 1181 -414 443 1333 -910 683 621 -329 1582 1275 -280 1002 669 -277 2005 283 -656 1677
522 1677 308 -831 970 474 -1193 1591 -325 -434 937 -318 -1138 828 -468 -1014 554 -1509
538 -1509 -870 -220 -1015 -710 -169 -882 -797 99 -250 -1415 -300 -434 -831 123 -1036 -1187 -1424 -1559 -647
557 -647 -433 -1221 269 393 -1095 -101 -141 -1031 142 462 -606 -319 421 -277 557 1009 -131 1012 844
576 844 369 1664 296 -286 874 687 -27 637 671 -162 526 97 -543 1070 196 300 1425 76 -160
595 -160 485 -47 -13 601 -145 402 328 -71 532 167 232 398 -242 -516 335 -68 -869 -591 549 -1039 -191
616 -191 -484 -663 -359 -553 -700 -896 -853 -1063 -680 -694 -978 -702 -343 -972 509 -1103 -499 -663 -480 -122
636 -122 -303 -85 -374 135 -107 -364 501 -218 81 506 -293 535 222 -236 294 885 650 419 214 439
656 439 -27 459 470 -59 601 396 704 871 745 719 231 593 697 240 106 -175 -673 -91 187 87 -70
677 -70 -315 104 237 -89 -394 -392 -326 237 79 -392 -124 -553 -224 -404 -538 -896 -697 -639 -753 -1164 -46 -971
699 -971 -180 -202 -43 -171 -869 -564 68 -454 -226 511 -606 -123 -36 -147 -312 133 77 -225 1131 -257
719 -257 -409 -7 -1272 -675 -57 -133 218 112 -326 -107 385 58 138 -215 -347 698 586 297 807 64
739 64 48 902 -386 -363 293 371 -389 1492 12 -697 1412 -174 531 803 -196 440 495 -383 -830 -29
759 -29 -728 -942 736 -984 -84 -154 -521 -775 -31 -1118 172 15 -996 -260 477 -780 -323 -401 -1025
778 -1025 -35 -729 -961 -327 120 -643 191 189 -725 -22 -717 -594 1075 -663 -424 50 -316 -713 274 704
798 704 -16 -463 -334 34 833 453 -484 1077 -27 425 724 207 1041 466 578 724 223 -234 37 1035
818 1035 40 555 754 -805 502 528 -408 159 6 -595 218 -421 -759 2 333 -257 -40 89 -996
837 -996 -227 -536 -510 -404 -285 -888 -22 -895 -893 -335 -626 -724 552 -1246 22 -18 -889 -180 257 -645 -172
858 -172 41 -831 -201 14 -679 -14 459 -323 380 346 -697 212 371 -284 400 -66 -488 367 211 -324
878 -324 472 572 -521 662 387 -145 663 542 72 770 138 -69 513 59 -141 418 434 256 844 25
898 25 -563 770 -442 38 416 -527 258 353 -378 -37 348 -748 -354 -126 -588 99 242 -880 148
917 148 216 -304 234 -18 -887 181 -179 -831 365 255 -1507 97 -133 -840 284 -281 -588 -8 -638
936 -638 -666 1224 -324 -306 378 -115 -679 887 -366 85 1290 -266 212 387 -1278 752 1346 -87
954 -87 357 842 -339 -352 546 450 520 549 -744 93 194 -231 169 1228 -563 870 270 -631 904 153
974 153 82 164 309 -431 226 -151 -61 -222 -680 -621 -392 -616 -14 0 440 214 -171 -252 -83 -197 -889 -104
996 -104 339 -633 155 240 -1130 -401 -96 -964 410 -880 -646 -445 -31 -1073 -158 650 -650 1019 -669
1015 -669 -269 384 -55 -1013 413 -327 109 678 134 -706 -359 -45 -212 227 11 397 697 0 886 1290
1035 1290 -102 -221 711 57 263 480 -46 -269 151 -335 1124 1425 105 -147 -85 -336 1 -486 -7
1054 -7 80 362 -127 39 -376 -460 47 -149 -49 5 323 -17 359 677 -1235 433 -242 -343 154 -183 -528
1075 -528 314 55 -1058 296 -646 -522 843 -724 -614 406 -838 -1347 997 -772 -484 835 -1269
1092 -1269 114 959 -155 -920 899 -808 395 702 -57 442 162 -233 -735 676 -594 206 501
1109 501 -653 24 950 -257 30 -80 -663 156 -166 -902 1009 137 -371 447 -126 -232 433 -5 -100
1128 -100 214 -307 91 411 -492 -100 309 -533 -17 -134 -127 143 150 -454 -372 -176 -554 41 217 -946 -260
1149 -260 21 -785 -335 -312 -279 16 191 -493 -254 -236 -364 325 286 -541 423 -125 -216 205 -37 -105 427 212
1171 212 -412 372 135 227 491 -337 -270 632 179 57 443 309 34 687 -142 -121 322 198 107 219 -192
1192 -192 304 40 -152 182 512 -170 35 37 70 -74 441 -419 176 170 189 -225 -19 -257 248 -227 -101 -174
1214 -174 -330 252 -106 -148 -612 621 -519 -476 13 63 -379 -140 183 -443 -44 -86 298 -231 -105 -124 -467
1235 -467 62 -290 145 39 99 1211 -354 -573 101 -277 83 69 397 116 -823 -627 660 849 -380
1254 -380 -253 505 -27 -475 -62 -727 -28 257 -511 416 -135 -160 -107 377 297 518 -313 -490 552 -64 -978
1275 -978 369 -1122 -656 600 -162 -112 485 469 137 242 40 112 212 -183 439 -818 -1065 149 675
1294 675 -563 -257 -219 -335 -1218 393 26 529 -380 -893 -387 526 -625 -380 -310 -752 579 -409 761
1313 761 66 -849 2 138 175 -942 221 -179 -314 282 -27 66 1023 82 431 16 473 568 393 -604
1333 -604 698 -115 304 -657 714 112 737 121 367 -871 -230 164 -174 -80 76 -146 -657 170 59
1352 59 206 161 -471 -597 -113 204 452 -74 29 178 263 113 -272 -16 88 -132 -43 -121 -552 -257 -1018 -380
1374 -380 -149 233 376 400 -231 -673 -54 315 263 -145 139 35 76 15 389 124 -427 -370 474 517 -6 555
1396 555 67 -239 311 -290 8 -75 -40 -138 61 46 -290 -264 -449 205 -88 -111 -13 360 134 -104 -655 680
1418 680 -65 257 9 -151 12 48 -204 110 131 -616 65 -636 268 187 -509 376 27 -40 -441 -1 718
1439 718 -420 -308 -415 -198 95 -35 279 -703 -133 -811 -39 -51 -124 136 36 -229 -307 -818 265 112
1459 112 1168 -126 306 -27 -467 129 225 199 37 238 332 -414 134 -129 -197 -320 -281 743 515 201 99
1480 99 157 133 503 -324 264 -279 125 57 447 128 368 321 444 -266 25 -523 156 -270 -304 517 -278 122
1502 122 -274 -73 -467 424 -468 35 -98 128 -206 -48 -389 -182 -285 20 -84 392 -320 -135 -269 -657
1522 -657 -299 81 100 114 68 -361 -209 81 75 -244 -234 -61 -429 -91 -247 -172 -126 149 -6 -102 467 265 -133
1545 -133 -8 357 -36 -263 2 -42 115 -273 287 136 -194 -275 -52 -228 131 189 230 126 108 166 149 169 -4
1568 -4 -435 158 331 109 234 21 138 15 233 25 -91 99 196 -120 -22 34 579 91 -384 139 -79 -35
1590 -35 -264 -48 -336 147 -41 -135 110 102 333 -346 104 -64 53 -599 114 92 -416 -386 0 145 -302 -294 -113
1613 -113 -173 94 -238 401 63 244 78 -340 174 -77 -13 -276 28 399 76 358 205 -117 2 317 110
1634 110 90 -51 22 -421 356 -197 -353 237 770 -261 404 -679 -594 -72 -889 -321 116 767 -802 655
1654 655 -43 12 118 91 -339 -642 -925 -35 41 -439 -385 -538 -207 626 -880 -149 -43 -584 153 350 79
1675 79 -338 -480 534 -313 -84 729 -234 401 -444 47 280 -1060 -114 -938 72 384 132 401 -216
1694 -216 -53 472 -683 372 316 763 -440 1365 -95 150 141 50 -13 434 -22 18 42 859 -300 280
1714 280 104 -159 -568 -103 -303 -988 672 -209 231 -294 -206 66 385 -205 -422 232 368 28 352 -346
1734 -346 -806 -354 -36 -242 -255 -364 138 -65 -715 601 -214 -541 -334 25 239 -118 -331 -78 40 -401
1754 -401 277 -294 197 227 865 -370 -228 -380 -28 211 88 113 443 -625 -173 251 -317 44 46 -74 259
1775 259 256 -213 434 -539 1228 599 67 414 391 -41 -257 205 351 -647 -423 665 848 169 -6 -404
1795 -404 -181 153 -305 -474 -314 -14 -695 -218 -431 -358 73 729 -166 -306 -202 -166 176 -101 -351 273 -827
1816 -827 303 -602 -482 -92 -106 -12 -612 -409 -217 401 105 -168 661 -593 345 -329 -48 -487 -584 61
1836 61 -317 76 -101 246 349 273 -87 70 -14 115 212 83 -283 166 -52 146 -235 -47 568 527 390 289
1858 289 135 -233 -544 -91 -84 -420 -510 -192 186 261 -178 197 -20 -351 -927 178 -16 61 -252 -396 57
1879 57 -375 59 -402 241 -50 24 147 313 -246 354 -171 168 -679 -17 180 487 387 -292 -291 -323 -534 -624
1901 -624 89 53 127 655 50 360 -178 749 -566 -386 -374 283 -824 -30 -208 160 237 -250 327 -335 72
1922 72 -444 57 -109 499 -561 707 -56 -310 704 -162 109 114 589 286 48 216 129 248 83 -114
1942 -114 328 186 24 186 56 159 -131 -161 105 -146 -87 74 -73 18 50 172 -365 -251 31 -92 -22 -104
1964 -104 -195 -252 146 114 -291 -216 -181 -291 -357 -129 -97 -28 -152 -349 -6 -85 -407 -192 -151 -138 288 159 119 -81
1988 -81 -57 -498 -580 -21 -93 238 -143 -49 112 -114 222 173 319 -224 251 39 -141 566 -249 56 -270 182
2010 182 -37 125 -77 56 238 -375 -138 -26 -421 107 -384 -112 -220 259 -142 -220 354 11 -84 142 141
2031 141 99 192 97 -176 -399 178 -251 -153 172 -145 89 47 -39 -155 -49 -91 -67 -362 -199 41 147 142 -240
2054 -240 -317 -390 -60 -141 79 -132 150 -417 -90 -94 -34 -34 167 74 -286 -7 3 238 -84 -25 69 -12 -330 108
2078 108 241 259 -254 37 110 -100 -259 -86 450 297 -62 -101 -392 23 -19 -53 178 7 115 7 284 -55
2100 -55 -31 66 -94 -123 -49 -570 -451 187 -314 77 -656 -509 -3 256 26 559 4 655 -434 -42 -189
2121 -189 47 -497 -402 -256 -409 151 117 -50 -76 207 425 458 -18 31 1 133 -335 139 -167 76 -246 -26
2143 -26 -98 -79 206 -125 117 -123 7 115 -60 100 148 242 157 547 348 -10 122 176 332 -80 -336 158
2165 158 -203 -48 -36 249 199 262 -226 420 111 -312 -207 258 54 235 549 387 460 167 -47 -366 -488
2186 -488 -80 -61 -274 -352 -146 -83 -472 -102 -50 -14 107 -206 -267 -132 -189 -95 232 -342 -141 -67 50 271 177
2209 177 -41 676 191 319 134 -30 -704 -611 296 -75 544 591 566 -57 679 167 -135 -430 -177 206 138
2230 138 -53 -296 135 335 150 -162 80 38 72 278 -11 35 46 210 -150 -195 41 -139 -239 157 21 -749
2252 -749 -43 229 27 -54 -490 1 -443 -87 -147 -229 47 329 161 -204 -332 -27 -175 -19 169 244 -101
2273 -101 -503 -15 -82 176 -200 81 13 215 -226 50 32 87 -120 -62 107 -77 -273 203 115 -18 -106 121
2295 121 179 99 -144 200 39 -3 270 290 -221 -154 -193 144 135 36 74 154 135 -128 199 15 130 -102 46 261
2319 261 -91 170 -48 -139 -237 -146 216 -128 62 -43 -195 -267 44 89 -142 50 167 98 -126 -28 -86 289 -80
2342 -80 -34 99 -53 205 26 107 107 -27 -111 -31 261 24 27 -131 77 -156 -343 -220 -73 -112 140 -62 105
2365 105 191 29 -24 77 48 82 191 67 191 -61 -8 62 -80 -139 197 -40 -88 -87 -53 -173 -355 -72 277 162
2389 162 132 129 103 9 -3 195 -96 149 113 126 -126 231 -100 -242 164 -22 176 -33 -40 -30 -46 -93 -195 -281 -113
2414 -113 -118 -201 -52 46 9 -236 243 262 -151 -225 -138 -158 125 -205 -356 -354 276 -199 -278 -192 -199 -126 0 11 -712 -234
2440 -234 207 -186 580 -245 743 122 -82 521 -126 -98 387 118 189 -310 160 -30 158 744 -687 432
2460 432 649 383 321 -139 -700 488 282 230 -214 -126 -821 113 233 -231 -233 -455 -47 -718 -404 614 -808
2481 -808 50 -875 -119 -580 -119 -278 238 -608 294 -180 -723 -746 67 882 -27 -429 322 419 192 216 265
2502 265 533 -439 362 890 -66 16 -60 -103 157 -36 326 20 -509 -61 372 317 735 325 523 -102 -373
2523 -373 -167 125 -578 -37 387 -126 -615 -200 -669 548 187 -152 -810 67 -222 -138 562 195 -606 18
2543 18 -42 145 36 485 -35 -296 -68 -330 207 65 -52 -59 -354 109 213 138 160 -83 -160 157 -317 -526
2565 -526 258 283 170 -319 -160 -56 -66 -124 289 -141 136 -337 -9 -18 -205 -369 -27 -62 46 87 31 210 122
2588 122 106 -59 -96 238 -398 219 184 -314 -211 -140 267 -158 -437 65 241 101 153 -11 -193 -25 -406 -46
2610 -46 486 -33 -646 -367 -70 -37 330 21 743 -43 -16 -558 265 373 545 772 -179 -122 -40 -22 294 164
2632 164 -95 106 -203 -72 95 200 -395 -115 105 43 -274 -545 44 92 269 -54 -274 -29 -108 -45 -239
2653 -239 60 -138 334 -125 -14 11 37 -193 -155 8 80 -266 96 15 -53 502 191 541 -219 -127 395 76
2675 76 -165 455 -210 429 -204 -588 -226 212 -257 -274 714 192 -510 222 436 -129 111 -347 -106 -245 -3
2696 -3 -268 -366 -204 -201 193 193 268 211 -236 55 -57 -382 209 -170 -238 -76 -4 -129 -272 88 -214 -148 296 -5
2720 -5 -130 39 -154 75 146 -127 245 -50 57 -13 -236 -75 112 30 -18 -43 -381 -290 -38 100 -113 102 16
2743 16 5 -199 -135 304 215 149 83 23 -92 -67 128 -194 -296 4 39 237 43 374 32 -7 53 -10 230 245
2767 245 44 62 78 218 -4 -247 27 -155 -139 9 -301 102 41 -231 -142 -133 -254 -16 -7 -238 -282 -37 169
2790 169 -223 -250 -327 -147 -77 -232 308 159 -390 -250 -58 294 100 -272 -301 -406 1 100 -35 70 311 -32
2812 -32 -343 180 -271 -564 282 -134 499 -270 29 -101 22 33 -261 14 -17 609 -3 51 259 60 -568
2833 -568 -252 -113 242 -539 -482 14 -252 -506 -519 23 -515 27 -68 489 30 72 493 289 171 -312 245
2854 245 341 -260 -321 -286 -293 450 -397 -655 369 -124 -41 -30 234 66 48 300 -267 24 -27 -160 -89 -89 45 -224
2878 -224 -78 468 68 236 113 -82 -188 -92 42 165 141 268 27 42 101 27 -278 -47 12 34 131 166 -183
2901 -183 161 -155 -142 -65 138 153 233 -38 21 181 72 -155 -11 220 23 -10 112 175 23 23 -5 -94 174 -16
2925 -16 157 -86 -19 317 -17 -207 -44 5 61 -33 156 -15 -175 93 121 80 -668 1113 -876 -1063 61
2946 61 43 -56 -409 99 -520 897 -544 105 247 -297 307 231 704 -50 -14 383 -322 -17 223 232 -177 -267
2968 -267 99 1 52 290 -95 39 -240 378 -1 321 104 248 -211 179 -150 -213 266 319 168 81 15 -59
2990 -59 168 109 -181 -60 -96 6 -84 -90 146 201 37 146 67 -12 -8 54 -60 16 75 -10 125 8 53 -1 -344 220
3016 220 11 -103 14 -282 12 23 30 -142 163 -14 -127 -56 26 28 -193 20 -43 -83 167 299 43 -112 83
3039 83 17 -127 140 129 81 65 -56 80 24 -67 -106 -172 75 130 -66 110 -26 78 -54 -61 64 -112 87 92 -48
3064 -48 -3 207 -54 46 -56 148 75 22 72 6 147 -85 106 -73 -69 -43 96 -84 -57 127 168 -83 -5 83
3088 83 -55 -63 -78 182 121 -29 101 -62 53 -233 53 -239 135 -105 68 109 109 -80 -31 -13 -114 123 -322
3111 -322 1 160 195 250 -251 -260 323 -254 -254 -34 304 -202 607 -45 -259 787 95 298 300 -263 46 -161
3133 -161 -437 -295 -239 90 -249 -840 179 380 -173 -144 -8 61 22 138 209 357 -260 -39 133 -203 77
3154 77 -41 330 -5 -43 19 29 -219 165 10 273 -150 -395 -5 -156 277 543 -304 -285 -161 383 116 35
3176 35 -442 -212 305 8 -384 -743 -634 -471 -221 592 -104 200 82 172 129 -139 -118 -216 121 4 -132 -118
3198 -118 -128 233 -74 -217 154 163 -107 66 -87 -74 80 106 53 -164 1 279 602 463 -161 7 46 -44 -127
3221 -127 -41 -119 -109 65 233 27 23 -130 -272 227 -186 226 -29 -136 57 94 223 -77 170 128 98 37 -178
3244 -178 -15 -28 159 37 -68 129 81 -19 -144 158 -33 -215 34 212 -152 -115 -125 58 -122 -374 20
3265 20 50 174 9 -138 -104 8 22 28 -146 220 -93 66 62 -118 88 -45 58 118 -38 142 192 -72 241
3288 241 -119 -82 33 -70 63 194 184 -40 54 135 -5 -131 14 -84 40 -413 -228 236 273 -933 452
3309 452 719 -582 -251 437 -502 -554 387 -62 -278 -492 208 -165 -4 -548 -10 400 -216 -307 37 -15 -555
3330 -555 -174 -118 108 -110 436 35 -47 -34 -51 -157 209 -99 -185 112 170 299 82 211 -115 -140 18 -38 203
3353 203 -199 -30 1 212 289 -23 43 38 -137 200 186 -273 -196 145 -71 119 132 231 177 135 81 33 -53 -42 370
3378 370 4 224 248 -255 217 -229 -113 110 155 -45 22 9 69 73 41 243 69 -96 34 32 42 -15 130 -133
3402 -133 47 81 -93 55 67 -15 -69 42 -34 29 -3 33 -103 165 -184 -360 206 -52 25 -169 10 -57 221
3425 221 114 117 -155 -85 -63 -8 -14 -32 -253 -33 -352 18 -125 13 1 10 -39 89 58 471 -393 144 79 -206 -291
3450 -291 26 378 341 302 175 598 -746 -281 -22 -275 95 -93 -179 139 -109 -54 249 137 -234 22 -114
3471 -114 53 -11 10 27 109 -102 184 -219 192 2 -35 79 44 -15 118 74 -138 232 87 -155 -4 81 6
3494 6 113 18 -272 77 10 183 160 68 46 94 117 106 -72 -49 -129 88 66 27 -147 261 -538 121 258 -274 131
3519 131 252 88 -366 -6 247 373 -322 683 716 -184 -535 551 -565 505 120 -279 237 -194 -158
3538 -158 119 49 -82 -71 46 127 -94 66 -172 6 73 -273 19 50 156 -93 1 272 -272 160 284 509
3560 509 -58 446 157 -114 218 125 232 -810 -186 95 269 261 262 -256 -381 184 48 11 235 -132 -186 20
3582 20 1 -26 105 -112 168 10 -62 51 -151 7 -23 -100 126 35 38 -4 92 -280 75 75 5 59 -86 -269 23
3607 23 42 80 -145 37 151 9 91 -48 7 66 31 -152 -35 32 -38 83 231 -263 -23 97 -21 -126 211
3630 211 -21 -243 -33 34 66 91 -46 -115 -54 72 22 66 -133 -56 98 46 276 46 -22 -30 -55 167 239 91 9
3655 9 78 117 154 154 -94 83 144 -223 -148 201 109 -104 -25 321 74 -109 214 3 -32 133 25 24 24 -100 39
3680 39 120 -90 -6 121 110 -96 156 -181 -65 120 -163 79 124 -203 -81 10 16 229 -332 -57 105 -58 -160
3703 -160 -24 43 -124 271 -118 116 -17 -166 -170 -6 278 -63 -15 -73 -142 -9 -13 45 -78 -208 -109 -75 65 -24
3727 -24 85 -51 111 -96 132 -30 -90 -74 73 -34 -109 78 -71 -247 33 203 171 74 -77 22 38 -185 13
3750 13 -1 -2 26 71 5 2 -163 36 30 0 75 41 -61 15 118 44 -20 59 373 -56 7 44 -182 -12 89 80 189
3777 189 -7 122 62 -37 -97 -257 -39 19 73 -110 34 -97 -165 -150 -14 136 40 43 129 -28 -53 2 1 -117 82
3802 82 140 -11 -169 47 -97 -362 110 131 225 58 56 -10 65 -31 -84 26 -108 -28 11 124 37 267 10 -33 12
3827 12 -294 129 -48 -22 62 -12 11 136 -74 -172 82 50 75 -119 -77 -31 -53 -140 -53 -38 -46 170 -254 86 -156
3852 -156 65 151 -118 1 -220 52 -128 -140 -53 -70 -84 -250 -184 -30 -63 -67 35 101 -64 -200 185 -49 -70 -3
3876 -3 74 54 241 -12 -9 44 164 -206 -124 -85 38 -35 73 93 9 145 -127 90 -77 95 -109 116 52 91 -221
3901 -221 -151 61 191 21 93 -4 -78 134 -79 -107 -45 122 -21 82 -290 -12 29 69 -60 92 70 -126 27
3924 27 113 -157 45 258 -115 -7 68 70 158 63 -55 29 -67 -12 -74 -147 -65 110 108 73 -181 51 -279 -112 6
3949 6 44 101 28 -28 48 166 14 13 144 -45 -83 178 -98 -178 88 -116 -98 -32 175 -27 12 -63 142 -58 -181
3974 -181 -95 -193 71 -52 -61 45 -182 48 226 -17 -285 -180 96 171 32 -20 -30 33 -7 -420 238 -79 -142
3997 -142 166 -14 164 -60 150 -102 58 -79 63 -3 62 76 -192 -122 -216 78 -3 -27 59 -70 -86 46 133
4020 133 183 108 -129 -30 -161 118 -156 2 -172 -22 35 1 -99 -50 -67 -151 -81 184 148 -151 -107 -89 -76 44
4044 44 275 80 114 128 105 46 8 29 321 165 47 -89 -308 105 -115 -78 197 -36 36 143 178 167 73 1
4068 1 -200 -26 -67 -45 -31 -170 -150 97 -119 -42 271 28 330 222 -107 158 18 -114 115 177 120 289 -87
4091 -87 -129 67 310 -33 108 -157 -64 -9 -143 72 110 122 33 -35 43 221 41 59 100 -89 215 7 57 6
4115 6 60 -62 -71 -159 110 -19 0 -55 3 101 88 -60 101 -156 -56 -96 43 -72 75 74 43 201 -122 -256 55
4140 55 -29 -16 -59 16 -28 -218 -169 -150 110 -7 -121 33 -53 -1 35 42 -77 22 -51 -72 -68 26 -124 -182 -214 -76 28
4167 28 8 -54 -39 -75 46 24 153 -94 75 -205 27 236 -59 -21 36 209 151 -88 -206 201 -27 -222 269
4190 269 -204 229 -215 400 206 -56 -7 -4 -227 -255 163 -334 526 -143 710 -2 -282 -195 150 125 627 347
4212 347 -658 -453 -42 13 181 242 57 254 188 -51 45 -11 -282 -28 -199 -172 2 -2 107 64 -81 159 -44
4235 -44 219 226 -32 -117 -45 43 -27 -141 268 -7 27 132 82 158 -95 106 58 -54 -61 -239 -189 27 -53 98 -22
4260 -22 183 146 -98 -47 178 71 129 -298 93 58 -205 -311 160 141 1 213 80 102 -69 -64 79 42 -184
4283 -184 170 1 -128 104 131 188 -140 -417 -37 -260 353 -79 -39 328 241 -134 388 -7 -52 -471 19 588
4305 588 -27 163 148 20 64 27 -782 -94 -191 -35 -277 -80 328 462 269 115 -43 370 446 -155 268 -358
4327 -358 26 -122 -554 120 124 -10 254 -194 -69 131 -107 -449 154 15 39 -112 -38 28 -31 83 45 -15 -56
4350 -56 79 -132 160 51 -25 111 83 54 -60 -58 14 178 25 127 -58 79 -187 34 86 -178 -139 -66 166
4373 166 -43 100 -33 -262 80 -112 -156 -265 82 59 123 -238 -29 35 -31 59 -154 65 0 119 73 -117 109
4396 109 -92 31 -116 -81 -83 -101 -107 -41 152 201 9 40 -207 -14 27 4 -64 -72 24 -64 87 -125 106 74 11 -170
4422 -170 -137 242 205 22 35 136 -103 40 198 -23 8 155 -15 -13 182 -12 -39 9 77 -161 36 -153 236
4445 236 195 -346 123 -151 -250 271 80 -562 220 -86 82 99 -130 -106 -158 39 -386 -331 49 -376 -546 278
4467 278 97 -190 -185 -282 -68 -135 -386 137 -384 71 -88 -216 171 223 -150 -167 -22 -42 -34 -55 40 -11 -196 348
4491 348 840 -834 150 -67 351 -518 -2 539 -569 149 526 -19 -361 302 -352 -127 -274 230 -202
4510 -202 -350 -218 -507 134 -198 -67 73 -395 -133 -30 -187 -358 -104 -104 121 164 -368 -147 -35 186 384
4531 384 -77 -363 73 -500 31 -355 -39 -414 158 -78 -388 -951 336 392 -223 331 -38 -97 366 521
4551 521 9 -636 -130 389 551 228 -369 271 288 -16 -68 38 159 164 -135 26 -126 138 73 98 -107 -65
4573 -65 -75 70 90 -71 293 102 142 -3 6 31 61 2 49 191 -2 -177 -97 44 -72 -23 -20 -135 45 6 125
4598 125 -124 -214 -224 -136 27 0 44 -54 65 -135 48 -88 -35 -33 6 191 -60 161 -59 -78 112 82 54 59 -21
4623 -21 -66 -137 -58 52 82 30 -29 190 -109 75 -55 14 -2 7 202 23 93 53 -140 6 201 -103 99 -62
4647 -62 -28 59 74 102 49 14 -34 41 143 1 87 -49 181 -174 -44 80 89 23 80 -109 -84 -143 184 43 -101
4672 -101 -126 12 2 -162 62 -42 55 -114 65 150 -57 -39 -42 -23 55 -215 -264 -49 -84 234 -23 -251 15 42
4696 42 192 -80 113 1 252 -7 -186 274 139 135 -26 -151 -113 -5 -152 -113 2 165 161 7 -1 157 130
4719 130 116 154 326 -154 -109 -83 11 175 147 92 121 241 75 -161 -117 212 87 -164 68 16 190 -136 130
4742 130 188 200 197 154 206 76 -180 178 -41 19 97 39 54 -59 -76 -60 -95 76 194 28 68 37 214 -5 40
4767 40 92 -43 -148 86 76 240 9 395 235 20 -237 -59 33 -454 -618 18 -244 -201 567 -98 -210 316
4789 316 228 68 -102 104 61 -190 -9 11 -126 228 113 -207 -302 -82 -54 36 39 -270 120 -65 -162 24 -107
4812 -107 -53 -256 167 -196 -325 485 -193 -521 -509 342 -159 -564 144 -122 -7 -226 315 -85 250 133 -149
4833 -149 178 -36 136 86 -40 52 173 -11 77 -140 53 -235 171 85 -6 10 -148 64 213 -70 65 162
4855 162 -115 46 112 -37 37 189 -99 171 -109 -63 347 59 137 -77 -182 -119 -44 14 165 192 88 94 75 14
4879 14 -46 -29 -5 98 -165 -132 89 -17 110 -14 -78 159 53 10 -80 -103 -77 -225 165 -192 -43 136 -140
4902 -140 119 225 -165 186 68 -72 -69 115 94 -174 138 188 102 -39 111 -25 384 -130 26 321 178 -75
4924 -75 -204 18 60 81 180 109 -227 -19 93 40 87 -139 32 -25 -70 -60 135 145 -103 18 -181 12 62 79
4948 79 84 102 167 112 3 30 18 -165 -27 -185 -75 145 24 50 -28 144 -141 34 -48 100 58 280 99 87
4972 87 -98 -212 -132 40 131 -63 -29 47 -189 138 -8 258 167 -90 -444 -106 -23 349 -230 -248 64 533 98
4995 98 -138 -460 -14 -14 301 1052 300 -141 75 -261 62 -252 75 62 40 477 -61 -9 -81 186 58 -53
5017 -53 3 -215 -171 -53 61 262 -36 -6 64 -19 61 -108 -34 -312 -123 -154 -38 19 155 -210 167 -351 -85
5040 -85 42 133 -206 -44 293 -233 -174 -135 -57 -44 273 -145 143 -17 -147 -3 -30 -21 -55 67 -203 97 54 -64
5064 -64 -107 70 -97 42 -4 -173 -109 -40 44 84 -35 16 -36 -9 245 -289 -79 -62 -94 111 -12 0 113 63 -226
5089 -226 152 -148 -2 30 -44 118 62 -215 -186 54 56 -108 -24 40 369 98 -261 239 -53 266 -209 165 80
5112 80 -81 204 38 154 -234 144 -75 -26 42 -93 -19 -51 66 383 -170 34 109 -14 183 -138 -181 100
5134 100 -83 -197 90 206 474 322 -37 -221 -142 -37 -248 -139 -291 -670 228 -401 423 780 -287 -292 -258
5155 -258 -426 -877 200 957 192 96 -376 26 176 34 -25 -128 -53 -38 -130 85 44 248 145 -111 83 23
5177 23 127 106 -21 94 370 -15 103 -74 122 25 193 129 -98 -67 -93 -138 80 -549 -250 83 -387 -193
5199 -193 -453 -159 8 -57 -466 -354 -765 -36 64 -669 -62 418 -59 189 847 -343 -687 578 -736
5218 -736 -5 -491 120 -374 -310 -9 -41 -189 -31 -31 126 18 -10 -10 206 129 286 -40 109 -111 103 167 8
5241 8 148 147 280 -163 10 156 67 33 126 -16 11 -108 101 19 -281 -29 174 210 146 61 -126 96 -37 -43 13
5266 13 108 -87 -94 28 92 -2 13 -205 -130 -394 443 76 189 -504 624 -163 478 280 -194 27 424 714
5288 714 -241 -53 -448 55 -307 -140 80 167 21 166 77 297 -102 113 -135 -9 337 -29 -302 216 -20
5309 -20 43 -14 234 33 187 373 -426 3 -109 139 106 -229 150 -112 -125 -62 53 199 79 55 -227 -9
5331 -9 -86 -32 -115 -23 -45 3 65 109 158 -294 94 159 23 20 93 132 62 61 -63 -95 50 -207 235 -96 109 -55 48
5358 48 185 -125 -5 -79 -56 -131 -115 -143 30 7 -19 -232 83 1 -69 15 -26 -94 -87 -282 -47 58 -197 35 27 -169
5384 -169 112 -269 3 111 -98 -165 132 204 -231 -11 47 75 -92 107 -181 377 52 71 -61 -4 4 111 131
5407 131 -41 31 -45 -259 -47 81 -76 -16 340 3 70 -58 102 76 -137 46 -38 9 -143 -154 152 -33 -48
5430 -48 33 -113 -101 -184 -17 -135 -1 -124 86 -97 28 103 -45 -82 74 0 156 -132 -7 89 200 42 -56
5453 -56 -32 -141 142 -107 -60 -65 112 -20 77 63 -59 -140 -47 -17 -308 -157 111 54 65 279 111 -86 -52 -215
5477 -215 -92 -73 192 103 -152 191 -52 47 -239 -112 -69 31 87 218 -30 -107 -57 -53 104 1 -194 -13 -47
5500 -47 -164 -8 274 114 272 -81 -193 33 113 -29 -158 342 5 -108 -33 -155 62 195 41 -8 -143
5521 -143 188 -68 128 -36 -188 71 126 32 49 -57 185 -100 -10 -12 46 23 -131 111 165 -89 -79 92 -152
5544 -152 -111 90 -17 75 230 -30 119 -176 6 -50 -167 -193 -144 4 -189 107 206 -97 171 152 -27 113
5566 113 57 -108 21 -82 11 -245 -116 -259 3 130 -11 -94 19 -334 -92 85 32 -111 -235 70 -52
5587 -52 48 69 62 -48 -25 -21 -25 179 -94 -34 -135 -259 -34 -75 142 127 -51 96 186 -136 95 -28 41 -66 319
5612 319 93 31 -36 25 -111 -94 150 -195 -101 -329 99 18 -121 -199 137 101 -18 85 -96 151 -150 -50 -98
5635 -98 -88 121 57 -62 -67 22 -118 -289 -170 -296 36 85 1 -66 -236 95 180 148 -33 -210 77 -124 -116 -159 45
5660 45 250 -119 52 -106 -160 186 37 -149 -157 -143 -42 0 21 -63 33 15 -19 -58 -31 -10 118 -83 -5 56 38 51
5686 51 487 365 -254 -106 47 -233 -435 216 326 -200 -119 -569 357 -84 404 96 -221 16 -116 7 -32
5707 -32 -88 0 -226 9 166 -54 59 30 -147 -65 -191 -82 18 30 127 188 52 116 -61 56 144 -144 39
5730 39 -47 -55 -68 -50 14 158 218 166 -57 -62 240 26 61 -118 115 -70 90 -41 -67 -140 -113 -44 -5 -126 -182 77
5756 77 -79 91 173 -125 69 138 107 86 93 226 4 -9 -89 -83 -31 316 -5 29 -44 81 -55 153 -72 130 57
5781 57 -78 44 218 -27 -27 -46 258 -88 113 -25 -30 -16 80 67 -142 -149 -6 -11 -141 92 255 83 52 100 134
5806 134 -92 43 -203 64 95 74 352 46 6 -173 68 21 167 72 75 -155 -24 -84 -134 -177 38 29 -85 -100
5830 -100 -142 188 127 -40 -71 -43 76 -105 -107 184 -54 -173 138 273 -120 124 -15 -46 -163 64 51 -143 145
5853 145 -100 -51 -35 10 -179 16 127 -243 -37 -91 -228 86 155 19 -103 -106 -26 -127 -6 52 -133 34 -197
5876 -197 -22 -5 8 -6 21 9 271 170 173 -37 -106 34 28 -88 -121 -122 -80 15 -167 -205 102 -69 -76 141 118 5
5902 5 177 -42 -126 -141 -235 -36 119 69 -155 110 -164 49 -57 3 -32 -99 119 -21 -57 29 42 -178 113 -163
5926 -163 215 -24 16 84 95 -121 126 5 -26 125 4 22 -175 -187 -21 -171 -39 -161 351 23 127 -57
5948 -57 -47 -49 -221 79 85 -66 274 5 52 155 10 -79 131 -62 41 -27 -79 -74 -208 42 -78 -63 -71 -20 -35 110
5974 110 -71 -84 -154 69 77 33 -126 55 -128 197 8 157 216 44 -41 -139 70 -127 -13 131 -23 -228 -146
5997 -146 -132 -8 -21 51 -3 22 -129 241 191 -234 -92 112 -66 5 86 -23 86 39 -60 -109 195 -197 102 130
6021 130 111 -166 -208 -298 -146 23 -116 137 53 149 -108 38 50 -13 -117 7 82 28 -10 -165 82 158 -46 -73
6045 -73 98 -59 -63 33 77 -262 334 -34 1 -49 153 23 -214 -93 176 25 -16 -20 370 402 46 69 -53 -46 271
6070 271 -142 254 -225 217 175 371 -77 178 85 14 -70 124 5 418 100 -270 -123 -90 -244 332 168 -18
6092 -18 -17 374 -169 -416 196 -100 35 64 345 -148 222 -14 295 614 23 -516 419 75 495 -155 -366
6113 -366 -288 -121 1 -386 -400 169 508 -172 -15 48 22 -62 343 507 -136 87 -445 326 844 69 -291 350
6135 350 388 177 -206 -275 -108 115 -166 -155 85 31 -52 -50 336 -257 147 71 -91 -43 6 159 -133 -137 -12 -301
6159 -301 1 -56 175 137 107 67 267 -13 125 -90 -94 -127 -132 -322 -174 -16 172 -222 124 -81 21 2 -382
6182 -382 -138 6 -201 -253 375 540 47 283 402 -27 -107 -8 -3 329 307 -44 -43 133 -58 -48 -85 181 -159
6205 -159 -29 -60 9 -50 -43 -261 -167 -134 -76 -27 -13 25 151 -147 62 192 77 -81 93 117 3 69 -91 334
6229 334 39 120 -193 -102 32 54 210 80 -50 28 184 298 -27 -38 184 336 124 54 161 145 165 16 10
6252 10 168 -246 346 -100 133 -74 -250 -391 -595 -191 -346 295 -106 -194 -521 -146 502 -233 134 437 44
6273 44 572 438 624 398 -365 -288 -451 125 -188 147 -286 188 101 -421 17 15 -237 157 -92 123 58 -75
6295 -75 -92 -218 111 -61 -132 166 -130 -37 82 35 75 -55 212 82 127 -99 69 -22 141 166 87 -109 21
6318 21 45 -46 123 -84 -21 -49 -197 -55 -65 58 -86 -102 63 -108 -148 -46 6 -71 2 121 96 -50 -44 -67 -6
6343 -6 -33 -51 168 20 114 -74 -387 112 56 83 94 -1 -163 32 206 -63 -32 137 6 13 27 -11 -140 79 -31
6368 -31 -6 -22 -148 127 88 -25 -15 -115 218 56 -67 174 -133 233 219 -126 -40 -120 -198 113 -21 188 99
6391 99 205 -242 21 239 -56 -114 108 129 -41 108 82 -115 58 77 77 250 -34 -176 -109 76 169 74 -14 -99
6415 -99 289 -117 -24 -46 -1 -37 53 95 83 -92 -141 190 113 -164 149 108 -106 245 23 -34 -66 -179 224 -121
6439 -121 -181 -268 96 -165 20 35 96 124 114 3 -87 -23 83 -142 -26 -57 -209 150 -39 -53 -84 -54 -111 -163 -17
6464 -17 121 -215 -109 33 166 -8 130 10 -268 -41 -51 -58 -1 -139 74 29 236 -38 91 103 0 65 -104
6487 -104 180 236 88 -21 -189 -43 -49 -4 146 38 19 69 -5 16 5 75 34 -4 -141 99 50 -19 -32 -44 45 3
6513 3 -122 173 40 48 -59 21 171 -36 128 -87 6 100 -272 -289 19 -71 -208 91 -127 14 24 38 128 41
6537 41 49 88 -13 -11 -40 -132 -144 3 116 334 -145 -173 -18 389 -123 -75 -209 -107 127 211 102 51 -33 181 -166
6562 -166 126 213 113 -127 64 67 -168 187 51 246 165 -31 17 -31 101 95 -120 150 173 57 -100 -33 82
6585 82 51 -83 -73 -43 22 37 93 -43 -95 -164 -68 66 13 25 154 -52 14 -100 105 -93 -97 -26 34 -212 105 119
6611 119 27 213 -29 -27 18 21 11 -18 172 62 -203 -4 53 -255 103 239 7 -92 -237 -20 15 -80 -172 264
6635 264 -93 4 -95 133 -15 -68 -3 45 -46 77 206 -114 -62 -6 245 130 -171 114 -97 -49 -74 -21 150 93
6659 93 148 -123 100 57 -42 164 392 -207 24 344 -152 -80 50 -27 12 93 60 122 -1 136 -114 -13 -127
6682 -127 88 35 27 -72 -37 167 -124 39 -91 -13 176 -398 -131 -20 -120 15 77 55 -153 10 14 -224 112
6705 112 90 16 50 -80 26 -156 -23 126 -43 -303 177 108 -33 -35 -53 -32 100 161 -57 223 -55 -157 -91
6728 -91 -35 6 -98 53 -12 52 -156 -91 -111 24 -30 125 -68 -48 49 -7 -173 17 5 -7 -178 195 73 14 121
6753 121 116 11 -18 111 34 91 50 -234 -425 207 5 -15 -118 -45 244 173 -79 -204 -232 -198 -78 5 -417 -121
6777 -121 -79 -261 113 3 404 22 -203 -138 -123 -5 -32 130 156 -280 -49 -125 135 90 168 -52 -18 14 188
6800 188 -36 -154 494 21 -13 174 -63 209 -153 -149 -27 -31 -91 68 -110 -5 155 70 -161 -6 195 140 133
6823 133 -52 165 -3 13 251 31 -58 63 27 73 -135 64 19 244 108 82 12 -89 79 178 80 -142 93
6846 93 -219 130 0 -31 -130 -50 114 -72 -12 46 48 -67 -170 34 -112 20 -22 8 -92 184 -163 -132 84 33
6870 33 -22 6 -86 2 89 32 37 4 186 -46 -32 -69 109 -23 -48 -189 10 79 -27 334 -147 -155 224 -114 -97 -137
6896 -137 106 -119 274 -134 151 56 70 53 -303 153 -61 -52 -61 -72 -149 121 -139 54 187 99 205 153 -109 262
6920 262 23 -6 -40 -255 -196 63 125 60 -36 -16 -47 215 -89 2 63 -147 -55 -69 191 14 -50 -30 -61 -15 -88 -48
6946 -48 -48 -9 -207 136 -98 -53 -90 -84 55 135 -31 167 147 -169 93 156 153 -23 45 -295 -106 19 -50 46 155
6971 155 -78 12 31 -128 -5 -139 -310 -63 -172 184 212 -9 111 -161 258 -50 134 -21 -67 196 -57
6992 -57 -189 149 -23 -96 229 31 10 63 8 -119 10 -219 108 25 -25 390 71 -40 -36 -87 95 191 -110 45
7016 45 164 6 -102 24 43 30 -18 -58 28 -126 -105 75 -11 189 149 -74 -301 -132 32 -18 81 -163 -38 161
7040 161 82 -308 -26 -138 -20 -146 148 -247 -111 166 -239 281 -19 -90 -192 -12 96 175 -5 143 67
7061 67 359 217 177 9 -69 -28 140 235 296 97 -182 244 -202 235 236 -2 355 -766 142 -783 -17 -59 -453
7084 -453 264 -84 477 -100 -140 35 110 -103 306 -280 383 120 148 117 197 -95 -271 -93 -110 -140 62 -224
7106 -224 9 -399 50 -232 -68 161 -78 78 -53 107 -300 165 24 332 111 -124 198 153 59 -436 74
7127 74 222 342 -78 29 -15 241 508 -40 57 -56 61 -344 -327 -499 -50 476 392 465 63 -125 332 -185
7149 -185 -136 -66 57 264 150 66 158 52 -306 242 -285 -223 -2 -190 87 441 -495 -256 -169 373 -176 -100
7171 -100 236 -19 -113 -98 61 156 -37 -114 -184 -119 75 -119 -28 166 51 233 13 -113 24 95 -69 -259 -10
7194 -10 -95 23 75 256 169 92 -130 26 -6 -182 143 -83 -113 -89 -35 -331 -99 4 78 60 160 100 99 91 22 113
7220 113 -50 -168 -25 36 66 37 -40 -67 81 69 3 -163 -161 185 -13 11 184 -99 -228 65 47 -197 30 -282
7244 -282 -114 -134 70 -137 32 -22 -205 -17 -84 -122 25 -5 112 298 -66 -61 -75 2 -24 65 40 -224 138 9
7268 9 -85 -4 33 -62 -69 -71 43 219 23 -113 -45 -200 -129 88 6 -13 -11 -155 -154 148 -186 -48 101 -234 91 7
7294 7 -338 -197 -181 186 -36 -106 -17 -118 -393 73 -132 79 136 -84 -84 138 351 61 -143 168 -66 26 91
7317 91 125 -103 54 64 72 78 26 258 -36 95 -5 135 54 -121 77 -90 -9 24 6 181 -21 43 -26 -12 27
7342 27 -55 176 66 63 -132 -20 13 -83 15 25 100 294 145 89 219 136 5 -27 2 81 -150 41 -124 52 -77
7367 -77 1 235 42 174 0 199 248 -127 -82 209 18 33 -137 23 -2 27 138 108 -208 -52 -30 -15 273
7390 273 58 123 104 -163 -26 -83 108 36 -82 90 -13 56 58 -65 -126 52 87 -96 -86 -11 43 -167 138 -148
7414 -148 2 170 -39 -8 80 172 -12 155 79 -180 -128 -62 -146 19 196 -29 -234 28 -5 -5 167 16 10 -195
7438 -195 -51 -120 -213 106 -38 -12 75 -138 -45 61 17 -56 195 -228 -47 -83 -23 162 -118 -131 -45 -72 109 76
7462 76 -76 -268 -88 81 -82 5 83 275 137 107 151 6 -110 152 -125 -167 24 43 142 97 176 -45 122
7485 122 49 25 -107 -90 123 -12 69 -32 20 -99 -45 40 133 238 100 58 59 -280 -203 -49 -8 -117 -45 -87 -281
7510 -281 130 -189 -151 -21 -34 -195 36 -84 96 -157 -20 -352 107 73 153 -93 -18 123 -100 -19 27 151
7532 151 195 -241 -39 138 158 47 30 -156 -93 -2 117 204 105 -27 67 20 -274 46 71 41 162 241 71 -64
7556 -64 -43 -8 228 -181 -137 -194 6 -189 40 229 -124 -41 -173 -168 94 -28 223 -157 -204 59 -32 -125 130 36
7580 36 -28 239 201 -42 -112 -113 17 -134 205 -32 -19 138 85 -57 17 296 -34 -121 72 115 2 89 -324 -65
7604 -65 83 268 -286 36 219 -76 -90 -133 49 21 -424 -597 290 -144 -34 97 -38 -200 -148 -579 -71 -106
7626 -106 -740 151 -152 67 645 252 34 -303 -93 136 50 -7 -325 533 -177 -393 -265 412 -119 -847 45
7647 45 -945 426 117 -46 262 -142 55 182 -188 -31 -51 158 -144 29 87 -202 304 95 -83 -106 274
7668 274 34 -123 45 22 105 190 23 -131 -77 -428 -294 -316 330 227 1 298 11 -191 193 63 12 -210
7690 -210 -185 -178 348 -235 318 -102 -158 1 -84 -49 -134 84 130 96 -387 -196 -10 32 159 -301 -312 307 218 332
7714 332 246 -437 504 -268 -526 -427 224 367 317 282 399 230 22 582 -63 -95 -439 39 -402 -44 55 108
7736 108 1036 565 143 -245 -195 488 -448 -669 -79 317 -252 -278 -523 -113 -21 -13 -302 -184 -17 -141 -188 20
7758 20 -206 382 -10 -222 -320 157 -387 -10 180 -353 -45 40 -24 -130 27 130 90 -148 -234 -55 -143 35
7780 35 -63 116 -89 227 -23 84 55 35 -87 -178 58 -148 -101 -137 124 69 -128 -89 30 213 127 -96 72
7803 72 -139 -169 37 -67 50 -48 76 104 -21 193 -225 -99 -2 -116 -56 -5 66 56 96 211 14 -167 -32
7826 -32 317 99 -161 -194 -61 91 -154 -109 136 194 1 87 165 -35 40 -66 138 24 34 11 131 -52 -41
7849 -41 268 96 66 -118 -54 -14 45 -193 -165 -96 -53 -47 17 73 212 -14 223 -79 -57 -104 172 162 244 -93 73
7874 73 -190 302 -41 248 233 -60 77 115 -89 117 118 69 80 -123 200 15 18 64 -57 -99 -40 100 334 1
7898 1 -129 -46 -53 8 155 -112 -60 -164 34 -210 227 -19 197 -171 87 -43 -96 152 -36 -153 86 -52 10
7921 10 25 -35 -18 37 -203 -69 109 5 119 105 138 35 -65 109 2 -67 -68 81 -55 104 57 -139 91 78
7945 78 42 241 82 -93 96 110 -24 10 -162 -37 292 10 -168 -104 8 -178 -38 -133 -9 -113 152 152 152
7968 152 63 -56 -555 -118 91 150 -91 24 -259 210 -21 1 -34 -466 522 347 349 332 -61 -109 -249 -196 207
7991 207 657 -162 393 161 -48 -198 -54 -76 -79 -136 -226 -17 27 -173 105 -15 125 21 -28 72 -104 14
8013 14 -165 108 -300 22 -190 285 117 155 -26 92 -132 32 -143 200 -62 -108 129 -138 43 -49 110
8034 110 14 59 83 -122 195 82 -74 141 -45 -37 12 181 -379 -208 -291 8 6 -4 126 186 121 240 36 -91
8058 -91 -119 -359 -384 77 260 -307 147 261 -72 165 -172 -193 235 -70 -256 490 -199 -299 -462 345 472
8079 472 41 11 -154 73 -469 209 490 -269 -455 508 0 -108 -284 -316 -227 -229 -199 127 -690 128 776 -764
8101 -764 352 16 -193 -639 -612 1048 473 -661 -134 887 188 -68 -641 455 259 242 257 -235 191
8120 191 353 -166 -103 104 -144 -383 277 278 75 73 -120 224 543 269 -103 400 331 -337 159 70 459 -263
8142 -263 57 -269 191 348 291 -48 -243 -38 61 -128 369 -153 -549 380 -463 -25 82 345 532 -196 495
8163 495 -164 419 -294 -61 650 28 151 318 270 -138 24 48 -283 51 303 -156 511 131 188 115 -346
8184 -346 350 -319 -273 -99 -413 -122 47
8191D7
##END NTUPLES=NMR FID
##END=
