##TITLE=1H_SR61_k
 D2O, 8 sc, 
 2.06.2021
##JCAMPDX= 6.0         $$ Bruker NMR JCAMP-DX V2.0
##DATA TYPE= NMR FID
##DATA CLASS= NTUPLES
##ORIGIN= UXNMR, Bruker Analytische Messtechnik GmbH
##OWNER= root
$$ XWIN-NMR		Version 3.5
$$ Wed Jun  2 12:24:52 2021 Russian Standard Time (UT+4h)  she@DPX200
##.OBSERVE FREQUENCY= 200.131506
##.OBSERVE NUCLEUS= ^1H
##.DELAY= (6, 6)
##.ACQUISITION MODE= SIMULTANEOUS
##.ACQUISITION SCHEME= undefined
##.AVERAGES= 8
##.DIGITISER RES= 18
##SPECTROMETER/DATA SYSTEM= spect
##.PULSE SEQUENCE= zg30
##.SOLVENT NAME= D2O
##.SHIFT REFERENCE= (INTERNAL, D2O, 0, 15.7039)
##AUDIT TRAIL= $$ (NUMBER, WHEN, WHO, WHERE, WHAT)
$$ ##TITLE= Audit trail, XWIN-NMR		Version 3.5
$$ ##JCAMPDX= 5.01
$$ ##ORIGIN= Bruker BioSpin GmbH
$$ ##OWNER= she
$$ F:/spectra/data/she/nmr/H-F/1/audita.txt
$$ ##AUDIT TRAIL=  $$ (NUMBER, WHEN, WHO, WHERE, WHAT)
(   1,<2021-06-02 12:23:39.71 +0400>,<she>,<DPX200>,
      <created by zg, POWCHK disabled, PULCHK disabled
       configuration hash MD5:
       00 E9 B6 7A A2 85 ED C7 34 08 36 98 17 FE 4E 26
       data hash MD5: 16K
       0E D1 EC B6 9E 59 8F 4A ED A5 EC 60 99 4D 27 95>)
$$ ##END=
$$ 
$$ hash MD5
$$ 9F 2C 3D CF 30 B6 BE 0E 16 C8 59 6E 8C CA 48 A5
##$RELAX= 
##$RELAX= 
##$RELAX= 
##$RELAX= 
##$RELAX= 
##$RELAX= 
$$ Bruker specific parameters
$$ --------------------------
##$DU= <F:/spectra>
##$EXPNO= 1
##$NAME= <H-F>
##$PROCNO= 1
##$TYPE= <nmr>
##$USER= <she>
##$AMP= (0..31)
100 100 100 100 100 100 100 100 100 100 100 100 100 100 100 100 100 100 
100 100 100 100 100 100 100 100 100 100 100 100 100 100 
##$AQSEQ= 0
##$AQ_mod= 1
##$AUNM= <au_zg>
##$AUTOPOS= <>
##$BF1= 200.13
##$BF2= 200.13
##$BF3= 200.13
##$BF4= 200.13
##$BF5= 200.13
##$BF6= 200.13
##$BF7= 200.13
##$BF8= 200.13
##$BYTORDA= 1
##$CFDGTYP= 0
##$CFRGTYP= 5
##$CHEMSTR= <none>
##$CNST= (0..31)
1 1 145 1 1 1 1 1 1 1 1 1 1 1 1 1 1 1 1 1 1 1 1 1 1 1 1 1 1 1 1 1 
##$CPDPRG= <>
##$CPDPRG1= <>
##$CPDPRG2= <>
##$CPDPRG3= <>
##$CPDPRG4= <mlev>
##$CPDPRG5= <mlev>
##$CPDPRG6= <mlev>
##$CPDPRG7= <mlev>
##$CPDPRG8= <mlev>
##$CPDPRGB= <>
##$CPDPRGT= <>
##$D= (0..31)
0 1.2 0 0 0 0 0 0 0 0.06 0 0.03 0 0 0 0 0.0002 0 0 0 0 0 0 0 0 0 0 0 0 
0 0 0 
##$DATE= 1622622219
##$DBL= (0..7)
120 120 120 120 120 120 120 120 
##$DBP= (0..7)
150 150 150 150 150 150 150 150 
##$DBP07= 0
##$DBPNAM0= <>
##$DBPNAM1= <>
##$DBPNAM2= <>
##$DBPNAM3= <>
##$DBPNAM4= <>
##$DBPNAM5= <>
##$DBPNAM6= <>
##$DBPNAM7= <>
##$DBPOAL= (0..7)
0.5 0.5 0.5 0.5 0.5 0.5 0.5 0.5 
##$DBPOFFS= (0..7)
0 0 0 0 0 0 0 0 
##$DE= 6
##$DECBNUC= <off>
##$DECIM= 32
##$DECNUC= <off>
##$DECSTAT= 4
##$DIGMOD= 1
##$DIGTYP= 9
##$DL= (0..7)
0 120 120 120 120 120 120 120 
##$DP= (0..7)
150 150 150 150 150 150 150 150 
##$DP07= 0
##$DPNAME0= <>
##$DPNAME1= <>
##$DPNAME2= <>
##$DPNAME3= <>
##$DPNAME4= <>
##$DPNAME5= <>
##$DPNAME6= <>
##$DPNAME7= <>
##$DPOAL= (0..7)
0.5 0.5 0.5 0.5 0.5 0.5 0.5 0.5 
##$DPOFFS= (0..7)
0 0 0 0 0 0 0 0 
##$DQDMODE= 0
##$DR= 18
##$DS= 0
##$DSLIST= <SSSSSSSSSSSSSSS>
##$DSPFIRM= 0
$$ [...]
##$SUBNAM2= <"">
##$SUBNAM3= <"">
##$SUBNAM4= <"">
##$SUBNAM5= <"">
##$SUBNAM6= <"">
##$SUBNAM7= <"">
##$SUBNAM8= <"">
##$SUBNAM9= <"">
##$SW= 16.9725357007746
##$SWIBOX= (0..15)
0 0 2 0 0 0 0 0 0 0 0 0 0 0 0 0 
##$SW_h= 3396.73913043478
##$TD= 16384
##$TD0= 1
##$TE= 0
##$TE2= 300
##$TE3= 300
##$TEG= 300
##$TL= (0..7)
0 120 120 120 120 120 120 120 
##$TP= (0..7)
150 150 150 150 150 150 150 150 
##$TP07= 0
##$TPNAME0= <>
##$TPNAME1= <>
##$TPNAME2= <>
##$TPNAME3= <>
##$TPNAME4= <>
##$TPNAME5= <>
##$TPNAME6= <>
##$TPNAME7= <>
##$TPOAL= (0..7)
0.5 0.5 0.5 0.5 0.5 0.5 0.5 0.5 
##$TPOFFS= (0..7)
0 0 0 0 0 0 0 0 
##$TUNHIN= 0
##$TUNHOUT= 0
##$TUNXOUT= 0
##$USERA1= <user>
##$USERA2= <user>
##$USERA3= <user>
##$USERA4= <user>
##$USERA5= <user>
##$V9= 5
##$VALIST= <valist>
##$VCLIST= <CCCCCCCCCCCCCCC>
##$VD= 0
##$VDLIST= <DDDDDDDDDDDDDDD>
##$VPLIST= <PPPPPPPPPPPPPPP>
##$VTLIST= <TTTTTTTTTTTTTTT>
##$WBST= 1024
##$WBSW= 4
##$XGAIN= (0..3)
0 0 0 0 
##$XL= 0
##$YL= 0
##$YMAX_a= 112375
##$YMIN_a= -87994
##$ZGOPTNS= <>
##$ZL1= 120
##$ZL2= 120
##$ZL3= 120
##$ZL4= 120
##$ABSF1= 10
##$ABSF2= 0
##$ABSG= 5
##$ABSL= 3
##$ALPHA= 0
##$AQORDER= 0
##$ASSFAC= 0
##$ASSFACI= 0
##$ASSFACX= 0
##$ASSWID= 0
##$AUNMP= <proc_1d>
##$AZFE= 0.1
##$AZFW= 0.1
##$BCFW= 1
##$BC_mod= 2
##$BYTORDP= 1
##$COROFFS= 0
##$CY= 11.3945322036743
##$DATMOD= 1
##$DC= 2
##$DFILT= <>
##$DTYPP= 0
##$F1P= 15.9154993809931
##$F2P= -4.1035820241983
##$FCOR= 0.5
##$FTSIZE= 0
##$FT_mod= 4
##$GAMMA= 1
##$GB= 0.15
##$INTBC= 1
##$INTSCL= 1
##$ISEN= 128
##$LB= 0.24
##$LEV0= 0
##$LPBIN= 0
##$MAXI= 10000
##$MC2= 0
##$MEAN= 0
##$ME_mod= 0
##$MI= 1.114404
##$NCOEF= 0
##$NC_proc= 0
##$NLEV= 6
##$NOISF1= 3.799351
##$NOISF2= 2.8
##$NSP= 1
##$NTH_PI= 0
##$NZP= 0
##$OFFSET= 15.70392
##$PC= 1
##$PHC0= -11489.11
##$PHC1= 18.00099
##$PH_mod= 1
##$PKNL= yes
##$PPARMOD= 0
##$PSCAL= 0
##$PSIGN= 0
##$REVERSE= no
##$SF= 200.130013532006
##$SI= 16384
##$SIGF1= 3
##$SIGF2= 2
##$SINO= 400
##$SIOLD= 16384
##$SREGLST= <1H.CDCl3>
##$SSB= 0
##$STSI= 0
##$STSR= 0
##$SW_p= 3612.71676300578
##$SYMM= 0
##$S_DEV= 0
##$TDeff= 0
##$TDoff= 0
##$TI= <>
##$TILT= no
##$TM1= 0
##$TM2= 0
##$TOPLEV= 0
##$USERP1= <user>
##$USERP2= <user>
##$USERP3= <user>
##$USERP4= <user>
##$USERP5= <user>
##$WDW= 1
##$XDIM= 8192
##$YMAX_p= 0
##$YMIN_p= 0
$$ End of Bruker specific parameters
$$ ---------------------------------
##NTUPLES= NMR FID
##VAR_NAME=  TIME,          FID/REAL,        FID/IMAG
##SYMBOL=    X,             R,               I
##VAR_TYPE=  INDEPENDENT,   DEPENDENT,       DEPENDENT
##VAR_FORM=  AFFN,          ASDF,            ASDF
##VAR_DIM=   8192,          8192,            8192
##UNITS=     SECONDS,       ARBITRARY UNITS, ARBITRARY UNITS
##FACTOR=    0.0002944,     1,               1
##FIRST=     0,             0,               0
##LAST=      2.4114304,     0,               0
##MIN=       0,             -87994,          0
##MAX=       2.4114304,     112375,          0
$$ Real data points
##PAGE= N=1
##DATA TABLE= (X++(R..R)), XYDATA
$$ [...]
2069E85Q37p73j225q09N20J498Q42o96j307o69J63J718R95q35j055r52J82J237
$$ 585 1422 649 -576 -1385 -865 633 1475 779 -528 -1197 -1034 684 1679 844 -211 -1163 -981 256
2087B56J187m34j300r08J59J430R35k89j187j084J84J265R38n6j237q40m1Q55
$$ 256 1443 1009 -291 -1199 -1040 390 1325 1036 -151 -1235 -1051 214 1152 1096 -141 -981 -1022 -167
2105a67J255O2j348j094L7J250R60R1r83j137K3Q32J279m9q15j253J41R12Q68
$$ -167 1088 1150 -198 -1292 -1255 -5 955 1046 63 -1074 -1051 -219 1060 1011 196 -1057 -916 -4 864
2124H64L66j000r34n09Q29R71L40m34j477j74Q47J000L67n59j107m73P32J011
$$ 864 1230 230 -704 -1213 -384 587 927 493 -984 -1158 -311 689 1056 497 -610 -1083 -351 660
2142F60O99n29j369l62M20J016P92m23j556o69M05J336P26l72j286o84M95R43
$$ 660 1359 830 -539 -901 -481 535 1327 904 -652 -1321 -916 420 1146 774 -512 -1196 -701 242
2160B42P07l27j018n87L85Q98Q07l43r47o36N7J010P35J0j273q81Q0J147J065
$$ 242 949 622 -396 -983 -598 300 1107 764 -183 -819 -762 248 983 993 -280 -1161 -1081 66 1131
2179A131j40j366o82K99R31Q92j46q73j016J8J289M72%m58r00n21R30Q01M31o58
$$ 1131 991 -375 -1057 -758 173 1065 919 46 -970 -952 337 809 809 351 -549 -1070 -140 661 1092 434
2199D34j269j87R79R58K23j085n35p21J245L51L13j67r16o86Q1J713L57q75j259
$$ 434 -835 -1022 -43 915 1138 53 -482 -1203 42 393 706 539 -377 -1063 -982 731 1088 213 -1046
2218a046L99J12Q54Q49p76p86q17P81J055J73l60q77m47N16P39N12l20r88n82
$$ -1046 -647 -535 319 1168 392 -394 -1211 -430 625 798 438 -439 -886 -370 369 881 561 -427 -1009
2237a009N06R37M65l25j121k33K53O40P78k91q04n11j5R27N88p2r17n73Q5Q07
$$ -1009 -503 434 899 574 -547 -780 -527 113 891 600 -204 -715 -730 197 785 713 -204 -777 -692 115
2257A15R43l00p37l30j25M37J036m44n30m57m03P78O45R2p48o22k63R51O59J13
$$ 115 1058 758 21 -309 -434 3 1039 595 65 -392 -795 -17 628 720 -28 -650 -913 38 697 810
2277H10o90q01q7N62P09K50n39q26k34O18Q92m0l31q26k86N71P19L82m89p90m76
$$ 810 120 -681 -768 -206 503 753 214 -612 -846 -228 664 624 293 -533 -819 -248 471 853 364 -426 -902
2298i02O21Q42K95o22o45m92O22O31L73m81o50l67L10O82P05m68r31j42J08O97
$$ -902 -281 561 856 234 -411 -903 -281 350 723 242 -408 -775 -465 217 922 454 -477 -619 -511 186
2318A86N47j18j011k61R4O68P53l95o77m33J19O31N90r8p45n89P1P07P61q8r24
$$ 186 733 615 -396 -657 -563 105 858 463 -214 -647 -528 103 693 595 -150 -739 -668 39 800 712 -212
2339b12m19q9Q33N09j19n45o85J20N13P15j65l11o83j14N12P83k7n38o05j84O06
$$ -212 -631 -720 113 622 503 -42 -727 -607 -94 621 456 145 -538 -652 -140 643 616 78 -527 -711 -105
2360a05O43J03n61o13m02P81O43K5k19p31k87O29N58K23k49p88m07M28Q34k7k65
$$ -105 538 641 80 -533 -935 -154 489 514 295 -436 -723 -94 464 687 438 -350 -757 -329 505 478 213
2381B13m48m67M23O53K32j89p74l30K51P42M61m52o67k53K47N50M97j74q26l98
$$ 213 -235 -702 -279 374 606 417 -357 -687 -436 306 767 315 -352 -605 -358 192 689 515 -311 -709
2401g09K45N31N24Lp06o11L51L66O63j66p02k10kK44J244m44r66q12M50P70N79
$$ -709 -464 67 591 594 -112 -723 -372 -6 657 491 -211 -421 -423 -179 1065 621 -345 -1157 -707 63 642
2422F42K39q90n80K23J85N58J76l86n81j13N97N66j48l65n33J09O2P43j45l08
$$ 642 881 -9 -589 -366 -181 377 553 167 -414 -527 70 636 488 123 -410 -301 -239 504 359 51
2442E1m38k87N11O55J60m79m93j34K16P86j87k42m52j85L42N17K72l48o80k74
$$ 51 -387 -674 -163 492 652 173 -320 -454 -238 548 361 119 -333 -518 -176 341 613 265 -415 -689
2462f89M38N88J23j74m54m73N44M02K57k41n15k82J99O17N9Q2o59l04O7M70M37
$$ -689 -251 337 460 286 -168 -641 -97 305 562 321 -194 -476 -277 340 399 481 -178 -482 -415 55 492
2483D92j66m20l45M7L97N06rp40l61K18M70M48N5o88k43j70O99M79o8n71m99K4
$$ 492 326 -94 -439 -392 5 511 502 -238 -599 -381 89 537 592 -96 -339 -509 190 669 601 30 -469 -445
2505d45L52M10J69m09m78mM06L72J98m91m91m9M65L70k4r9o62OK26N94R7l95n36
$$ -445 -93 317 486 77 -401 -405 1 373 571 80 -411 -460 5 375 351 252 -410 -404 -178 416 513 118 -418
2528d18n0J96N23K13m30m22j3P6N20J12J8n56j89J74O15L5k76l42k10K33L61K96
$$ -418 -468 -272 251 464 34 -388 -401 -325 195 307 325 -231 -420 -246 369 404 128 -214 -424 -191 170 466
2550D66k82m74j72J58N13K11k38k51m19M4O81K74k1m37m81J99L39L78k48l79l85
$$ 466 184 -290 -462 -304 209 420 182 -69 -488 -444 237 511 490 53 -428 -229 110 488 240 -139 -524
2571e24K18M33O7K59l65n50J36L61M41r2j93o03j60M03M55L8l13l73m0M03K88
$$ -524 -306 127 194 453 88 -462 -326 35 476 384 191 -412 -572 -169 286 324 11 -362 -402 1 289
2592B89n4m45P5k55J18N17j43j86j42p6L22P9Q7J92l71k31j27M85J09J2k86k71
$$ 289 235 -210 -135 -390 -272 245 102 -84 -226 -302 20 99 186 378 7 -224 -351 134 243 255 -31 -302
2614c02j14M31M89o43m8m40J40Q35j57k87Mm71M70M73L22j049K35k8m41P03M36
$$ -302 -416 15 504 -139 -187 -627 -487 348 191 -96 -92 -563 -93 380 702 -347 -112 -140 -581 122 558
2635E58n22q3q6o47R11J8k3J57p34L22jL65M14r29j8l08J042l0o08O5k76J37n2
$$ 558 36 -47 -133 -780 131 149 126 283 -451 -129 -130 235 649 -280 -298 -606 436 406 -202 -137 -413 -276 -328
2658c28P39j39k91j55J20l93J106j21n04l16N9M4L20L22m72m53J02M76J87J63
$$ -328 411 272 -19 -174 -54 -447 659 538 34 -282 -223 -179 141 463 -9 -462 -360 116 303 466
2678D66k54n23j58N05J15J90p8k92l67K86J69L27l9n23n2J60K85m6M0l23l4J9
$$ 466 212 -311 -469 36 151 341 263 -29 -396 -110 59 386 347 -176 -228 -68 217 171 211 -112 -146 -127
2700a27J82K18M6n41q6L7L66J59k62J0k20O5K72K02p1l28k05l5M49J05j32p5l14
$$ -127 55 273 319 -222 -308 -271 95 254 -8 2 -218 -153 119 321 250 -78 -283 -318 131 236 104 29 -285
2723b85l9K09L71n9k01k50O6L40L2kk00l06R8K06J82Q5k20m11j6M45LJ74j38k02
$$ -285 -324 -115 256 197 -4 -254 -188 152 184 182 -18 -324 -226 -20 162 247 27 -384 -400 45 48 222 84 -118
2747a18J82k14M27j15k20j58m3L35rJ07j57m24J64K19L7M30n88J96k81P6K14k6
$$ -118 64 -150 277 162 -58 -216 -259 76 67 174 17 -407 -243 -24 13 443 -145 51 -230 -154 60 34
2769C4Q2l36J7Q2j1R12q68r2K3j17K69K18l01k54k4L42N48O6q56J00j04j31M95
$$ 34 116 -220 -203 -121 -132 780 -88 -180 -157 -274 -5 213 -88 -342 -366 -24 524 590 -266 -166 -270 -401 94
2792I4J26N3m87j83K66J77N4J07j05l62o7M17o5J07k68o5j04L88Q3n3Jl10L0P6
$$ 94 220 273 -214 -397 -131 46 100 207 102 -260 -327 90 25 132 -136 -201 -305 83 166 113 114 -196 -166 -90
2816i0L57j24j09k46q0L12N1J06j33j48k26L17P8kK3k75j23L01J2K17n1l78J18
$$ -90 267 143 34 -212 -292 20 71 177 44 -104 -330 -13 65 63 86 -189 -312 -11 1 218 167 -211 -93
2839i3j00K48R1m7r5k43L31j48K46o1l55m6R5L25O2n1m16o8J34K29K08r7j63l48
$$ -93 -193 55 146 99 4 -239 92 -56 190 129 -226 -272 -177 148 210 159 -257 -325 -191 38 246 149 -14 -362
2863c62K95K30J74k23k53n2J02J76O6j24j5p4l3PK84j70J89m13n1K08K88m6qm24
$$ -362 -67 163 337 114 -139 -191 -89 87 153 29 14 -60 -93 -86 198 28 217 -196 -247 -39 249 203 195 -229
2887b29L70J95J73k57k25O4m22L77K7J13k70j60r6K36J84P4m0l96J24J2L08m5
$$ -229 141 336 509 252 27 91 -331 46 73 186 -84 -244 -340 -104 80 154 114 -282 -158 -146 162 117
2909A17j42P4k30J03J57J62k04r2k04K26N7J20l2j13o6k51L23J60j1k78k7O3Q7
$$ 117 -25 49 -181 -78 79 241 37 -55 -259 -33 24 144 112 -1 -67 -318 5 165 154 -124 -151 -88 -1
2932aJ99j20k46l5M6K05oO8j11j02o8K33K09k98k8j34J4K52L4r5L7j16l06M67
$$ -1 198 78 -168 -203 -157 48 42 110 -1 -103 -171 62 271 -27 -55 -189 -175 77 111 16 53 -63 -369 98
2956I8NO1j65k09M5J2L17P0k30j06M4RK31k4l73J20j22K88O3o1O1j68j56J17J84
$$ 98 103 164 -1 -210 -165 -153 164 234 4 -102 -58 -49 182 158 -215 -95 -217 71 134 73 134 -34 -190 -73 111
2981A11k2k8j43j3J47J89l0k7k54%J09O0R9l66j5Jq4J30L94j47k73J8j65M53k3
$$ 111 89 61 -82 -95 52 241 211 184 -70 -70 39 99 198 -168 -183 -182 -266 -136 258 111 -162 -144 -309 144 121
3006A21j37R1p1o6Q5O8n1q1m0O5M2O7L9o0k76M3K18K91k05r1k19nQ4K13Jr8j16
$$ 121 -16 75 4 -62 23 91 40 -41 -81 -16 26 93 132 72 -204 -161 57 348 143 52 -167 -172 -88 125 126 28 -88
3033h8o6K70j46J85p2r3j52J81R1p7j88J29R0p7J11K2r3k46K51k25J85K21k70
$$ -88 -154 116 -30 155 83 -10 -162 19 110 33 -155 -26 64 -13 98 120 27 -219 32 -193 -8 213 -57
3056e7m0Q8o3J84J28k24j06n4qK20N1p3j03n7j39N37k27lr4k06Q3J62R2m7j99
$$ -57 -97 -9 -72 112 240 16 -90 -144 -152 68 119 46 -57 -114 -253 284 57 54 -40 -246 -163 -1 91 44 -155
3081a55j34R2L91j19J83k71j36K5qK47k30J0N7O4k00M32k16j69L9j14K63rJ93
$$ -155 -289 -197 194 75 258 -13 -149 -124 -132 115 -115 -105 -48 16 -184 248 32 -137 -98 -212 51 42 235
3104B35k41l23P9J99J35j2L9k74K45k6j58K54j75kj81K16O7K59j68j27l17K14
$$ 235 -6 -329 -250 -51 84 72 111 -163 82 56 -102 152 -23 -25 -206 10 77 336 168 41 -276 -62
3126f2L6J11Q1j97j18J38N9Rl3j63N3oJ10Q3r1Pl47J53K83J62k0k80j87J60k2
$$ -62 -26 85 166 -31 -149 -11 48 57 24 -139 -86 -92 18 101 10 17 -330 -177 106 268 248 -32 -219 -59 -81
3151h1K63k46N8j58K2M07m0k56j03j82N4J02m0J75M2l29L98l82L67k10L7K61k44
$$ -81 182 -64 -6 -164 -142 265 225 -31 -134 -316 -262 -160 -200 -25 17 -312 86 -296 71 -139 -102 159 -85
3174h5K9R8O9l18MR5J04J73m3Qp7LqP7Qkj92j6K5J85K3j60K2r6O2J55o2m4j52
$$ -85 -56 42 111 -207 -203 -108 -4 169 126 134 57 60 52 129 137 135 -57 -73 -48 137 160 0 22 -74 -12 143 81 37 -115
3203a15l0J78j8L7r6No7P0J32q2j67K11j13j9N2J36j05p2r2J81o7o1K24k0j85
$$ -115 -145 33 15 52 -44 -39 -106 -36 96 14 -153 58 -55 -74 -22 114 9 -63 -155 26 -41 -102 122 102 -83
3228h3J25j02M0M2qk24J18Q1M9J19j56j15J11J89l8l6l3j92J1J41J47j73l1j80
$$ -83 42 -60 -20 22 14 -210 -92 -11 38 157 1 -114 -3 186 148 112 79 -113 -102 39 186 13 -18 -198
3252a98r3K36J50J5J0j40j84L06j5%Nj17j96J86K23J15k30k51J19Q6P7KP2k49
$$ -198 -291 -55 95 110 120 -20 -204 102 87 87 92 -25 -221 -35 188 303 73 -178 -59 27 104 106 178 -71
3276g1m9J23J35j86K78j89m8JR2r3J20j6l38J27J02J83r0j62p1J77L6j4j23J01
$$ -71 -120 3 138 -48 230 41 -7 -6 86 -7 113 97 -241 -114 -12 171 81 -81 -152 25 61 47 -76 25
3300B5j31K3O2R4n8J5j41MJ31O6j1o3j79N7J39qj2jn9PP2n8J89j77j30o4J93L1
$$ 25 -106 -83 -21 73 15 30 -111 -107 24 90 79 16 -163 -106 33 25 13 12 -47 -40 32 -26 163 -14 -144 -208 -15 16
3328A6J01o7j19j47m6K25Q4K0j48M0r3K47L3j67P8j5j88Q6K53j25j59l0J05M8
$$ 16 117 50 -69 -216 -262 -37 47 67 -81 -41 -134 113 146 -21 57 42 -146 -60 193 68 -91 -121 -16 32
3352C2P4q5K7k9j29R0J84m0k6k20J29O9j4q8K9j87J23K00m0o4j6k04K11p5l1K27
$$ 32 106 21 48 19 -110 -20 164 124 98 -122 7 76 62 -26 3 -184 -61 139 99 35 19 -185 26 -49 -80 147
3378A47k15j03O9M9K08R5j39k22m3J87o2K11l5k84J26j5J76l4o4j85J31j17J54
$$ 147 -68 -171 -102 -53 155 250 111 -111 -154 33 -29 182 147 -137 -11 -26 150 116 52 -133 -2 -119 35
3401C5R5r6n0r3M5J61K2l8j42j98K11m3L53j7k78p2jJ06J05K2k82K7J12J23l0
$$ 35 130 34 -16 -109 -64 97 119 81 -61 -259 -48 -91 262 245 -33 -105 -106 0 105 127 -155 -128 -16 107 77
3426G7R3j86j5j47J98O8j2j36m1j83K11O3Q9j47K0j30j0J42R4O2k08j27J34M6
$$ 77 170 -16 -31 -178 20 88 76 -60 -101 -284 -73 -10 79 -68 -48 -178 -188 -46 48 110 -98 -225 -91 -45
3450d5K09j16j44M2j0K22o4Q3k04j84J54Q3K18k78N9j88J32J81J7l30K1J62j36
$$ -45 164 48 -96 -54 -64 158 94 177 -27 -211 -57 26 244 -34 25 -163 -31 150 167 -163 -142 20 -116
3473a16L42j37qj54P0L8M5o5M7k02J8L5K29k0j58j5k3J08j34K53p0j15k6p1J28
$$ -116 226 89 81 -73 -3 35 80 15 62 -140 -122 -87 142 122 -36 -51 -74 34 -100 153 83 -32 -58 -129 -1
3498aJ88k07k2p0%O4J29jK7j26o9J3J37l4L0j48J9R3J18m4q2l5p9J23O2o5J03
$$ -1 187 -20 -42 -112 -112 -48 81 80 107 -19 -88 -75 62 28 58 -90 -71 22 140 96 14 -21 -100 23 85 20 123
3525A23k03K3J9L5J36n8k34K12j2J76k90J23k29Q2K05j99J86k01J19n2j7j6J73
$$ 123 -80 -57 -38 -3 133 75 -159 53 41 217 -73 50 -179 -97 108 -91 95 -106 13 -39 -56 -72 101
3548A01j45O7n9j8p2J86p6k3j9j8J93n5L4o4j51n2J23J37J6k62p8K00J49j50R2
$$ 101 -44 23 -36 -54 -126 60 -16 -39 -58 -76 117 62 96 32 -119 -171 -48 89 105 -157 -235 -35 114 -36 56
3573E6j02k22J68M9K13j8k95q3J26Q2J33m5k46J66p9O0J07Qj62o2j14K10R9oK2
$$ 56 -46 -268 -100 -51 162 144 -151 -234 -108 -26 107 62 -184 -18 -97 -37 70 78 -84 -146 -260 -50 49 43 65
3598F5j59L2r0K96k06J19r1p2R0qL1M6P7k09J70j3m2L6j35k24K50l8K10o2j86
$$ 65 -94 -62 -152 144 -62 57 -34 -106 -16 -24 7 53 130 -79 91 78 36 72 -63 -287 -37 -75 135 73 -113
3623a13LJ1J90l8K0j18r4LK83Oo5p5j85L30k37K65p5K8k95n4L25O0N0k82l6J22
$$ -113 -110 -99 91 53 73 -45 -139 -136 147 153 88 13 -172 158 -79 186 111 139 -156 -210 115 175 225 -57 -93 29
3649B9J80k60K60o5l70J09j26K29M02j84k99O20j93j52j08QL23o69N65m4K45q6
$$ 29 209 -51 209 144 -226 -117 -243 -14 388 204 -95 525 332 180 72 80 403 -266 299 255 500 414
3671D14o30J84K22r0p48Q87k27j5N28p75N0K68k46j10J1K21M88m82K06M23l80
$$ 414 -216 -32 190 100 -648 239 12 -3 525 -250 -200 68 -178 -288 -277 -56 432 -50 156 579 199
3692A99j22N44p90K32N5k4l48M49o6k25j13j2J78j54J20j3m6J19k19K09q7J33
$$ 199 77 621 -169 63 118 94 -254 195 129 -96 -209 -221 -43 -197 -77 -90 -136 -17 -236 -27 -114 19
3714A9j02K0l7J39R4j9k53j13L32q5J64j01j26k01J85J83O0k25K7p4P7J74j14
$$ 19 -83 -63 -100 39 133 114 -139 -252 80 -5 159 58 -68 -269 -84 99 159 -66 -39 -113 -36 138 24
3737B4J57l13o3K33l0J09q3k33K6P8J20K32j91q3j64K55K09n5j09l51LJ72J90
$$ 24 181 -132 -195 38 8 117 34 -199 -173 -95 25 257 66 -17 -181 74 283 228 119 -232 -229 -57 133
3760A33m9lm1k36K03O9R3q7q0j28j16L73j36Ln4q3j3K64j14J72j40j32m1J69P9
$$ 133 84 81 40 -196 7 76 169 82 2 -126 -242 131 -5 -2 -56 -139 -152 112 -2 170 30 -102 -143 26 105
3785A05p8r1J36j85Q0J69q8l3M6r0M9K4R8j19k4k61J24L75N8j51o68L96Q9J88
$$ 105 27 -64 72 -113 -33 136 48 15 61 -29 20 44 142 23 -1 -262 -138 237 295 144 -524 -128 -39 149
3809A49J26n43K96j74J88M39n6K38o63OP6n42N39l31L66RQ1k50J02j63M82n43
$$ 149 275 -268 28 -146 42 481 425 663 0 6 82 -460 79 -252 114 123 204 -46 56 -107 375 -168
3831a68J96J17j08L0k78K00J25N31m50k52l48K67J24J21j68K52j67k93J44Q7K08
$$ -168 28 145 37 67 -211 -11 114 645 195 -57 -405 -138 -14 107 -61 191 24 -269 -125 -38 170
3852A70lj16K8j22P6J24R2m62J34n7J44Q9o9K5r2j8J56p0j8p4r6J5J43J86k21
$$ 170 167 51 79 -43 33 157 249 -213 -79 -136 8 97 28 53 -39 -57 99 29 11 -63 -159 -144 -1 185 -36
3877c6k4l0O8L9M6N1o8j28j15J55J78p0p2LP6k04R6K09j54n8k25K67nO6k0Ok78
$$ -36 -60 -90 -22 17 63 114 46 -82 -197 -42 136 66 -6 -3 73 -131 -35 174 20 -38 -263 4 -1 65 45 51 -227
3904b27J75K14j83M5j85J6K0K83o4j39Jj84J65J57j7r5k2P1j06K8K82j70k41J79
$$ -227 -52 162 -21 24 -161 -145 -125 158 94 -45 -44 -228 -63 94 77 -18 -40 31 -75 -47 235 65 -176 3
3928Cq6J23L1Nj37k15R3J49J19m1r0p1J9M1K04O1l27JL2N3J54p0p7L5j55P0K97
$$ 3 -83 40 71 76 -61 -276 -183 -34 85 44 -46 -117 -98 -57 147 208 -119 -118 -86 -33 121 51 -26 9 -146 -76 221
3955B21j89nq9j32J59N3K43k71Nq0P5K8J14k53j27K14k9K86o8k32K7M4L8p0K59
$$ 221 32 27 -62 -194 -35 18 261 -10 -5 -85 -10 18 132 -121 -248 -34 -63 223 155 -77 -50 -6 32 -38 221
3980B21k21j92O6K11p4K37k78m6r1J34N0N8Q3j65L1j26J89R4j00j41n3J32j78
$$ 221 0 -192 -126 85 11 248 -30 -76 -167 -33 17 75 158 -7 24 -102 87 181 81 -60 -113 19 -159
4003a59L10J6k43K1r5L6K78l2j00k95O0K07J16L1j31p5q2K72r4j2mj69jJ08R1
$$ -159 151 167 -76 -55 -150 -114 164 132 32 -263 -203 4 120 151 20 -55 -137 135 41 29 25 -144 -145 -37 54
4028E4M2k42j8L5K87o0p0J9j25k00M01o5J66j51l32R5L3L21J6l3j37k38M8J16
$$ 54 96 -146 -164 -129 158 98 28 47 -78 -278 123 58 224 73 -259 -164 -131 190 206 173 36 -202 -154 -38
4052c8R4o1p6l31K27L95k04J29j10j94K3K70k16j4o6J2K18P8j3J13m45K16k32
$$ -38 56 -5 -81 -412 -185 210 6 135 25 -169 -146 124 -92 -106 -172 -160 58 136 123 236 -209 7 -225
4075b25K65J62Jl80j54M58l65M82L21p12R7j7J74m6J39j84q8L0j3K17R7J08o49
$$ -225 40 202 203 -177 -331 127 -238 244 565 -147 -50 -67 107 61 200 16 -72 -42 -55 162 259 367 -282
4098b82K22J02k74P83n92J90l02P1M75r9n53J4L28j00k45N2N79o38K9L31j64K24
$$ -282 -60 42 -232 551 -41 149 -153 -82 393 294 -259 -245 83 -17 -262 -210 369 -269 -240 91 -73 151
4120A51J55m15l53M21LJ34K40p26J86J64R1K76j13j12L97j76R2j7m19j54pK61
$$ 151 306 -109 -462 -41 -38 96 336 -390 -204 -40 51 327 214 102 499 323 415 398 -21 -175 -182 79
4142G9Q2k14k05L19p3n8pM3k2q0j05L34J01k18k5K6j75J35K77o4k44J28l8k23
$$ 79 161 -53 -258 61 -12 -70 -77 -34 -56 -136 -241 93 194 -24 -49 -23 -198 -63 214 150 -94 34 -4 -227
4166b27J61K50m1r2j88k0R1J23O4J6m65J93L37j83K4k73J17j8J75P9L5j23l08
$$ -227 -66 184 143 51 -137 -157 -66 57 121 137 -328 -135 202 19 43 -230 -113 -131 44 123 158 35 -273
4189b73Q7J45L5P7j5j16j17J16J65N9k25j17J2J42J33q1l4j76M3R2J21L6L8l77
$$ -273 -186 -41 -6 71 56 -60 -177 -61 104 163 -62 -179 -167 -25 108 27 -7 -183 -140 -48 73 109 147 -230
4213b30K00OJ1K44j73k29Q4oK44N3j99l30J60N9J85J49k16jl73L09J21J84k54
$$ -230 -30 -24 -13 231 58 -171 -87 -93 151 204 5 -325 -165 -106 79 228 12 11 -362 -53 68 252 -2
4236bM9j79M2J80J22r8l72oJ97J09K37j68j77k5q8J87J37m5k57r6J42J68M2l1
$$ -2 47 -132 -90 90 212 114 -258 -264 -67 42 279 111 -66 -91 -179 8 145 100 -157 -253 -111 57 99 68
4260F8j47o4k5J16K93j04j52j02k19M05l6J24l9k23J11J12P3o0k66p8O5K11N3
$$ 68 -79 -143 -168 -52 241 137 -15 -117 -336 69 33 157 118 -105 6 118 191 131 -135 -213 -148 63 116
4283A16k4j86J1j18K19rn3J00j87m6N8K26R3k70p9n0K00L8M1J8k96R8j19K93K13
$$ 116 92 -94 -83 -201 18 9 -44 56 -131 -177 -119 107 200 -70 -149 -199 1 39 80 98 -198 -100 -219 74 287
4308B87l82K48k40J44Q9J3n8k18P9Q4O5m2Q3l73l9K21J71p4J9j46n2M5J09J39
$$ 287 -95 153 -87 57 146 159 101 -117 -38 46 111 69 152 -221 -260 -39 132 58 77 -69 -121 -76 33 172
4332A72j12j36j16l1L49L6Q1k98j95K42o2K39m1k28j6l5K55j7M5j47k23Q2K47
$$ 172 60 -76 -192 -223 126 162 243 -55 -250 -8 -70 169 128 -100 -116 -151 104 87 132 -15 -238 -156 91
4355I1R8N2j50j95j19J40K65n0r2k88Q9K05J17J16k80j65k1J36J50J75j87j95
$$ 91 189 241 91 -104 -223 -83 182 132 40 -248 -159 46 163 279 -1 -166 -187 -51 99 274 87 -108
4377a08j07J80K01J48k26j43j27J69Q0J60k8k85Om8L17L0r1j74j60J21L44j11
$$ -108 -215 -35 166 314 88 -55 -182 -13 67 227 199 -86 -80 -128 189 219 128 -46 -206 -85 259 148
4399A48k1k77j08J86R2J59j50J2k26Q0R9K21l0l28m4J31M5J74k3k62l6N9K88j12
$$ 148 127 -150 -258 -72 20 179 29 41 -185 -105 -6 215 185 -143 -187 -56 -11 163 140 -122 -158 -99 189 77
4423G7N4k05j55J63J22R3N8k53k32O9K48Q5L9k10j26J18J10J12n7j15j95r4K17
$$ 77 131 -74 -229 -66 56 149 207 -46 -278 -209 39 124 163 -47 -173 -55 55 167 110 -5 -200 -294 -77
4446g7K27J11r4l88j70M95jJ07k20j72Q4N3J39K42k68l16P4K12J02n6M7k60lJ15
$$ -77 150 261 167 -221 -391 104 103 210 -10 -182 -98 -45 94 336 68 -248 -174 38 140 84 131 -129 -132 -17
4470a7J64r9K1k64j65J46K26K00k15j7l04J46J97J66M3k21k79M6K74J93j2k22
$$ -17 147 48 69 -195 -360 -214 12 212 -3 -20 -324 -178 19 185 228 7 -272 -226 48 241 229 7
4492Gk31pL77M7j9k79j99J57L48N2j05j34j33j30J52L56j37k50j74k8J90K72j10
$$ 7 -224 -231 146 193 174 -105 -304 -147 201 253 148 14 -119 -249 -97 259 122 -128 -302 -330 -140 132 22
4515B2j43k2M3O0K85p4j03l45m5L07K43nl12n6k22K89J90P0k3k80j79L38J12J25
$$ 22 -121 -143 -100 -40 245 171 68 -277 -322 -15 228 223 -89 -145 -367 -78 112 182 159 -121 -300 38 150 275
4539B75k37l8m36L47J26K85k77k00o8R6K31n7P8k58k96L00J73J34r1j41j5k68
$$ 275 38 0 -436 -89 37 322 45 -155 -223 -127 104 47 125 -133 -429 -129 44 178 87 -54 -69 -337
4561c37M19K82l17j04l24J03M14J41J50l16l41J30J35M57l48j64m97K26L97n9
$$ -337 82 364 47 -57 -381 -278 136 277 427 111 -230 -100 35 492 144 -20 -517 -291 106 47
4581D7j27j69n9lN00o7L09m86j17K53l84P63k75k27p42M13J26M34Q9J8m52q9j18
$$ 47 -80 -249 -308 -311 189 122 431 -55 -172 81 -303 460 185 -42 -784 -371 -245 189 278 296 -156 -245 -363
4604c63O83l91J09K76m31j80K29N39n50k7J3K40oq8p0K66n38RN21J97l83k17j27
$$ -363 320 -71 38 314 -117 -297 -68 471 -79 -106 -93 147 141 53 -17 249 -289 -280 241 438 55 -162 -289
4627b89K76j59K93Mm08j94M88J09L8k6k44n44P02M59m5j89n62J62k16N39J27k02
$$ -289 -13 -172 121 125 -283 -477 11 120 158 132 -112 -656 46 505 460 271 -291 -129 -345 194 321 119
4649A19l81n9K21K41j5k07l52J77K12j24N99r3m65R0l9J01J16M06o87k83KJ74
$$ 119 -262 -321 -100 141 126 -81 -433 -256 -44 -168 431 338 -127 -37 -76 25 141 547 -140 -423 -421 -247
4671b47N76k15k23lo2R9PM25k06m37n9M00L69J20n68l86l8P44j04J17l74j73Q2
$$ -247 329 114 -109 -112 -174 -75 -68 357 151 -286 -345 55 424 544 -24 -410 -448 296 192 309 -65 -238 -156
4694a56M61j14L43m36Lk50O2K85k27L25n60o0M86K18K53o21l53J36m1L08M42l37
$$ -156 305 191 534 98 101 -149 -87 198 -29 296 -264 -324 162 380 633 12 -341 -205 -246 62 504 167
4716A67m22J3L3J49N84l31rp63M80L17Lj46j89n93M84K34M39l73n84J16L44N6
$$ 167 -255 -242 -209 -60 524 193 184 -579 -99 218 221 75 -114 -707 -223 11 450 77 -507 -391 -47 9
4738IK19m19j79K84k0O74l95L97q40J6N7O06N78j310O29n11l57P25K47j01m58
$$ 9 228 -191 -370 -86 -106 568 173 570 -270 -254 -197 409 987 -323 306 -205 -562 163 410 309 -149
4759a49J6j13L14J4N1m44j21m9k24J002K28K38j277j6L3L26N77m43m96L78J74
$$ -149 -133 -246 68 82 133 -311 -432 -481 -705 297 525 763 -514 -530 -497 -171 406 -37 -533 -155 19
4780A9L02M19p03K45m91P1J23M54n54J06K96n3R3K88j108N81n58L64J91n69Q80
$$ 19 321 740 37 282 -209 -138 -15 439 -115 -9 287 234 327 615 -493 88 -470 -106 85 -484 396
4801C96l60j50Q3O0M32k77k37j25r25R30M16k62J73n38j98N32L17M95m91l89m35
$$ 396 36 -114 -31 29 461 184 -53 -178 -1103 -173 243 -19 154 -384 -582 -50 267 762 271 -118 -553
4822e53J027Q7J94j049k8k37R58K04l67J7k79j97KKO86k36k97k36L11K98j88j73
$$ -553 474 561 755 -294 -322 -559 399 603 236 253 -26 -223 -221 -219 467 231 -66 -302 9 307 119 -54
4844e4l39j73M80K16M12n03m47nK55L1N56o12Q9k38P4P81j36J4n88L53p84P73
$$ -54 -393 -566 -86 130 542 39 -408 -413 -158 -127 429 -183 -94 -332 -258 523 387 401 -187 166 -618 155
4866A55K34k32k65k94K47K31K6k5j14n15L13P05r1J12p43N5o7P02n24R1j89o9
$$ 155 389 157 -108 -402 -155 76 102 77 -37 -552 -239 466 375 487 -256 -201 -268 434 -90 1 -188 -257
4888b57J51L6R2J89l78k05L57k5O57k70q18J50J35pL94K07l00o95K5J77O85N2
$$ -257 -106 -70 22 211 -167 -372 -15 -40 617 347 -471 -321 -186 -193 201 408 108 -587 -562 -385 300 352
4910C52j31o50K82N61nm3m66j68o6L80K52M8k74m54r1L93M13n8k43m70N4R1N12
$$ 352 221 -429 -147 414 409 366 -100 -268 -334 46 298 346 72 -382 -473 -80 333 275 32 -438 -384 -293 219
4933B19J99m06k72K1J81M26j23j31m52j1J75K75J34j12j68m15J83L94K26k06j88
$$ 219 418 12 -260 -239 -58 368 245 114 -338 -349 -174 101 235 123 -45 -460 -277 117 343 137 -51
4954e1n13L39L27J60J8l63l21J87L71K67j33l52j26m3K57L76k73j48k91P8L60
$$ -51 -564 -225 102 262 280 -83 -404 -217 154 421 288 -64 -190 -233 24 400 127 -21 -312 -234 126
4975A26N7R7m24j52jN59R9p5k61l58J36K54J32J11k96m08J66J95K90J32l08l60
$$ 126 183 280 -144 -296 -297 262 361 286 25 -333 -197 57 189 300 4 -404 -238 -43 247 379 71 -289
4997b89j19K73N17j57k18j37k41J20M42J21j33l72j15J69L40K29l57l52m1K05
$$ -289 -408 -135 382 225 7 -130 -371 -251 191 312 179 -193 -308 -139 201 430 73 -279 -320 -115
5017a15L87J32k47l53j78L04K98K46l36l37j72q2M74L85k31m07q3Q0J58N60k75
$$ -115 272 404 157 -196 -374 -70 228 474 138 -199 -371 -453 21 406 175 -232 -315 -235 -77 483 208
5038B08k73k03j1L26M47k52l27j70j43O04J39j51m30l7J66J59L26P3o16k8j26
$$ 208 -65 -268 -279 47 494 242 -85 -255 -398 206 345 194 -236 -273 -107 52 378 451 -165 -193 -319
5059c19L68M77k55l25k53K9L41J22O3l40j89j24K81N09j20j31l93m3N7O23j6k24
$$ -319 49 526 271 -54 -307 -278 63 185 248 -92 -281 -405 -124 385 265 134 -259 -302 -245 378 362 138
5081A38k64k71L89L65M1l30k81j12J5O16mk02l63k9J79L91R1k45k21m15M37L43
$$ 138 -126 -397 -8 357 398 68 -213 -325 -310 306 302 100 -263 -292 -113 278 369 124 -97 -512 -75 268
5103B68J01r3l82l07K06K19L86l50j09l30L07J10L99j55l51j42M8L78R3p2m08
$$ 268 369 276 -106 -413 -207 12 398 48 -61 -391 -84 26 425 270 -81 -223 -175 203 296 224 -184
5124a84r8j67M44K79N6m60l77K7N99J80K6l20l38R6L76J49m4m77n4j2K08N41j15
$$ -184 -282 -449 -5 274 330 -130 -507 -480 119 299 325 5 -333 -237 139 288 244 -233 -287 -299 -91 450 335
5147C35l51k25PJ32M35P1m65l29J13L06K89k6j74m23j0K54L49Ol00j45j72L77
$$ 335 -16 -241 -234 -102 333 404 -61 -390 -277 29 318 292 118 -305 -315 -61 288 294 -6 -151 -323 54
5169E4J64J92j04n95k04K18N17j7p8m10q4K40K72K82k00m04l45L37M99K25l03
$$ 54 218 410 306 -289 -493 -275 242 225 147 -263 -347 -107 165 447 247 -157 -502 -165 334 559 256
5190B56m54j79K29K43K12j83l89j22J35K99L89r0m48m30K73L69L12lm05l74k3
$$ 256 -198 -377 -148 95 307 124 -265 -387 -252 47 436 346 -102 -532 -259 110 422 419 14 -360 -383
5211c83L18L40L4l89k29p8K78N27k49k35k49l5K16N06l0j95m01k4L75J71N9j19
$$ -383 -65 275 309 -80 -309 -387 -109 418 169 -66 -315 -350 -134 372 342 147 -254 -278 97 268 327 208
5233B08m29l06L92L91J58m76k71j1K45O08k6l47m33j13L70K64J18l11l29j12J65
$$ 208 -221 -527 -135 256 414 -62 -333 -344 -99 509 483 136 -297 -410 -40 224 342 31 -298 -410 -245
5254b45L48K46l03l75j52L15M15R7j25l32k65J94L43J14L2n21l01M44K12L45k37
$$ -245 103 349 46 -329 -481 -166 249 346 221 -111 -376 -182 161 275 307 -214 -515 -71 141 486 249
5275B49n84l3J59K23L76r2l97k61P1K66K72l8k86k89J2L03L68k4m11k55J96L82
$$ 249 -335 -368 -209 14 390 298 -99 -360 -289 -23 249 211 -75 -364 -352 -49 319 295 -116 -371 -175 207
5297B07o0K57l52m66k6N04L07p1m12j64j02L06M68p0l28m14J06L30L06k2k76l58
$$ 207 147 404 52 -414 -440 64 371 300 -112 -276 -378 -72 396 326 -2 -416 -310 20 326 304 28 -330
5319c30K2K06L44R8l32k48j55J29M81K82l55k33k37J07O36l3l77j24l72J73N44
$$ -330 -308 -102 242 340 8 -240 -395 -266 215 497 142 -91 -328 -221 415 382 5 -119 -491 -318 226
5340B26P3p0n20j66J65M67J51j29l32k03J59L09K13p8m17l13K86L20K33J8n28
$$ 226 299 229 -291 -457 -292 175 326 197 -135 -338 -179 130 343 265 -152 -465 -179 141 374 392 -136
5361a36j63K0L03L77P6o40j92J43M13J5J48j82m49j59N14K43M1k77l21%K10L18
$$ -136 -299 -279 24 401 477 -163 -355 -212 201 216 364 182 -267 -426 88 331 372 95 -226 -226 -16 302
5383C02P3m31k63j33N52K21J06m10n16K23L41K60J67n92m12M47l0M38L0k06l54
$$ 302 375 -56 -319 -452 100 321 427 17 -499 -276 65 325 492 -100 -512 -65 -95 343 373 167 -187
5404a87j01K33M43j27j03l94k66L32N89j02j33m80rP0N15O0k40l27j60J95L28
$$ -187 -288 -55 388 261 158 -236 -502 -170 419 317 184 -296 -305 -235 280 340 100 -227 -387 -192 136
5425A36J98q1l51l99M12M04K67k47n15L2j19K90R5J46k53q15Q14j91N06l30L35
$$ 136 334 253 -98 -497 -85 319 586 339 -176 -144 -263 27 122 268 15 -800 14 -177 329 -1 334
5446C34j066L02K23L5P08o52n6K48l1P2N79o76m94M6L92J96J74n30l3r8K30O31
$$ 334 -732 -430 -207 -172 536 -116 -172 76 45 117 696 20 -474 -428 -36 160 334 -196 -229 -327 -97 534
5468E34q6n06K2n66P28k94O24l78n38o1M02O10K31o01n49k00Q25r6j05L57j163
$$ 534 448 -58 -36 -602 126 -168 456 78 -460 -521 -119 491 722 121 -428 -628 197 101 -4 353 -810
5489h10R18n56O37O15p73l82l65Q26K01L92m12o19K4Q1Q68k31Kp86n50P31L93
$$ -810 108 -448 189 804 31 -351 -716 110 311 703 291 -328 -304 -223 645 414 416 -370 -920 -189 204
5510B04j6K91o70l23j55J578n86Q9q12J30M87j18K61p7j90l00J13O22L68m0l16
$$ 204 188 479 -191 -514 -669 909 323 412 -400 -270 217 99 360 283 93 -207 -94 528 896 856 540
5531E40k15r05P06R3j89r7J15n23O11K07j3o37k78K46L00N94l16o3n38K05m5M78
$$ 540 325 -580 126 219 30 -67 48 -475 136 343 330 -307 -585 -339 -39 555 239 176 -362 -157 -202 276
5553B76P6m54j52l63M01L93K8J32q23J73L92L5J70m66k73P2M24q0M18o6r12L52
$$ 276 352 -102 -254 -617 -216 177 205 337 -486 -313 79 114 284 -182 -455 -383 41 -39 379 313 -599 -247
5575b47L06Q3K69l9p83m8K92K54O02p06R6q57N49O04M27m30p03l34L64M05K80
$$ -247 59 142 411 372 -411 -459 -167 87 689 -17 79 -778 -229 375 802 372 -331 -665 -301 104 384
5596C84J69p23k69K69K66M84l21k81o96L77R55l28J54n96l13N62l83Q90k04o96
$$ 384 553 -170 -439 -170 96 580 259 -22 -718 -341 614 286 440 -156 -469 93 -290 600 396 -300
5616c00l13K5N79M34j26r4m46j77M98NJ78J12r02K41K73M13J48m19k63o00O98
$$ -300 -613 -588 -9 425 299 205 -241 -418 80 85 263 375 -527 -286 -13 400 548 129 -134 -734 -36
5637c6RQ65n92l92m81J24N37N32p84j12l85J0P37L55j52p36J04L66N89k59j61
$$ -36 -27 838 246 -146 -627 -503 34 566 -218 -330 -715 -705 32 387 235 -501 -397 -31 558 299 138
5658A38k05P3j31M87r1J6k12m86L01K17M45m19k16n48K70N07L66k96l18l35J68
$$ 138 -67 6 -125 362 271 287 75 -411 -110 107 552 133 -83 -631 -361 146 512 216 -102 -437 -269
5679b69L99L53j45l16m18k8N72M5K10l78m08k1M47L52p7k38o45M10k1M32J90k66
$$ -269 130 483 338 22 -396 -424 148 193 403 25 -383 -404 43 395 318 80 -565 -155 -176 256 446 180
5701A80l40m09N50L69M0j75p52p3L30O95K41l61m21O5J90J33O1k25l78j55L76
$$ 180 -160 -569 -19 350 390 215 -537 -610 -280 415 656 295 -126 -61 129 262 323 98 -280 -435 -59
5722e9K38J84j66l74j91K34M40J38k37l62l39L72K90J56k5m97p8J06K24M26k36
$$ -59 179 363 197 -177 -368 -134 306 444 207 -155 -494 -122 168 324 299 -198 -276 -170 54 480 244
5743B44l30k94K75K81J60jn38k02M1M65L02j61l27l50J06N27j9Q0l68l82J72M03
$$ 244 -86 -380 -105 176 336 335 -203 -405 -364 101 403 242 -85 -435 -329 198 179 259 -109 -491 -319 84
5765H4M40k34n25j27p7N04K49m3l03k32o9K98M43j61l18k24j80L11M26K45m54
$$ 84 524 290 -235 -362 -439 65 314 271 -32 -264 -333 -35 408 247 -71 -295 -475 -164 262 507 53
5786E3n06Q6L43M20J13m84l15j01K70M54m4j05n49l2M07K85J77k43m86k63M39
$$ 53 -453 -367 -24 396 509 25 -290 -391 -121 333 289 184 -365 -397 10 295 472 229 -257 -520 -81
5807h1K39K10q6m37j31J4N20J08r0n33k2K19L94R9j78l78k79J75M73r7Jk96k44
$$ -81 158 368 282 -155 -286 -272 248 356 266 -267 -289 -70 324 423 245 -133 -412 -237 236 139 140 -156 -400
5830d00K03L52K90j72l61l94J42N07K94K0o92j05l5L71K13J52n49j91nL45L23
$$ -400 -197 155 445 273 -88 -482 -340 167 461 481 -211 -316 -351 20 233 385 -164 -355 -360 -15 308
5851C08J39m69l18P9J65N17qm09k87j35L44N66p4k27n29j08L04M48J66m18l86
$$ 308 447 -22 -340 -261 -96 421 413 4 -283 -418 -74 492 418 191 -338 -446 -142 306 472 54 -332
5872c32j04L03L98K74m83k22l07L30N07P6l17m77k42K15N89K38k92m34j30K01
$$ -332 -436 -133 265 539 56 -166 -473 -143 364 440 123 -354 -596 -381 208 446 154 -280 -410 -209
5892b09M83J94l41l64k79K72M31K44k12l80o9k2M87O1k5n46j13J19M33K73k50
$$ -209 274 468 127 -237 -516 -244 187 431 219 -161 -230 -252 235 296 271 -275 -388 -269 164 437 187
5913A87l06k54m7M72L19n2n14k78k8N25N85k60l14k85j65L85M00K7n27k33M1M58
$$ 187 -119 -373 -420 52 371 319 -195 -473 -501 24 609 349 35 -250 -415 -30 370 397 -130 -363 -322 136
5935A36L04j21l15k44j50K67N10K9m76l25J38N7P41k07k26k83j84J95L93K05m43
$$ 136 440 319 4 -240 -390 -123 387 416 -60 -385 -247 -190 551 344 118 -165 -349 -154 239 444 1
5956Aj81j41J95N07j9k99l40j63K22M58J45k38m26l08L64M85J86j71m08l81J90
$$ 1 -180 -321 -126 381 362 63 -277 -440 -218 240 385 147 -279 -587 -223 262 448 277 -131 -512 -322
5977c22M94K15k28l95l47L69M34J27K9n02k02M3K89M08q5l69l52J61J42L98l3
$$ -322 172 387 159 -236 -583 -214 220 347 376 -126 -328 -285 4 412 327 -42 -394 -233 -91 307 274
5998B74l42m69PP09K84j65l09l83j11N31L03j8m57l33J04M42J90K3k59m45j3N88
$$ 274 -68 -537 -530 179 463 298 -11 -394 -505 26 329 311 -146 -479 -375 67 257 280 21 -424 -437 151
6020A51L04J4m47m15j07M83L72k6k25n81J68K12M48J23k28m90j84M05J81L15k92
$$ 151 455 469 22 -393 -500 -17 355 329 104 -477 -309 -97 351 474 246 -244 -428 -23 158 473 181
6041A81n38M4J32M06J47l46k62k46J65O07J73j34m75k78K01N01J95k50l21j47
$$ 181 -357 -313 -181 225 372 26 -236 -482 -317 290 463 329 -146 -424 -223 278 473 223 -98 -245
6061b45K2L74K27j69l16m12K44M60L30l45l08j88J3M61K10K5m82k52J16M10K91
$$ -245 -223 151 378 209 -107 -519 -275 185 515 170 -138 -326 -313 148 358 383 -99 -351 -235 175 466
6082D66k45l70m08Q4M84L22Q0k86m90OL14L86n9l39l00j5L22L78Q5l20k74j55
$$ 466 221 -149 -557 -473 11 333 413 127 -363 -357 -43 343 284 -55 -355 -370 -48 330 415 95 -179 -334
6104c34K08L92Ok43k85j91L79L71J40l42m46k27L14M52M62n29m29j52L91K17J15
$$ -334 -126 266 272 29 -256 -447 -68 303 443 101 -345 -572 -258 194 656 127 -302 -454 -63 154 269
6125B69m7l98l12J88M46L01k82k55k49J22L36J38m3l92j07j21O30K88k92l60k98
$$ 269 222 -176 -488 -300 146 447 165 -90 -339 -217 119 257 214 -178 -285 -406 224 512 220 -140 -438
6146d38J97L56M05l10k67l79K30L31N12l76l96j79n8L56M18j76k10l42r8M03M08
$$ -438 -241 115 520 210 -57 -436 -206 125 637 261 -135 -314 -372 -16 402 226 16 -326 -424 -21 387
6167C87n3k89l39L2L29L93M4l33m56L6L44K01J06l00m52j69M70M07P2m42k22j3
$$ 387 334 45 -294 -262 67 460 504 171 -285 -249 95 296 402 102 -350 -519 -49 358 430 -12 -234 -247
6189b47Q3M57J32m12k16l23L32N69J16m26m11j3K29N91O9l59l31j77J41L88K93
$$ -247 -164 293 425 13 -203 -526 -194 375 491 65 -346 -359 -130 461 530 171 -160 -337 -196 192 485
6210D85m02l89j03J81M36K83l23l94j08J87L59J46k05m99L2p5N79J76j39m87j73
$$ 485 83 -306 -409 -228 208 491 168 -226 -334 -147 212 358 153 -346 -314 -389 190 366 227 -260 -433
6231d33J41M28L19k20j85l94k6N58K56o8l37m64J36K15L14J33m65l04N2L36L16
$$ -433 -292 136 455 235 50 -344 -370 188 444 376 39 -425 -289 -74 240 373 -92 -396 -344 -8 308
6252C08j21k71k92J5L43M31l9l24l77r4L47M26R1l27n11j3L78L07J25k87m33j07
$$ 308 187 -84 -376 -361 -18 413 374 50 -327 -421 -74 352 443 116 -395 -408 -30 277 402 115 -318 -425
6274d25K41N41Qj77l41k03J72M59P2j1n18k91K25L30K35j76k97k48K10M01J85
$$ -425 -184 357 365 188 -153 -356 -184 275 347 336 -182 -473 -248 82 317 141 -156 -404 -194 207 392
6295C92m9m42l24N8M74M26j70n88k38J90L30M61m01k71j94J01K83K60Q0m56j87
$$ 392 343 -99 -423 -365 109 535 365 -223 -461 -271 59 520 119 -152 -346 -245 38 298 378 -78 -265
6316b65l7L35K45n3l79k07m3L71M16k51j03l94K6K60N27j83k26m32L9J94M69P7
$$ -265 -302 33 278 225 -154 -361 -404 -33 383 132 29 -365 -339 -79 448 265 39 -393 -354 -160 309 386
6338C86m58k49j38M47K23J53l19k58j09K01L92J74k37m79m2K89L18J13l71l71
$$ 386 -72 -321 -459 -12 211 364 45 -213 -322 -121 271 445 208 -271 -313 -24 294 407 36 -335
6358c35p1L07L60O3j06m75k12J45O21M3l9m88j86K46K43L27k91m85n6J62L73J87
$$ -335 -406 -99 261 324 218 -257 -469 -324 297 340 301 -187 -373 -127 116 443 152 -333 -389 -227 146 333
6380C33j00k74k78J5K46M25k44k45k54J42L72K47j44l05j75K4L65O8j36j31l06
$$ 333 233 -41 -319 -304 -58 367 123 -122 -376 -234 138 385 241 -64 -239 -215 150 218 82 -49 -355
6401c55K59M6L66M6m76k42r9M89K42J06m94k68n3L82N39l05j29l77ML42K67Q8
$$ -355 -96 -50 316 362 -114 -356 -455 34 276 382 -112 -380 -433 -51 488 183 54 -323 -319 23 290 378
6423C78k38m47k0K82M27R9k97n44mJ76K41L12l04j42k10N2N32M6j41m88p4M41
$$ 378 140 -307 -327 -45 382 481 184 -360 -364 -188 53 365 61 -81 -291 -239 293 339 198 -290 -364 77
6445G7K24LJ6n15k43L95J55J55J6n14j87J22L64M04k73k96k55K3M62J09J50m47
$$ 77 301 304 320 -195 -438 -43 112 267 283 -231 -418 -296 68 472 199 -97 -352 -329 133 242 392 -55
6467e5k69J51K50L06o8m85k23K36L87K55l39k18k41O6K99L21P9m12l57lL08K43
$$ -55 -324 -173 77 383 315 -170 -393 -157 230 485 146 -72 -313 -247 52 373 452 40 -317 -320 -12 231
6489B31L4k61k87j39M60K68J0k75m00QK30L37J16l09l80O8J48N01o7k65l09J19
$$ 231 265 4 -283 -422 38 306 316 41 -359 -351 -121 216 332 23 -357 -289 -141 360 293 28 -281 -162
6511a62Q1J73K56j71m13k41J99N89J65l77l92j44K37L92J53o9m86k04K68K64K75
$$ -162 -81 92 348 177 -236 -477 -278 311 476 99 -293 -437 -200 192 345 276 -210 -414 -146 118 393
6532C93k05k86k77K85K71L18k50m28k86J36M24J78J34m76m13J57N35J98q2m15
$$ 393 188 -98 -375 -90 181 499 249 -179 -465 -329 95 273 407 -69 -482 -325 210 408 326 -89
6552h9l73J57M20L74j85l12l30P7M76J66q5k92l80J59K17K60P3k95l90K8K95K51
$$ -89 -462 -305 115 489 304 -8 -338 -261 215 381 296 4 -376 -217 0 260 333 38 -352 -324 -29 222
6574B22J45k32l71k75O81J29J67m73m27J27K36L28J38k47l85k9N1N49J18l97m36
$$ 222 367 135 -236 -511 170 299 466 -7 -434 -307 -71 257 395 148 -237 -266 -215 334 452 55 -381
6595c81k11N40K50K50l01l01k94K41M41L2j58l48k89J82N87J64j59l87k19K46
$$ -381 -592 -52 198 448 147 -154 -448 -207 234 266 108 -240 -529 -347 240 404 245 -142 -361 -115
6615a15K68J24j44m05j21K32L84J5M2m28j96K37J21M08k06l73j43P6M33J82k39
$$ -115 153 277 133 -272 -393 -161 223 238 280 -148 -344 -107 14 422 216 -157 -300 -224 209 391 152
6636A52k39l37K31K93J18P7l35m65M72j7L82K2l95k91K05J22J83K96m73l54p7
$$ 152 -87 -424 -193 100 218 295 -40 -505 -33 -50 332 354 -41 -332 -127 -5 178 474 1 -353 -430
6657d30M98J48jj88m04L7J90L63J80n20j03p8K31K47K75l57l98P4K27K52J13l30
$$ -430 68 216 215 27 -377 -340 -150 213 393 -127 -230 -308 -77 170 445 88 -310 -236 -9 243 356 26
6679B6j79k06M01L49j42j51m42p9M32L10j26n7l35k18K36M36J16j09m10j75K7
$$ 26 -153 -359 42 391 249 98 -344 -423 9 319 193 136 -199 -417 -181 255 371 262 -148 -323 -296
6700b96L80J35j00k76k29J25M61J09q4m06k18J27L12L08j13k14k45o7L16M67j30
$$ -296 84 219 119 -157 -386 -261 200 309 225 -181 -399 -272 40 348 235 21 -224 -291 25 492 362
6721C62m92q5J06K90R2j5m08r6j36M53J35K53n37k97J1L82L22m8j42m05j62L66
$$ 362 -130 -215 -109 181 273 258 -150 -246 -382 71 206 459 -78 -375 -364 18 340 292 150 -255 -417 -51
6743e1L12r9j16m15J46O8M33Q2k90m57j0M21J28J68k06j96q0L2L05K94m72r3k80
$$ -51 261 162 46 -369 -223 -155 278 360 70 -387 -397 24 152 320 114 -82 -162 -130 175 469 -3 -96 -376
6766c76L05J89J44j70p7l61K8M88J72k08m63k7J76K82K69k53k31k77Q7M71J71
$$ -376 -71 118 262 92 15 -346 -318 170 342 134 -329 -356 -180 102 371 118 -113 -390 -303 168 339
6787C39m2m43j78J19K43J72K8k11k04o0K85L18j11k71l45NL06L55N7n22j21K9
$$ 339 297 -146 -324 -205 38 210 238 27 -177 -237 48 366 255 -16 -361 -356 -50 305 362 -160 -281 -252
6809b52M06Q4p5k25k85Q9J83M66j76j64k59p0K83K77m5k24k45p6K31K86K8k95
$$ -252 154 238 163 -62 -347 -258 -75 391 215 51 -208 -278 5 282 237 13 -232 -308 -77 209 237 -58
6831e8j78n6L27K67j2L9n00j60K06K42K10j99k48j74J15K87L16l44j70r8P3O8
$$ -58 -236 -292 35 302 290 329 -171 -331 -125 117 327 128 -120 -294 -179 108 424 80 -90 -188 -115 -47
6853d7N45k97l48j84R9L98J93j90j78m02J79M43J65k48k99k03L87J5L11j05l26
$$ -47 498 201 -147 -331 -232 166 359 169 -9 -411 -232 211 376 128 -171 -374 13 28 339 234 -92
6874i2j65rL80L12k65j57m69K77J95K79K7k67j72j49L28K67q1l13k53J74J80J54
$$ -92 -257 -266 114 426 161 4 -465 -188 7 286 313 46 -126 -275 53 320 239 -74 -327 -153 27 181
6896A81J03k92k07r1K89K22J92l43l01k0K60J08J54p9n31M0K31M32j39k41j71
$$ 181 284 -8 -215 -306 -17 205 397 54 -247 -267 -7 101 255 176 -355 -315 -84 348 209 -32 -203
6917b03PM5M15LKn10q5R4M40M5j7l35j39o1M89M7Nm56k06J86L67K22k74k76j37
$$ -203 -196 -151 264 267 269 -241 -326 -232 208 253 236 -99 -238 -299 190 237 242 -214 -420 -234 133 355 81 -195 -332
6942c32K68K48P1o4l56q3j24M02K33k44k06j46M4L17K24j54q4j82q3K93K02K8
$$ -332 -64 184 255 191 -165 -248 -372 30 263 19 -187 -333 -289 28 252 98 14 -168 -251 42 244 272
6964B72l64j51O5K67L41k41j91j93MJ60L33Kk58j79q3K71J56O0l75J20k18K48
$$ 272 -92 -243 -178 89 430 189 -2 -195 -191 -31 302 304 46 -133 -216 55 211 271 -104 16 -202 46
6986D6K51m8l4n58L7J93J92K58l14j67k84M76J39Q1j80l21L5L2M48oj05j48l24
$$ 46 297 249 215 -343 -306 -113 79 337 23 -144 -428 48 187 268 88 -233 -198 -166 282 276 171 23 -301
7009c01J66L37K46k30k92j53J28L35J04j89k76j64J77K0M31l20n4k58J6M14R1
$$ -301 -135 202 448 218 -74 -227 -99 236 340 151 -125 -289 -112 -92 339 19 -35 -293 -277 137 228
7030B28r4l04j56K30P3K95p1l72n6J14J46K73j17k01j58J6J52L91j84k73j93K53
$$ 228 134 -170 -326 -96 -23 272 201 -171 -227 -113 33 306 189 -12 -170 -154 -2 389 205 -68 -261 -8
7052hn7K11n0P4j22m77L24L66j5k55np45Q64L76m65j82J54o00P73K7m6p5q36J59
$$ -8 -65 146 96 170 48 -429 -105 261 246 -9 -14 -759 105 481 16 -166 -12 -612 161 188 142 67 -769 -610
7076f10L19J56M97k88r4m14N70l49M38l00j50q6O0M67J16j21l92N4k5K97J02o0
$$ -610 -291 -135 362 74 -20 -434 136 -213 225 -75 -225 -311 -251 216 332 211 -181 -127 -152 145 247 187
7098A87m52o7K55J86J88j07l23k00P8L52J31j35k31qn6L26J64j03j56l22K72K6
$$ 187 -265 -332 -77 109 297 190 -133 -333 -255 97 228 93 -138 -146 -202 124 288 185 29 -293 -21 5
7120EK05R8l27j58j2K57K26O6l23k83j26K71M93j59l41j55rK14K04K3n6k07k18
$$ 5 210 308 -19 -177 -189 68 294 360 37 -246 -372 -101 392 233 -108 -263 -272 -58 146 169 113 -94 -312
7143c12M08J66L6k64j90k61L63J55J67j68k65j23O6M30L1k66k2j14J68L76j22
$$ -312 96 262 298 34 -156 -417 -54 101 268 100 -165 -288 -222 208 239 -27 -49 -163 5 381 259
7164B59l37k7k26J44L38N1j32k33j30K61K47J35q0l31j69l2L10L84l06k8m17K96
$$ 259 -78 -105 -331 -187 151 202 70 -163 -293 -32 215 350 270 -61 -230 -262 48 432 126 98 -319 -23
7186b3O6J63K4k43k62o6N49J5m9j39n34K24L16J60K3l02j81J6K45K1K29l27j47
$$ -23 43 206 230 -13 -275 -341 208 223 174 35 -499 -275 41 201 224 -78 -259 -243 2 23 252 -75 -222
7209b22P1P7L13j91r1j67m0J95J35K09k41k26j12K09L95J3k21l07o9K97J96N7
$$ -222 -151 -74 239 48 -43 -210 -250 -55 80 289 48 -178 -290 -81 314 327 106 -201 -270 27 223 280
7231B80j69k42k36K35M23j20N7k96k01N9M29K5j29k27k83L59L7J94m8j73q9m3
$$ 280 111 -131 -367 -132 291 171 228 -68 -269 -210 219 244 115 -112 -395 -36 1 195 147 -26 -115 -158
7253a58K88J73p5l60j33J59J87J7R6m11q7n1M01K13p0m70Qj0L98Q9j41l0m10J94
$$ -158 130 303 228 -132 -265 -106 81 98 194 -217 -304 -355 46 259 189 -281 -273 -283 115 204 63 33 -377 -183
7277a83K66J27J40j80l28J4K00P1nj73k84J87R4L27j72j02j68k2K71M0L1j72k47
$$ -183 83 210 350 170 -158 -144 56 127 122 -51 -335 -148 -54 273 101 -1 -169 -191 80 120 151 -21 -268
7300b68q4J79K49J43l49q1q6K01L18L3j88k20NO3K28P2j06l92M3MM67K4k05j09
$$ -268 -352 -173 76 219 -130 -211 -297 -96 222 255 67 -153 -148 -85 143 215 109 -283 -240 -236 231 255 50 -59
7324e9k2R7J04J15j97k55j22M50k5L86m93j16j30O7K93N7Rl41q5qK58J88Q1l16
$$ -59 -81 16 120 235 38 -217 -339 111 86 472 -21 -137 -267 -200 93 150 159 -182 -267 -275 -17 171 252 -64
7348f4j09P2J71K19r4k34o5qJ63J33L0m29j34O9K67K29kk59k09J53K15J22j11
$$ -64 -173 -101 70 289 195 -39 -104 -112 51 184 214 -215 -349 -280 -13 216 214 -45 -254 -101 114 236 125
7371A25j72k64P1K92J86K1l22q5j37L03K80j62j22k95J4K96J76q2l2j85O7q3K81
$$ 125 -47 -311 -240 52 238 259 -63 -148 -285 18 298 136 14 -281 -267 29 205 123 91 -94 -27 -110 171
7394A71K19l78m8j93K61J76j5n0k90k09J46L15O2o7k73n0JN00k4j66l41R5J2L34
$$ 171 390 12 -36 -229 32 208 193 143 -147 -356 -210 105 167 100 -173 -223 -222 278 254 88 -253 -158 -146 188
7418A88j1J18l44l21K66L11K6j13k11j06l8J80K36j13l1k77R3K10M2kj63o2qL46
$$ 188 177 295 -49 -370 -104 207 233 120 -91 -197 -235 -55 181 68 37 -240 -147 63 105 103 -60 -122 -130 216
7442B16R8j30k29j73qL02J18m0j77p8j30K16R2P5j39k55PK19J93R5k24j96m9J23
$$ 216 314 184 -45 -218 -226 76 194 154 -23 -101 -231 -15 77 152 13 -242 -235 -16 177 272 48 -148 -197 -74
7466g4K02J72o2l92kK60J13r4l2k86k7J60J39J94j68l77M1O7L28m6l1k54j47L99
$$ -74 128 300 238 -154 -156 104 217 123 91 -195 -222 -62 77 271 103 -274 -233 -166 162 116 85 -169 -316 83
7490H3o6J12L3k86n3R2K05M2N8k21k81J12K16K91l48M7k16J87QJ12o8j65r3R6
$$ 83 17 129 162 -124 -177 -85 120 162 220 -1 -282 -170 46 337 -11 36 -180 7 15 127 59 -106 -199 -103
7514a03L57Qj21l96mK13KR9K15n06l7J30J80J75O2m09j18J51J46J66M2k05j92
$$ -103 254 262 141 -255 -259 -46 -44 55 270 -236 -273 -143 37 212 274 -135 -253 -102 44 210 252 47 -145
7537a45N3QK35j96P4k25n2J90J91r1R6k19j39K11J20j38j21j0j43K25J81J0r1
$$ -145 -92 -84 151 -45 29 -196 -248 -58 133 42 138 -81 -220 -9 111 -27 -148 -158 -301 -76 105 115 24
7560B4l48O4K09J27O9k15p4j37K92K39K4l50m4m8L7R6K19j30j42k2j41L48P2j11
$$ 24 -324 -260 -51 76 145 -70 -144 -281 11 250 274 -76 -120 -168 -131 -35 184 54 -88 -110 -251 97 169 58
7584E8k87m9R4L07j5k8k14k36J57K81J62j01k68mj18K06K04L0j83j60kR3L09k31
$$ 58 -229 -278 -184 123 108 80 -134 -370 -213 68 230 129 -139 -143 -261 -55 149 179 -4 -164 -166 -73 236 5
7608Em5k40K7K47R7O7k43oJ5Q9K15l7j98k02J9M13N0j76j21k59L3K07J66j8j30
$$ 5 -40 -280 -253 -6 91 158 -85 -91 -76 13 228 191 -7 -209 -190 223 273 97 -24 -283 -250 -43 123 105 -25
7633b5j87P5r1L34k4o0j40m6R8J43R2p3k38RO8K41L3m3k46j30J80Q4J39p1o6k14
$$ -25 -212 -137 -228 106 82 22 -118 -164 -66 77 169 96 -142 -133 -65 176 209 166 -80 -210 -30 54 193 122 56 -158
7659a58R9N2K87j50j83j5P1J26J13j07k41q3J1P9M48k18j96j4p6K20R5rl66K2
$$ -158 -59 -7 280 130 -53 -68 3 129 242 135 -106 -189 -178 -99 349 131 -65 -79 -155 65 160 151 -215 -193
7683a93o0J74K30j00l4k15P7O3L02o6k60j25n2J97K93j72K3m05K2L99J65k04j21
$$ -193 -253 -79 151 51 17 -198 -121 -58 244 178 -82 -207 -259 -62 231 59 82 -323 -301 98 263 59 -62
7706f2n3l0J75J03K9l34P0p2L1L62n3j49k03p5K57K34j94j00mj59K23J92j43J14
$$ -62 -115 -145 30 133 162 -172 -102 -174 -143 219 166 17 -186 -261 -4 230 36 -64 -68 -227 -4 188 45 159
7730A59m10n7L29J07o9q4j57j24K33J80N5j93Ok82K24K33j32J87j80k63Q9J10
$$ 159 -251 -308 21 128 59 -25 -182 -306 -73 107 162 -31 -25 -307 -83 150 18 205 25 -238 -149 -39
7752c9K06j57o9j4j07R4L20q2k37j70O8K42J10j72n6j44K82k62J94J11L58l58
$$ -39 167 10 -59 -73 -180 -86 234 152 -85 -255 -187 55 165 -7 -63 -207 75 -187 7 118 476 118
7774A18j8N2L79j81l54o21L22L81j21L79k40m35J67K03J73k6k44j56j09L26J05
$$ 118 100 152 531 350 -4 -625 -303 78 -43 336 96 -339 -172 31 204 178 -66 -222 -331 -5 100
7795A00K18l90k79J85J71J91j00o0k36J09J42%oj2m4j70J90J65P8q4k75n7J51
$$ 100 318 -72 -351 -166 5 196 96 36 -200 -91 51 51 45 33 -11 -181 9 174 252 168 -107 -164 -13
7818a3K34J32k56k87O7j92M44O2r4k31L8K35N8M8j56j80j76J67K77o0l4k8l61
$$ -13 221 353 97 -190 -123 -315 129 191 97 -134 -96 139 197 245 89 -91 -267 -100 177 117 83 55 -306
7841c06L53J07j11jk27M1j4K66L53m53k99l6K08K62Pp8r5r2J69k8J69j59j24j28
$$ -306 47 154 43 42 -185 -144 -158 108 461 8 -291 -327 -119 143 150 72 -23 -115 54 26 195 36 -88 -216
7865b16P4J18K53k36q1q6l1K24J05o4j58P0j66N5K81p3n9j77j19K30L74j80j65
$$ -216 -142 -24 229 -7 -88 -174 -205 19 124 60 -98 -28 -194 -139 142 69 10 -167 -286 -56 318 138 -27
7888b7M8j34L8J43l3N1k65P4kK73L0j78l5l4M4J83j45p7l8K3k9J78K5r3j29k0
$$ -27 21 -113 -75 68 35 86 -179 -105 -107 166 196 18 -17 -51 -7 176 31 -46 -84 -61 -90 88 113 20 -109 -129
7914a29P2L5K6Q0j46j09R4M2J83n7k15j6R8N0P9R9j31j08j31J23K01R9l44j51
$$ -129 -57 -22 4 84 -62 -171 -77 -35 148 91 -124 -140 -42 8 87 186 55 -53 -184 -61 140 239 -105 -256
7938b56Q4N4L96j67k10o0O9R0Q0o9l6j7j52K70J07o8k40k8M7M8J21l2n3k68J28
$$ -256 -172 -118 278 111 -99 -159 -90 0 80 11 -25 -42 -194 76 183 115 -125 -153 -106 -58 63 31 -22 -290 -162
7963a62R5J40J08j34l52J09R0J45Q6M7l73J71O4N8J50k38pk32J77J06K23j68j12
$$ -162 -67 73 181 47 -305 -196 -106 39 125 172 -201 -30 34 92 242 4 -3 -235 -58 48 271 103 -9
7986ij03R9K60k21J3P4k95J70K51j45J08k55p2q3K26J92j39j64Jo5K42K5Jl16
$$ -9 -112 -13 247 26 39 113 -182 -12 239 94 202 -53 -125 -208 18 210 71 -93 -92 -157 85 110 111 -205
8010b05K0R1J00Q3O0k44j29J03J54J57p0l10Q1P1QK13n5k19J51k61L06j00K53
$$ -205 -185 -94 6 89 149 -95 -224 -121 33 190 120 -190 -109 -38 -30 183 128 -91 60 -201 105 5 258
8033B58k73l2j88J65K31q4n6k69J95J54K34k94Jj31j07K43Q3l49P25m36o7K85
$$ 258 -15 -47 -235 -70 161 77 21 -248 -53 101 335 41 42 -89 -196 47 130 -219 506 70 3 288
8055B88q0j66N9N1l59P3m1M04k71m7K5KM46n16J14N1J48L13n58K98n2n00O12m38
$$ 288 208 42 101 152 -207 -134 -175 229 -42 -89 -64 -62 384 -132 -18 33 181 494 -64 234 182 -318 294 -144
8079a44K16j2K95n91J53L17j1K93p32L78m11R9QL49L33m77m92J72M35m34J67p1
$$ -144 72 60 355 -236 -83 234 223 516 -216 162 -249 -150 -142 207 540 63 -429 -257 178 -256 -89 -160
8101a60J07l8l9L50m5k25J06j74J70n7J95j08j79R8P3l5P0j25j36Q1K14J8q2N2
$$ -160 -53 -91 -130 220 175 -50 56 -118 52 -5 190 82 -97 1 74 39 109 -16 -152 -71 143 161 79 131
8125A31l24R5J13J41K2k17j98J66k2J55O5m6r8N5j62J85J46q5k07%lJ30p9L3K3
$$ 131 -193 -98 15 156 178 -39 -237 -71 -93 62 127 81 -17 38 -124 61 207 122 -85 -85 -88 42 -37 -4 19
8150A9l14K44J76Jq6j88Q2j5J13M2O0j37k73K76J08Q9j06j97o6J30K33k05J57
$$ 19 -295 -51 125 126 40 -148 -66 -81 32 74 134 -3 -276 0 108 197 91 -106 -172 -42 191 -14 143
8173A43j75l8j03J77J17j1k17K2L8O2J75M3j01l90K79JJ96k20
$$ 143 -32 -70 -173 4 121 110 -107 -85 -47 15 190 233 132 -258 21 22 218 -2
8191b
$$ Imaginary data points
##PAGE= N=2
##DATA TABLE= (X++(I..I)), XYDATA
0@%%%%%%%%%%%%%%%%kJ0j6J6j6J6j8K6l2L4m2M9n6O4p3Q5r5J08j24J40j56J74
$$ 0 0 0 0 0 0 0 0 0 0 0 0 0 0 0 0 0 -2 8 -8 8 -8 8 -10 16 -16 18 -24 25 -31 33 -40 45 -50 58 -66 74 -82 92
38I2j95K18k43K71l01L34l69M07m50M96n46O03o67P34q07Q89r84J089j204J337
$$ 92 -103 115 -128 143 -158 176 -193 214 -236 260 -286 317 -350 384 -423 466 -518 571 -633 704
58G04j491J671j886K145k464K872l413M170n315P270j1517L9623m4737p5626L1067
$$ 704 -787 884 -1002 1143 -1321 1551 -1862 2308 -3007 4263 -7254 32369 -12368 -87994 -56927
73e6927O9429Q0641j8473q8389o8986J0228P3229P9913r548q3040o9918K923O8884
$$ -56927 12502 93143 74670 -13719 -82705 -72477 752 80665 71117 -11923 -81841 -78918 -10034
86a0034P8542k918p3912o6966p525O3476P9944K189o5827o4947j3859N9578P7127
$$ -10034 68508 65590 -8322 -75288 -82813 -19337 60607 62796 -3031 -67978 -81837 -22259 54868
99E4868P247n6996o3875j8450N4243P5880J1735n1021o1969k3253M8934P5556
$$ 54868 62115 5119 -58756 -77206 -22963 52917 64652 13631 -48338 -71591 -22657 52899
111E2899J6175m7088o1932k6408M6575P0992J9406l8549o5367l1180M4926O7909
$$ 52899 69074 21986 -39946 -66354 -19779 51213 70619 32070 -33297 -64477 -19551 48358
123D8358K3758l4184o6986l4033L9718O6392K7808k9318o6717l9509L5210O5253
$$ 48358 72116 37932 -29054 -63087 -23369 43023 70831 41513 -25204 -64713 -29503 35750
135C5750L1657k4173o6692m2366K9391O1539L7788j8682o5938m4240K2542N8840
$$ 35750 67407 43234 -23458 -65824 -36433 25106 62894 44212 -21726 -65966 -43424 15416
147A5416M1853j3414o1977m6339J4854N5694M6087p362n9327m6748J0375M9285
$$ 15416 57269 43855 -18122 -64461 -49607 6087 52174 44812 -14515 -61263 -50888 -1603
159a603M8914j350n5097m6063L641M5268N0219L591n0292m5689j719M1210N0909
$$ -1603 47311 45961 -9136 -55199 -51558 -6290 43929 47520 -2772 -48461 -50180 -8970 41939
172D1939P587m4820m6474o859L8188N1697J0362m0693m6118j1601L5089N1903
$$ 41939 49526 4706 -41768 -48627 -10439 41258 51620 10927 -35191 -46792 -11703 40200
184D0200J2874l7037m5926j6280L2529N2426J4365l2835m6359k0444L0389N1689
$$ 40200 53074 16037 -29889 -46169 -13640 38786 53151 20316 -26043 -46487 -16098 35591
196C5591J6872k9911m6337k3221K7332N1013J9071k6214m6687k6353K4949N0133
$$ 35591 52463 22552 -23785 -47006 -19674 31339 50410 24196 -22491 -48844 -23895 26238
208B6238K1732k2501m6597k9189K2245M8157K4945j7432m6979l1683J9072M6506
$$ 26238 47970 25469 -21128 -50317 -28072 20085 45030 27598 -19381 -51064 -31992 14514
220A4514K8140j3101m5811l4349J5346M4727L0891p784m4817l6286J1539M1800
$$ 14514 42654 29553 -16258 -50607 -35261 9466 40357 32573 -12244 -48530 -36991 4809
232D809L3993l142m3019l7539P246L8877L6632J004m0899l8217K617L6005L8580
$$ 4809 38802 35660 -7359 -44898 -37652 1225 37857 38861 -2038 -40255 -37638 -1633 36947
245C6947M692l8515l8605j719L2643M0196P940l6104l8758n215K9393M0926J0555
$$ 36947 41639 3124 -35481 -37200 -4557 35639 43579 7475 -31283 -36498 -7105 33821 44376
258D4376l3664l8420q667K6319M1696J2100l0690l8069j1905K3947M1356J4057
$$ 44376 10712 -27708 -36375 -10056 31640 43740 13050 -25019 -36924 -12977 28379 42436
270D2436k8060l7115j5245K1400M1620J5468k5335l6359j8060J9366M1252J7107
$$ 42436 14376 -22739 -37984 -16584 25036 40504 15169 -21190 -39250 -19884 21368 38475
282C8475k2076l5774k0820J7121M1158J8602j8638l5409k3369J5041M0454K0878
$$ 38475 16399 -19375 -40195 -23074 18084 36686 18048 -17361 -40730 -25689 14765 35643
294C5643j4876l5020k6106J2792L9246K3013j0983l4081k8759J0131L8123K5235
$$ 35643 20767 -14253 -40359 -27567 11679 34692 23709 -10372 -39131 -29000 9123 34358
306C4358o968l3581l0805P352L6276K7020k864l2409l2830M088L4191K8686R63
$$ 34358 27390 -6191 -36996 -29644 6632 33652 30788 -1621 -34451 -30363 3828 32514 33477
319C3477l1312l3756J176L1305K9931M471k9708l4527j651K8289L0947P505k8378
$$ 33477 2165 -31591 -30415 890 30821 35292 5584 -28943 -30594 -2305 28642 36147 7769
332G769l4538m150K5257L1547R739k6131l4175o534K1912L2042J2082k4178l3356
$$ 7769 -26769 -30919 -5662 25885 35624 9493 -24682 -31216 -9304 22738 34820 10642 -22714
345b2714r160J9256L2082J3969k1978l2469j1332J6817L2147J5770j9686l1404
$$ -22714 -31874 -12618 19464 33433 11455 -21014 -32346 -15529 16618 32388 12702 -18702
357a8702j3745J4332L2530J6970j7274l0363j5913J2190L2588J8488j4837k9457
$$ -18702 -32447 -18115 14415 31385 14111 -16252 -32165 -19975 12613 31101 16264 -13193
369a3193j8490J0247L2651J9978j2494k8534k0707P867L2214K1494r500k8008
$$ -13193 -31683 -21436 11215 31193 18699 -9835 -30542 -22675 9539 31033 21533 -6475
381f475k2898N616L1646K2687o548k7143k4952L428L0509K3644l479k6294k6697
$$ -6475 -29373 -23757 7889 30576 24028 -3115 -28067 -24639 5870 29514 26035 -259 -26956
394b6956J631K8620K4591n86k4884k8242o72K7020K4982K502k3736k8829k689
$$ -26956 -25325 3295 27886 27300 2416 -25826 -26498 522 25504 28006 4270 -24559 -27248
407b7248K4543K5258N336k1516k9589m686K2245K5345Q086k0025k9577o266J9447
$$ -27248 -2705 22553 27889 6373 -23216 -27902 -5657 19688 27774 7749 -21828 -28094 -8647
420h647K5698J0487j8748k8503q073J6481K6167J2089j6582k7965j0055J4810
$$ -8647 17051 27538 8790 -19713 -27786 -11305 14862 26951 10369 -17596 -27651 -12841
432a2841K5696J4327j5124k7486j0961J1887K6078J5912j3578k6913j2682J0029
$$ -12841 12855 27182 12058 -15428 -26389 -14502 11576 27488 13910 -13003 -25685 -15656
444a5656K6352J6977j2092k5957j4630Q103K6295J8283j0514k5213j6048O193
$$ -15656 10696 27673 15581 -10376 -25006 -16903 9392 27675 17161 -8052 -24100 -17907
456a7907K5974J9578r176k4186j7780M260K5824J9753o934k2561j9898K386K5177
$$ -17907 8067 27645 18469 -5717 -23497 -19237 6587 26340 19406 -3155 -23053 -20667 4510
469D510K0650m712k1850k1033M28K3553K1356j868k0365k2017k070K2741K1735
$$ 4510 25160 20448 -1402 -22435 -22007 1546 22902 21034 669 -21348 -23418 -677 21058
482B1058J66j8643k2975l588K0850K1250L447j7050k3226n381J8838K1308N934
$$ 21058 21224 2581 -20394 -23982 -3132 18118 21565 4515 -18711 -24092 -5254 16054 21988
495B1988j5882k3581o722J7373K1186P663j3438k4355q163J5656K0952R909j2244
$$ 21988 6106 -17475 -24197 -6824 14362 22025 8587 -15768 -23931 -8275 12677 22586 10342
508A0342k4353r422J3698K1341J1506j1296k3891j0346J1745K1111J2681r825
$$ 10342 -14011 -23433 -9735 11606 23112 11816 -12075 -22421 -10676 10435 23116 13291
520A3291k3472j1616R865K1279J3940q681k3580j1771P890K0457J5396p636k2470
$$ 13291 -10181 -21797 -11932 9347 23287 14606 -8974 -20745 -12855 7602 22998 15362 -7108
533g108j3062N635K0746J5909n937k1374j4992M146K0359J7086n115k0276j5431
$$ -7108 -20170 -14535 6211 22120 16183 -5191 -20183 -16037 4322 21408 16293 -3983 -19414
546a9414K048J9085J8413l175j9129j6438l26J8823J9279k274j6929j7965j900
$$ -19414 -17366 1719 20132 16957 -2172 -18610 -18936 -113 19166 16892 -37 -18002 -19902
559a9902J8293J8756R16j6157j8849l676J7047J9925K731j5298j9410n172J5891
$$ -19902 -1609 17147 18063 1906 -16943 -20619 -3572 16353 19084 3786 -15624 -20796 -4905
572d905J9940L937j2857k0062p046J5088J9441N998j1682k0384p945J3669J8999
$$ -4905 15035 18972 6115 -13947 -20993 -5905 13536 19534 7852 -12532 -20477 -6808 12191
585A2191P582j0803k0041q740J1916J8668Q932r304k0237r639J0840J8141R839
$$ 12191 19773 8970 -11071 -19811 -7895 10773 19705 10401 -9836 -19475 -8635 9506 19345
598A9345q228j9949r835Q839J7673J1375p225j9707j0684P407J7339J2444o187
$$ 19345 11117 -8832 -18667 -9828 7845 19220 11995 -7712 -18396 -10989 6350 18794 12607
611A2607j9201j1638O062J6671J3847m753j9013j2302M040J6727J4692l785j8121
$$ 12607 -6594 -18232 -12170 4501 18348 13595 -5418 -17720 -13680 3047 17739 13954 -4167
624d167j2927K140J6325J5857k491j7009j4071K52J5834J6732j142j5702j5001
$$ -4167 -17094 -14954 1371 17228 14737 -2272 -16343 -16091 -257 16475 15333 -369 -15370
637a5370j466J5234J7065M87j4567j5229l379J4157J7800J753j3120j6020m942
$$ -15370 -16836 -1602 15463 15950 1383 -13846 -17225 -3068 14732 16485 3365 -12655 -17597
650a7597J3634J7588L003j1670j6256o117J2504J7135M506j0333j6476p232J1409
$$ -17597 -3963 13625 16628 4958 -11298 -17415 -4911 12224 16730 6397 -10079 -17311 -5902
663e902J6868N201q610j6625q004J0246J6313O687p538j6764q783R322J5681P591
$$ -5902 10966 16167 7557 -9068 -17072 -6826 9487 16174 8636 -8128 -16911 -7589 8092 15683
677A5683o261j6566r548Q138J5169Q827n228j6397j0245O943J4500R920l833j6409
$$ 15683 9422 -7144 -16692 -8554 6615 15442 10214 -6183 -16428 -9485 5015 14935 11102 -5307
691e307j0830N820J3917J1128k849j6293j1255M256J3728J2221j821j5680j1791
$$ -5307 -16137 -10317 3600 14728 11879 -4414 -15669 -11413 2315 14536 12715 -2965 -14756
704a4756K547J3121J3296r05j5115j2330J202J2454J4185N97j4780j2636k34J1831
$$ -14756 -12209 912 14208 13303 -1812 -14142 -12940 -486 13699 14296 -484 -13120 -13354 -1523
718a523J4694J423j3418j3079k117J1277J5292K349j2334j3296l298J0211J5293
$$ -1523 13171 14594 1176 -11903 -14020 -2743 12549 14898 2564 -10732 -14030 -3819 11474
731A1474L324j0954j3352m838R447J5360M286r855j3154o228Q688J4967N113q337
$$ 11474 14798 3844 -9508 -14346 -4899 10461 14747 4892 -8262 -14490 -5802 9165 14278 5941
745E941j3314o880P586J4853N700p187j3120q097P005J4279O521n701j3372q476
$$ 5941 -7373 -14253 -6667 8186 13886 6699 -6421 -14518 -7513 6766 13287 7586 -5786 -14262
759a4262N888J4059P397m713j3189r488N327J3588Q119l502j3105j0244M588J3069
$$ -14262 -8374 5685 13082 8369 -4820 -14308 -8981 4607 12726 9224 -3881 -14125 -9537 3532
773C532R036k422j3098j0641L480J2603R762j335j2852j1105K497J2047J0622
$$ 3532 12568 10146 -2952 -13593 -10113 2490 12252 10917 -1935 -13040 -10543 1504 12126
786A2126m12j2623j1574J632J1194J1425M65j2096j1695J81J0632J1917J594j1673
$$ 12126 11714 -909 -12483 -10851 343 11768 12233 137 -11558 -11377 -745 11172 12766 1093
800A093j1838q18R648J2262K498j0615j1909k136Q787J2680L309r725j2016l466
$$ 1093 -10745 -11563 -1915 10347 12845 2230 -9679 -11815 -3028 9652 12961 3236 -8780 -12246
814a2246P909J2899M205q650j1833m586O913J3155M585p578j1619n601O263J2984
$$ -12246 -4337 8562 12767 4117 -7716 -12302 -5389 7766 12351 4773 -6846 -12447 -6184 6800
828F800N329o782j1252o772N755J2494O174n501j1198p433M738J2668O372m703
$$ 6800 12129 5347 -5905 -12677 -6922 5572 11746 6245 -4953 -12386 -7648 5020 11392 6689
842F689j0775q070M468J1789P204l831j0886q490L890J1816P220k690j0788r262
$$ 6689 -4086 -12156 -7688 4101 11305 7474 -3412 -11902 -8012 3804 11024 8334 -2454 -11716
856a1716L543J1040P888j599j0660r882K755J0463Q205j4j0426j0179J353J0608
$$ -11716 -8173 2867 10755 9156 -1504 -11386 -8631 1832 10037 10023 -403 -10582 -9229 1379
870A379Q665L77j0089j0827J450Q786R683J542j0015j0605k80Q063J0367K590
$$ 1379 10044 10421 332 -10495 -9045 -259 9424 10966 951 -9654 -9934 -1871 8496 11086
884A1086r583j0016j402P304J0648K966q650j0321k584O903J0792M185q203j0565
$$ 11086 1503 -8513 -9915 -2611 8037 11003 2353 -7968 -10552 -3649 7143 11328 3125 -7440
898g440k985N837J0909M996p822r689m212M948J1662M470o046j0282n023N007
$$ -7440 -10425 -4588 6321 11317 3495 -6194 -10406 -5458 6204 10674 4628 -5654 -10677 -5670
912e670J1139N273n419j0022n161L557J1087N354m276r233o361K877J0883O305
$$ -5670 5469 10742 5323 -4699 -9860 -6303 4784 10138 5862 -3371 -9732 -6855 4028 10333
926A0333l683r557o814K715J0411O397l203q349p971K580R615O791j557q518q656
$$ 10333 6650 -2907 -9721 -7006 3405 9802 6599 -1750 -9721 -7141 2474 9265 7708 -810 -9466
941i466J777R369P431j157q343q456O38R297P216J21q496r052Q74P837Q430N48
$$ -9466 -7689 1680 9111 7954 -389 -8845 -8207 1090 8306 8427 -69 -9121 -8247 -410 8020 8568
957H568p861r127n03Q145Q117J939p856r532p69O954Q749K710o933j0021k045
$$ 8568 707 -8420 -8923 -778 7339 9278 1422 -8110 -8879 -1925 6824 9534 2601 -7420 -9465
972i465O968Q810L124o472r356l074N889R177M122o838q452l474M633R148M968
$$ -9465 -2497 6313 9437 2965 -6391 -9465 -3576 5601 9723 2885 -5567 -9041 -4408 4740 9708
987I708n803q701l687L947R081M991m802q761m271L458R169M303l592q471n236
$$ 9708 3905 -4796 -8483 -4536 4545 9536 4734 -4027 -8298 -4840 4329 8632 5040 -3431 -8667
1002h667L534Q615N851l908q226n481K143Q593N943k684p821o012K125Q156O416
$$ -8667 -5133 3482 9333 5425 -2801 -8282 -6139 2454 8397 5713 -2108 -8120 -5995 2161 8577
1017H577k390p913o094P69Q386O702j274p580p141O67Q156O307j68p093p723j21
$$ 8577 6187 -1726 -7820 -7051 1335 8037 6763 -817 -7958 -7291 865 7172 7004 -89 -7812 -7933
1033g933Q222P002j24o662q415j0P427O844P57n932q242p13O535O994K428o364
$$ -7933 289 7291 7167 505 -7910 -7920 -493 6351 7108 1176 -7066 -7779 -1244 5750 8178 1814
1049A814q144j677O533P453K110n494q443k098N813P219L150n098q012k770M769
$$ 1814 -6330 -8007 -1474 5979 8089 2595 -5848 -7946 -2133 5086 8236 3138 -4874 -7644 -2875
1064b875P102M218m892q190k971L707P639M478m056p752l703K762P821M759l792
$$ -2875 4227 8445 3553 -4637 -7608 -3901 3738 8216 4160 -3592 -7295 -4533 3288 8047 4255
1079D255p739m024K432Q026N107l616p299m383J958P396N700k621p337m932J310
$$ 4255 -3484 -7508 -5076 2950 8057 4441 -2858 -7241 -5283 2113 7813 5192 -2145 -7077 -5767
1094e767P161N748j413p435n639J438P275N727j532o566n576M60O638O697j296
$$ -5767 1394 7142 5729 -1706 -7345 -5907 1368 7095 5563 -1003 -6579 -6119 519 7216 5920
1109E920o406n651m48P073O475p20n941o612n15O667O450L18n859o217j319N777
$$ 5920 -486 -6137 -6585 488 6963 6243 302 -6310 -6825 -158 6292 6610 751 -5466 -6785 -1008
1125a008O881Q81m953p120j921N969O714J286m536p250k207N397O730K278m172
$$ -1008 5873 6754 1801 -5319 -7240 -1271 5443 6729 2193 -5057 -7264 -1867 4863 7141 2969
1140B969p630k310M456O697L031l890p470l127M308O498L503l283p566l247L390
$$ 2969 -4661 -6971 -2515 4182 7213 3323 -4147 -7274 -2966 3532 7035 3752 -3814 -7061 -3671
1155c671O573M099k811p607l331K689O641M318k303p346l978K444N927N303k318
$$ -3671 2902 7001 4190 -3417 -6748 -4059 2582 6900 4597 -2749 -6727 -4283 1644 6947 4629
1170D629o742m168J602O081N121j507o295n087J342O004N573j293o339m785N02
$$ 4629 -2113 -6281 -4679 1402 6523 5016 -1279 -6366 -5024 980 6553 5260 -1079 -5864 -5362
1185e362O057N833j087o041n074p1O161N860n98n502n621l98N634N905J09n058
$$ -5362 695 6528 5441 -600 -5674 -5745 416 6276 5678 176 -5445 -5843 -209 5696 5805 747
1201G47n879r17N351N970O61m704o141j399N107O041J184m468o173j746M567N997
$$ 747 -5132 -6049 -698 5272 5933 1229 -4912 -6311 -1204 4837 6021 1553 -4620 -6366 -1799 4198
1217D198J779l853o359k182M149O183K349l636o377k764L929N887K780k873o469
$$ 4198 5977 2124 -4235 -6417 -2268 3915 6264 2628 -3749 -6513 -2584 3303 6083 3210 -3259
1232c259l165L513N832L219k577o445l269L007N364L853k033o747l137K659N079
$$ -3259 -6424 -2911 2921 6140 3563 -2882 -6151 -3144 2220 6073 4040 -2707 -5844 -3185 1894
1247A894L897j742o187l505J852N566M203j698n876m006J329N266M570j326n641
$$ 1894 5791 4049 -2138 -5643 -3791 1775 5978 4280 -1596 -5602 -4273 993 5563 4237 -1404
1262a404l871N19N340M858j159m930m119Q1M945N236n34n328m380o09N050N311
$$ -1404 -5275 -4756 584 5442 4283 -647 -4766 -4685 260 5496 4962 -366 -4746 -5355 -305 5006
1278E006o3m707m752o62M346N452M41m172n183j284M366N693O71l933n305j817
$$ 5006 4943 236 -4516 -5178 -832 4620 5061 889 -4294 -5578 -1212 4481 5152 1219 -4086 -5903
1294e903M564N237J361l377n577k245M058N646J410k941n543k377L545N401K116
$$ -5903 -1339 3898 5259 1882 -3695 -5940 -1882 3764 5174 2233 -3310 -5687 -2142 3259 5375
1309E375k652n527k828L164N317K483k115n781l133K892N236K772j931n367l305
$$ 5375 2723 -2804 -5632 -2468 2849 5332 3217 -2564 -5697 -2805 2431 5203 3272 -2095 -5400
1324e400K464M828L290j674n303l549J988M750L598r42n518l649J522M621L915
$$ -5400 -2936 1892 5182 3508 -1795 -5344 -3356 1394 4992 4050 -1468 -5117 -3595 1026 4941
1339D941q34n140l770J050M263M337l74n113m049N01M274M581k52m719m051J27
$$ 4941 4107 -1033 -4803 -3753 510 4847 4473 -640 -4689 -4188 86 4667 4415 -304 -4355 -4228
1355d228L982M676K14m532m352k89L897M862L85m295m198r20L637N285M78l880
$$ -4228 -246 4430 4644 112 -4240 -4529 -632 4230 4615 320 -3878 -4798 -1161 4124 4602 722
1371G22m370j246L688M950R68l544m356j739L332N087J412l139m706j993K924
$$ 722 -3648 -4894 -1206 3744 4712 1168 -3188 -4927 -1595 3492 4904 1765 -2941 -4934 -2010
1386b010N049J627k587m657k363K700M998K070k350m689k683K341M864K256j792
$$ -2010 3039 4666 2079 -2578 -4941 -2241 2757 4827 2477 -2212 -4895 -2554 2310 4566 2774
1401B774m601k889K102M468K542j256m623l152J658M448K794j020m541l348J448
$$ 2774 -1827 -4716 -2614 1854 4396 3140 -1483 -4635 -2977 1471 4265 3245 -1296 -4644 -3196
1416c196M277L306q30m486l633J324L968L478m88m274l683O59L803L854j23m298
$$ -3196 1081 4387 3557 -929 -4562 -3238 730 4208 3720 -554 -4237 -3578 225 4079 3956 -342
1432c42l824M67L598M087P1m147l621k51L720L913N22l846l927l93L290M135P39
$$ -342 -4166 -3699 -101 3986 4057 -90 -3711 -3962 -242 3671 4193 347 -3580 -3973 -683 3452 4191
1449D191l569l781r41L038M316R27l166m003j137K759M237J518l013l841j683
$$ 4191 622 -3159 -4100 -1062 3254 4181 1015 -2988 -4125 -1366 2871 4389 1376 -2465 -4148
1464d148K362M467J583k528m009j763J882M630J741k181m045k096J768M515J847
$$ -4148 -1786 2681 4264 1736 -2273 -4036 -2154 2476 4217 2036 -2009 -4105 -2337 2178 4025
1479D025j792l679k679J790L832K724j647l939k900J616M063K445j119l868k838
$$ 4025 2233 -1446 -4125 -2335 1497 4221 2574 -1365 -4265 -2649 1414 3859 2740 -1128 -3966
1494c966J206L904K306m75l597l305O98M167K365K8l863l263O87L400L415j40
$$ -3966 -2760 1144 3450 2975 -622 -3927 -3229 938 3303 3331 -532 -3795 -3108 292 3707 3567
1510C567l798l406L66L328L219L30l399l642J70K944L370O21l551l483j3K818
$$ 3567 -231 -3637 -3271 57 3276 3606 207 -3435 -3265 -321 3049 3670 119 -3364 -3377 -559
1526e59L489Q39l199l501m95K503M027M13k496l446j184K455L529J467k603l474
$$ -559 2930 3769 570 -2931 -3426 -923 3104 3517 1021 -2425 -3609 -1154 2375 3842 1239 -2235
1542b235j561K271L950J329k451l334j589J759M016J730k278l340j875J581L749
$$ -2235 -3796 -1525 2425 3754 1303 -2031 -3620 -1861 2155 3885 1607 -1733 -3608 -2027 1722
1557A722J861j785l401k015J168M180J741j280l252k572J120L844K142j066l351
$$ 1722 3583 1798 -1603 -3618 -2450 1730 3471 2191 -1061 -3633 -2513 1331 3473 2407 -944
1572i44k698J062L680K115o78l321k637P11L425K493n19l134k894N53L333K524
$$ -944 -3642 -2580 1100 3215 2537 -784 -3421 -2710 715 3208 2689 -445 -3339 -2786 547 3071
1588C071k30k960l117L87L061K875J06l049l229R7K920K860L57k798l153k75K765
$$ 3071 2841 -119 -3236 -2849 212 3087 3193 144 -3085 -2988 -68 2792 3149 351 -2802 -3077 -312
1605c12K881O75k592l508l33K541L134P96k491l356n34K197L107J341k464l225
$$ -312 2569 3244 652 -2856 -3189 -648 2486 3282 791 -2565 -3099 -902 2205 3546 1082 -2143
1621b143j086J787L379J616k348l189j128J503L347J604j901l054j575J446L285
$$ -2143 -3229 -1442 1937 3553 1205 -1984 -3112 -1609 1738 3342 1441 -1613 -3188 -1742 1543
1636A543J902j740l069j773J126L369J912j498k966j900R51L260K132j264k876
$$ 1543 3445 1705 -1364 -3137 -2011 1358 3270 1772 -1194 -3094 -2143 1117 3249 1985 -891
1651h91k260R00L030K156p76k835k295N59L106K140m83k852k371M18K831K456
$$ -891 -3151 -2251 779 2935 2159 -676 -2971 -2412 694 2834 2351 -501 -2872 -2454 377 2833
1667B833l95k504k747K18K807K300J64k589k734rK712K471K03k399k874k19K423
$$ 2833 2438 -66 -2813 -2595 212 2512 2676 87 -2647 -2656 56 2527 2730 331 -2543 -2762 -339
1684c39K638N73k395k709n90K285K626P39k147k904o68K019K744R84j953l089
$$ -339 2299 2872 477 -2232 -2822 -537 2089 2828 681 -2223 -2891 -872 1872 2856 903 -2186
1700b186p12J888K602J356j844l095r01J671K837J246j589k904j097J230K689
$$ -2186 -2898 -1010 1592 2948 1104 -1991 -2892 -1221 1616 2862 1273 -1631 -2728 -1498 1191
1715A191J702j481k756j281J000K759J719j188k715j565Q39K590K077j121k538
$$ 1191 2893 1412 -1344 -2625 -1625 1134 2853 1665 -1050 -2615 -1776 814 2891 1770 -768
1730g68j705O26K569K122r90k432j663K78K721J806n43k513k083M12K642K040
$$ -768 -2473 -1847 722 2844 1854 -578 -2241 -1963 758 2564 2021 -492 -2575 -2163 479 2519
1746B519n20k370j916j08K557K052k2k117k195k27K428K151j42j881k444j78K220
$$ 2519 1999 -371 -2287 -2395 162 2214 2192 75 -2120 -2347 81 2232 2090 209 -2235 -2413 -193
1763a93K249K50j730k474n04K030K149M78j556k743l92J855K233O40j329k719
$$ -193 2056 2306 576 -1898 -2402 -372 1777 2255 699 -2044 -2436 -581 1652 2292 963 -1756
1779a756p35J819K115R41j461k416j081J677K227J112j308k513j074J305K215
$$ -1756 -2491 -672 1443 2384 923 -1493 -2574 -897 1330 2442 1134 -1379 -2453 -1148 1067
1794A067J440j096k609j061J032K093J424q36k427j435R18K321J591q99k137j494
$$ 1067 2507 1411 -1198 -2259 -1227 866 2290 1454 -973 -2408 -1490 831 2422 1523 -614 -2108
1810b108N51K052J741o51k128j573L38K272J690m56k150j553J55K049J955k40
$$ -2108 -1557 495 2236 1585 -543 -2116 -1778 494 2184 1728 -422 -1975 -1820 229 2184 1944
1826A944k270j638n8J990K054m2j693k247Q3J429K526j67k021j557p37K093K022
$$ 1944 -326 -1964 -2022 -32 2022 1980 287 -1960 -1877 -448 2078 1911 -110 -1667 -2404 -311 1711
1843A711K15j529j938p18J612K335K01j325k159l28J325J996O41j394k149o40
$$ 1711 1926 397 -1541 -2259 -647 1688 1889 564 -1595 -1923 -598 1398 2039 645 -1504 -2144
1859b144J427K079Q18j274k156p43J085K082Q80q34k421r88J141K091J018p47
$$ -2144 -717 1362 2180 906 -1250 -1993 -908 1174 2054 1220 -1201 -2189 -1048 1043 2061 1314
1875A314k407r14Q05K032J295q35k216r56Q74J533J567p66j927j232M38J748J480
$$ 1314 -1093 -2007 -1202 830 2125 1290 -926 -1882 -1008 525 2092 1326 -601 -1833 -1395 353 1833
1892A833m41k006j052K34J644J701k72j887j341q0J873J452o9j954j297J63J587
$$ 1833 1392 -614 -1666 -1432 212 1913 1641 -246 -1587 -1667 206 1658 1589 -365 -1662 -1499 88
1909H8J689j64j774j683J41J411J677K47j464j508n58J645J990j91j251j456o04
$$ 88 1777 1613 -161 -1844 -1703 -292 1385 1632 168 -1340 -1898 -253 1737 1546 295 -1161 -1765
1926a765J364K081K9j205j785m91J174J890L21q58j814q58J287J921O16j117j791
$$ -1765 -401 1680 1709 504 -1281 -1772 -598 1292 1613 755 -1059 -1917 -630 1291 1907 790 -1001
1943a001p04J055J337J019p59j701j226J194J839P85r51j779q63P37J600R72o71
$$ -1001 -1705 -650 687 1706 947 -754 -1980 -786 1053 1838 887 -892 -1755 -1018 582 1554 883
1960H83j675r48L56J856R98n8j798j406Q41J203J195k35j565j192R3J692J431
$$ 883 -792 -1740 -1384 472 1470 1412 -386 -1792 -951 252 1447 1212 -353 -1545 -1452 240 1671
1977A671j64j576j809P37J359J207j39j389j149O5J204J328K88j576j533K24J059
$$ 1671 1507 -69 -1878 -1141 218 1425 1286 -103 -1252 -1187 17 1345 1633 57 -1476 -1252 -193
1994a93J455kj078j266j44J133J663m5j101j609j69R48J694L43j252j332o42J174
$$ -193 1262 1260 182 -1084 -1228 -95 1568 1523 422 -1187 -1356 -408 1286 1629 377 -955 -1597 -423
2012d23J534K88r33j464o32J033J574N50j030j361o52Q84J664N08q28j376p41
$$ -423 1111 1399 466 -998 -1630 -597 977 1527 497 -864 -1516 -632 1032 1540 712 -664 -1405
2029a405N71J462Q37n22j619r07O46J539Q71k73j669j016P01J239R36j36j566
$$ -1405 -834 628 1465 943 -676 -1583 -937 602 1473 1200 -469 -1485 -784 455 1391 1255 -311
2046c11j239N89J442R19k91j462q94O18P99R93J7j318j081K18R99J312p1j355
$$ -311 -1550 -961 481 1400 1109 -353 -1247 -629 170 1163 1180 -138 -1219 -1001 -2 1310 1239 -116
2064a16r59j51J231J165J00j365r94j36J175J151J92j222j335K06P13J189O57
$$ -116 -1075 -1226 5 1170 1270 -95 -1089 -1225 -50 1101 1293 71 -1264 -1058 -345 844 1501
2081A501p52j594o51J196J311K2n43j258m50N61J502M74r08j164n93P94J457L82
$$ 1501 749 -845 -1496 -300 1011 1033 490 -768 -1218 -657 845 1319 411 -753 -1346 -552 905 1287
2099A287p78j192n88O05J342M87n10j368n68M87J490N67l99j343o56M13J275P53
$$ 1287 509 -683 -1271 -666 676 1163 653 -715 -1283 -796 694 1261 862 -481 -1137 -724 551 1304
2117A304o84r44q87M51J186N88j95r85j099O73R21Q00j19j169r98K39J067R07
$$ 1304 620 -324 -1211 -760 426 1014 819 -166 -1265 -592 329 1129 1010 -159 -1157 -918 149 1056
2135A056l08j108q24J01J264P32J48j164j144M00Q18R29q0o02j247l03J489Q72
$$ 1056 748 -360 -1184 -1083 181 913 1061 -103 -1247 -847 -29 900 820 218 -1029 -1332 157 1029
2153A029j21q95q15l66Q93J413q8r16j061J28P01R53K21r54r10j78N71R18O75
$$ 1029 908 13 -802 -1168 -275 1138 1050 134 -927 -799 -98 855 1076 122 -788 -966 -395 523 1198
2172A198j029p86k26K03J440K07o61j030n60O52J184M16p34q11l37L88Q60P49
$$ 1198 169 -617 -843 -640 800 1007 346 -684 -1244 -592 592 1008 274 -537 -874 -486 374 1123
2190A123q02o49r29L79J148J023q01p99p64L67Q37P47l32o52q27K41J335J74k68
$$ 1123 321 -328 -1257 -878 270 1293 492 -307 -1071 -704 133 880 548 -104 -931 -690 645 819 551
2209E51o16p92j0J564K85m61p56r92q8J105J087j43n16p14m61J414K35K43r90
$$ 551 -65 -857 -867 697 982 521 -235 -1227 -1315 -210 877 734 218 -496 -957 457 692 935 -55
2228e5q05K23P10O14J40q02q64J43M32R65J17p26p93j40N91R54K27p02q58m0M86
$$ -55 -860 -637 73 687 827 25 -839 -696 -264 701 818 92 -701 -841 -250 704 931 229 -629 -669 -183
2249a83O86M02n69q89l10M59J037J65j44j045l26M89J016j00m30p16k77N64M64
$$ -183 503 905 336 -553 -863 -404 633 798 654 -391 -717 -228 788 688 258 -458 -735 -171 293
2268B93K70k28n93n04L57P14M92l04o12n35K6R62M98n17o04m32J45P19N99k37
$$ 293 563 335 -258 -762 -405 309 801 497 -115 -650 -624 338 836 319 -285 -717 -572 147 746 509
2288E09p58n46L62N45N99j81p31n34L2Q39N38r6q15m79j8R79L34L1n35p68LP87
$$ 509 -249 -795 -433 112 711 530 -201 -735 -703 136 674 578 -237 -716 -734 245 579 610 75 -693 -690 97
2310I7N85P9m85r75M2M66P09J09m66p57j44O38N24K73m06q78j55P12N20J95n13
$$ 97 682 761 276 -699 -657 -191 518 627 161 -596 -740 -102 422 695 289 -589 -744 -32 488 683 170
2331A70n77l79N39O81K63m19o66l63L70P83K11k41q20k85L65P35M38l95o14m46
$$ 170 -407 -786 -247 434 697 278 -388 -751 -381 402 613 372 -448 -733 -368 367 805 410 -204 -650
2351f50K17P63M68m48n58m94K60O13N19j97o15n13P2O03P12l13o48l88O3N36P62
$$ -650 -433 330 798 350 -208 -702 -442 171 690 493 -122 -635 -563 40 752 439 -209 -597 -534 2 764
2372G64k31o12o04J86N49N93j22m81n15j65P27M96n0n45m70r6P05N63n3l96o30
$$ 764 533 -79 -683 -497 52 645 523 42 -473 -638 89 585 535 -10 -480 -576 129 692 639 243 -387
2393c87l14O30O24O8m16p45jM03O21J33k23r94m1O41L97k10K29m61p91O46M05
$$ -387 -701 -71 553 621 205 -540 -541 -138 483 616 393 -601 -642 -1 396 186 415 -46 -837 -191 214
2414B14K61l75l48n49M38P61J6j82o12m06L98Q64K35j82o75n17K75O81L43m64
$$ 214 475 100 -248 -797 -359 402 418 236 -376 -782 -384 480 715 533 -142 -659 -384 297 640 176
2434A76k65o02L13N96M05k86l26n16R1M47O15k37n15l14PN45L94k51m10l54Q4
$$ 176 -89 -691 -378 218 623 337 11 -505 -414 33 648 411 -104 -418 -411 134 528 277 -133 -487 -403
2455d03L53N45o9o26l99J45N08L58N0l34m49j83N87L95n6n92l03r7M67M92J14
$$ -403 -50 495 426 -200 -599 -454 54 412 462 128 -321 -504 83 478 422 -170 -473 -570 -103 389 503
2476E03n51l19o9L85N41M1l93n03J4J64N12J28j79o53j73M01N44J92m49l68l68
$$ 503 -48 -367 -436 -51 490 531 138 -365 -351 -187 325 453 274 -379 -552 -151 393 585 136 -232 -600
2497f00L90N05J89j56n59j99L14M19J83j37n71l92L38N76K12k22n81k64L31L10
$$ -600 -210 295 484 328 -231 -430 -116 303 486 349 -222 -614 -276 300 512 290 -291 -555 -224 86
2517H6L39j82l59l96J66M62L14M8n07m37K44K80L01p0k52m30J86K05M44L8n71
$$ 86 425 243 -116 -512 -346 116 430 478 -29 -466 -222 58 359 289 37 -393 -207 -2 442 480 -91
2538i1l38k3M05L55nl28k05o1K42M75j27k24k66j96K96N11M4l47m85J8J01O32
$$ -91 -429 -452 -47 308 303 -25 -230 -291 -49 426 299 75 -191 -387 -91 420 464 117 -368 -350 -249 383
2560C83j54j35m23j08L46L36K99l64l48o5k11Q07no2m99j68M05K47J06L2n36m20
$$ 383 229 94 -329 -437 -91 245 544 180 -168 -233 -444 363 358 296 -203 -371 34 281 387 419 -117 -537
2582e37L22M75J46j70k75m46K75L63K03j02j16m27J44lJ72M32l54q32N73o7O75
$$ -537 -215 260 406 236 -39 -485 -210 153 356 254 138 -289 -145 -148 24 456 102 -730 -157 -224 451
2603D51J36p37m11K55K15L51r2R4l65j92K67L87k6m78k51K79L17J34J23m92o99
$$ 451 587 -150 -561 -306 -91 260 168 262 -103 -295 -28 359 333 -145 -396 -117 200 334 457 -35 -734
2624g34L59M32O35l37l48k19k80N19K97j24Rk73l98J89P63j59J32m86k78RO21
$$ -734 -375 57 692 355 7 -212 -492 27 324 200 209 -64 -462 -273 490 331 463 -23 -301 -292 329
2645C29j3j40k76k01L33K78L35j54n36k0o8K07K65m4m48j50j09L13K43J26p80
$$ 329 316 176 -100 -301 32 310 645 491 -45 -65 -133 74 339 295 -153 -303 -412 -99 144 270 -510
2666e10Q2N5L29L81m3n81j02J88j0N81j28k79l45p6M87J80R5j75l17O5J15L85
$$ -510 -428 -373 -44 337 294 -287 -389 -201 -211 370 242 -37 -382 -458 29 209 304 129 -188 -123 -8 377
2688C77k04j04l36O4J86L13j16j97j13l14M20J91J05k36k21o2K60K82k3j87k73
$$ 377 173 69 -267 -203 -17 296 180 -17 -130 -444 -24 167 272 36 -185 -247 13 295 272 85 -188
2709a88j52K23K63J94k56l62N3J40J70J88l34qj45Q5M59J5l26k48J1o7N24J28
$$ -188 -340 -117 146 340 84 -278 -225 -85 85 273 -61 -69 -214 -129 330 345 19 -229 -218 -285 239 367
2731C67k72j15l92L34J61K05o4l57n2l6L27QK6k10l7j6J46J96j27k05LL10k71
$$ 367 95 -20 -412 -78 83 288 224 -133 -185 -221 106 114 140 -70 -107 -123 23 219 92 -113 -110 200 -71
2754g1J70Mj20n5j71J25N84n06n8j40K14K89k82j61K85o94N51J54O9L36n22p11
$$ -71 99 103 -17 -72 -243 -118 466 -40 -98 -238 -24 265 -17 -178 107 -587 -36 118 187 523 1 -710
2776g10R31m28N56j94k73q8k18%M34J03J22m72L7J23R7j73L08m95K05kK04J46
$$ -710 221 -207 349 155 -118 -206 -424 -424 10 113 235 -237 -200 -77 20 -153 155 -340 -135 -137 67 213
2798B13j75j34k19K26K15K76k17k28j83O5J47L02pm02o9M9J59J55j56q4o0J04
$$ 213 38 -96 -315 -89 126 402 185 -43 -226 -161 -14 288 281 -121 -190 -141 18 173 17 -67 -127 -23
2820b3J05K22l00o0m1p1J67J37J19k38q4m8J24J68j47k60k0N4J04J95J00k06j67
$$ -23 82 304 4 -56 -97 -168 -1 136 255 17 -67 -115 9 177 30 -230 -250 -196 -92 103 203 -3 -170
2843a70j6L54P2j06j85l08K65J70P0K9j83j13l5K28qL3L5k84mK25J9R0j15k31
$$ -170 -186 168 240 134 -51 -359 -94 76 146 175 -8 -121 -156 72 64 97 132 -152 -156 69 88 178 63 -168
2867a68j03K02K15K5k61M5j76J98J04P3j5l41Q2J35J04J17k27j84q2M0K61K99
$$ -168 -271 -69 146 171 -90 -45 -221 -23 81 154 139 -202 -120 15 119 236 9 -175 -257 -217 44 343
2889C43n24L04l57J50J08K01j51kj85k1K70Q3l3k60n5j77L92J75k03o5r3j87M31
$$ 343 -181 123 -234 -84 24 225 74 72 -113 -134 136 219 186 -74 -129 -306 86 261 58 -7 -100 -287 144
2912A44K6j62J4k42J37R2J25R4j57k24M6N8J58j7j51k2J1J42R0Nk04j15k10L35
$$ 144 170 8 22 -220 -83 9 134 228 71 -153 -107 -49 109 92 -59 -81 -70 72 162 167 -37 -152 -362 -27
2936b7K44j92Rj11j11J88r0J30Ok5o0L1J6K10j2j61k18P2J14J2J38k40N5j40K90
$$ -27 217 25 34 -77 -188 0 -90 40 46 21 -39 -8 8 218 206 45 -173 -101 13 25 163 -77 -22 -162 128
2961A28J25j19k19j68Q0K48O9j34j10j56L24j30K71L5k36k95K71M4J37j04k00
$$ 128 253 134 -85 -253 -173 75 144 10 -100 -256 68 -62 209 244 8 -287 -16 28 165 61 -139
2982a39j44J93R4J72r3k89J52j6J48j02L2j71M7M3n2K26Mj04q5j55K09J13J80
$$ -139 -283 -90 4 176 83 -206 -54 -70 78 -24 8 -163 -116 -73 -125 101 105 1 -84 -239 -30 83 263
3005B63k35k35j5K79m3J33J4q6k32J84K51nk27n3k40J53J29J06l2m3j46k0K80
$$ 263 28 -207 -222 57 14 147 161 75 -157 27 278 273 46 -7 -247 -94 35 141 109 66 -80 -100 180
3028A80j26p5qpr2K42J3j13j23j40J69P1R5j2j80J07j51P4Q3J71k35j68J09R5
$$ 180 54 -21 -29 -36 -128 114 127 14 -109 -249 -80 -9 86 74 -106 1 -150 -76 7 178 -57 -225 -116 -21
3052b1J13O6k11j66Q3Q6J39J45k97j51R1O7K13m9j53p7j31J64K64j73P1L7l58
$$ -21 92 158 -53 -219 -136 -50 89 234 -63 -214 -123 -56 157 108 -45 -122 -253 -89 175 2 73 110 -248
3075b48J54N6K2l1M6p3j36L00K37k28j98J88k13K70L9k79J10k88J48K92m1J44
$$ -248 -94 -38 -16 -47 -1 -74 -210 90 327 99 -99 89 -124 146 185 -94 16 -272 -124 168 127 271
3097B71m92J53K8k8L42k63K2l54J45K17P5J22l42n5j33L59J50j24l37J44J58j5
$$ 271 -221 -68 -40 -68 274 11 33 -321 -176 41 116 238 -104 -159 -292 67 217 93 -244 -100 58 43
3119D3J0pp6n1K2j37K90l3j24M5l2J35J62J6j93j85j67K56J84j04j13r0L4O9K29
$$ 43 53 46 -30 -81 -59 -196 94 61 -63 -18 -50 85 247 263 70 -115 -282 -26 158 54 -59 -149 -115 -46 183
3144A83p8n6k58L29j58K85j19L8m6l26K56jP0m5j35l09M78J94o5j96l8l44M21
$$ 183 105 49 -209 120 -38 247 128 166 120 -206 50 49 119 74 -61 -370 108 302 237 41 3 -341 80
3167H0K53O5k37k44l1O59l41m8J25m48Q7K32J22k03J53m17K96p2lL67l72j07q8
$$ 80 333 398 161 -83 -114 545 204 156 281 -167 -80 152 274 71 224 -193 103 31 28 395 23 -84 -172
3190a72L27j19K13k7k34j26O4J34n6Q9M0j84j82K12N2R2j04j99k4K75R8n1o3j90
$$ -172 155 36 249 222 -12 -138 -74 60 4 93 133 -51 -233 -21 31 123 19 -180 -204 71 169 118 55 -135
3214a35j54M22k74K41j46J0o6Q1j3K84j87jk01L3R9j6K50k87r7P3J20L8ppj78
$$ -135 -289 133 -141 100 -46 -36 -102 -21 -34 250 63 62 -139 -106 -7 -23 227 -60 -157 -84 36 74 67 60 -118
3239a18n2M7K60j28j56Rj5K21L1j15n7k55K98j6J93j8k12J55j16K08L0o5j32j56
$$ -118 -170 -123 137 9 -147 -138 -153 68 99 -16 -73 -328 -30 -46 147 129 -83 72 -44 164 194 129 -3 -159
3263a59J32n5K88lj82j80J0J11J20P1j66j3k44L68J19j49j84J76q2o7K5J02J54
$$ -159 -27 -82 206 203 21 -159 -149 -38 82 153 -13 -26 -270 98 217 68 -116 60 -22 -89 -64 38 192
3286A92m36R0J81N0J1J25k69m6RR6R7j27j33R8J46k6J34m6j36p7J35Q9q9J5o5
$$ 192 -244 -154 27 77 88 213 -56 -102 -93 3 100 -27 -160 -62 84 58 192 146 10 -67 68 157 68 83 18
3311A8j14K3K18j63N8j11k55L87J1j04K6m1K8l1M6J00L7j90N9o1J09J23q2k77
$$ 18 -96 -73 145 -18 40 -71 -326 61 72 -32 -6 -47 -19 -50 -4 96 133 -57 2 -59 50 173 91 -186
3335a86P2l8J74K5P5j45j01oK1Q6N1O4j93R4N6J2J23j09j35p3J05NR7j69j3p3
$$ -186 -114 -152 22 47 122 -23 -124 -130 -109 -23 28 92 -101 -7 49 61 184 75 -60 -133 -28 -23 74 -95 -108 -181
3361a81pQ2J67J3r9j35L4J76j1N0k26%N0J62k3Pj21K2L9O9Nk6j17j70N4K74j70
$$ -181 -188 -106 61 74 -25 -160 -126 50 39 89 -137 -137 -87 75 52 59 -62 -40 -1 68 73 47 -70 -240 -186 88 -82
3388h2K35k4j72m2Q7J49j11j7k28J0L24p7K10k58N1j91P0L4J00j38k6M2pJ24J15
$$ -82 153 129 -43 -85 2 151 40 23 -205 -195 129 52 262 4 55 -136 -66 -32 68 -70 -96 -54 -61 63 178
3413A78j71j38J14m5J0R7p1K3j60J15P7Q3q5k0j24J15J10l1P6k80M0K3J41m6Q3
$$ 178 7 -131 -17 -62 -52 45 -26 -3 -163 -48 29 112 27 7 -117 -2 108 77 153 -127 -87 -64 77 31 114
3438A14k02n0K85k50J06k9j52K34r5J33J7M3k01mk0j2L18j79P0j02j59J25O9n
$$ 114 -88 -138 147 -103 3 -26 -178 56 -39 94 111 154 -47 -51 -71 -83 235 56 126 24 -135 -10 59 54
3462E4j66L4p3K42N5k22L1k03J30K90o2J1j33j15J28Q5Pm5j50Q7j3K5lN0M0k59
$$ 54 -112 -78 -151 91 146 -76 -45 -248 -118 172 110 121 -12 -127 1 86 93 48 -102 -15 -28 -3 -6 44 84 -175
3488a75n0J22L85j07m0L4l39Q0R4O7r0L9j99P8J44J25k06o6J04n6J0L7Q0j53l0
$$ -175 -225 -103 282 175 135 169 -170 -90 4 71 -19 20 -179 -101 43 168 -38 -104 0 -56 -46 -9 71 -82 -112
3513a12O9p7K34j70l3kq3J60K33j18n5k88M1P9J75jj45K3Q5o1J02O4l3k09J05
$$ -112 -43 -120 114 -56 -89 -91 -174 -14 219 101 46 -242 -201 -122 53 52 -93 -70 15 -46 56 120 87 -122 -17
3538a7R2L6Jm7j89L0J41J08o8jK2k37K10k6j5J4j02j08Q3J61O2k26L1q2J06J13
$$ -17 75 111 112 65 -124 -94 47 155 87 86 108 -129 81 55 40 54 -48 -156 -73 88 150 -76 -45 -127 -21 92
3564I2j41J41k43K54k35K14l1j21l4mR5J59r1n0j01P2O5q3K73j88l0n3q2K75n6
$$ 92 -49 92 -151 103 -132 82 51 -70 -104 -108 -13 146 55 5 -96 -24 41 -42 231 43 13 -40 -122 153 97
3589I7j33j68O2K17j28L7Q3o4j59J09K09M5k13j49J28ol7J19k7J01r7j54r2L74
$$ 97 -36 -204 -142 75 -53 -16 67 3 -156 -47 162 207 -6 -155 -27 -33 -70 49 22 123 26 -128 -220 154
3613A54Mk38J83k06J05Q9O0j19l6n4K8J43L0r4r1j01J33K16j28J73m56K70m2q9
$$ 154 158 -80 103 -103 2 91 151 32 -4 -58 -30 113 143 49 -42 -143 -10 206 78 251 -205 65 23 -66
3637f6J93n6o6k1J01J38k99J65j35J19J52k3P5r5n16n7L82K23k22r7j25J44r4
$$ -66 127 71 5 -16 85 223 -76 89 -46 73 225 202 277 182 -334 -391 -9 214 -8 -105 -230 -86 -180
3660a80j20M89J14N06j238L05l56L66%K23K43j79k56L69j08k71m69Q07n98K38
$$ -180 -300 189 303 809 -429 -124 -480 -114 -114 109 352 173 -83 286 178 -93 -562 245 -353 -115
3680a15k89j025J679n78M27oK90k67l98O92l03K79n52K00rm45K70L12J19l47p9
$$ -115 -404 -1429 250 -328 99 93 383 116 -282 410 107 386 -166 34 25 -420 -150 162 281 -66 -145
3701a45P7j2J64P5j04j03L0j18J96l6K8j98J86m3J72k5k9j93k1j0J46J13k56n2
$$ -145 -68 -80 84 159 55 -48 -18 -136 60 24 52 -146 40 -3 169 144 115 -78 -99 -109 37 150 -106 -158
3725a58K61k18P8Q9lj19j19J46J78l7o4k7o5k6n3L68j89o3j15J23j1R8M4k70Q
$$ -158 103 -115 -37 52 49 -70 -189 -43 135 98 34 7 -58 -84 -137 231 42 -21 -136 -13 -24 74 118 -152 -144
3750a44J35J74j40R8j81j53J64k5J11R9r9j54J59l8K71j79l7n9j37Q1J07M4j31
$$ -144 -9 165 25 123 -58 -211 -47 -72 39 138 39 -115 44 6 277 98 61 2 -135 -54 53 97 -34
3773c4j2QJ6R5r1k9p4P0lJ04J04K0k23p4J25J80k0n3j29j4J2J73N4j19k00J77
$$ -34 -46 -38 -22 73 -18 -47 -121 -51 -54 50 154 174 -49 -123 2 182 162 109 -20 -34 -22 151 205 86 -114 63
3799F3JL74m17J97n3p44J99M38K70N7m79j30J00J47K14l68r1P6J93Q3l9L0n8j10
$$ 63 64 438 21 218 165 -579 -380 58 328 385 -94 -224 -124 23 237 -131 -222 -146 47 130 91 121 63 -47
3823d7J48L2N4j44o11O59j30N90l00k69j24L21L5J41o46O24k16j09Q1R4k39k46
$$ -47 101 133 187 43 -568 91 -39 551 251 -18 -142 179 214 355 -291 333 117 8 89 183 -56 -302
3845c02p4M45k19j61M68J1j43o8Q8j26L00k73J05jp1l5J04R4j82L8j79J74J04
$$ -302 -376 69 -150 -311 157 168 25 -43 45 -81 219 -54 51 50 -21 -56 48 142 -40 -2 -181 -7 97
3868I7K1j04p8n7p1L34qn2k31o5K84K3n7r0p9O9j7J06P2J2j74J5m1K64Po2j29
$$ 97 118 14 -64 -121 -192 142 134 82 -149 -214 70 93 36 -54 -133 -64 -81 25 97 109 -65 -50 -91 173 180 118 -11
3895a1K3k28J71R1l1q0K29l40J58J42J02k48r2L4Q8K24oj49r8J00k34J70J03j62
$$ -11 12 -216 -45 46 15 -65 164 -176 -18 124 226 -22 -114 -80 8 232 226 77 -21 79 -155 15 118 -44
3919d4N1q5j6K65r1j41k7p9J79J17j98P3k11R6P9J16j62Q1j00k0R8K03P6k65p1
$$ -44 7 -78 -94 171 80 -61 -88 -167 12 129 -69 4 -207 -111 -32 84 -78 3 -97 -117 -19 184 260 -5 -76
3944g6J71k06Q7P6O3j16P8QNO5p4j64j04K12LJ35L0k34k89K98M1J74L1k14k25
$$ -76 95 -111 -24 52 115 -1 77 85 90 155 81 -83 -187 25 28 163 193 -41 -330 -32 9 183 214 0 -225
3969b25J03P5J28k6J7k08N0J31J13j85q4O9o1N5J49k0j29j0j44K23N1j51L1l4
$$ -225 -122 -47 81 55 72 -136 -86 45 158 -27 -111 -42 -103 -48 101 81 -48 -58 -202 21 72 -79 -48 -82
3993h2j64K37J35K7j35k79K11p9K06N1j32j45J91j71K43p2N4k06j15L12J75k41
$$ -82 -246 -9 126 153 18 -261 -50 -129 77 128 -4 -149 42 -129 114 42 96 -110 -225 87 262 21
4015B1r0o9L6O7RL36q2k36j06J40k4M2o4J4j96R4K07K04j89j68J27j02J38P9k38
$$ 21 -69 -138 -102 -35 -26 310 228 -8 -114 26 2 44 -20 -6 -202 -108 99 303 114 -54 73 -29 109 188 -50
4040e0Jj63J08O9K30j61K5l87J89L43q3J22l17M3j17J98J18Ll51J86j89K32q5
$$ -50 -49 -212 -104 -35 195 34 59 -328 -139 204 121 243 -74 -31 -148 50 168 171 -180 6 -183 49 -36
4063c6N5M8k21j27P1N85k40j61j71n4K21J79j67j59JJ63L01j94m8j59l14L99J85
$$ -36 19 67 -154 -281 -210 375 135 -26 -197 -251 -30 149 -18 -177 -176 -13 288 94 46 -113 -427 -28 157
4086A57k38j09K88n46J47N26k39J62Q9m99J93k25q7L30L10j94l35nO31j65n9k8
$$ 157 -81 -190 98 -448 -301 225 -14 148 237 -262 -69 -294 -381 -51 259 65 -270 -275 356 191 132 104
4108A04k90r2N85m75J98k68K23j86O43j0k59M7k09l75K84n0K69k60j00k0N05N
$$ 104 -186 -278 307 -168 30 -238 -15 -201 442 432 173 220 11 -364 -80 -130 139 -121 -221 -241 264 269
4130B69j64k19j18L53m48N60r8r4j03j05L80m4N4n38M40n89L76K72l27K9k3k30
$$ 269 105 -114 -232 121 -327 233 135 41 -62 -167 213 169 223 -315 125 -464 -88 184 -143 -114 -137 -367
4152c67M16J39M3k05j64j18R7L41n9j73o4R1K11j23p5J69k95r1K42l2K80j19k71
$$ -367 49 188 231 26 -138 -256 -159 182 123 -50 -114 -23 188 65 -10 159 -136 -227 15 -17 263 144 -127
4175a27L2oN6K79j98k53J11O0J61L6m6k37R4r1K66mJ01k53k32J92J44J08l6k08
$$ -127 -95 -101 -45 234 36 -217 -106 -46 115 151 105 -132 -38 -129 137 133 234 -19 -251 -59 85 193 157 -51
4199e1k15K25N8K09N4k94n5O6j5L4J03j44k30J92Q5P9K04k84k33J17JK18J95l20
$$ -51 -266 -41 17 226 280 -14 -69 -3 -18 16 119 -25 -255 -63 22 101 305 21 -212 -95 -94 124 319 -1
4223aj69O2K45P1j09o0j50n7M0J2L51k4l00j18J48J29M8j83n0j56K96R1O6l11
$$ -1 -170 -108 137 208 99 39 -111 -168 -128 -116 235 211 -89 -207 -59 70 118 -65 -115 -271 25 116 182 -129
4247a29n5J04pL34mn1l82O6P3J42R1j44j37j65J75K31J57m08J9o0L4K52n0M8l35
$$ -129 -184 -80 -87 247 243 192 -190 -124 -51 91 182 38 -99 -264 -89 142 299 -109 -90 -150 -116 136 86 134 -201
4272b01Q0p8K24K99k19j40j54K33R6j16K44l65l1QJ94R4l1j37k90N7L66Rp5%l64
$$ -201 -121 -199 25 324 105 -35 -189 44 140 24 268 -97 -128 -120 74 168 137 0 -290 -233 133 142 67 67 -297
4297b97Q8K53J54m2k14O2j50K28Q6L6o7j68l5P9P2J7j05k08K68L2N8ro9k16m0
$$ -297 -209 44 198 156 -58 4 -146 82 168 204 137 -31 -66 13 85 102 -3 -211 57 89 147 138 69 -147 -187
4322a87J75K26K1r4k77Q0jJ32Q1j20k90M1J34J05J66k01j51p3K06J81ll5j26k21
$$ -187 -12 214 235 141 -136 -56 -57 75 156 36 -254 -213 -79 26 192 -9 -160 -233 -27 154 151 116 -10 -231
4346b31J40L47j94jj67j01J66K77o7m2l28J58kJ88l7Lj22k25J26K61K9ol13q6
$$ -231 -91 256 62 61 -106 -207 -41 236 169 127 -201 -43 -45 143 106 109 -13 -238 -112 149 178 172 -141 -227
4370b27Q9J01K94j48k40k5q2L78N3j09p6j81K04K4P4P0j79k62M6K05O5M8j66j74
$$ -227 -138 -37 257 109 -131 -156 -238 140 193 84 8 -173 31 55 129 199 20 -242 -196 9 74 122 -44 -218
4394b18p9M79j33J76k46j32Q8K11Q9j10n4l8j50K23O9N1k66j28N9rK79P1j83j49
$$ -218 -297 182 49 225 -21 -153 -65 146 235 125 71 33 -117 106 175 226 -40 -168 -109 -118 161 232 49 -100
4418a00j74J80J14J48P1l38j03K65M4J85r4m09J00M7J78J17j63j19o8oK43P6j52
$$ -100 -274 -94 20 168 239 -99 -202 63 107 292 198 -211 -111 -64 114 231 68 -51 -119 -125 118 194 42
4441D2j92K2N0J36K06l54j7j49J56K55L4n3j94j28Q3J75J01j19o9j66n6K33J93
$$ 42 -150 -128 -78 58 264 -90 -107 -256 -100 155 189 136 -58 -186 -103 72 173 54 -15 -181 -237 -4 189
4464A89j59k61Q6LJ41J29K06k87k67K0K75J8K41j92m52J94J2L09J46k48m13Q5
$$ 189 30 -231 -145 -142 -1 128 334 47 -220 -200 75 93 334 142 -310 -116 -104 205 351 103 -310 -225
4486b25J93J67n5J34l88p4K29K99N0k56m17pK01M06q8m2k77Pk2K47J84j72k12
$$ -225 -32 135 80 214 -174 -248 -19 280 330 74 -343 -350 -149 257 169 127 -150 -143 -165 82 266 94 -118
4509a18j39M8K90J78p2l28j07N6K81R0n5j12r6j18L53J00o5j70l59L41Q9J44n9
$$ -118 -257 -209 81 259 187 -141 -248 -192 89 179 124 12 -84 -202 151 251 186 16 -343 -2 87 231 172
4532A72j93j61O6K76Q2k16j68j8%K01R6K7j60k46K7L63J48r9r6k79J06R5K86N1
$$ 172 -21 -182 -116 160 242 26 -142 -160 -160 41 137 164 4 -242 -215 148 296 197 101 -178 -72 23 309 360
4556C60l88j91K9M74p9K8k80k66J22K15K64q1r7l68j40M80J34l0k40K7j44K62
$$ 360 -28 -219 -190 284 205 233 -47 -313 -191 24 288 207 110 -258 -398 82 216 186 -54 -27 -171 91
4578I1r3J77m5j36k55J79M29l48L09m92m1L64j58N40k51n61J04k96J108l00M8
$$ 91 -2 175 130 -6 -261 -82 347 -1 308 -184 -225 139 -19 521 270 -291 -187 -483 625 325 373
4599C73j94p77K09L82l8L28n58J52j63O53n20mN4j63L33j91K19j21J2j5k91J53
$$ 373 179 -598 -389 -7 -45 283 -275 -123 -286 367 -153 -157 -103 -266 67 -124 95 -26 -14 -29 -320 -167
4621a67N59j48q1n13K79j95J72N27l23m08K12O4K2L49k00l46J46j78K34J98l21
$$ -167 392 244 163 -350 -71 -266 -94 433 110 -298 -86 -22 0 349 149 -197 -51 -229 5 203 -118
4642a18J40j74j10M96L30n00n4l13K54K48R6K9n47n05R25o9J92k07m08M04l73
$$ -118 22 -152 -262 234 564 64 10 -303 -49 199 295 324 -223 -728 197 128 320 113 -295 109 -264
4663b64K09O49l42m87l40N71M6L36L31r34R2J15J42m3n3k11j98JM58L09j13l63
$$ -264 -55 594 252 -235 -575 -4 42 378 709 -225 -133 -18 124 81 28 -183 -381 -380 78 387 274 -89
4685h9j50l3M67j34Q7m27K47N3k3K05j82k07j20K99m1M34Rk96k70o5N7M76P5m34
$$ -89 -239 -272 195 61 148 -279 -32 21 -2 203 21 -186 -306 -7 -48 386 395 99 -171 -236 -179 297 372 -62
4709f2j40j93K75M65l2l91L12o76L17N32k47pK5j07J96K67k60J22m85k06K85K92
$$ -62 -202 -395 -120 345 313 -78 234 -442 -125 407 160 153 178 71 267 534 274 396 -89 -295 -10 282
4731B82J89k62m46j99K96j44L12K72p55j75O89O21l88m78n98P41m86M21r9M93
$$ 282 471 209 -237 -436 -140 -284 28 300 -455 -630 59 680 292 -186 -784 -43 -529 -108 -207 286
4751B86q40K14n3M75N61P4k26o30rO8K47K16k46o0K13l96P99k79j23p76l50N29
$$ 286 -554 -340 -393 82 643 717 491 -139 -148 -80 167 383 137 77 290 -106 693 414 291 -485 -835 -306
4773c06J95J8Q0k05m87O65K87K37o64J27K1nN21m30L07j33p07K56J22J45R5n57
$$ -306 -111 -93 -13 -218 -705 -40 247 484 -180 -53 -32 -37 484 54 361 228 -479 -223 -101 44 139 -418
4795d18K11k04K93K80J0q6n12K59K47k89L90m66l23Q69m35M86j70n54K21K23P5
$$ -418 -207 -411 -118 162 172 86 -426 -167 80 -209 181 -285 -608 261 -174 312 142 -412 -191 32 107
4816A07M08o01K52oJ18k05J82o05P74m22n86P50J46k25q2j67M14M7N1l06k8l57
$$ 107 515 -86 166 160 278 73 255 -350 424 2 -584 166 312 87 5 -162 252 299 350 44 16 -341
4838c41P7L69K7j31k10k85M72J00L46k68l91k12Q4M51K61K0j78l28M3M06m8l54
$$ -341 -264 105 132 1 -209 -494 -22 78 424 156 -235 -447 -363 88 349 369 191 -137 -94 312 264 -90
4860i0m08L5J48M23n1k2R6k66K36l10O36j23o66j4k58L56P36K38p99m31L85rJ065
$$ -90 -498 -463 -315 108 57 35 131 -135 101 -209 427 304 -362 -376 -634 -278 458 696 -103 -534 -149 -158 907
4883I07j065J09j62J75j49Q2N87m36n0p3J31Q8J0P1k73k18N59Q7K06m39j14l50
$$ 907 -158 -49 -211 -36 -185 -103 484 48 -2 -75 56 144 154 225 -48 -266 293 380 586 147 33 -317
4905c17L73J85J4J79q54j9J51N48J55q1l24m27L28J43J73p5l75j54J07L49L91
$$ -317 56 241 255 434 -420 -439 -288 260 415 334 10 -417 -89 54 227 152 -223 -377 -270 79 470
4926D70k52k60l89p1O63J60K4l29n20K00L52J73J89m74l03J72K22L92j80j95l21
$$ 470 218 -42 -431 -502 161 321 345 16 -504 -304 48 221 410 -64 -367 -195 27 419 239 44 -277
4947b77J37J87J61p0k25k73O1K05L95J50n51k92R0L37K91N9l00k06k42L05L26
$$ -277 -140 47 208 138 -87 -360 -299 -94 301 451 -100 -392 -302 35 326 385 85 -121 -363 -58 268
4968B68K36l49n38J34R9L30Q6k02k45j29J40M05K00j70m71o6J70L53p3r9k27l09
$$ 268 504 155 -383 -249 -150 180 266 64 -181 -310 -170 235 435 265 -206 -272 -102 251 178 79 -148 -457
4990d57K60L64K32j73l07k13p5O32J84l24k34j84K48J22J36J40m95j15J7L46L04
$$ -457 -197 167 399 226 -81 -294 -369 263 447 123 -111 -295 -47 75 211 351 -144 -259 -242 104 408
5011D08M2m61k85O6J61M34j41l08l30J85J92M23k67k04j88q3M78K76j23j33n39
$$ 408 450 -11 -296 -230 -69 365 224 -84 -414 -229 -37 386 119 -85 -273 -356 122 398 275 142 -397
5032c97m5N12P2J56k42l56m3L27K95P3j72l93k10L83J26K32k87k01j33L99K31
$$ -397 -442 70 142 298 56 -300 -343 -16 279 352 180 -213 -423 -40 86 318 31 -170 -303 96 327
5053C27Nk19m70j06K63L91R0j70l20r0L8L37J09K9l97j37P8M41K51l73k40k74
$$ 327 332 113 -357 -463 -200 191 281 111 -209 -299 -261 76 185 214 -183 -320 -242 199 450 77 -163 -437
5075d37K21L65J34q5k79l47R1M74L10n6m90m6K5J64K81n2l10m04K10K94L25k2
$$ -437 -216 149 283 198 -81 -428 -337 137 447 391 -99 -145 -120 44 325 273 -37 -441 -231 63 388 366
5097C66m42k95mM37K83R0k89l76j76L39M00nk84m36J32L51L19j13m28j91jK44
$$ 366 -76 -371 -375 62 345 435 146 -230 -406 -67 333 328 44 -392 -260 91 410 297 -131 -322 -323 -79
5119g9L53O1k02m01p4K49L68J14k31k97j41K15L00K82k43m97k10L75L16J12j48
$$ -79 274 335 133 -268 -342 -93 275 389 158 -139 -280 -65 235 517 274 -223 -433 -58 258 370 222
5140B22m19j52j5N89R8j83l77r2P0N00J09k00l41j39J06L48L00k31l30j72J7M66
$$ 222 -197 -349 -364 225 323 140 -237 -329 -259 241 350 150 -191 -330 -224 124 424 193 -137 -309 -292 174
5162A74L06j66m66k39J65M33J42j24j56l21NK92J36J03k93k40m0L79K09P7m52
$$ 174 480 314 -152 -391 -226 207 349 225 69 -252 -247 45 181 284 -9 -249 -289 90 299 376 -76
5183g6k43l27M79L80J81n48k47Q2K48K50J93k12n68L0M64J69J49l88k65k07M35
$$ -76 -319 -646 -167 213 394 -154 -401 -319 -71 179 372 160 -408 -378 86 255 404 16 -249 -456 -21
5204b1L87m5k28l89lK42L87Nn6m14l30K66L32J74k06m07j08K20M28Q6q2m01k69
$$ -21 366 321 93 -296 -299 -57 330 335 279 -135 -465 -199 133 307 101 -306 -414 -194 234 320 238 -163 -432
5227d32R5M31K85J0n71j67K17L72J08k5l87k51J33J37M66j54m49j44J0N87K33
$$ -432 -337 94 379 389 -182 -349 -132 240 348 323 -64 -315 -182 -45 421 267 -182 -326 -316 271 504
5248E04m31k0l14k15N55L22J0n14j71Q7K39L28o4l16k34J8K05L08Q9k38m45j69
$$ 504 73 53 -261 -476 79 401 411 -103 -274 -187 52 380 316 0 -234 -216 -11 297 386 148 -297 -466
5270d66M43L35P8l68k94k91M66L91P4k23m06j5K69L36J75l37l56l01N28J93N5
$$ -466 -23 312 390 22 -272 -563 -97 294 368 145 -261 -276 -7 329 504 167 -189 -490 38 231 286
5291B86j51m39q4K85M16M1r5o40O3J87L00K52j73l99j45J56K50K59j03m43j31
$$ 286 135 -304 -388 -103 313 354 259 -381 -318 -131 169 421 248 -151 -296 -140 110 369 266 -177 -308
$$ [...]
8191a20
##END NTUPLES=NMR FID
##END=
