##TITLE=1H_SR5_rmo
 ?, 8 sc, 
 27.12.2019
##JCAMPDX= 6.0         $$ Bruker NMR JCAMP-DX V2.0
##DATA TYPE= NMR FID
##DATA CLASS= NTUPLES
##ORIGIN= UXNMR, Bruker Analytische Messtechnik GmbH
##OWNER= root
$$ XWIN-NMR		Version 3.5
$$ Fri Dec 27 13:51:36 2019 Russian Standard Time (UT+4h)  she@DPX200
##.OBSERVE FREQUENCY= 200.1315
##.OBSERVE NUCLEUS= ^1H
##.DELAY= (6, 6)
##.ACQUISITION MODE= SIMULTANEOUS
##.ACQUISITION SCHEME= undefined
##.AVERAGES= 8
##.DIGITISER RES= 18
##SPECTROMETER/DATA SYSTEM= spect
##.PULSE SEQUENCE= zg30
##.SOLVENT NAME= CDCl3
##.SHIFT REFERENCE= (INTERNAL, CDCl3, 0, 15.7039)
##AUDIT TRAIL= $$ (NUMBER, WHEN, WHO, WHERE, WHAT)
$$ ##TITLE= Audit trail, XWIN-NMR		Version 3.5
$$ ##JCAMPDX= 5.01
$$ ##ORIGIN= Bruker BioSpin GmbH
$$ ##OWNER= she
$$ F:/spectra/data/she/nmr/H-F/1/audita.txt
$$ ##AUDIT TRAIL=  $$ (NUMBER, WHEN, WHO, WHERE, WHAT)
(   1,<2019-12-27 13:49:47.26 +0400>,<she>,<DPX200>,
      <created by zg, POWCHK disabled, PULCHK disabled
       configuration hash MD5:
       00 E9 B6 7A A2 85 ED C7 34 08 36 98 17 FE 4E 26
       data hash MD5: 16K
       BC 46 0C 43 EE D3 80 F3 BA 02 17 6F 37 FA F4 B0>)
$$ ##END=
$$ 
$$ hash MD5
$$ 97 1C 78 D8 91 8B F1 FA 43 00 BF A5 12 72 C9 C9
##$RELAX= 
##$RELAX= 
##$RELAX= 
##$RELAX= 
##$RELAX= 
##$RELAX= 
$$ Bruker specific parameters
$$ --------------------------
##$DU= <F:/spectra>
##$EXPNO= 1
##$NAME= <H-F>
##$PROCNO= 1
##$TYPE= <nmr>
##$USER= <she>
##$AMP= (0..31)
100 100 100 100 100 100 100 100 100 100 100 100 100 100 100 100 100 100 
100 100 100 100 100 100 100 100 100 100 100 100 100 100 
##$AQSEQ= 0
##$AQ_mod= 1
##$AUNM= <au_zg>
##$AUTOPOS= <>
##$BF1= 200.13
##$BF2= 200.13
##$BF3= 200.13
##$BF4= 200.13
##$BF5= 200.13
##$BF6= 200.13
##$BF7= 200.13
##$BF8= 200.13
##$BYTORDA= 1
##$CFDGTYP= 0
##$CFRGTYP= 5
##$CHEMSTR= <none>
##$CNST= (0..31)
1 1 145 1 1 1 1 1 1 1 1 1 1 1 1 1 1 1 1 1 1 1 1 1 1 1 1 1 1 1 1 1 
##$CPDPRG= <>
##$CPDPRG1= <>
##$CPDPRG2= <>
##$CPDPRG3= <>
##$CPDPRG4= <mlev>
##$CPDPRG5= <mlev>
##$CPDPRG6= <mlev>
##$CPDPRG7= <mlev>
##$CPDPRG8= <mlev>
##$CPDPRGB= <>
##$CPDPRGT= <>
##$D= (0..31)
0 1.2 0 0 0 0 0 0 0 0.06 0 0.03 0 0 0 0 0.0002 0 0 0 0 0 0 0 0 0 0 0 0 
0 0 0 
##$DATE= 1577440186
##$DBL= (0..7)
120 120 120 120 120 120 120 120 
##$DBP= (0..7)
150 150 150 150 150 150 150 150 
##$DBP07= 0
##$DBPNAM0= <>
##$DBPNAM1= <>
##$DBPNAM2= <>
##$DBPNAM3= <>
##$DBPNAM4= <>
##$DBPNAM5= <>
##$DBPNAM6= <>
##$DBPNAM7= <>
##$DBPOAL= (0..7)
0.5 0.5 0.5 0.5 0.5 0.5 0.5 0.5 
##$DBPOFFS= (0..7)
0 0 0 0 0 0 0 0 
##$DE= 6
##$DECBNUC= <off>
##$DECIM= 24
##$DECNUC= <off>
##$DECSTAT= 4
##$DIGMOD= 1
##$DIGTYP= 9
##$DL= (0..7)
0 120 120 120 120 120 120 120 
##$DP= (0..7)
150 150 150 150 150 150 150 150 
##$DP07= 0
##$DPNAME0= <>
##$DPNAME1= <>
##$DPNAME2= <>
##$DPNAME3= <>
##$DPNAME4= <>
##$DPNAME5= <>
##$DPNAME6= <>
##$DPNAME7= <>
##$DPOAL= (0..7)
0.5 0.5 0.5 0.5 0.5 0.5 0.5 0.5 
##$DPOFFS= (0..7)
0 0 0 0 0 0 0 0 
##$DQDMODE= 0
##$DR= 18
##$DS= 0
##$DSLIST= <SSSSSSSSSSSSSSS>
##$DSPFIRM= 0
$$ [...]
##$SUBNAM2= <"">
##$SUBNAM3= <"">
##$SUBNAM4= <"">
##$SUBNAM5= <"">
##$SUBNAM6= <"">
##$SUBNAM7= <"">
##$SUBNAM8= <"">
##$SUBNAM9= <"">
##$SW= 24.9337058887773
##$SWIBOX= (0..15)
0 0 2 0 0 0 0 0 0 0 0 0 0 0 0 0 
##$SW_h= 4990.01996007984
##$TD= 16384
##$TD0= 1
##$TE= 0
##$TE2= 300
##$TE3= 300
##$TEG= 300
##$TL= (0..7)
0 120 120 120 120 120 120 120 
##$TP= (0..7)
150 150 150 150 150 150 150 150 
##$TP07= 0
##$TPNAME0= <>
##$TPNAME1= <>
##$TPNAME2= <>
##$TPNAME3= <>
##$TPNAME4= <>
##$TPNAME5= <>
##$TPNAME6= <>
##$TPNAME7= <>
##$TPOAL= (0..7)
0.5 0.5 0.5 0.5 0.5 0.5 0.5 0.5 
##$TPOFFS= (0..7)
0 0 0 0 0 0 0 0 
##$TUNHIN= 0
##$TUNHOUT= 0
##$TUNXOUT= 0
##$USERA1= <user>
##$USERA2= <user>
##$USERA3= <user>
##$USERA4= <user>
##$USERA5= <user>
##$V9= 5
##$VALIST= <valist>
##$VCLIST= <CCCCCCCCCCCCCCC>
##$VD= 0
##$VDLIST= <DDDDDDDDDDDDDDD>
##$VPLIST= <PPPPPPPPPPPPPPP>
##$VTLIST= <TTTTTTTTTTTTTTT>
##$WBST= 1024
##$WBSW= 4
##$XGAIN= (0..3)
0 0 0 0 
##$XL= 0
##$YL= 0
##$YMAX_a= 387767
##$YMIN_a= -154973
##$ZGOPTNS= <>
##$ZL1= 120
##$ZL2= 120
##$ZL3= 120
##$ZL4= 120
##$ABSF1= 10
##$ABSF2= 0
##$ABSG= 5
##$ABSL= 3
##$ALPHA= 0
##$AQORDER= 0
##$ASSFAC= 0
##$ASSFACI= 0
##$ASSFACX= 0
##$ASSWID= 0
##$AUNMP= <proc_1d>
##$AZFE= 0.1
##$AZFW= 0.1
##$BCFW= 1
##$BC_mod= 2
##$BYTORDP= 1
##$COROFFS= 0
##$CY= 11.3945322036743
##$DATMOD= 1
##$DC= 2
##$DFILT= <>
##$DTYPP= 0
##$F1P= 16.9975609425685
##$F2P= -3.02152046262296
##$FCOR= 0.5
##$FTSIZE= 0
##$FT_mod= 4
##$GAMMA= 1
##$GB= 0.15
##$INTBC= 1
##$INTSCL= 1
##$ISEN= 128
##$LB= 0.24
##$LEV0= 0
##$LPBIN= 0
##$MAXI= 10000
##$MC2= 0
##$MEAN= 0
##$ME_mod= 0
##$MI= 1.114404
##$NCOEF= 0
##$NC_proc= 0
##$NLEV= 6
##$NOISF1= 3.799351
##$NOISF2= 2.8
##$NSP= 1
##$NTH_PI= 0
##$NZP= 0
##$OFFSET= 15.70392
##$PC= 1
##$PHC0= -10142.5
##$PHC1= 10.6008
##$PH_mod= 1
##$PKNL= yes
##$PPARMOD= 0
##$PSCAL= 0
##$PSIGN= 0
##$REVERSE= no
##$SF= 200.130013532006
##$SI= 16384
##$SIGF1= 3
##$SIGF2= 2
##$SINO= 400
##$SIOLD= 16384
##$SREGLST= <1H.CDCl3>
##$SSB= 0
##$STSI= 0
##$STSR= 0
##$SW_p= 3612.71676300578
##$SYMM= 0
##$S_DEV= 0
##$TDeff= 0
##$TDoff= 0
##$TI= <>
##$TILT= no
##$TM1= 0
##$TM2= 0
##$TOPLEV= 0
##$USERP1= <user>
##$USERP2= <user>
##$USERP3= <user>
##$USERP4= <user>
##$USERP5= <user>
##$WDW= 1
##$XDIM= 8192
##$YMAX_p= 0
##$YMIN_p= 0
$$ End of Bruker specific parameters
$$ ---------------------------------
##NTUPLES= NMR FID
##VAR_NAME=  TIME,          FID/REAL,        FID/IMAG
##SYMBOL=    X,             R,               I
##VAR_TYPE=  INDEPENDENT,   DEPENDENT,       DEPENDENT
##VAR_FORM=  AFFN,          ASDF,            ASDF
##VAR_DIM=   8192,          8192,            8192
##UNITS=     SECONDS,       ARBITRARY UNITS, ARBITRARY UNITS
##FACTOR=    0.0002004,     1,               1
##FIRST=     0,             0,               0
##LAST=      1.6414764,     0,               0
##MIN=       0,             -154973,         0
##MAX=       1.6414764,     387767,          0
$$ Real data points
##PAGE= N=1
##DATA TABLE= (X++(R..R)), XYDATA
0 0 0 0 0 0 0 1 0 8 -8 8 -15 16 -24 24 -32 39 -47 55 -64 74 -88 104 -120 137 -160 184 -210 238 -270 307
30 307 -346 388 -436 488 -545 607 -675 751 -834 924 -1023 1133 -1255 1389 -1539 1705 -1894
47 -1894 2109 -2353 2636 -2971 3368 -3850 4455 -5235 6283 -7782 10110 -14252 23887 -96354
61 -96354 54851 165726 -136595 -132180 97984 107849 -139329 -154973 -9204 -18982 -127336
72 -127336 -40868 63462 -10594 -71008 67555 123542 -42648 -144745 -22600 37250 -60381
83 -60381 -52504 114113 139636 -7105 -46555 55567 48855 -56476 -39605 81341 99981 29428
95 29428 13937 40074 38376 53185 85418 48063 -18170 22350 109527 77860 -6937 38366
107 38366 147743 128000 20623 1070 51850 55726 41683 73242 92172 68291 82233 125805
119 125805 90132 8988 27455 102503 75608 -2340 34792 129870 115457 47949 79103 137721
131 137721 77524 -15195 10676 83323 67686 28768 72978 129237 101548 52218 52363 52159 21803
144 21803 27932 69900 63105 20513 42431 107536 96321 24661 17207 68576 63985 89 -12769
157 -12769 41090 71427 54413 46565 56880 45240 16260 9395 18925 15519 12747 32157 49340
170 49340 37317 18725 22426 31188 17691 -2159 -2556 7022 4905 1292 16511 38466 34980 10039
184 10039 -6152 -4055 -7769 -23794 -25008 1136 24820 19079 1741 -1412 1368 -8557 -22649
197 -22649 -26725 -23943 -20671 -12017 -59 1947 -3808 -2914 -1734 -19224 -43973 -45486 -25466 -13699
211 -13699 -17060 -12857 -114 -1012 -20589 -34933 -33697 -31264 -34593 -33835 -25209 -16773 -14883 -15738 -17852
226 -17852 -21239 -26691 -34261 -41594 -42546 -35656 -27126 -20812 -16073 -13594 -17789 -26488 -34175 -41202 -46657
241 -46657 -42493 -29341 -20453 -22083 -20217 -12099 -15700 -34798 -45404 -37719 -33143 -40584 -38010 -18641
255 -18641 -7184 -15579 -22401 -19434 -25680 -41144 -44526 -33043 -27169 -27562 -17329 -5077 -11597 -25924
269 -25924 -25071 -19533 -28927 -40315 -30427 -13929 -15757 -21881 -12351 -1229 -9300 -23083 -23205 -19612
283 -19612 -26401 -29389 -17679 -5976 -5040 -4842 -82 -3696 -15873 -21997 -17702 -16790 -17879 -9266 4228
298 4228 7636 1333 -407 792 -4909 -14383 -15982 -8006 -405 3813 7684 10979 11609 8895 3008
313 3008 -3954 -5857 -815 4928 6762 9359 16269 19745 15924 10124 8541 7415 5208 5568 9110
328 9110 13136 17334 23405 24946 20624 16335 15729 13415 6627 6316 16066 24310 24756 24635 28460 28346
344 28346 19408 11145 10894 14076 15675 19112 25362 30065 29724 27442 22975 16745 12540 13451 16370 17111
360 17111 19236 26269 30408 26757 20726 18557 18216 14435 9618 11320 17278 21483 21505 21058 21634 20722
376 20722 16980 10785 7231 7252 10498 11800 12275 15287 19548 19685 13628 6716 3670 2828 1384 1519
392 1519 4760 10881 14583 13485 7668 2294 -289 -1525 -3854 -5169 -1623 5059 6458 3460 803
407 803 853 -874 -6624 -10869 -9985 -6138 -3930 -3417 -2285 -1288 -2420 -5818 -10242 -12658 -11819 -10396 -9916
424 -9916 -10145 -8474 -5043 -4549 -7542 -11446 -11883 -12526 -16315 -19044 -15802 -9050 -5513 -6468 -8470 -8930 -11074
441 -11074 -16037 -20004 -18831 -13864 -9649 -8291 -8320 -8051 -7657 -9594 -13849 -17579 -17101 -13577 -11338 -10723
457 -10723 -9111 -5205 -3178 -6617 -12371 -13497 -11812 -11536 -12346 -11274 -6601 -3956 -4776 -5793 -5702 -5658 -7395
474 -7395 -9665 -10552 -9725 -6895 -3962 -2087 -1494 -144 83 -3455 -8743 -9765 -5872 -2444 -3057 -1992
490 -1992 2458 5231 1030 -3658 -4625 -2570 -2658 -3804 -2230 1318 3971 4582 3560 969 -1391 -482
506 -482 -268 -1961 -2078 1943 6529 5731 1957 2246 4550 3233 -751 -800 2079 2568 1461 2485 5954
523 5954 7074 5700 4735 3634 714 -643 416 1466 2881 6026 8980 7046 3077 2144 3248 2053
539 2053 -850 112 5021 7473 5624 3979 4386 5140 4029 1394 -836 261 3861 6496 5295 3756
555 3756 5727 7033 2954 -970 331 3993 3997 2363 4242 5636 4343 3815 5084 4717 1964 1504 2822
572 2822 1757 -758 2961 8595 7501 3290 4286 6691 651 -4854 -681 6641 5248 695 4308
587 4308 9729 5982 -817 722 4776 2056 -1640 1903 5094 2051 1990 7539 7527 -279 -2687 3707
603 3707 4807 -2321 -2644 6724 8176 55 -2518 3557 5317 -520 -980 4028 3380 -2434 -1666 3799
619 3799 3132 -370 1575 4102 327 -4242 -1939 1573 -146 -705 3869 4603 -1963 -5118 -1614 -351
635 -351 -3482 -3964 818 2306 -940 -2117 -1375 -1960 -2869 -1617 -2969 -6423 -5176 -252 226 -3934 -2875
652 -2875 1309 -904 -7612 -8054 -3144 -3456 -5890 -3292 -739 -4686 -7250 -2971 -223 -5238 -7658 -2668
668 -2668 -2363 -9224 -10232 -1899 506 -5372 -4824 603 -2682 -11879 -10622 -1042 -1208 -7636 -5612 1751
684 1751 -1918 -9506 -6798 -774 -3057 -7126 -3521 -224 -5318 -7807 -1528 1803 -4222 -7258 -1176
699 -1176 1000 -5461 -7139 -131 2912 -2075 -4289 -397 359 -3836 -3418 1316 1193 -2023 -1629 533
715 533 146 -981 1154 3258 1505 -879 -564 179 -582 465 3794 5412 3880 1575 458 369 1306
732 1306 2173 2816 3761 5533 4746 2047 413 3330 5829 3927 2199 3616 4644 2179 1969 5008
748 5008 6526 4196 3724 5418 3812 752 2028 6504 6050 2142 3650 6391 4614 1101 3457 7083
764 7083 4510 227 1874 5193 3859 1037 4138 7566 4667 -270 -781 2058 2631 1575 3087 5260
780 5260 3746 1171 588 1404 414 -227 2073 3391 1468 -1953 -1192 2029 1848 -235 -262 1966 1078
797 1078 -2875 -3654 -293 1931 -231 -705 779 291 -2975 -3568 -681 0 -2544 -2937 -316 -279 -3122
814 -3122 -2528 668 -267 -4079 -4023 -1476 -2192 -4473 -2117 2041 291 -4192 -4426 -1370 -2584 -4910 -2810
831 -2810 780 -48 -3413 -3213 -1271 -2341 -3710 -1694 292 -2135 -4515 -2852 -1054 -1658 -2746 -546
847 -546 1112 -1236 -4087 -2917 -1361 -1564 -2092 -187 1154 -163 -2015 -1752 -588 -1017 -2091 -1447 -466
864 -466 -166 -639 -142 873 728 -423 -1077 -1212 -1165 -991 211 1757 1593 15 -595 684 115 -1607
882 -1607 -1674 1289 2161 -112 -819 638 1870 159 -406 1358 1557 -634 -1660 172 1044 -152 779
899 779 3089 2501 -577 -1548 303 -236 -1651 -419 2129 1948 2 377 2276 1187 -1764 -1310 955
916 955 625 -1352 -432 1855 1816 142 -101 202 -220 -897 -411 579 740 71 832 1033 -407 -840 124
935 124 700 149 -1072 -467 433 618 -149 125 1051 887 -222 -1065 -921 -119 84 406 1153 2090 1292 -68
955 -68 -1079 -427 -566 -695 119 1066 1952 1360 1240 1047 115 -158 291 521 -69 138 1842 2588 1198 658
975 658 1577 1853 419 -833 81 1684 1421 622 1177 2267 1854 1495 1316 1234 486 264 654 1047 1053 1563
995 1563 2790 2202 845 482 773 303 -546 158 1734 2597 1532 1129 1535 900 -272 -830 91 1339
1013 1339 1122 1059 1352 1344 1025 236 -438 -604 -353 509 270 -327 153 631 833 208 -764 -611 -706 -1063 -1363
1034 -1363 -1248 -746 -8 -205 -691 -649 -579 -1311 -2073 -2514 -1909 -1308 -945 -847 -612 -508 -999 -2041 -2978 -2839
1054 -2839 -2332 -2004 -1977 -1679 -680 -819 -1879 -2717 -3193 -2384 -2285 -2806 -2107 -1861 -881 -1084 -2417 -2526 -2178 -1590
1074 -1590 -2364 -3179 -2398 -1424 -1291 -1644 -1703 -1056 -1295 -1490 -2265 -2470 -2053 -1487 -1709 -1329 -815 -227 -128 -1176
1094 -1176 -1693 -1556 -1173 -1894 -1630 -140 858 786 -28 -496 -497 -653 -994 -1203 -407 1262 1478 1320 712 761
1114 761 1216 450 -36 -169 765 1701 1523 897 1218 1898 2049 1152 674 1030 2003 1195 747 1437 2468 2629
1134 2629 2393 1778 1818 1659 1434 862 810 1784 2591 3094 2550 2145 2052 1873 1221 395 881 2078 2743 2413
1154 2413 1916 2464 2441 1238 579 863 1493 1393 1460 1433 2397 2195 1591 515 621 848 904 686 492 767
1174 767 1252 1338 719 482 654 1060 764 -502 -555 189 578 456 420 841 733 203 -902 -1369 -847 -596
1194 -596 -506 -166 337 578 475 -542 -830 -1116 -1260 -937 -545 -187 191 326 -201 -950 -1226 -894 -996 -1403
1214 -1403 -1328 -667 2 -62 -745 -489 -165 -637 -1313 -1308 -900 -633 -876 -851 -539 191 50 -661 -585 -712 -878 -927
1236 -927 -942 -472 -307 446 810 -105 -909 -774 -802 -954 -1313 -484 1017 1026 -56 -117 307 73 -827 -1221 -2
1257 -2 471 11 -13 311 585 -247 -431 -187 -505 -849 -278 338 203 -42 33 851 134 -650 -269 261 -168
1278 -168 -1160 -406 423 301 -273 -113 603 306 -899 -1267 -582 -553 -769 -204 814 695 -353 -710 -512
1297 -512 -1134 -1541 -712 351 406 6 -85 17 -565 -1145 -1113 -321 -543 -1329 -1376 110 142 -635 -909 -198 -323
1318 -323 -989 -1492 -825 -230 -793 -534 75 115 -707 -687 -76 -636 -1307 -1331 -439 -693 -841 -70 736 437 -902
1339 -902 -1181 -399 -635 -1390 -626 731 1164 329 -351 -133 -399 -1176 -690 333 739 74 26 681 354 -21
1359 -21 78 396 465 -433 329 792 955 236 1010 1831 1486 430 -150 859 725 322 180 1379 1616 1346
1379 1346 578 936 1283 963 622 759 1027 964 935 1800 2181 1088 789 1067 265 48 219 1624 2343 1626
1399 1626 587 946 1411 -32 -280 1120 2095 1245 354 589 1352 689 -183 618 1579 301 -312 150
1417 150 595 -54 417 1198 918 -393 -350 713 526 -677 -547 1144 632 -514 -620 138 1002 -815
1435 -815 -1117 -189 -476 -717 -1056 -331 322 352 -454 -618 -964 -1583 -964 -707 -408 -471 -473 -510 -1129 -1340 -1370 -892
1457 -892 -380 -680 -1001 -922 -278 -1254 -1426 -885 338 -457 -1445 -1220 -768 -386 -1201 -970 164 -108 -1457
1476 -1457 -1095 -642 -1119 -1173 -231 209 -257 -1136 -360 147 -713 -982 377 465 -918 -1641 96 1259 307
1495 307 -713 85 616 -806 -1174 -505 922 549 530 318 272 -405 -325 505 548 311 48 840 374 -525
1515 -525 -71 1168 1004 92 -410 439 441 -179 -143 965 1009 1011 247 239 459 818 300 19 863 851 397 93
1537 93 379 722 698 243 320 -65 -292 226 942 622 12 631 938 -178 -1239 -360 1051 827 9 172
1557 172 739 346 -977 -670 747 497 -20 -431 -12 -78 -992 -153 222 -262 -773 20 -168 -1074 -882 147
1577 147 750 -521 -918 -380 -66 -1012 -1257 -565 -166 -444 -905 -708 6 -96 -431 -746 -866 -614 -594 -493
1597 -493 -329 -86 -42 -141 -691 -941 -973 -780 -188 -129 -259 11 47 -228 -989 -646 65 -24 -381 -580 -88 243
1619 243 -450 -284 258 598 148 -436 -168 -55 -114 -245 278 626 600 339 445 28 -211 -96 688 516 36
1640 36 242 1371 1043 161 302 829 317 -347 5 943 1119 483 302 818 263 -229 17 437 399 375 862
1661 862 1013 603 613 561 705 -117 -25 662 586 152 -222 513 1158 641 112 237 570 38 -47 35 373 311
1683 311 599 584 429 193 -9 -267 -416 -173 65 363 297 -102 151 331 -335 -577 -668 -391 -57 -96 -165 241
1705 241 -1 86 -536 -750 -308 -60 -222 -610 -442 34 -224 -239 -305 -55 -46 -507 -491 -457 -464 -315 -271 -17 6 3
1729 3 -93 -109 -841 -725 -390 -295 169 181 292 605 -428 -520 -640 118 -143 151 -57 887 658 46 -18 4 -88
1752 -88 -369 -469 5 486 269 239 227 -22 197 -9 181 -249 19 364 483 469 250 310 940 252 80 -114
1774 -114 199 8 -148 -46 614 377 801 146 99 583 -464 -31 -109 257 659 820 578 80 -100 46
1794 46 -162 -130 95 167 63 121 290 153 -1 -331 -595 -294 -393 -22 66 64 -283 29 78 -598 -256 -569 -18
1817 -18 -310 -761 -530 -102 -263 -625 -645 -437 -529 -829 -958 -1102 -984 -344 -413 14 -569 -127 -538 -930 -1132
1838 -1132 -1046 -313 -445 -368 -567 148 -69 -633 -1048 -817 -639 -637 -584 -98 6 -130 -178 -596 -610 -657 -405 -342 -557
1861 -557 -500 -289 148 -288 -341 -298 -88 -440 -430 -360 -172 -205 -124 94 187 185 104 -464 -408 -343 -4 319 143 319
1885 319 785 532 255 -207 186 556 -145 -60 442 921 792 851 402 383 663 364 203 506 574 634 798 711
1907 711 842 764 676 316 235 318 573 784 580 612 893 678 908 364 440 572 247 310 450 646 861 1115
1929 1115 586 528 457 155 448 77 74 649 679 806 759 243 539 212 -59 -11 394 591 605 451 351 435 146
1952 146 -215 -382 -52 -123 -114 -13 407 371 93 -19 206 -239 -68 -167 -202 -425 -440 239 13 158 -195 -253 -189
1975 -189 -831 -734 -606 12 18 3 -99 110 -211 -739 -799 -641 -497 -148 -577 -200 -213 -178 -266 -435 -251 -651 -511
1998 -511 -321 -196 285 277 -86 -134 -537 -473 -261 -405 -558 -584 -91 78 -219 -302 132 27 -758 -215 -255 -532
2020 -532 -581 -395 -76 -154 -175 206 358 -277 -646 -467 60 -463 1 638 713 -41 -477 -146 -160 -484 -722 -423
2042 -423 317 89 -114 57 163 -62 -598 -514 -348 -278 -360 223 7 -150 -353 0 0 -633 -247 -561 -230 -293
2064 -293 -4 6 59 78 -207 -108 -207 -359 -635 -552 -236 30 20 68 83 -14 -391 -776 -723 -354 -423 -27 262 -138
2088 -138 -291 -44 -272 -600 -692 -460 -53 -264 -390 -53 23 91 -465 -355 -93 -50 -645 -463 94 163 90 -371
2110 -371 -85 130 -319 -238 -15 -203 -251 -6 142 269 157 570 464 -126 -440 -280 91 497 346 727 829
2131 829 227 -135 230 103 189 -10 173 523 499 635 520 403 414 283 602 654 220 428 522 524 853 583
2153 583 491 529 247 53 179 649 689 562 511 904 626 779 191 727 757 458 172 602 1091 978 659 726
2175 726 621 233 124 338 504 193 474 777 958 263 52 144 382 265 -4 591 691 246 -95 335
2195 335 882 59 46 -12 -74 -138 -112 64 387 96 155 118 -471 -406 -49 69 -71 -267 -230 -36 -174 -381 -468
2218 -468 52 -182 -511 -657 -447 -150 -23 -131 -106 -89 -318 -880 -667 -480 -574 -325 -373 -255 -394 -428 -441 -527
2240 -527 -567 -595 -552 -232 -229 -299 -538 -331 -316 -248 -98 -488 -422 -822 -368 6 130 -705 -92 -454 -394 -686 -382
2263 -382 -220 -307 -340 -52 51 -303 54 100 -57 -624 -405 -129 -88 -15 -196 293 663 -259 -414 62 230 -245
2285 -245 -27 112 143 -84 -201 -137 -17 -13 -81 -58 -167 -98 -27 339 103 -10 145 379 111 -83 -309 40 294
2308 294 -180 65 229 148 191 -119 118 296 89 -335 -204 148 210 -24 210 268 -65 -391 -376 -32 -35 15 51
2331 51 346 31 30 148 -15 -589 -502 -442 125 107 15 139 76 -190 -156 -73 43 -272 -26 -60 19 -95 64 -23
2355 -23 159 -213 57 -293 -364 78 42 289 278 92 137 -113 -69 -386 -226 -172 -102 -87 179 227 321 340 8 -28
2379 -28 63 -301 148 15 510 530 160 161 157 214 122 167 294 206 300 277 408 129 161 253 309 400 34 122 354 135
2405 135 415 298 371 389 244 213 577 137 153 154 222 358 337 177 410 202 414 273 604 174 -22 416 380
2428 380 82 292 101 -44 165 82 307 402 13 96 47 126 144 148 134 -279 219 80 108 -39 -117 106 -70 -183
2452 -183 120 7 77 5 -72 237 -15 45 -97 -17 37 -118 -293 -210 -330 -66 62 -71 -528 -114 -235 -177 -688
2475 -688 -403 -445 -242 -143 -44 -167 -287 -550 -560 -244 -425 -111 -133 -753 -164 -259 -345 -513 -594 -158 -125 -387 -560
2498 -560 -506 -165 -110 -514 -155 -353 -199 -367 -479 -429 -481 -449 -270 -151 -160 -233 32 -89 -91 -326 88 -42 115
2521 115 -114 35 -38 -120 -23 -463 226 -31 281 15 69 194 254 351 -29 65 52 182 -84 56 305 189 59
2544 59 355 513 345 311 473 160 -155 53 -70 -28 255 372 271 377 534 90 261 20 18 152 306 486
2566 486 481 243 115 256 11 -86 216 238 123 377 211 60 354 67 326 149 348 500 237 9 192
2587 192 200 75 51 131 265 121 212 -10 -70 -11 -211 267 69 45 77 -24 8 111 157 -92 -152 -93 -104 -137 -29
2612 -29 -112 88 -182 62 147 185 -105 79 114 120 -415 55 -401 -247 17 45 242 -200 37 -169 -245 -12 -87
2635 -87 93 -35 -186 -17 -314 -178 76 73 77 -9 -90 28 90 6 103 -183 59 192 51 145 340 -147 -44 52
2659 52 33 -207 159 189 -42 -97 -99 103 -101 -294 -202 12 -189 -55 -108 95 -88 90 248 94 395 398 27
2682 27 9 128 -31 38 130 -177 192 171 -95 -247 38 234 90 38 60 -238 25 286 -66 -171 -28 -56 -84
2705 -84 -100 -208 190 11 121 -199 97 -76 -153 -144 -78 -7 -167 -199 -123 14 43 147 119 -258 113 -140 -392 -367
2729 -367 -45 210 14 -217 -24 -25 -76 -68 -315 -70 -186 -41 5 -369 -105 -407 -143 -242 -204 332 -38 -183 32
2752 32 155 -72 -313 -220 89 -70 34 -30 -77 -225 3 -355 -51 110 -210 135 -53 -66 -152 258 42 -140
2774 -140 12 77 79 146 -320 -169 17 60 -105 38 482 345 39 17 308 -63 -21 -94 222 286 88 156 271
2797 271 4 329 -101 94 452 -107 137 341 288 289 98 424 312 114 245 156 676 82 -211 498 24
2818 24 241 62 323 286 -40 -110 232 -14 219 120 592 34 -412 183 94 152 249 -85 155 24 44 -112 -45
2841 -45 87 -291 -259 227 215 44 -254 190 270 -104 -66 25 -166 91 -22 -66 -381 -170 62 23 35 -273 -59
2864 -59 -251 106 79 -218 -126 140 -139 -389 -219 -164 -377 -118 -21 -288 -331 213 65 113 -121 -82 -316 -291 -64
2887 -64 -186 44 -12 -123 -114 56 56 -99 64 165 0 -224 -221 -118 13 77 -426 130 -145 -152 -1 -182 7 -332
2911 -332 46 -86 -291 -122 -115 13 -66 208 189 302 -196 297 -22 180 74 223 -146 276 415 174 366
2932 366 116 306 -60 -135 -5 41 -311 -3 349 236 27 29 120 -64 195 39 405 13 13 -132 116 144 239
2955 239 84 329 250 209 161 -145 140 -58 3 -223 171 191 -163 -45 -113 -108 -33 236 -152 315 411 -11 46 -93
2979 -93 56 104 -112 -418 -164 58 292 -40 -189 -273 -207 -180 113 -167 148 -1 -219 182 -172 -326 -355 -195
3001 -195 -245 -105 -52 -25 26 -15 -72 -41 48 -42 -401 -264 -130 -235 -288 66 149 -573 -45 -115 -110 -203 21 21 74 133
3027 133 -214 -16 -319 104 -136 -104 208 -3 90 240 76 275 -138 133 -8 -33 -189 -161 139 193 -130 -41
3049 -41 390 -62 238 -38 50 52 -105 -165 -97 48 694 67 60 -34 32 -279 -35 -76 -92 41 -120 225 42 26
3073 26 91 102 66 -76 70 -55 -241 39 -23 10 255 50 230 -200 -132 191 186 30 -4 -140 143 84 159 -51
3097 -51 -156 54 227 17 -35 -9 -153 197 270 -317 -476 -185 -86 66 -371 5 -150 43 -102 -206 -290 -60
3119 -60 57 -142 -249 -23 134 108 -277 -161 -469 -145 2 -328 -268 -408 150 -168 0 -69 -92 -227 -192 131
3141 131 -139 -291 -111 64 -129 -49 -55 -104 54 -130 -78 -198 265 53 -237 188 -37 168 118 43 11 -68 -161
3164 -161 218 123 102 -48 -130 -83 51 -51 -106 -58 137 -149 -88 -56 -36 -43 16 -77 -276 157 221 6 101 126 -47
3189 -47 171 -216 175 191 213 313 356 -6 185 117 54 254 36 8 169 30 -18 142 8 122 15 222 59
3212 59 257 -88 41 -2 26 -6 67 168 112 47 -101 -117 64 80 107 -105 -244 -134 122 252 118 59 167 -237
3236 -237 187 -149 74 265 -32 -19 -72 -22 -80 -79 -565 142 57 65 -51 16 85 -80 -185 178 -57 -182 -77 -150
3260 -150 -161 -263 -21 115 -201 -185 -133 -314 -146 -284 -15 155 -16 -127 -76 -64 -81 -74 -140 -111 -18 -226 -196 -106
3284 -106 91 -44 85 67 -36 -95 226 -11 -269 200 -42 222 237 -79 12 9 -322 138 -154 99 135 -5
3306 -5 83 217 181 -211 31 21 26 325 -112 -35 163 163 248 70 -110 -54 188 226 68 156 127 -20 92 -98 167
3331 167 384 212 256 47 80 -243 234 239 3 129 25 9 143 74 121 123 240 -92 -61 59 150 -34 -88 -148
3355 -148 145 7 131 218 260 -96 -320 -37 -45 -182 -171 -176 119 -156 91 79 -191 160 -3 196 -311 -30 -79
3378 -79 -245 -104 -177 -201 8 17 -125 11 -182 -226 -31 -120 65 78 -107 -89 -113 -36 33 -94 -140 -18 -17 63 -36 -33
3404 -33 -119 -18 78 160 -131 -44 233 -67 -101 236 19 -133 130 61 -258 75 101 188 92 -98 40 -147 -54 185
3428 185 53 132 137 -113 12 9 50 -94 -108 155 -105 -44 111 -110 -170 269 -26 270 31 274 112 121 79 -18
3452 -18 -127 89 -157 -23 -164 205 114 14 74 13 15 -141 -151 18 68 -19 -97 106 -22 126 72 62 333 -19
3476 -19 358 -104 55 422 -71 140 -385 231 87 -118 79 -143 -251 -133 175 -137 -111 -235 -37 -118 2
3497 2 24 152 62 138 -40 -86 -74 178 -111 125 -224 -109 -18 285 154 -101 -118 -120 29 -488 -24 -6 -221 70
3521 70 37 -250 -155 -196 89 101 130 46 56 23 -231 -6 -126 55 -127 35 58 -32 -169 75 239 -58 -280 253
3545 253 -140 -233 220 -61 -147 -42 10 14 -94 -234 164 52 -67 361 37 28 -81 38 193 -36 37 205 -26
3568 -26 85 -47 11 392 95 210 86 21 3 352 161 272 -45 218 232 -198 -3 271 -227 183 465 -39
3590 -39 70 244 155 137 203 134 83 -86 -260 118 89 109 253 -105 143 -15 -116 245 -34 -4 -65 192 223 225
3614 225 -93 82 -35 115 118 106 155 294 47 -75 140 -115 187 -233 -39 50 -36 -36 173 102 -68 -139 -117 -120
3638 -120 50 25 -156 -180 89 127 9 91 -380 253 -206 -31 -109 86 -342 21 -240 93 152 26 -330 -90
3660 -90 65 -318 104 -97 212 183 -211 -306 -335 -116 199 -108 35 280 -44 -49 256 -53 46 -14 219 -429 156
3683 156 199 -286 206 -38 -50 -38 108 79 -154 58 -200 -94 169 -28 10 38 146 142 58 -181 6 -134 110
3706 110 229 111 -216 39 -183 114 -55 -311 2 193 -98 -33 -44 -91 -27 -4 -283 144 279 28 35 9 -2
3729 -2 -252 47 43 5 125 242 -28 -60 -164 -117 -88 -392 -23 -106 -143 -60 -35 -56 -8 59 -273 112 -226 -425 -11
3754 -11 -97 171 162 -80 -183 99 -3 -15 -179 -72 -196 -37 -140 -301 -251 -199 -43 -76 54 -71 -182 -317 -11
3777 -11 26 -74 -256 -61 -121 153 60 -88 -96 -224 -185 -136 37 -105 192 -157 35 -44 -210 62 -169 -88 -56 -228
3801 -228 -178 -152 -49 -103 151 -217 101 -65 -87 219 346 74 196 -219 9 294 -91 -45 532 133 -44 -33
3823 -33 291 -34 85 -32 -143 -88 187 -243 4 221 -119 58 73 92 169 195 -101 251 266 -66 1 124 24
3846 24 306 111 26 218 14 -136 -129 208 93 103 280 -124 9 -217 -175 -88 -162 -5 285 -82 121 -206 359
3869 359 320 -239 14 10 -61 78 34 219 -281 21 -31 124 -159 145 -16 113 180 -147 14 -103 261 -38
3891 -38 11 -36 -89 -45 -88 116 19 26 353 87 -121 -284 147 23 142 114 21 80 68 21 -201 121 282 237 -256
3916 -256 367 122 -162 123 -217 -131 -380 -179 -150 -56 186 22 -52 196 171 -108 -133 -111 -105 -66 123 -48 91
3939 91 14 149 179 175 70 467 -173 68 130 -138 4 155 49 63 -105 132 119 108 148 6 43 -220 -208 60
3963 60 -19 67 119 38 -161 -137 379 193 -192 160 -202 -21 218 -17 159 73 91 -8 -34 209 -205 158 71 52
3987 52 7 122 83 -32 -78 -239 -84 9 -111 133 160 168 -92 -199 174 188 149 57 41 -232 -94 -100 -16 -441 -87
4012 -87 -239 -88 -136 88 155 -67 203 2 -13 -63 -107 190 277 -223 -72 9 -179 34 -196 -10 32 -106 -18
4035 -18 -79 199 133 -313 -106 2 -13 33 65 83 95 -102 -190 -71 -198 -2 93 -46 81 -179 12 7 -72 89
4059 89 147 -130 -134 69 -36 -63 351 66 72 -32 -369 122 329 159 -38 28 -162 -15 38 269 81 -37 -111
4082 -111 453 187 80 -131 114 4 -89 -43 146 38 -43 241 124 62 9 102 186 95 -190 -103 -246 -6 -309
4105 -309 69 399 -192 -32 -90 119 302 42 -80 140 291 -87 167 -47 -165 -30 124 304 26 30 270
4126 270 163 -315 -294 -165 -15 -266 162 -61 308 -72 134 49 -40 -196 322 75 30 -91 -101 122 14 -70
4148 -70 284 2 -241 -139 14 -219 -193 -252 -163 89 215 -36 131 187 229 -148 260 -127 -104 -25 -72 26 -200
4171 -200 -302 336 -200 -50 -116 -19 -21 173 45 -108 10 -292 69 245 15 172 142 -104 -40 2 84 33 130
4194 130 71 35 -123 -268 -200 -66 -281 -9 29 178 -176 -282 190 300 -65 -210 279 -11 -106 288 -136 24
4216 24 22 -129 25 27 65 326 3 -51 260 74 202 79 164 142 -115 -166 -319 -225 206 38 182 150 -166 -27
4240 -27 -263 105 44 9 17 -212 -5 -41 202 74 141 27 128 -267 105 -91 -33 62 108 125 26 -221 -60 -123
4264 -123 -142 10 -28 -10 20 -311 -3 224 193 -79 -101 49 111 -6 -151 -123 32 25 -38 276 -18 -204 48 231
4288 231 -227 -132 124 -4 -150 -45 -101 -24 -135 24 -44 54 -82 -136 78 57 81 5 146 -225 152 -138 -48
4311 -48 91 193 -26 -41 -245 -44 265 -78 110 -198 6 -119 110 40 23 -118 324 -95 200 91 64 -140
4333 -140 -68 -68 1 -399 -64 195 291 109 -55 94 -248 132 29 73 182 -230 -211 -90 26 87 -133 11 -156
4356 -156 120 -53 224 -180 78 184 -107 -146 -136 -5 192 -4 38 -171 -137 77 -351 99 -182 -101 27 51
4378 51 115 -192 201 2 123 352 -318 -62 -73 85 -98 -274 -40 -119 70 78 311 -141 361 -46 -62 35 -88
4401 -88 124 68 33 97 -286 54 5 130 244 -179 -237 29 -24 163 169 146 49 136 -116 -178 77 -89 115 -364
4425 -364 -70 -49 3 -20 169 -75 -298 -15 117 -5 -24 105 -8 -44 90 -203 -6 -64 169 -65 148 -100
4447 -100 -9 121 -5 220 -37 -253 230 -277 -58 -131 4 -55 -25 112 -18 32 -159 98 67 131 -185 230
4469 230 -18 37 -237 39 31 80 155 -7 118 -110 -94 202 -16 281 -43 73 83 234 -155 103 55 -93 37
4492 37 -181 -38 106 -152 -56 223 121 -6 64 147 214 31 49 -189 -107 108 -83 -61 -262 -100 219 198 112
4515 112 60 -104 255 -22 -118 -111 -121 176 -197 38 241 92 -74 329 -82 102 154 257 72 -315 -117 243
4537 243 -38 -181 246 -330 -37 77 -44 175 1 -78 45 -236 -52 -189 -224 46 -74 -152 57 -192 158
4558 158 -81 85 -134 -112 178 233 -100 -41 -127 -16 129 -205 5 -208 28 267 136 91 36 17 232 117
4580 117 172 -173 -48 82 255 125 -14 51 -69 18 134 92 -7 -95 -189 -114 -105 89 -174 -20 66 122 78 10 109
4605 109 -44 -24 1 308 -319 1 86 -58 -122 -226 -167 -8 125 52 -53 89 -25 -124 270 147 -284 -31
4627 -31 73 151 -81 205 -283 68 248 39 153 3 -58 -160 -210 131 -93 41 -135 -46 103 86 147 65 -30
4650 -30 -65 -15 191 -17 -126 -12 -43 53 26 83 -112 68 -48 -193 -213 -92 -178 -134 5 -90 87 25 12 -64 -217
4675 -217 -114 193 290 254 98 55 150 -4 77 155 101 76 -301 15 -11 25 1 -128 -152 -243 115 -171 169 -167
4699 -167 -285 -5 -50 -7 -129 111 9 -146 -12 -47 52 111 48 -206 129 -59 172 -240 129 79 205 -69
4721 -69 -47 -107 218 41 46 409 96 162 -76 162 -71 -8 -92 -201 118 255 103 162 144 -295 66 315 -135
4744 -135 257 -57 -189 -269 18 35 -50 107 -412 160 -47 155 66 153 86 56 208 76 -57 -238 317 -42
4766 -42 78 109 -169 53 -204 -1 -44 -91 63 25 -152 -47 -212 4 -21 10 81 106 -41 -316 40 -92 139
4789 139 187 212 -172 20 267 -41 -211 -129 150 184 70 -135 -149 -386 -66 -91 227 148 173 -255 -1 95 159
4812 159 41 23 -63 -37 73 -84 151 18 80 22 -72 25 -132 33 -37 -200 -66 -172 -233 296 -22 -182 114
4835 114 207 -32 -44 69 -326 -56 -83 -278 112 -95 -31 107 225 211 -254 108 -162 -2 -31 -122 103 106 -99
4858 -99 -355 -160 -42 -34 -79 -27 -135 149 -3 -40 107 -83 -77 -218 -155 -49 -108 -75 73 -157 -57 110 86 182
4882 182 -257 -22 -187 -185 144 95 -179 58 -236 -304 193 190 -260 172 -7 -57 -76 222 281 205 -221 -247 -112 -150
4906 -150 -18 -9 139 -42 -176 -335 -86 28 -121 -123 32 -82 -163 -137 -219 24 96 -91 -134 -51 -198 44 -255
4929 -255 -60 43 -176 119 -19 133 -105 94 -65 -113 -27 17 -106 57 -182 -9 126 -46 -80 -6 -152 -204
4951 -204 -70 -29 118 -12 75 110 148 -122 -147 86 -137 4 -26 -141 -26 -152 -30 -112 106 -58 -247 4
4973 4 54 -40 -88 148 239 87 97 125 -223 55 -70 -55 32 63 -38 35 133 -246 -205 54 -138 253 108 -40 60
4998 60 -298 20 -116 -255 -157 120 126 -4 378 -237 53 -80 145 60 226 274 122 72 29 208 -56 17 43
5021 43 -114 -107 44 72 -151 130 -93 -132 16 143 18 -95 -21 -167 93 -135 118 116 -105 -32 -32 11 104 31 153
5046 153 -136 29 25 -9 36 7 288 143 -84 -11 -228 84 152 -139 60 98 -132 -20 -106 22 -248 -281 -146
5069 -146 -24 35 -107 7 -157 -192 -211 267 8 39 51 7 -125 146 229 -200 -115 67 -212 196 -53 -85 204
5092 204 -259 -171 34 252 225 217 -24 -169 198 -80 -274 185 -98 -113 151 99 -280 149 19 4 -6 -23 -149
5115 -149 483 -37 -36 -192 219 -180 -64 88 115 61 -217 -414 -11 188 -30 211 -68 102 107 -252 -203 -286 -173
5138 -173 101 142 -298 0 -72 -150 176 104 180 -150 110 -107 177 -77 -15 -210 33 -165 45 54 17 135 -142
5161 -142 -42 197 9 -269 -9 169 -62 -74 278 -213 114 231 -135 -41 -175 -80 -132 218 -61 285 -105
5182 -105 96 76 -273 268 237 304 -77 -225 53 -151 156 296 67 -66 170 -53 -58 -122 -173 -17 -255 21
5204 21 127 -368 -3 152 111 28 -101 92 72 139 -213 176 112 126 -352 -125 -127 164 -102 -166 23 -260 -153
5227 -153 88 257 195 -87 -9 -21 -404 389 -176 -32 105 127 -209 -214 80 -372 -134 132 -23 151 44 272
5249 272 125 138 -115 -37 -40 -70 18 226 -200 -256 -100 -173 -78 93 -40 -29 86 31 -122 -94 -33 -252 -158 80 125
5274 125 -52 -103 285 -238 257 1 -26 -126 -76 86 47 -84 -185 412 -246 11 -229 186 26 -219 86
5295 86 -56 -71 -21 83 202 -78 33 -16 -48 -72 73 -185 -107 -102 108 298 -149 18 144 24 -79 20 164
5318 164 -154 237 -14 80 -56 3 -27 63 45 199 140 -194 -61 -52 -366 32 9 60 78 34 -23 11 -123 -21 156
5343 156 -225 -204 113 -13 -44 153 114 -284 9 -275 285 -251 273 305 186 100 -105 -107 192 -166 -206 263 -41
5366 -41 -12 -170 79 -22 -40 -19 130 186 67 -6 413 -41 -191 -36 -16 129 263 10 71 39 13 -290 6
5389 6 -17 216 -161 -175 198 -48 267 -114 -111 -38 77 182 -23 -163 -126 -61 159 -105 161 31 65 56 186 235
5413 235 193 -65 -53 -86 -153 64 -58 64 -145 11 -77 169 132 -214 -50 -81 22 -42 101 141 75 145 -129 -168
5437 -168 -35 -55 -108 -14 -12 -67 104 155 1 -248 -139 42 -56 -228 -134 65 17 81 300 -100 56 -160 148 -9
5461 -9 59 -207 -82 107 -12 -34 98 -276 119 44 27 -126 3 -136 88 -27 68 6 -159 -207 -24 172 49
5484 49 92 208 42 28 68 176 108 148 122 -62 213 8 -13 170 4 13 0 172 176 145 128 93 -241 86 151 11
5510 11 129 -146 52 29 236 178 91 130 46 -26 162 -134 -28 15 192 17 -49 296 -108 -144 -47 -79 -136 237
5534 237 106 4 -20 234 -255 24 -27 -4 206 -215 -173 -11 -101 -195 400 -37 -44 157 262 105 208 -65 -97
5557 -97 465 -113 -207 127 -175 -139 47 151 -168 146 4 121 161 -182 -93 -250 -185 136 -221 -1 186 -142
5579 -142 62 -170 128 -11 -81 141 -245 -260 -181 -36 -4 -66 84 -429 -210 254 170 304 75 -218 -240 81
5601 81 135 102 -350 347 -57 -152 175 -193 27 -47 -57 58 167 271 -282 -369 -125 -46 336 257 -180 -48 3
5624 3 -171 -299 486 73 50 -99 -6 266 214 -140 42 222 -34 -11 -76 81 -204 -55 14 -34 -263 53 196
5647 196 163 184 25 204 63 -157 97 214 266 -120 -57 -107 209 -15 219 4 344 60 -30 168 257 38
5669 38 -13 -42 157 265 -141 -16 177 218 61 180 -60 60 -149 -217 -68 145 171 -246 -26 -52 111 -63
5691 -63 113 163 32 47 -100 -60 -114 63 -47 66 182 -176 -120 -303 -88 -164 130 223 200 -42 72 -86 39
5714 39 14 -474 65 34 41 -207 20 -205 41 150 315 118 134 63 224 -167 13 211 92 231 -159 31
5736 31 26 150 76 -133 46 -35 -130 91 2 37 -52 178 -221 -148 -200 141 254 -86 68 58 120 246 450 44
5760 44 159 -240 86 37 93 -152 3 -167 -88 300 144 19 -148 -147 86 34 -180 222 -182 -47 -222 204
5782 204 -159 155 2 113 152 -87 -131 83 8 -27 -39 49 204 294 -123 -140 251 -246 -104 228 -242 -67 46
5805 46 -395 207 -211 75 41 82 -57 52 89 97 158 39 -190 -59 240 -78 139 -53 -353 -175 -372 42
5827 42 -14 206 160 -91 185 -9 -248 -88 -23 -24 -45 -195 203 38 -60 46 -273 2 50 -205 -4 203 57
5850 57 196 172 -158 -46 -114 -34 -144 50 -80 210 226 354 158 48 -57 178 -333 -228 -208 -115 179 -131
5872 -131 198 -76 0 -147 255 -13 18 -184 -39 -45 51 295 -19 -38 -63 -31 83 -87 -143 -190 -84 179 -25
5895 -25 -147 69 -139 98 -105 42 -38 -333 -149 -410 112 -152 -6 -46 123 -2 53 120 -228 444 -213 -173
5917 -173 11 17 -171 -71 -37 -85 -101 -12 51 68 65 203 78 -160 -22 410 -61 87 -22 -63 217 -241 86 -468
5941 -468 -50 -89 130 -145 16 49 13 -246 205 -326 -258 -35 10 241 -61 -42 -9 14 -149 5 81 5 138
5964 138 137 117 -48 16 8 -19 266 -279 117 104 -201 -44 -231 -318 118 90 -92 -39 76 -16 -287 -60 14 -152
5988 -152 -33 -72 -482 -55 146 -71 -219 110 -258 -156 -115 -114 65 -138 39 -102 -7 -210 -83 129 -25 -157
6010 -157 -38 -133 -101 -146 65 399 144 -107 -268 20 -64 -4 -124 -88 104 68 190 1 -11 -121 -104 79 -30
6033 -30 33 96 -131 -250 -41 -84 186 -202 142 -203 -122 40 -129 3 28 78 -206 -20 58 -108 -220 -138 -102
6056 -102 209 90 -97 -74 -67 5 13 -65 -59 95 -72 233 0 11 214 123 0 -91 176 91 254 -225 244 204 -4
6081 -4 0 -291 -9 529 -85 -128 -223 37 -109 -86 159 217 172 8 -169 15 87 113 115 143 109 153 -150 -204 -117 -189
6107 -189 -102 135 91 -37 -41 47 164 -364 47 -107 -115 -163 -37 63 97 145 -96 -333 20 -55 -91 167 139 -255
6131 -255 -118 184 123 34 166 177 164 -247 -259 84 215 220 -50 27 -112 -118 117 21 21 -19 -126 124 -86 212 22
6156 22 -6 53 -139 42 -76 80 -3 -129 26 -7 43 -28 -214 63 -162 324 16 158 256 -102 60 -49 -216
6179 -216 -246 5 376 -110 -95 -59 116 -126 45 205 -112 67 -129 -59 -111 234 205 7 274 28 -33 -77 247
6202 247 -40 13 221 -90 -198 -100 223 -27 -208 -79 58 133 9 46 97 179 -384 358 26 63 -51 -221
6224 -221 53 166 -137 -1 -55 183 245 -3 181 92 -422 -139 -38 89 21 -213 354 140 213 280 -31 -28 11
6247 11 -159 47 -123 -228 10 -7 12 -13 -210 -27 283 237 -109 -109 -1 -2 -26 -10 -23 30 -195 -401 -286 4
6271 4 -34 -202 -122 -32 -11 -147 119 -106 275 109 160 78 -206 163 -108 194 25 -222 -144 -12 83 288 -81
6294 -81 182 245 51 -103 227 -187 296 -234 -80 -60 -127 107 -25 -66 -216 0 190 109 81 -4 18 186 -92
6317 -92 203 -151 95 -112 48 270 63 161 -183 144 49 -67 -92 117 -22 -166 102 -146 -80 36 243 67
6339 67 11 96 261 -53 359 -371 -271 -120 -209 -59 -6 69 -108 -126 49 -296 51 -10 -95 178 15 -52 -132 128
6363 128 60 -110 -110 97 -206 37 137 -74 36 -60 108 168 -57 90 -61 229 -31 28 -59 48 -112 191
6385 191 138 38 6 -234 35 117 9 -154 -135 4 -70 -1 35 -317 -253 -22 155 -142 -233 134 4 7 -146 -52
6409 -52 92 -165 417 -111 79 192 -127 -29 335 34 -159 94 11 94 -21 -107 -24 130 53 -266 193 -89
6431 -89 108 -57 -12 -13 39 125 -31 -56 224 1 -213 244 151 -4 81 -19 5 -60 10 -102 -109 249 -136 38 -77
6456 -77 -71 90 207 -139 -33 -24 -121 -103 -149 -7 186 -145 8 89 12 -3 -51 -308 103 122 -426 -121 -60 -39 -61
6481 -61 -173 79 31 6 -219 399 -46 -64 -305 149 -275 -210 54 128 -66 -81 94 43 -95 58 -75 -183 -112
6504 -112 -49 67 63 31 143 -64 -4 -309 -246 -71 -15 217 -146 311 -80 -72 128 -172 -25 -68 -46 -164 -80 -199
6528 -199 506 -23 288 117 -65 168 -16 174 -108 -149 30 165 -66 -18 -71 -136 84 109 -70 256 -6 122
6550 122 -87 217 -95 70 -53 -110 -104 -178 189 -136 303 -18 -275 -5 -218 -80 44 150 183 97 -106 -400
6572 -400 -318 -133 -190 -57 170 39 260 -185 88 -68 237 -51 -61 -163 53 38 74 -38 27 149 -17 -314
6594 -314 146 -230 -199 -1 -62 -250 -211 255 142 -40 -14 42 -165 88 -210 59 -161 -12 15 98 -102 -4 117
6617 117 -108 -48 85 -8 267 -263 -256 145 42 206 68 153 -210 70 93 -151 -224 140 -99 141 70 41 -164
6640 -164 -49 74 -166 -145 -64 201 105 44 246 -42 194 76 245 -308 -267 255 -16 -138 293 -150 134 -30
6662 -30 -91 -47 -95 53 -226 34 -111 -95 -7 172 -159 -411 -120 9 -126 43 24 -169 -215 161 323 -238 185
6685 185 110 -179 227 2 -85 66 183 16 -137 -173 241 5 30 -154 -162 242 228 -160 -216 9 -74 -247 21
6708 21 73 -93 -103 15 -322 200 -219 245 113 159 124 98 -185 122 110 49 155 -210 -194 -343 20 241 -79
6731 -79 243 -130 19 85 -11 121 -38 82 82 199 9 -85 -79 -247 -19 -30 -253 -97 -31 88 198 -144 14
6754 14 48 -172 38 18 232 -199 167 8 201 -87 -19 -442 78 165 -151 -155 -296 -70 -103 -115 -54 148 -23
6777 -23 -11 40 239 -6 -275 -30 -171 290 68 44 68 -128 -4 3 188 148 24 -223 -214 -182 185 -257 157 66
6801 66 68 -27 12 106 -130 -240 -229 -19 196 -60 60 -261 191 -114 85 -173 -100 90 87 91 -33 -37 -13 78 14 111
6827 111 -156 -79 -354 105 -27 -237 -322 -181 -62 93 148 -117 -205 104 303 16 147 -85 -171 23 138 -101
6849 -101 -13 28 -80 -25 -16 -71 -19 -72 176 112 172 -46 -150 329 -212 -15 62 197 -420 -30 152 -115 66 245
6873 245 64 -114 222 -11 44 84 19 102 -233 -217 1 -52 104 -4 53 -134 -69 -135 113 -144 -48 -208 -134 -131
6897 -131 -194 -173 -246 -86 -136 -50 -226 47 -59 76 98 22 -16 96 210 50 13 -13 264 173 32 -83 51 -34
6921 -34 285 127 -65 -7 -114 -19 -137 -186 211 163 10 -106 286 -19 -80 68 221 62 -147 1 199 -10
6943 -10 -359 14 -7 175 -207 32 70 186 39 21 34 -55 -42 437 114 -92 76 28 -100 165 285 -64 204
6966 204 -47 -185 -165 -123 104 51 -164 -33 62 188 115 193 -7 17 136 310 -94 -88 -76 -86 -5 80 -170 37
6990 37 217 -99 -145 -71 -19 92 -257 -373 63 27 86 228 151 -147 88 166 -72 54 -16 6 -59 -83 -227 352
7014 352 -76 23 14 138 262 -70 -198 -555 10 -84 -283 -66 -42 -93 218 192 -63 -145 114 -19 279 32 -253
7037 -253 -212 220 -25 194 -27 180 -230 -306 -2 95 11 75 253 -16 347 -27 -15 -30 -32 -136 5 63 270
7060 270 -57 71 197 114 90 -137 -60 46 -167 -114 15 146 234 232 -164 -164 -57 -228 -207 101 153 209 31 -248
7084 -248 312 16 -72 133 3 114 -71 -104 -119 246 -110 23 32 -168 52 148 -21 13 194 44 -184 120
7106 120 208 -115 -3 53 167 -88 86 -173 96 -275 -191 -143 80 -19 222 -37 -116 30 -261 120 83 -191
7128 -191 -87 -20 -58 -188 -58 -47 196 -171 132 24 -250 145 126 -195 -39 238 -115 -18 -161 -31 251 40
7150 40 304 204 183 128 165 0 -26 -210 -42 228 27 10 -58 177 76 -135 -56 300 -206 -10 101 -117 77
7173 77 57 -270 -129 -181 -144 180 20 173 -57 -23 -42 174 145 -22 137 -135 235 235 20 -10 -146 122 -24
7196 -24 52 209 149 281 86 -206 -65 168 2 99 149 -199 -231 -67 130 -50 213 37 302 -75 -83 -139 374
7219 374 179 -30 -95 -183 110 67 -112 -23 -52 -238 253 60 66 24 417 115 -125 319 162 149 438 88 6
7242 6 -89 213 -55 -73 -6 -136 330 77 -164 27 -48 -7 -31 259 236 82 -274 -278 -23 247 81 -215 -150 -24
7266 -24 126 161 64 12 47 -50 54 -65 0 -243 -58 249 -156 -238 -262 -173 -77 -2 51 152 -275 63 332 -112
7290 -112 -205 -52 212 -121 -291 -67 -139 183 -378 168 -22 -6 -86 -83 99 -47 -182 -33 -31 110 -242 74 121
7313 121 -35 106 -208 25 -7 -66 -101 146 -3 85 -232 -128 -192 88 183 -154 -113 101 4 -215 83 -49 54
7336 54 174 -91 73 85 -126 263 26 185 -78 97 -157 319 -328 374 -255 2 153 -202 -27 -24 -108 105
7358 105 228 300 -268 -289 -54 -111 102 -346 95 -101 3 -14 159 105 302 3 -331 64 -182 -213 94 101 -133
7381 -133 -65 410 -288 284 -122 87 -368 50 45 78 12 170 182 94 -265 -329 -230 -49 198 -75 99 -122 -125 -9
7405 -9 18 -39 -41 -290 12 -233 -60 -230 53 145 -34 19 -33 72 67 337 60 21 -72 -91 -92 190 39 33 55 124 -69
7432 -69 17 35 258 -140 -218 -285 199 324 149 120 -109 42 -141 154 -28 49 33 27 -94 -157 168 -119 67 123
7456 123 -19 152 48 6 -151 181 254 -73 98 28 -140 -347 176 59 233 -24 -44 -271 99 -146 -177 247
7478 247 -59 323 -152 91 32 203 -98 55 -370 6 179 -157 -188 139 215 -29 165 -126 -247 -36 5
7499 5 -178 -37 -215 -128 -43 -194 -53 146 34 -11 74 136 -238 -82 -121 -231 -5 -163 -44 271 -36 -224 -180
7522 -180 69 105 -47 -28 -138 -239 83 -363 -34 64 45 -85 -245 -159 97 -90 135 83 -12 -269 115 143 121
7545 121 237 -60 113 -108 -140 -48 54 4 280 146 -35 278 254 -280 -237 -112 38 -109 -158 -178 176 -7
7567 -7 -42 162 209 179 -119 -74 239 159 28 166 -106 -23 -38 -222 27 7 -195 -34 -158 -9 62 191 -77 25
7591 25 -20 130 128 -251 -26 57 89 115 20 109 173 42 115 83 -395 369 73 212 151 -209 68 99 162 44 194
7616 194 34 296 16 54 79 -186 7 -378 -96 -67 11 172 118 -182 -151 72 -58 44 158 -130 -63 -98 90
7639 90 -51 -149 -6 54 9 -130 -223 -24 -53 213 299 -100 64 37 400 -14 -150 214 189 -282 -99 -194 81
7662 81 -34 157 -100 -81 302 -161 -103 72 -61 -118 18 -305 -150 -45 183 275 5 133 -82 164 174 -109
7684 -109 -232 60 -169 202 -90 135 189 -251 106 96 79 -149 117 29 82 141 100 -51 117 140 23 -6 107
7707 107 -206 313 -59 -17 102 124 -22 54 -112 -24 150 69 -143 86 424 101 -20 -118 -98 160 -159 163
7729 163 -3 -128 191 139 -85 134 -173 165 269 97 -356 51 -119 -80 -398 144 -129 188 -2 -160 -4
7750 -4 -403 11 -207 307 -155 -29 -356 -58 -86 -6 -150 160 -217 -66 54 -82 -95 -13 -79 207 86 387
7772 387 21 -44 223 11 -55 45 -245 281 159 -31 252 165 179 26 -160 -106 -39 113 185 55 -158 24
7794 24 110 242 -239 18 -72 -79 130 223 93 -106 176 259 -45 32 96 146 -44 -66 -77 -182 205 -83 -130 24
7818 24 -9 -145 -173 41 -176 -99 64 181 -38 -36 175 250 -130 -101 79 -59 -237 17 88 192 101 -36 -57 308
7842 308 125 76 198 131 245 -76 258 64 -102 -204 33 83 -77 -136 93 -31 57 -67 12 -145 -40 8
7864 8 -14 -195 3 -177 -87 38 -111 56 -134 -3 -95 -25 83 104 -17 -92 -113 -45 -193 242 114 -64 26 102
7888 102 -322 265 -2 25 24 -41 -107 -68 -7 52 51 -137 -60 -16 -31 306 152 211 -8 145 -157 -88 -125 -240 -16
7913 -16 -205 -35 -9 -58 -68 31 125 231 7 102 -233 119 101 155 22 288 -13 -62 37 -58 4 -393 -10 -121
7937 -121 169 -17 103 109 -36 -85 -167 -211 167 141 -62 312 63 114 71 -61 120 125 312 -283 -19 -160 -303
7960 -303 56 -219 -222 -363 -188 49 76 -200 -39 396 -103 131 -60 121 221 -129 20 20 263 162 -44 225
7982 225 56 -20 290 -169 -131 58 -28 -184 29 82 58 71 -185 -95 -94 -281 -89 241 -35 -177 -64 -109 149
8005 149 -165 119 155 40 119 -113 -237 -153 73 143 130 -243 56 165 111 -91 -491 -152 255 -22 278 189
8027 189 190 -16 1 -9 -7 -294 -129 -167 -164 -86 -111 -141 225 441 -50 -227 -182 -94 -49 65 -72 49 -152 13 -84
8052 -84 78 90 -6 3 -21 -72 192 -111 130 -141 -51 102 -110 81 71 -237 -42 -33 -92 169 164 103 -4 -165 -278
8077 -278 119 16 59 10 31 216 270 -90 232 -69 -42 164 57 168 183 98 492 321 -12 -198 -21 -68 227
8100 227 -317 -14 137 122 33 181 136 -173 66 -341 373 249 -247 -67 42 14 -224 1 124 113 247 -105
8122 -105 -4 153 95 -217 -84 203 -93 204 95 -254 187 275 -62 -31 -33 -12 55 40 286 243 -158 -137 -127 -253
8146 -253 -256 30 -299 -76 -147 -47 -2 -118 -379 -270 19 4 114 119 -48 45 385 184 -95 -250 -15 -202 194
8169 194 -107 246 -355 67 91 -126 60 -210 198 152 -129 90 -34 63 -69 -138 90 -55 -53 72 -332 78
8191G8
$$ Imaginary data points
##PAGE= N=2
##DATA TABLE= (X++(I..I)), XYDATA
0 0 0 0 0 0 8 0 8 -8 14 -16 16 -24 32 -32 40 -49 64 -72 88 -104 120 -139 161 -186 214 -246 279 -318 360
29 360 -407 456 -513 576 -644 718 -798 890 -987 1096 -1214 1344 -1489 1649 -1824 2021
45 2021 -2245 2494 -2781 3110 -3492 3946 -4491 5163 -6017 7138 -8687 10973 -14694 21803
59 21803 -40261 187043 387767 -31009 -74361 144783 177317 -55689 -28191 174904 190525
70 190525 42577 78559 162550 87634 13636 143051 206783 55589 -40102 92491 160130
81 160130 52921 34243 183288 201360 50234 10080 121720 119748 4545 12798 134530
92 134530 146898 63497 52697 101578 99624 78875 77117 39640 -9605 42539 135102 110324
104 110324 25521 55771 136555 83806 -40327 -43648 46364 75887 57088 74667 84082 41918
116 41918 23641 44409 12996 -47435 -12403 73709 54787 -23932 3215 84418 53320 -31875
128 -31875 -12150 47516 -1836 -80456 -38572 44460 25469 -28586 3498 51144 10980 -48701
140 -48701 -42910 -25291 -43299 -39432 -938 -3004 -39827 -21657 31880 8609 -69274 -77275 -21443
153 -21443 -21449 -75549 -71490 -3670 22691 -13548 -40529 -37820 -49034 -71697 -67531 -43036 -34215 -34410
167 -34410 -21491 -14928 -36423 -60037 -56200 -43123 -50171 -62693 -53246 -36393 -35252 -41046 -32370
180 -32370 -21302 -33118 -59804 -68609 -55789 -47937 -54079 -48759 -23564 -9111 -25617 -49017 -50697
193 -50697 -43405 -48306 -57212 -52988 -40812 -32528 -24487 -16962 -20335 -31374 -36515 -37532 -49527 -62114
207 -62114 -49954 -20971 -8066 -15913 -19215 -14204 -21662 -41900 -50228 -38470 -27051 -24193 -20082
220 -20082 -11099 -6524 -10882 -17335 -22260 -24983 -27006 -28081 -26373 -19655 -9050 -1001 -24 -2440 -5664
235 -5664 -13073 -20650 -23043 -21070 -16554 -7547 5932 11064 4605 186 3055 -2498 -17998 -22254 -6922
250 -6922 4017 1264 3915 19923 24764 8988 -2960 -634 -1844 -10641 -6533 11187 19985 17261
264 17261 20563 25709 15223 -789 520 10816 7174 1697 14774 31200 27295 15942 20672
277 20672 28050 16948 2817 6820 16620 15465 14742 26978 36257 31121 24040 23230 19067 9207 7995
292 7995 17792 23979 24145 30351 38809 35357 23261 18085 19618 16470 11354 15786 26970 33942 33884
307 33884 31938 29565 25407 19867 14551 11641 14939 23368 28903 28767 28048 29541 28157 20107 13172
322 13172 13030 14725 15535 17264 21639 24474 25651 25199 21683 13814 8547 9239 9017 7139 10012 19468
338 19468 24421 19676 14033 12818 9721 1206 -4182 503 7369 10045 11528 13868 12964 7674 1516
353 1516 -3786 -7356 -7967 -3403 1505 2691 3050 6152 5029 -2343 -10155 -11375 -9531 -10972 -11779 -8132
369 -8132 -1835 -357 -3435 -7066 -9302 -11430 -15532 -19139 -19178 -15092 -10172 -8520 -9341 -8915 -8071 -11274
385 -11274 -18811 -24088 -23412 -19578 -17338 -14927 -11190 -7772 -8122 -13668 -20945 -24080 -23015 -20718 -19698
400 -19698 -17568 -13080 -8380 -9821 -15214 -18823 -18103 -18529 -21286 -21886 -17285 -11743 -9619 -10753 -11335 -11654
416 -11654 -13930 -17184 -18815 -17407 -14468 -10765 -9565 -9402 -8084 -6161 -7448 -11294 -13707 -12835 -11294
431 -11294 -11535 -10879 -5439 562 1493 -2464 -6758 -7511 -8296 -10200 -10054 -5149 1100 4457 3381 990
447 990 -587 -929 -3133 -5603 -5451 -2219 3142 5697 5378 5070 7010 5873 1266 -3017 -1972 2426
463 2426 4519 4095 6127 9432 10263 7475 4431 4844 4641 3723 2707 3449 6436 9231 11318 10938 9386
480 9386 8117 7053 3642 690 2659 8202 11716 9996 9453 11223 11184 5953 1240 2543 6020 7194
496 7194 6284 8137 10369 11381 9140 6279 3539 2312 4074 5819 5185 5613 8849 11214 8153 3341
512 3341 3022 5284 4459 1064 2092 5829 6478 4788 5354 7635 6541 3931 1786 1037 123 252 2422
529 2422 4892 5806 6871 6874 3727 -907 -1458 1054 1182 -164 1764 6359 6488 3142 288 989 1040 606
547 606 -1709 -1885 388 4471 5232 2615 209 1286 2047 -1733 -4265 -1417 3490 2685 306 1091 2121
564 2121 544 -811 111 -63 -2893 -2534 -18 -208 -1635 1265 5310 2595 -3055 -2816 -685 -4451
580 -4451 -7595 -1805 5437 3264 -2843 -572 3274 -852 -7814 -5154 113 -1832 -5216 -1431 2100
595 2100 -1214 -2798 974 321 -7344 -8534 -1327 816 -5711 -5843 2057 3108 -6176 -8836 -1653 515
611 515 -5724 -6643 -1366 -1329 -6999 -6344 -250 -970 -5364 -4482 -1877 -5328 -8963 -5485 -653 -2186 -3948
628 -3948 -1308 -1684 -7391 -9708 -4534 -2122 -4682 -5261 -706 -250 -4396 -6330 -4458 -4045 -4516 -4023 -4277
645 -4277 -5913 -4493 542 322 -4413 -4431 -717 -2317 -7889 -7060 -540 -283 -2946 -1685 1023 -2424
661 -2424 -5082 -683 1875 -2987 -5298 -386 1192 -4406 -4415 4146 5981 -985 -2630 2668 504 -6781
677 -6781 -3764 6339 6045 -1371 -197 6148 2944 -4065 -1256 6558 4259 -790 2221 5961 1678
692 1678 -869 5167 8045 1911 -1437 4572 7265 975 -604 6918 9477 2992 101 4533 6259
707 6259 2304 2645 6653 6758 2614 2862 5492 5417 3631 4971 6659 4382 1535 2556 4725 4627 5236
724 5236 7168 7054 3917 1081 905 2438 3667 4579 4871 4642 5122 3616 861 420 3428 5261 2442
741 2442 517 2152 2867 883 657 3302 3981 750 -193 1245 374 -2224 -393 3424 1937 -1670
757 -1670 -1389 1644 187 -3415 -1722 2131 -634 -4857 -2940 1232 39 -3413 -1450 1426 -1903
772 -1903 -6879 -5632 -1198 -1013 -2363 -1510 -369 -2413 -5495 -5256 -3111 -2962 -3266 -2026 -884 -3153
788 -3153 -5831 -4494 -1158 -1160 -3888 -4182 -2094 -2521 -5575 -5224 -1612 35 -2520 -3855 -2214 -2651 -5199
805 -5199 -5216 -1187 -488 -3008 -3522 -898 -690 -3399 -2885 -26 -1210 -4494 -3813 -630 -359 -2377 -471
822 -471 2341 -25 -4659 -3945 -274 6 -2221 -342 3149 1612 -2323 -2008 748 419 -1106 433
838 433 2152 0 -1785 -242 2606 1634 -212 1771 2910 87 -1995 -131 2348 1518 767 2437
854 2437 2960 1211 -897 392 1936 1366 328 1140 2373 2262 1614 1547 1821 1793 240 232 818 984 1507
873 1507 2608 3264 2312 -39 -382 781 1047 -397 215 2852 3078 167 -941 1537 2201 485 -231
890 -231 978 1604 -921 -1375 940 2255 949 1058 2313 1146 -1844 -2095 -1 477 -411 453 2988
907 2988 1730 -1090 -824 1239 108 -2226 -1542 1106 1138 -381 233 2025 1251 -967 -1303 -359 -235
924 -235 -466 452 1273 1039 143 197 548 -387 -1065 519 924 278 -728 206 1180 958 453 551 839 510
944 510 -490 -845 -66 764 1076 994 1680 1683 387 -1189 -1163 -120 704 817 898 1893 2131 971 376 153
964 153 -443 -469 292 510 476 964 1771 1943 125 -1141 278 405 -555 -1164 185 1906 751 -345 163
983 163 989 396 -588 -531 -706 -1044 -813 -52 258 88 208 714 -435 -1827 -2107 -1321 -1100 -1332 -518 488
1003 488 615 -812 -1572 -1173 -1531 -2493 -2308 -1195 -263 -585 -1247 -1313 -1258 -1576 -2249 -2408 -2309 -1658 -1042 -1174
1023 -1174 -1252 -1733 -1279 -1254 -2276 -2847 -2139 -1622 -1934 -2272 -2277 -1151 -670 -1456 -1975 -1659 -1897 -2186 -2601 -2328
1043 -2328 -1113 -530 -378 -958 -912 -729 -1468 -2203 -2427 -1670 -374 -423 -226 -13 312 -53 -1374 -1853 -1268
1062 -1268 -263 44 38 407 919 977 657 -755 -592 463 566 100 94 693 1835 1536 812 1246 1558 1659
1082 1659 969 404 867 1248 1800 2283 2225 2444 2524 1970 1035 723 1322 2063 2090 1956 2986 3670 2946 1840
1102 1840 1192 1536 1943 1480 1903 2617 3555 3161 2260 1574 1539 1687 1656 1243 1350 2289 3026 2373 1509 1877
1122 1877 1827 1737 1089 672 1143 1990 1638 958 1025 2043 1893 964 82 319 504 225 8 382 1270 1755
1142 1755 1638 450 -598 -489 -578 -866 -919 -73 927 1083 151 -220 -453 -612 -1646 -1987 -1183 -217 -457
1161 -457 -552 -481 -238 -513 -1782 -2092 -1869 -1247 -1046 -1000 -1348 -1044 -330 -702 -1337 -1728 -1654 -1210 -1981 -2186 -1644
1182 -1644 -817 -555 -881 -986 -1011 -1009 -1762 -2555 -2311 -912 -742 -1057 -875 -235 -620 -1385 -1943 -1813 -1700 -1019
1202 -1019 -621 -709 -85 -47 -203 -959 -1526 -1424 -773 -828 -637 -744 225 288 -43 -532 -574 11 -315 -1182 -910
1223 -910 12 554 -90 46 438 348 73 -399 -207 -39 -492 -332 482 862 909 1063 528 297 -594 -690 -65
1244 -65 -208 157 669 1416 772 -106 -533 -148 -33 -683 -294 591 976 468 -60 455 400 -426 -971 42
1264 42 -21 -288 114 612 575 -27 116 477 -346 -999 -387 43 -259 -860 -50 962 567 -324 -550 386 -51
1285 -51 -1222 -1083 -171 403 15 408 550 383 -611 -1169 -845 -811 -708 -122 864 501 -32 20 -5 -672 -1021
1306 -1021 -409 417 56 -460 -161 695 585 -163 -621 418 215 -330 -468 384 946 305 59 775 718 -83
1326 -83 -140 548 674 -577 60 1185 1047 526 759 1760 835 -496 -303 800 950 277 878 2016 2342
1345 2342 483 -103 545 637 374 452 1770 1600 923 654 1292 983 375 324 1276 848 631 601 1388 1066
1365 1066 813 948 1428 911 -188 167 1073 1266 546 380 1233 1090 493 -76 305 429 287 -89 145
1384 145 330 310 318 637 668 -141 -890 -800 101 -849 -79 981 1116 -304 -1289 -643 -436 -1180 -1286 481 529
1405 529 -315 -1335 -425 25 -724 -1496 -719 -142 -1463 -1659 -969 -205 -1066 -946 72 -346 -1694 -1431 -803
1424 -803 -643 -1594 -1373 -118 -274 -1689 -1691 -353 -249 -1354 -1781 -898 -793 -1012 -1123 -498 -244 -280 -1161 -1558
1444 -1558 -1218 -1235 -537 -1 131 -252 -429 -789 -1025 -1067 -1005 123 241 25 -548 -214 108 -188 -603 2
1464 2 1105 286 -858 -707 580 727 35 17 1090 525 -567 -387 536 399 288 859 1019 535 -282
1483 -282 735 1408 198 138 980 1256 17 -349 1032 2394 838 -508 418 1042 222 -546 784 1787
1501 1787 1423 319 462 543 -74 148 900 863 467 597 952 568 -315 163 1261 785 -242 -303 395 465
1521 465 275 120 651 797 288 -477 -611 128 251 -225 -156 76 178 -116 -368 -172 -97 -177 -403 -289 -429
1542 -429 -782 -209 509 68 -571 -734 -143 -878 -1229 -452 1012 567 -1089 -817 15 -583 -1492 -904 293
1561 293 295 -761 -591 -357 -379 -739 -242 -18 -265 -669 -347 -45 -594 -926 300 627 -383 -993 -284 -35
1581 -35 -236 -657 11 598 69 -395 -57 204 52 -280 -296 140 175 278 402 514 431 528 131 -52 -176 293
1603 293 411 631 537 565 737 281 140 -47 312 597 670 310 157 552 870 376 255 760 998 327 -136
1624 -136 236 478 635 316 985 740 549 476 756 643 199 197 614 878 220 702 716 427 -696 -493 363
1645 363 280 -195 -20 1097 761 172 -75 228 -7 -353 -399 265 192 -204 259 341 -68 -514 136 -55 -357
1666 -357 -559 -71 176 -367 -476 32 -226 -180 -571 -698 -197 -448 -590 -533 -374 190 -497 35 -385 -406 -928
1687 -928 -703 -724 -358 110 -210 -164 -306 81 -307 -711 -839 -842 -12 -63 -40 -187 -230 -399 -69 -439 -478 -471 -315
1710 -315 -287 -178 -495 155 28 -564 -480 -64 142 -221 -296 211 152 241 207 220 157 -10 -58 -47 -397 90 435
1733 435 455 63 287 233 105 -53 -525 145 327 295 185 463 649 366 -142 -278 -269 39 -20 304 361 267 398
1756 398 227 559 -154 -21 -24 -7 -54 262 472 418 -74 -71 163 -40 -81 -152 -195 127 31 -289 -114 202 216 -166
1780 -166 -617 -512 -510 -235 -449 -566 -27 193 -10 -428 -825 -571 -453 -683 -486 -200 51 -84 -89 -468 -448 -821
1802 -821 -690 -785 -554 -307 -190 51 -246 -607 -500 -439 -748 -749 -634 -258 -320 -627 -353 -34 196 -258 -432 -370
1824 -370 -409 -714 -934 -599 99 193 393 96 -247 -98 -355 -471 -516 -63 707 429 430 389 212 112 -220 -427
1846 -427 -6 291 319 460 578 859 437 586 69 315 205 556 459 318 792 1028 845 379 326 500 450
1867 450 115 379 555 653 699 733 980 734 735 653 408 143 491 1019 850 705 963 840 1111 266 -58 322
1889 322 619 677 722 916 1211 938 791 385 150 5 209 314 241 592 854 723 334 232 -306 184 174
1910 174 -208 178 425 492 31 -166 312 524 55 -356 -319 -251 -106 -290 262 194 147 135 -96 -567 -532 -601 -609
1933 -609 -385 -102 158 51 -220 -446 -836 -789 -577 -856 -671 -397 32 -193 -560 -634 -399 -664 -1048 -850 -364
1954 -364 -459 -183 -369 -291 -406 -480 -727 -923 -332 -523 -247 -539 -802 -280 -87 -230 120 -731 -502 -1010 -857
1975 -857 -465 -247 147 -41 -123 -220 -224 -659 -865 -748 -399 197 29 186 481 38 -348 -212 -586 -245 -430
1996 -430 -274 60 333 339 177 99 -204 -240 -277 -128 -10 -157 245 259 333 -107 -141 -74 -268 -115 -122 -228 -200 122
2020 122 164 910 616 424 -210 75 -181 -150 -135 565 559 -256 389 335 -111 -350 -144 362 178 -494 120 283
2042 283 634 -23 -274 114 -299 -545 148 -74 -196 422 307 -88 -289 -189 52 -226 -215 -247 277 289 -138
2063 -138 -226 281 207 232 -215 39 -114 -449 -383 -9 824 637 395 177 -89 -147 -344 -500 352 246 261 334
2085 334 373 353 29 130 97 431 -93 21 540 597 422 553 683 484 -237 -427 391 124 263 298 789 818
2107 818 368 -349 593 727 -161 266 700 492 222 458 870 903 283 615 332 -113 -388 416 1109 899
2127 899 632 687 612 285 -114 111 577 780 346 531 830 745 282 278 149 -28 -104 12 173 148 479 439 299
2150 299 357 34 -42 -264 -188 -58 -29 199 130 -10 -96 307 279 -372 -334 -176 -1 28 -644 29 467 56 -239
2173 -239 -313 -104 -764 -705 -334 -243 -241 -6 7 -214 -710 -629 -419 -164 -418 -611 18 -16 -559 -771 -163 -248 -668
2196 -668 -860 -855 -482 -651 -758 -135 -102 -827 -754 -443 -672 -457 -745 -551 -531 -578 -359 -418 -190 -899 -704 -273
2218 -273 -588 -826 -462 -212 -146 -112 -189 -223 -135 -741 -659 -552 -55 78 -13 -53 51 -56 -430 -326 -156 -283 -338
2241 -338 215 294 -170 -121 263 286 171 -545 -21 -105 -76 -405 293 659 355 -358 272 120 -188 -236 277 139
2263 139 173 201 250 568 203 105 -95 259 -99 114 156 435 187 559 436 325 185 -71 -340 108 -28 183
2285 183 542 484 392 167 104 463 15 -79 -108 438 589 155 339 353 201 -22 120 207 -279 -265 52 146 218
2308 218 215 169 194 178 -364 249 -76 -22 80 9 351 183 59 -114 262 -242 -671 -544 -22 323 106 215
2330 215 167 -98 -169 216 -309 -150 161 162 562 150 80 -66 208 -315 -375 48 88 150 -87 296 121 207 9
2353 9 305 -58 -214 165 84 141 227 190 53 184 -154 18 262 33 131 -39 327 322 286 231 172 150 -301 -112
2377 -112 -49 312 168 313 234 329 381 18 45 -96 175 210 351 469 -15 236 356 194 19 2 355 158
2399 158 -154 87 69 225 -175 283 122 122 78 -125 -277 107 -123 -169 243 66 -130 -12 -185 -104 -544 -135
2421 -135 -263 -108 34 -9 108 -116 -12 -572 -290 -333 -78 -193 -178 -321 -333 -632 -402 -308 -220 -478 -218 -297
2443 -297 -320 -125 -421 -452 -403 -237 -400 -437 -204 -320 -529 -231 -423 -171 -341 11 -646 -337 -9 -315 -313 -401
2465 -401 -133 137 -223 -190 -115 -345 -73 -285 -408 -206 -9 -3 -199 -274 -191 -208 -81 -157 64 102 -65 -197 195
2488 195 -161 -114 -79 99 107 217 137 -90 -9 107 272 313 108 350 242 596 630 -133 91 200 323 379 498
2511 498 136 139 113 96 179 255 20 169 391 536 495 275 173 182 359 282 214 100 516 363 535 359 189 258
2535 258 126 129 -117 22 457 206 133 212 252 270 168 212 163 -39 40 45 417 -41 367 264 153 51 -85 242
2559 242 -111 -190 265 123 80 315 -47 126 -228 80 -83 86 97 80 -47 -360 -425 39 -66 -402 -144 -176
2581 -176 171 -124 56 42 81 11 -86 -215 -374 -104 -182 18 -252 -61 -122 -218 -143 -246 -316 -136 -117 -189 24 -370
2605 -370 -121 31 -79 -116 -182 -294 -318 -137 34 -52 67 234 -344 224 -421 -29 -93 -166 -135 114 -205 28
2627 28 -161 -32 -111 -7 80 -14 221 -99 206 107 -62 128 184 -66 175 313 -42 -35 128 415 166 -136 -168
2650 -168 417 257 129 -157 72 424 -127 65 36 229 387 84 -138 -225 -121 15 69 106 163 92 -116 -16
2672 -16 -58 -225 -37 87 16 -201 73 18 47 -306 -132 -213 -105 -113 -168 4 -214 -172 -138 127 -212 -253 -337 -305 40
2697 40 -404 -141 87 -334 44 281 -66 -100 -78 108 98 -200 -12 -133 25 35 -217 197 -290 -49 96 -267
2719 -267 41 14 -154 269 -5 51 -266 -246 -150 194 -69 -163 449 -20 -134 -256 204 -36 -105 77 265 160
2741 160 -72 -44 163 97 7 3 261 200 -185 106 291 224 30 80 178 215 388 75 225 266 346 177 -122 4
2765 4 -36 121 420 152 63 118 418 360 178 250 222 249 196 75 292 139 389 323 37 347 72 135 -92 309
2789 309 86 104 418 393 30 24 295 -142 -131 176 209 314 105 60 418 36 65 36 207 -11 -364 71 78 -147
2813 -147 -64 -143 26 -269 103 -133 -155 76 -28 -40 539 -274 112 -171 -207 -275 -217 -157 -224 -224 -149 -370 -102 -101 -438
2838 -438 -319 -198 -184 -330 -24 -375 -155 -134 -414 -88 -154 -174 -319 185 -169 -271 -131 -87 -166 -267 13 303
2860 303 -228 -170 -142 -50 70 34 -329 10 -145 -152 -44 -44 79 -72 -129 -54 -103 -99 -144 -210 60 77 4 -57 352 83
2886 83 96 304 145 -71 -163 178 259 -66 -221 547 270 127 127 -181 11 80 -107 -138 114 91 135 40 52 181
2910 181 119 163 298 -22 -33 -244 72 108 431 248 -91 -33 102 -11 -94 -16 -113 160 396 -30 50 222 252
2933 252 -164 -2 164 -67 190 -347 354 165 52 -44 -150 27 -174 213 109 186 -8 -194 102 118 266
2954 266 -58 -106 -109 -19 -387 -147 92 -70 -209 -251 29 206 -70 10 17 20 -279 350 -259 -86 108 -247 -199 -506
2978 -506 -16 -59 -129 9 46 74 13 -396 -116 -38 -194 27 330 26 150 82 -111 264 142 -16 -157 -89 -79
3001 -79 287 -186 -188 -294 1 27 130 -104 -80 -69 -218 205 72 -162 -38 304 182 117 211 -48 130 57 -196
3024 -196 270 -95 -38 197 199 195 -81 -33 -146 -100 177 -100 199 324 -158 -35 -357 -258 54 -40 369 -105 -93
3047 -93 -54 -177 -164 226 -243 115 -27 30 120 200 -61 177 -162 -144 222 -394 92 -100 164 282 42 -5 28
3070 28 148 251 -100 -241 -66 92 -35 -110 -325 181 85 233 -54 54 182 6 265 109 -132 53 -27
3091 -27 294 -154 -206 222 -254 -97 41 -69 67 -69 -85 -108 43 184 -60 64 -29 -271 129 -321 -130 -204
3113 -204 95 -267 -79 22 -176 8 311 -1 -150 183 3 -111 36 -12 -83 3 -250 86 -120 -70 124
3134 124 155 48 264 33 62 269 50 131 138 -86 11 64 101 89 321 -70 -105 -210 174 392 1 334 68
3157 68 -197 209 -24 393 -210 81 -35 -70 118 7 387 109 -308 46 24 84 369 26 331 -111 274
3178 274 77 92 -96 43 -115 304 -41 257 41 99 -97 209 -88 -166 -82 -111 -27 -155 52 15 92 -195 49
3201 49 -249 -52 -158 -448 -34 22 29 49 52 142 21 -70 -47 -37 -236 -162 130 59 -232 -84 -201 32 -100 -136 -70
3226 -70 56 114 60 -6 -90 -151 -347 -98 -83 127 -123 213 -55 -177 -231 17 -113 46 -143 158 91 77 40 -227
3250 -227 -199 -113 -47 149 119 -77 -26 -59 32 -206 47 161 57 19 134 -93 -131 -321 200 -261 -112 61 -112
3273 -112 245 125 -145 134 -121 68 -5 47 -124 6 66 -156 22 -59 58 -53 27 122 176 -214 69 -221
3295 -221 146 -191 57 176 -170 16 227 62 180 -77 147 113 -115 -142 129 -367 16 233 38 117 154
3316 154 -21 -169 189 -31 159 -124 -62 298 52 -53 -74 23 382 25 309 -239 9 23 -17 -103 246 -55
3338 -55 -247 -138 75 -84 6 101 -40 6 -248 -30 -84 8 -178 -343 -157 179 -348 327 20 -47 -265 -279 -125
3361 -125 220 99 -21 110 -404 -124 -101 -117 29 94 101 -47 -85 -13 0 22 49 279 231 185 -61 20 -76 -15 -22 109
3387 109 20 -147 163 -191 -64 -131 261 -135 31 358 -184 -79 215 -115 263 79 -23 -47 131 -314 88
3408 88 -32 -299 131 86 -27 -235 -233 18 82 65 231 -129 102 205 -186 -182 -260 -102 -181 11 -65 -82 -113 -262
3432 -262 -221 215 37 -67 -45 153 254 -55 151 71 -241 -106 44 41 143 323 -216 207 -272 -133 29 -116
3454 -116 -4 -26 22 -295 4 29 83 10 -90 -154 -165 -39 -138 -29 -317 -228 8 37 90 79 -69 184 61 123
3478 123 220 -29 116 -102 17 -423 -77 -112 -169 -50 -121 -158 374 -83 -94 68 -170 -18 -2 47 240 -124 -71
3501 -71 105 -275 36 -66 362 -252 -318 117 -71 5 -12 138 8 155 76 5 -37 -4 -49 323 135 113 89 209
3525 209 -49 -67 1 284 138 45 152 118 139 5 155 201 181 -77 -230 413 -18 39 -95 -201 -256 -72 -34
3548 -34 -228 138 -77 132 -13 -61 -79 28 372 248 -258 56 -1 67 -88 -162 60 69 -120 -350 162 -72 -33
3571 -33 -129 -30 257 127 398 75 179 469 6 -132 222 -172 -126 -441 291 -303 295 54 81 -219 -27 -75
3593 -75 -270 124 -400 131 76 -110 192 -123 31 -132 -110 100 -300 -22 -212 -207 15 5 -140 57 -349 65
3615 65 -182 197 -116 -116 67 178 91 -58 -257 -42 -8 -164 -76 284 59 -318 -30 45 303 64 -183 196
3637 196 63 -310 111 65 242 -112 -88 -119 -195 23 121 -39 18 -59 -37 -45 210 31 -193 -211 157 129 140 -263
3661 -263 288 -132 -205 -177 -162 265 -98 164 -32 -270 -214 -191 46 117 58 -119 -181 171 108 146 158 42 90 139
3685 139 -172 277 -199 21 -265 -29 -236 -148 -83 -177 52 -52 -16 6 -181 -76 277 29 177 15 -175 45
3707 45 -144 148 -60 -129 73 -149 250 82 -235 6 -227 -391 -73 -36 206 -438 -139 23 55 -44 45 297
3729 297 -223 -44 -65 -267 20 -295 -163 -114 -92 121 55 341 -34 71 -96 -23 -286 -237 54 -68 -92 -94 131
3752 131 -179 27 97 171 -210 -13 -92 75 -149 218 -228 -131 -73 112 39 -507 78 157 35 -42 -153 214 178
3775 178 -198 93 45 237 -12 157 8 0 225 -239 175 69 -38 61 -84 5 -131 -9 -159 65 208 225
3797 225 -95 -209 0 -57 135 25 90 -124 -40 31 -382 47 99 40 30 -38 -84 -98 -115 -53 199 144 -6 258
3821 258 21 111 164 78 177 64 224 1 -44 37 -177 -5 216 128 328 32 -100 -95 -153 126 -18 -151 27
3844 27 177 422 128 -84 -274 -123 152 152 -2 -73 -94 -135 186 91 -177 -225 100 -35 -25 24 145 -113 -140 -32
3868 -32 -58 263 119 -273 -32 -125 8 -6 -143 -275 -201 -110 -215 15 29 -24 228 185 -350 87 95 233 -12 -236
3892 -236 -27 -109 -112 -106 -52 311 82 -52 -77 -50 -222 330 -226 73 -286 -44 187 6 133 -125 24 87 76
3915 76 -70 -109 44 97 -37 116 -151 -126 23 156 -27 -176 -4 332 142 -112 28 -244 -191 -9 175 280
3937 280 68 -107 -19 94 101 143 34 10 343 133 201 454 84 170 -19 226 -117 -61 -130 84 -41 144 51
3960 51 51 -105 -46 -367 7 -12 92 -257 -122 75 -26 85 -292 -241 -38 95 -86 -105 168 -58 134 -122
3982 -122 60 -291 19 -104 -333 -97 123 9 -287 353 149 -108 -3 -252 49 -130 47 96 -71 120
4002 120 -177 161 -133 -263 220 -84 -216 -55 -160 -38 -58 -252 5 -100 -474 -184 162 42 -90 239
4022 239 -71 -135 -114 4 -153 -6 -207 -75 -340 178 -121 -51 205 -114 208 178 69 44 57 91 206 245 -125
4045 -125 -211 -86 -145 -348 -53 73 154 83 320 -101 -90 -87 -70 63 121 102 102 -117 100 -56 58 212 29 53
4069 53 90 49 -72 19 -122 -41 -261 44 -13 256 -74 19 313 295 -50 114 126 -263 205 296 154 46 205
4092 205 -96 327 77 -13 -77 -159 53 156 -272 -156 125 -104 -204 -330 105 -97 204 118 213 -139 -218 -89
4114 -89 -132 10 66 -163 67 73 -73 -126 198 -1 73 179 -60 18 -24 114 176 -187 -44 -30 46 -203 98 22
4138 22 -176 -89 114 -146 373 113 44 -73 -141 -326 35 -46 -21 227 128 -252 -143 38 114 -146 -247 92 6
4161 6 113 -51 154 173 -51 -244 24 -189 123 -268 244 232 -150 98 -296 91 109 -236 -239 -80 39 170
4183 170 89 -89 -74 -223 -142 -103 372 98 130 59 22 111 263 76 -21 9 13 -294 241 -175 -342 -48 -32 351
4207 351 190 -31 -11 -82 -43 183 239 -112 -189 -3 -348 -150 315 141 -259 20 31 45 107 -76 90 228 -249
4230 -249 -16 207 -89 -95 29 93 196 -290 403 -68 69 -285 173 285 -59 -6 -197 179 -119 -130 56 33
4252 33 195 213 -42 -6 -30 72 194 222 146 326 145 17 -55 -209 244 -101 -36 -36 -281 -206 -116 85 370 263
4276 263 -111 -143 -58 201 77 165 82 -109 29 -128 198 -268 188 178 -197 -5 239 18 57 -33 159 -135
4298 -135 29 267 -109 68 -181 -1 56 280 90 51 -148 -144 -295 182 204 16 11 53 -66 -212 -108 192 207
4321 207 -88 92 100 -86 67 139 156 -18 292 -60 -57 -119 17 -72 69 -100 1 25 89 -79 93 -130 -268
4344 -268 84 14 227 47 -119 65 24 7 -7 40 266 -85 30 8 -333 181 -92 -140 -29 297 -63 -168
4366 -168 -24 -107 254 133 -19 -193 106 -161 7 153 -75 -62 -115 19 182 120 -42 -19 -330 -129 -77 -51
4388 -51 231 -100 -74 -170 -85 199 81 112 -116 45 -24 36 -23 -85 -42 -57 114 279 52 -243 34 -40 -92 -171 -141
4413 -141 256 -224 315 69 158 255 -140 65 -208 222 476 -87 85 238 -96 -158 23 111 -9 -181 190
4434 190 -1 -58 393 -112 88 147 -178 189 43 15 29 -103 -224 80 64 150 21 137 338 -22 -27 79 54
4457 54 -120 12 -51 51 -276 33 155 -20 -41 373 -29 110 -110 83 -69 305 -149 -18 14 -15 279 85
4479 85 -367 -293 -189 0 457 108 -67 49 77 197 -193 23 -126 -70 88 -79 -41 -12 -288 108 69 -5 65
4502 65 -112 -13 -177 -65 6 52 289 -75 113 10 15 49 -168 17 105 54 -121 -159 61 -313 37 -85 63
4525 63 325 120 -227 -165 -10 -231 -109 -130 -194 -99 251 -377 67 66 194 397 -233 13 -94 -8 -105 72 104
4548 104 91 -163 -189 -186 -281 -185 -35 159 -272 218 213 150 -247 157 -191 -136 46 92 -14 -164 -114 97 129 83 -39
4573 -39 187 10 -24 -99 20 -55 -96 230 354 114 -56 173 -81 27 -155 -6 -31 -268 134 -285 -1 96
4595 96 -62 -118 18 233 58 -108 -378 0 -234 -104 -43 -201 52 18 -153 -3 -104 -134 103 -231 -160 189
4617 189 183 -238 261 -18 161 -129 -230 -117 311 48 -143 -78 -14 -79 -239 41 55 -19 81 130 28 123 -163
4640 -163 106 -102 -31 -36 -72 332 -151 -149 -123 -152 -97 -143 -132 -67 -115 6 133 -171 -214 -41 -207 -270 77 212 -190
4665 -190 -3 -195 -34 -44 -81 -50 14 -54 -213 194 -147 -21 161 244 -19 141 -105 205 -159 -197 -27 -90 -56
4688 -56 -72 51 -67 -81 -261 -25 -39 96 -163 53 -139 89 135 -51 -143 49 70 54 -183 142 -239 -132 29
4711 29 10 0 -156 396 25 190 -207 42 64 -117 235 89 153 -31 10 66 -116 -326 22 124 -120 175
4733 175 11 -237 -97 124 92 -167 -118 -40 5 -148 173 -268 -71 93 -203 -67 -5 95 93 -75 300 -19
4755 -19 -280 -6 -116 234 40 238 367 -17 -108 123 -136 -23 128 -90 43 -109 84 -73 19 -251 -45
4776 -45 167 6 -152 388 -20 57 159 43 -58 8 109 -298 55 111 128 -193 40 373 132 21 7 55
4798 55 -117 107 27 187 -74 -298 108 -159 200 -137 172 -100 -458 -160 -164 262 7 -33 18 173 -22 31
4820 31 -84 -113 -380 -120 -44 70 -299 131 47 -41 239 130 -250 11 43 65 62 142 13 -35 -280 -59 -338 -310
4844 -310 -52 -161 -186 240 -27 -140 306 -158 -61 -193 81 -217 137 233 -112 -79 -73 284 -176 90 -61 12
4866 12 145 325 -101 -292 -11 -89 -9 -31 -200 -9 122 220 -177 3 -209 3 -39 -186 -35 50 44 -152 -305
4889 -305 -160 65 102 -28 48 52 233 -179 44 227 -165 183 -137 -164 90 -137 -297 -147 -71 102 -100 138
4911 138 -77 -197 5 -46 8 -17 145 -130 65 -16 -17 206 198 -18 -236 -7 -208 32 267 -143 -2 213 -30
4934 -30 -50 -89 72 25 151 -180 -38 -350 -74 182 24 -122 -17 171 -21 163 -165 308 -109 -56 88 -365
4956 -365 7 -165 242 48 -3 -151 57 44 88 -143 -57 -132 -135 112 -55 -66 -28 -56 -125 43 43 -107 47 277
4980 277 232 -60 40 -129 -117 -39 77 97 15 -127 69 -76 -73 19 55 17 38 188 154 -22 -77 149 -30 131
5004 131 49 70 276 -134 -153 -44 -185 -219 127 140 47 -181 123 -15 -168 51 -51 147 84 -243 -81 -76 -57
5027 -57 -126 -31 -177 -154 48 -32 27 178 -272 65 57 42 154 60 -19 -19 29 -251 149 -78 319 -169 317 125 4
5052 4 14 176 458 -56 47 236 -46 -100 -109 143 -39 -122 -207 128 202 -289 -8 -85 -105 -210 -19 192 136 367
5076 367 -197 114 221 -249 112 -197 -60 -256 23 53 -166 71 -176 -122 -133 -23 169 119 166 154 122 -280
5098 -280 36 -98 208 235 90 199 13 -9 57 -211 -115 73 -25 120 -174 -48 24 -80 -80 9 8 -36 196 108
5122 108 1 -197 364 13 -13 200 15 183 -24 -148 -199 -65 -23 354 -6 -67 101 51 -57 1 -39 131
5144 131 -11 332 87 137 26 90 92 -142 -375 331 -192 177 -211 61 -130 16 286 -53 -248 152 -21
5165 -21 -112 -159 -156 4 137 13 205 -133 87 118 -18 -132 272 54 -233 -200 -57 -36 89 195 -20 129 7
5188 7 92 -4 -236 14 79 -111 -187 188 -98 277 -78 -117 -94 125 221 142 92 -17 -276 57 277 -133 196 227
5212 227 20 7 -91 30 90 -280 48 160 -236 254 239 197 143 -94 -235 -42 54 -246 339 13 -122 80
5234 80 119 52 120 -182 -194 139 86 -28 271 152 206 90 -129 -418 -25 -7 110 -233 209 27 101 15 -166
5257 -166 -115 -81 -17 -38 -10 -280 -18 -94 34 -97 116 -204 -38 -55 -28 -114 27 -355 135 -381 104 -122 -121 129
5281 129 -117 122 232 -224 6 -102 137 -253 -120 -29 -100 104 280 -55 -78 -118 104 -170 -168 54 107 -63
5303 -63 -101 7 216 -226 52 -373 122 -13 66 -57 -195 36 -166 -25 -18 -105 -14 230 -282 259 343 205 169
5326 169 17 31 -40 23 25 -17 96 92 -85 -1 -210 -91 -39 104 -239 -33 -158 -168 102 -55 -156 -60 10 -85 163
5351 163 -152 -333 -290 -187 103 -107 -115 -104 50 218 101 -123 -178 259 -105 118 -218 -253 87 -21 132 124 -69
5374 -69 -21 39 28 167 12 128 -357 -14 107 38 1 -156 -80 -44 92 -108 -8 -7 76 -69 144 117 -47 122
5398 122 224 -178 11 89 -215 -4 106 3 105 -342 -131 328 -177 -33 -86 -28 92 27 38 -158 2 -67
5420 -67 43 -140 -28 -164 17 6 6 -176 35 -111 -181 16 156 -24 -131 17 109 -180 -133 19 102 267 239
5443 239 -198 269 98 -131 220 20 -52 13 -22 -136 61 205 12 -114 208 19 124 -193 -67 53 154
5464 154 -53 121 -62 -174 32 -67 30 119 316 -66 -80 -165 187 -185 10 -35 -22 11 -125 301 196 98 -41
5487 -41 -331 135 -250 -27 56 -333 131 -246 -90 -239 185 330 -54 41 110 157 -649 -49 186 -170 -254 295
5509 295 -178 -372 -15 -157 -223 72 78 -189 -37 35 62 173 -28 -27 -145 239 -282 -234 -81 75 -49 34 82
5532 82 106 150 -106 146 16 -124 -36 24 -105 -215 -29 -13 -168 -85 434 219 -71 148 358 -76 -103 -51 -44 -124
5556 -124 28 -145 61 134 -61 65 -27 -231 119 50 5 82 -66 177 -201 -17 -283 78 -160 -25 194 126
5578 126 121 -243 136 122 -152 -214 196 -299 55 -119 -76 -20 61 77 6 -38 -252 -219 -10 106 -82 -23 296 41
5602 41 203 7 -322 -420 -29 -78 -18 260 -83 0 3 -422 -116 19 -19 120 -17 -138 -141 46 82 -58 -116 -10
5626 -10 140 -104 -64 105 -131 82 -108 173 13 152 282 -10 -225 81 -46 -74 -205 176 -158 -18 32
5647 32 -123 -365 -82 278 -96 -65 156 -162 -73 -163 98 202 158 377 -57 -27 -240 -38 -125 -186 23 53 84
5670 84 63 233 81 29 -182 27 253 -132 3 8 389 -147 62 -120 -172 -64 112 184 -9 -271 17 -210
5692 -210 19 -183 -126 65 -190 100 122 71 67 116 63 -24 -20 10 41 42 -122 -53 65 -258 -228 169 -51 -145 -64 106
5718 106 -348 141 131 51 7 -230 -116 -65 -96 -171 -56 -28 87 155 117 -166 196 160 60 4 -40 134 205 40
5742 40 2 -73 140 148 -49 23 -72 273 -64 -137 -39 48 50 157 385 -114 -405 81 124 -264 62 206 -129 214
5766 214 3 106 129 80 14 -93 129 -16 -125 87 119 -90 101 6 -10 334 -37 -123 300 -97 102 98 73
5789 73 71 122 121 -111 -308 -54 -156 4 -120 34 -29 -92 -99 116 130 223 -51 -82 76 -45 50 -50 -125 202 -250
5814 -250 -125 -101 -207 -205 -270 189 186 -22 -50 59 310 -208 -76 54 -4 -111 -166 -15 20 176 -103 26 186
5837 186 77 -186 -295 -8 -302 -121 -1 -94 -10 87 -62 52 -147 -267 -184 -308 -120 70 42 -33 -104 182
5859 182 -139 169 8 67 298 55 -72 -36 28 109 140 88 74 -264 10 11 19 56 4 -148 -97 387 29 -255 50
5884 50 251 -143 -173 219 8 -312 -364 -164 199 67 160 57 -135 -4 -403 39 0 251 119 177 111 -157
5906 -157 -248 3 52 -145 18 90 148 2 -268 -37 -20 100 51 30 117 -218 52 160 60 -54 -38 34 146
5929 146 -196 26 125 -122 213 -72 -266 39 -45 124 -101 -33 27 -153 294 -54 33 26 -50 7 165 -37 -51
5952 -51 -100 -155 -226 120 142 -53 0 -81 6 32 74 -111 -51 383 -376 171 -127 30 217 76 84 -20 -84 -14 -78
5977 -78 301 149 -90 -111 89 -130 150 -45 125 139 106 72 -150 12 -44 1 -125 -58 -141 156 192 134 -21 -22
6001 -22 35 87 -30 62 35 -128 64 -131 -211 153 28 125 -94 -70 -39 54 237 -120 124 -263 -337 90 -59 201
6025 201 -128 52 16 -115 -57 -168 -271 -32 79 179 138 -19 188 -179 -134 -236 103 -135 -32 252 -132
6046 -132 -74 -126 -143 -115 17 239 -345 -35 -8 -89 231 -20 37 -50 -91 -84 -118 -130 206 37 89 -148 118 2 -36
6071 -36 42 106 -197 -233 -157 20 -60 -240 104 31 111 -156 135 165 89 102 -470 -24 23 131 -107 184 -135 -137 9
6096 9 80 32 -44 -69 -213 -283 113 -21 12 -20 45 -181 -162 221 -209 191 -154 -33 69 215 -109 65 162 132
6120 132 -216 -89 -200 163 -201 -117 57 82 -233 197 -75 356 9 -254 229 -121 -32 218 -57 200 -108
6141 -108 -134 -122 179 -5 260 -197 -70 42 -38 -48 -105 66 -36 -279 67 -394 136 115 -55 -255 -49 -161
6163 -161 6 14 -232 75 54 -36 67 -127 -152 64 28 17 -81 69 -51 129 172 185 17 -114 -254 1 -136
6186 -136 -138 56 -164 53 164 178 -141 -200 10 -306 -87 150 -136 154 -137 270 -74 0 123 -10 244 114
6208 114 282 -13 22 -250 180 49 -304 -201 30 -128 225 -98 -172 102 218 45 80 -285 141 -72 110
6229 110 5 137 -163 59 -5 105 175 249 -26 127 -21 80 77 211 2 -153 177 225 237 110 30 123 3
6252 3 -36 93 77 -212 149 88 172 336 -24 -29 64 128 73 406 -161 -18 79 26 40 -117 157 23 -90 19 -61
6277 -61 81 -113 -218 34 -37 83 77 103 170 -158 -62 44 -195 -26 125 -213 40 48 128 34 -113 -2 11 -86
6301 -86 -107 25 -23 -40 -14 203 -52 82 479 31 3 -126 -45 -210 231 311 -132 -73 -159 -37 -138 -408 146
6324 146 -60 53 146 -280 -135 -5 -34 146 -66 141 59 227 100 -74 24 124 125 -166 44 -94 -311 69
6346 69 -103 157 -167 39 21 195 -127 -98 121 -49 42 -142 -83 294 -6 72 36 -123 -70 -21 -82 -7 56 21
6370 21 -42 -82 75 -166 -46 70 -152 17 66 -34 66 -54 168 84 -194 76 9 -209 221 -375 84 -64
6392 -64 -11 39 -283 -40 294 31 -257 -196 -211 -320 -255 205 153 -28 0 -282 44 369 -206 341 -132 238 322
6415 322 -86 -142 -261 -85 -61 129 145 157 163 -205 54 -177 28 -105 -120 -48 19 -285 -81 -27 -142 172 112 -66
6439 -66 -40 -127 182 27 316 -183 -46 328 105 -144 182 28 234 -133 -35 13 -3 -91 102 -14 -66 187 -106
6462 -106 249 -172 255 46 45 -66 -200 -184 153 75 -287 -107 -46 219 7 67 15 -139 -135 6 -207 136 -26
6485 -26 63 -121 -69 140 -227 -222 145 -53 -270 183 102 -229 19 100 21 -129 4 146 15 -402 109 -213 -248
6508 -248 -53 324 -118 51 -28 375 262 60 226 37 74 -6 -103 -51 60 -26 -23 -90 -203 24 -183 -35 -239
6531 -239 -179 153 156 -108 -123 70 78 200 18 380 92 169 -20 -98 15 -84 -149 -34 -364 129 200 -46 106 -36
6555 -36 339 -163 -93 -566 78 -109 -26 -177 -373 345 -218 -103 -324 -14 -38 220 118 279 13 37 -383 -17
6577 -17 237 -254 53 70 -102 -145 -49 -126 83 -53 217 90 172 -139 81 12 0 66 83 39 73 0 -168 -167 -65
6602 -65 248 9 106 -313 42 -30 160 -37 99 -100 -101 -24 304 53 30 140 40 -249 259 -97 -54 -85 -53
6625 -53 117 -527 -15 -213 48 232 127 -102 -13 137 -85 -105 -410 18 115 32 124 7 -63 -250 416 117
6647 117 72 180 -225 62 175 175 -149 -138 24 -3 -17 -122 104 -228 -446 -225 -133 -25 110 -20 49 -235 150
6670 150 2 68 -102 117 -26 -167 56 108 34 -131 -286 -11 72 189 -88 -31 -66 128 277 265 19 127
6692 127 251 4 150 257 91 390 -181 298 158 63 174 -11 -34 19 -70 -102 152 -44 -44 -142 315 40 -108
6715 -108 -203 47 2 -44 285 -136 -175 -118 -337 -35 305 250 -87 -59 -106 252 -242 -40 93 -17 155 -218 -264
6738 -264 -18 -40 79 135 -66 187 -33 83 -104 104 342 234 35 83 73 -35 27 -159 11 -126 -55 -22
6760 -22 209 1 15 122 -70 -94 260 -109 -121 170 -292 140 -289 105 16 -146 -56 142 -74 136 71 275
6782 275 -329 -33 231 -84 -119 7 -164 -237 -83 21 122 289 -162 -222 99 27 406 71 38 -73 164 -237
6804 -237 -288 188 199 -188 105 -163 -43 136 212 -18 -4 51 -11 6 28 -154 3 373 -122 -106 -132 -226 -87 -12
6828 -12 -88 288 140 55 -60 -107 -6 -118 90 106 -117 -404 307 -269 -287 -198 272 -130 -92 -8 -410 120 85
6851 85 -118 42 -93 170 155 185 163 68 -60 -24 109 53 75 349 -70 16 231 -126 -20 -102 120 87 40 -260
6875 -260 -284 210 36 7 34 -161 261 -112 -253 3 30 -193 101 233 178 -83 -235 -18 62 92 67 -171 -202
6898 -202 268 -159 -304 184 -221 -222 -121 37 -77 8 106 -308 -124 42 -66 239 11 -35 274 110 -113 185
6920 185 88 -30 -42 255 48 124 18 -99 -16 -55 121 -53 -250 -128 -76 82 -140 115 225 127 -117 -216 82
6943 82 66 -66 -73 -147 -26 70 249 204 -194 165 -88 128 -87 394 140 -79 -41 42 111 123 -166 291 -48 199
6967 199 86 -166 -162 -28 -62 122 -68 91 67 -372 -1 89 -13 143 -241 322 -36 -22 54 -200 138 149 350
6990 350 -5 -50 30 55 48 77 7 213 6 -139 60 114 135 184 -46 -300 -85 -138 -42 85 80 -139 14 -89 -35
7015 -35 28 20 -122 -26 60 -73 177 -222 -264 223 83 -207 -172 -97 -253 359 -143 135 397 56 -107 -89 31
7038 31 -277 73 -260 87 112 -344 -158 -131 229 -272 2 59 152 -197 -236 -267 -78 132 -196 203 143 -86 -191
7061 -191 -148 96 183 -128 -158 -120 56 -85 133 -217 27 -264 -49 261 171 -323 12 -18 -38 -28 5 305 140
7084 140 162 54 -58 156 134 11 112 -211 -255 -83 58 205 -245 -59 119 276 -26 137 -187 87 64
7105 64 177 -175 185 -7 -154 -22 -235 -140 72 130 242 -218 86 150 137 200 30 126 -59 -258 134 -51
7127 -51 18 77 -84 -92 -175 -99 -298 10 247 164 27 -14 167 12 445 -1 29 -211 -131 9 63 71 -124 -171 -2
7152 -2 201 259 -21 -9 385 -189 -127 304 37 -172 -40 216 186 10 44 -297 98 -310 -73 -428 -130 -108 -65
7175 -65 193 -255 207 -277 122 -195 29 -161 140 -20 -150 112 -97 -81 27 148 -69 16 -21 -134 -96 -72
7197 -72 -42 -264 132 121 19 17 26 206 -217 183 -163 51 -38 -158 -154 -73 -125 -72 51 -268 48 1 -57 -81 56
7222 56 -25 -116 164 -7 248 -141 22 -12 -21 -9 142 301 125 361 -191 -298 -117 -264 -203 -212 -31 81 175 -11
7246 -11 -84 5 -17 118 -54 36 -26 323 255 -11 81 34 255 -35 -13 17 -191 -313 -132 -274 -14 -222 390 52
7270 52 371 -55 -70 97 -169 -120 43 -159 -96 119 -128 213 -10 171 -41 -81 -54 176 -106 -61 86 -137
7292 -137 -462 -26 107 150 27 18 73 2 42 95 153 74 -70 -338 122 -131 -67 -105 -145 55 -5 -74 -76 -102 95 38
7318 38 72 -105 -76 -68 7 -232 238 113 -44 -7 74 -5 -3 -77 79 -17 196 -29 109 -212 103 126 -70 249 156
7343 156 -169 43 2 76 143 -295 -30 -82 -311 62 144 -146 -187 112 164 51 290 52 -67 -59 -100 158 68 -208
7367 -208 48 -17 86 -65 -260 -36 27 28 -76 -102 105 -131 -398 -109 -106 -64 -26 98 147 -4 102 -117 -195 193
7391 193 115 253 87 79 54 -168 134 11 59 -33 -49 43 201 268 8 -27 66 114 18 165 119 73 -167 -43 -544
7416 -544 304 30 134 -281 -115 160 267 242 227 -213 71 -202 -25 -58 -376 -142 77 152 107 -26 93 -24
7438 -24 -176 -22 285 68 -115 246 260 -194 161 122 -34 -46 179 -165 -458 95 248 180 -57 156 -14 351
7460 351 397 -46 158 144 164 -195 -126 -160 220 -116 -182 10 -33 -43 -17 49 192 -193 -297 -238 -22 -32 261 41
7484 41 51 141 -121 -143 -2 109 109 114 106 -160 10 -196 -114 -313 -23 106 68 242 19 -126 -197 -19 -128 -201 -44
7509 -44 -328 59 -24 -2 -101 72 48 56 -99 -373 66 94 -52 -69 -359 48 -355 47 204 -292 102 6 40 -24
7533 -24 218 -47 80 115 84 -79 157 85 155 219 -164 -22 20 -222 456 41 -175 -13 -76 -24 -328 -155 287
7556 287 -190 -59 -221 74 218 194 -265 -93 314 -89 35 10 -297 -70 2 129 -51 -113 0 262 -150
7577 -150 1 233 96 330 -100 -187 267 416 -98 -192 -120 -263 13 418 119 -12 238 -33 75 -90 338
7598 338 144 -332 141 183 116 136 -57 -33 337 -4 -229 -75 146 -14 85 68 -249 -56 -20 148 -30 183
7620 183 -43 -82 85 -87 -69 -152 340 -237 313 -54 -220 35 52 -125 175 -122 -125 -143 118 -22 61 -129 -317
7643 -317 75 139 27 -3 68 159 186 -175 45 84 -1 -488 -14 215 97 -5 49 73 83 -104 59 -108 -127 -142
7667 -142 144 15 39 -2 1 269 -131 -100 8 -75 -193 97 227 -287 -193 51 163 -262 6 384 -35 -133 217
7690 217 340 -2 182 -218 -159 -305 -18 150 35 -484 265 -104 -29 132 121 50 -226 -15 -203 -330 80
7711 80 53 239 229 55 -154 26 -72 -118 -64 41 102 -44 -127 93 -78 -21 311 -250 79 -184 74 -207 -127
7734 -127 -206 -301 174 -79 194 14 -48 27 0 -80 2 93 -61 378 139 108 -72 36 160 155 220 -4 -265 -270 109
7759 109 90 5 -182 9 79 -101 68 -224 54 -170 218 -205 -59 -228 0 -251 86 113 -33 -39 -74 55
7781 55 251 -162 348 -242 -196 60 -39 89 -245 -318 -147 101 180 222 205 -149 -177 14 -80 283 53 -18 -59 -113
7805 -113 -169 -64 202 87 172 50 -179 -209 154 -228 -17 327 -57 -103 208 103 170 -6 275 92 62 143
7827 143 65 -183 -165 200 -101 -30 87 -234 5 -2 135 -77 -186 105 141 -12 34 -35 -40 -38 19 -95 -26 -86 85
7852 85 56 48 -169 -206 110 122 60 77 -139 -223 -102 88 210 -100 -214 29 47 278 328 79 -286 234 -11 -95
7876 -95 143 187 127 160 -125 42 63 139 218 368 -146 -91 -52 74 -93 -28 -158 -370 -35 -106 -13 27 25 40 6 131
7902 131 229 -393 -258 71 234 -16 -116 181 144 -87 -333 -72 129 8 23 -37 -306 -145 -384 201 -42
7923 -42 -23 -66 -226 -250 -186 165 30 78 -54 -103 293 -29 -30 -90 175 -213 230 -61 76 94 -185 153 -138 192
7947 192 130 -111 -268 -190 -37 207 -193 -45 -178 125 -112 -190 140 -223 239 -146 -29 225 131 -60 96
7968 96 334 -79 -101 54 11 -210 155 194 -216 -161 13 264 55 108 176 32 2 -96 183 -163 90 -222 161
7991 161 -78 214 87 -109 354 114 -15 14 -38 -20 31 -48 76 106 25 -41 -62 -147 -29 -92 117 32 75 -137
8015 -137 107 -38 244 -3 -342 -287 139 -138 34 -176 -169 -21 -132 282 114 134 118 122 115 -101 -307 10 -20
8038 -20 -42 -171 -15 8 75 -42 328 -27 -180 -175 -115 41 153 0 -70 24 76 90 20 -196 -411 -70 209 -69
8062 -69 85 158 -76 142 -54 228 169 85 -147 108 167 42 -3 135 -6 -125 248 36 86 19 -154 89 30
8085 30 -39 164 -200 106 101 -31 -43 -117 -146 44 75 -127 25 -74 -56 -80 -114 -68 184 -126 12 73 -50 6 -20
8110 -20 -166 -161 116 -163 137 -63 187 77 -150 114 -403 157 -25 -260 170 -192 -115 -184 24 153 68 99
8132 99 -12 304 -176 47 -148 98 -145 -140 295 -24 -4 -5 35 -72 131 -224 25 21 77 60 0 -87 126 60 28
8157 28 -157 -152 -137 -30 -241 -276 44 16 125 76 -185 194 -44 -282 33 -155 245 117 6 175 180 -107 21
8180 21 18 -54 -26 1 39 -346 -88 -209 34 -33 114
8191A14
##END NTUPLES=NMR FID
##END=
