##TITLE=1H_SR5_K_TFA
 CDCl3, 8 sc, 
 9.1.2020
##JCAMPDX= 6.0         $$ Bruker NMR JCAMP-DX V2.0
##DATA TYPE= NMR FID
##DATA CLASS= NTUPLES
##ORIGIN= UXNMR, Bruker Analytische Messtechnik GmbH
##OWNER= root
$$ XWIN-NMR		Version 3.5
$$ Thu Jan  9 14:09:07 2020 Russian Standard Time (UT+4h)  she@DPX200
##.OBSERVE FREQUENCY= 200.1315
##.OBSERVE NUCLEUS= ^1H
##.DELAY= (6, 6)
##.ACQUISITION MODE= SIMULTANEOUS
##.ACQUISITION SCHEME= undefined
##.AVERAGES= 8
##.DIGITISER RES= 18
##SPECTROMETER/DATA SYSTEM= spect
##.PULSE SEQUENCE= zg30
##.SOLVENT NAME= CDCl3
##.SHIFT REFERENCE= (INTERNAL, CDCl3, 0, 15.7039)
##AUDIT TRAIL= $$ (NUMBER, WHEN, WHO, WHERE, WHAT)
$$ ##TITLE= Audit trail, XWIN-NMR		Version 3.5
$$ ##JCAMPDX= 5.01
$$ ##ORIGIN= Bruker BioSpin GmbH
$$ ##OWNER= she
$$ F:/spectra/data/she/nmr/H-F/1/audita.txt
$$ ##AUDIT TRAIL=  $$ (NUMBER, WHEN, WHO, WHERE, WHAT)
(   1,<2020-01-09 14:07:54.15 +0400>,<she>,<DPX200>,
      <created by zg, POWCHK disabled, PULCHK disabled
       configuration hash MD5:
       00 E9 B6 7A A2 85 ED C7 34 08 36 98 17 FE 4E 26
       data hash MD5: 16K
       5B 00 F2 CD 54 89 09 6E C2 57 FA 58 2F C2 76 C7>)
$$ ##END=
$$ 
$$ hash MD5
$$ 46 B9 29 55 D3 05 AF 8E 49 6A 0A 0A 34 F1 F1 DD
##$RELAX= 
##$RELAX= 
##$RELAX= 
##$RELAX= 
##$RELAX= 
##$RELAX= 
$$ Bruker specific parameters
$$ --------------------------
##$DU= <F:/spectra>
##$EXPNO= 1
##$NAME= <H-F>
##$PROCNO= 1
##$TYPE= <nmr>
##$USER= <she>
##$AMP= (0..31)
100 100 100 100 100 100 100 100 100 100 100 100 100 100 100 100 100 100 
100 100 100 100 100 100 100 100 100 100 100 100 100 100 
##$AQSEQ= 0
##$AQ_mod= 1
##$AUNM= <au_zg>
##$AUTOPOS= <>
##$BF1= 200.13
##$BF2= 200.13
##$BF3= 200.13
##$BF4= 200.13
##$BF5= 200.13
##$BF6= 200.13
##$BF7= 200.13
##$BF8= 200.13
##$BYTORDA= 1
##$CFDGTYP= 0
##$CFRGTYP= 5
##$CHEMSTR= <none>
##$CNST= (0..31)
1 1 145 1 1 1 1 1 1 1 1 1 1 1 1 1 1 1 1 1 1 1 1 1 1 1 1 1 1 1 1 1 
##$CPDPRG= <>
##$CPDPRG1= <>
##$CPDPRG2= <>
##$CPDPRG3= <>
##$CPDPRG4= <mlev>
##$CPDPRG5= <mlev>
##$CPDPRG6= <mlev>
##$CPDPRG7= <mlev>
##$CPDPRG8= <mlev>
##$CPDPRGB= <>
##$CPDPRGT= <>
##$D= (0..31)
0 1.2 0 0 0 0 0 0 0 0.06 0 0.03 0 0 0 0 0.0002 0 0 0 0 0 0 0 0 0 0 0 0 
0 0 0 
##$DATE= 1578564473
##$DBL= (0..7)
120 120 120 120 120 120 120 120 
##$DBP= (0..7)
150 150 150 150 150 150 150 150 
##$DBP07= 0
##$DBPNAM0= <>
##$DBPNAM1= <>
##$DBPNAM2= <>
##$DBPNAM3= <>
##$DBPNAM4= <>
##$DBPNAM5= <>
##$DBPNAM6= <>
##$DBPNAM7= <>
##$DBPOAL= (0..7)
0.5 0.5 0.5 0.5 0.5 0.5 0.5 0.5 
##$DBPOFFS= (0..7)
0 0 0 0 0 0 0 0 
##$DE= 6
##$DECBNUC= <off>
##$DECIM= 24
##$DECNUC= <off>
##$DECSTAT= 4
##$DIGMOD= 1
##$DIGTYP= 9
##$DL= (0..7)
0 120 120 120 120 120 120 120 
##$DP= (0..7)
150 150 150 150 150 150 150 150 
##$DP07= 0
##$DPNAME0= <>
##$DPNAME1= <>
##$DPNAME2= <>
##$DPNAME3= <>
##$DPNAME4= <>
##$DPNAME5= <>
##$DPNAME6= <>
##$DPNAME7= <>
##$DPOAL= (0..7)
0.5 0.5 0.5 0.5 0.5 0.5 0.5 0.5 
##$DPOFFS= (0..7)
0 0 0 0 0 0 0 0 
##$DQDMODE= 0
##$DR= 18
##$DS= 0
##$DSLIST= <SSSSSSSSSSSSSSS>
$$ [...]
##$SUBNAM2= <"">
##$SUBNAM3= <"">
##$SUBNAM4= <"">
##$SUBNAM5= <"">
##$SUBNAM6= <"">
##$SUBNAM7= <"">
##$SUBNAM8= <"">
##$SUBNAM9= <"">
##$SW= 24.9337058887773
##$SWIBOX= (0..15)
0 0 2 0 0 0 0 0 0 0 0 0 0 0 0 0 
##$SW_h= 4990.01996007984
##$TD= 16384
##$TD0= 1
##$TE= 0
##$TE2= 300
##$TE3= 300
##$TEG= 300
##$TL= (0..7)
0 120 120 120 120 120 120 120 
##$TP= (0..7)
150 150 150 150 150 150 150 150 
##$TP07= 0
##$TPNAME0= <>
##$TPNAME1= <>
##$TPNAME2= <>
##$TPNAME3= <>
##$TPNAME4= <>
##$TPNAME5= <>
##$TPNAME6= <>
##$TPNAME7= <>
##$TPOAL= (0..7)
0.5 0.5 0.5 0.5 0.5 0.5 0.5 0.5 
##$TPOFFS= (0..7)
0 0 0 0 0 0 0 0 
##$TUNHIN= 0
##$TUNHOUT= 0
##$TUNXOUT= 0
##$USERA1= <user>
##$USERA2= <user>
##$USERA3= <user>
##$USERA4= <user>
##$USERA5= <user>
##$V9= 5
##$VALIST= <valist>
##$VCLIST= <CCCCCCCCCCCCCCC>
##$VD= 0
##$VDLIST= <DDDDDDDDDDDDDDD>
##$VPLIST= <PPPPPPPPPPPPPPP>
##$VTLIST= <TTTTTTTTTTTTTTT>
##$WBST= 1024
##$WBSW= 4
##$XGAIN= (0..3)
0 0 0 0 
##$XL= 0
##$YL= 0
##$YMAX_a= 127256
##$YMIN_a= -92113
##$ZGOPTNS= <>
##$ZL1= 120
##$ZL2= 120
##$ZL3= 120
##$ZL4= 120
##$ABSF1= 10
##$ABSF2= 0
##$ABSG= 5
##$ABSL= 3
##$ALPHA= 0
##$AQORDER= 0
##$ASSFAC= 0
##$ASSFACI= 0
##$ASSFACX= 0
##$ASSWID= 0
##$AUNMP= <proc_1d>
##$AZFE= 0.1
##$AZFW= 0.1
##$BCFW= 1
##$BC_mod= 2
##$BYTORDP= 1
##$COROFFS= 0
##$CY= 11.3945322036743
##$DATMOD= 1
##$DC= 2
##$DFILT= <>
##$DTYPP= 0
##$F1P= 16.9975609425685
##$F2P= -3.02152046262296
##$FCOR= 0.5
##$FTSIZE= 0
##$FT_mod= 4
##$GAMMA= 1
##$GB= 0.15
##$INTBC= 1
##$INTSCL= 1
##$ISEN= 128
##$LB= 0.24
##$LEV0= 0
##$LPBIN= 0
##$MAXI= 10000
##$MC2= 0
##$MEAN= 0
##$ME_mod= 0
##$MI= 1.114404
##$NCOEF= 0
##$NC_proc= 0
##$NLEV= 6
##$NOISF1= 3.799351
##$NOISF2= 2.8
##$NSP= 1
##$NTH_PI= 0
##$NZP= 0
##$OFFSET= 15.70392
##$PC= 1
##$PHC0= -10144.1
##$PHC1= 10.6008
##$PH_mod= 1
##$PKNL= yes
##$PPARMOD= 0
##$PSCAL= 0
##$PSIGN= 0
##$REVERSE= no
##$SF= 200.130013532006
##$SI= 16384
##$SIGF1= 3
##$SIGF2= 2
##$SINO= 400
##$SIOLD= 16384
##$SREGLST= <1H.CDCl3>
##$SSB= 0
##$STSI= 0
##$STSR= 0
##$SW_p= 3612.71676300578
##$SYMM= 0
##$S_DEV= 0
##$TDeff= 0
##$TDoff= 0
##$TI= <>
##$TILT= no
##$TM1= 0
##$TM2= 0
##$TOPLEV= 0
##$USERP1= <user>
##$USERP2= <user>
##$USERP3= <user>
##$USERP4= <user>
##$USERP5= <user>
##$WDW= 1
##$XDIM= 8192
##$YMAX_p= 0
##$YMIN_p= 0
$$ End of Bruker specific parameters
$$ ---------------------------------
##NTUPLES= NMR FID
##VAR_NAME=  TIME,          FID/REAL,        FID/IMAG
##SYMBOL=    X,             R,               I
##VAR_TYPE=  INDEPENDENT,   DEPENDENT,       DEPENDENT
##VAR_FORM=  AFFN,          ASDF,            ASDF
##VAR_DIM=   8192,          8192,            8192
##UNITS=     SECONDS,       ARBITRARY UNITS, ARBITRARY UNITS
##FACTOR=    0.0002004,     1,               1
##FIRST=     0,             0,               0
##LAST=      1.6414764,     0,               0
##MIN=       0,             -92113,          0
##MAX=       1.6414764,     127256,          0
$$ Real data points
##PAGE= N=1
##DATA TABLE= (X++(R..R)), XYDATA
$$ [...]
2020d1j81M47M83l41l45j72m33O78Q85k13p61j03L14l91N46K24J84n41n09K60
2040a0N22m3L2J68L3p18j11M80J093q42m94J20k78n25K90J039K9o92n39N37K59
2061C50k00O9L98m32p30L74M20M57l99k49L0k17m20Q03J63O1o10k95nJ71J77q
2083i2K37k52l97o47Q82M20L33q44j86N5K31n25N05L92k89j034K51R34j74l53
2103e53J1O62l96q74M14R06l42o56o2O98n26q8N91O19n22q15k65Q01K06k65J01
2124c55L79n33l11J37R82j97l51n90K38j49L91N96j30j82m40r3J69M93J7k22k43
2145c94J80Q4k09M22N91l50o20r3M19k58J70J17N14m84l34M3R21j59o49%K81j62
2167C0l57Q47M81l65r00MO09k50k1M66M26o96n13K35O86L78j004L04J39m44j98
$$ y = [-41, -222, 225, 708, 367, 22, -150, -583, 95, 980, 767, 6, -97, 217, -174, 372, 596, 780, 239, -270, -10, 512, 469, 501, 669, 702, -16, -127, 353, 1446, 604, 110, 230, -48, -573, -283, 756, 785, 93, -446, 91, 350, 150, 219, 617, 185, -545, -171, 249, 706, 307, 58, 88, -129, -549, 254, 417, 478, -132, -427, -432, -261, -84, -92, 145, -107, -504, -1151, -269, 151, 484, -360, -546, -491, -260, -785, -280, 112, -177, -1211, -960, -26, -200, -553, -542, 120, -276, -1150, -736, 170, -172, -828, -890, -192, -718, -806, -215, 404, -118, -933, -1198, -397, -191, -456, -355, 24, -509, -820, -683, 299, 102, -249, -839, -601, -750, -359, 237, 107, -75, -515, -608, -439, 54, 71, -151, -394, -214, -130, -339, 83, 674, 324, -296, -389, 30, -228, -58, 59, 573, 89, -245, -202, 719, 560, -89, -89, 192, 30, -327, 520, 1001, 636, -264, -260, 349, 99, 78, 544, 970, 274, -239, -4, 682, 1060, 56, 360, 499, 55, -143]
2188a43N28O41j22r32M7M84q9m02N18k62O6p39N64N86j67k19k59L87m17pL4N31
2210F28k28o84M3L45J54l49M16q3p9o19L58N18m0Rm23k05r9N04l77J77J41k57
2232a50o50K89N57L32l99J2n7j45o83N09O08r3p25J73L41J03k29p4Q93k47j123
2253g58j74J031J4p83P46Nm12M7J31P70o64k63j84M47J15l33M99P32p11n73R3
2274b25L19M5j82p6O59m64m17P20L04l05j79m04K76j95L86P4O0O7m62K30J8M92
2296G41k51j55M5m04K49J79L91k02J84n56l25L36k2J57l8j28M3r8K4O89j07l99
2318C53m01R2j13K67q1L97K6n08J71P5J23l47j61M53l22p49N78M62Lk56L4k29
2340a33j02j53O26j60K99m58L8J6lj85M00Ok41o25K06M38K36k98J11k06m75JL92
$$ y = [-143, 385, 1026, 904, -28, 19, 503, 414, 12, 530, 268, 334, -405, 159, 745, 578, 359, 100, 487, 70, 63, 97, 628, 400, -284, -241, 104, 258, -91, 325, 242, 163, -456, -98, 420, 380, 389, -34, -239, -338, 166, -211, -34, 107, -150, -800, -511, 46, 378, -21, -9, -66, -211, -894, -385, 223, 130, -595, -422, -81, 22, -207, -281, 612, 365, -758, -932, 99, 113, -670, 76, 81, -331, -284, -153, 617, -47, -310, -494, -47, 68, -265, 234, 966, 255, -318, -225, 94, 139, -43, -119, 540, 76, -341, 379, 683, 378, 199, -205, 71, -124, 262, 336, 396, 463, 1, 231, 249, 741, 490, 335, 380, -24, 225, 404, 795, 593, 777, 221, -104, 232, 210, 367, 329, 201, 244, 146, 170, 859, 752, 353, -48, 44, -69, 198, 117, 514, 540, 32, 203, 278, 401, 54, -107, 346, 24, -725, -147, 315, 318, 62, 96, -133, -235, -388, 238, 78, 377, -81, -43, -27, -30, -215, 185, 191, -50, -675, -469, -31, 205, -93, 18, -188, -663, -662, -270]
2363b70K35q0n34Q0M56j40J68mP5m34l16J08L40M32n39N6Q2k55M11j0K17k87m43
2386f52k8M84L1M4k4K09m65p7K38K76k80J72j50k96L07m0K47J97L3k76l91K02
2408b39J00M52j16k78p8K7M03j56Q8k4k11j96L1L95j15K00K6l49r2K75j93R2L81
2431D23l78j23K22k68L40K61j3n50m0L67j51Q2K96j20k48j31r6M91j20j6K2j33
2453A17k21R0R5J63r7n5KPm6M31NK8p13M8j88N16OL1j3k46k51P9M55m0K0p81J56
2480d02J34QR1K83k10j06R2k70K04J12K48k8n73k18L44q8L90j31r6j09n6k7L71
2503c7J8j02L6m17LL42j87J91o5K18o30O7M97oo9J34l60Q9N0J60K38k96j18P4
2527a70J41j57O42l82oj36j39J91k20O84k67j58j30j17M97j99M74l37M14o79L71
$$ y = [-270, -35, -115, -649, -569, -113, -253, -85, -89, -14, -448, -764, -656, -316, 116, -423, -367, -285, -540, -129, -139, 78, -209, -652, -680, -196, -165, -121, -145, 64, -401, -478, -240, 36, -244, -72, -222, -518, -211, -251, -4, 193, 226, -50, -441, -239, -139, 313, 197, -81, -159, -132, 271, 115, 203, 179, -32, -228, -197, 198, 83, 283, 309, -40, -132, 143, -50, 42, 423, 45, -78, 144, -124, 216, 477, 464, -86, -126, 241, 90, 172, 468, 348, 100, -31, -127, 364, 244, 228, 250, 117, -104, -14, 81, 244, 147, 92, 94, 101, 55, 486, 491, 519, -194, -146, -334, 182, 188, 219, 206, -40, -291, -212, 243, 203, 223, -558, -402, -268, -260, -169, 114, -96, -202, -110, -380, -176, -64, 184, 156, -417, -635, -291, -379, 11, -120, -216, -325, -381, -408, -37, -19, -121, -85, -502, -499, -157, -344, -153, -218, 0, -630, -563, -66, -72, -141, -7, -367, -278, -228, -68, 170, -126, -244, -170, -29, -186, 456, 74, 68, -68, -207, -16, -236, 448, 181, 23, -107, -224, 273, 74, 548, 211, 625, -54, 317]
2548C17k19M39Q2k54k18j94oN17j12k38p8j08J41N4K45J68j94M4N8m84J58o7N68
2571F19j78l51j98K49MO19l98r6Kk84N14m00L54l9k01k4k4J2J12J73l43j78r5
2594a51M94l01K76oJ91o38k97K57o1K95J17r6n1j82L79j4j60l38K38j14J1l5O5
2617a21P4J08m62L63k22L79K6l36K15j51k5j64K64j5Oj38l85r0M10J67j4j92L20
2640A7p18L46K77K14k41j5r4o4o7L8O01k44K5m36P8L13o7P6j66J02m3l02K69L88
2664B87K10p12P5J04k27K4K65k1p0r2O1L22m5o2J00j01l92R2K44J83J21j91r2
2687H3k85K46J16r4K46j72j30l10O98P2J17m57J57l5k38K46k98L77j9l72K3L00
2709B71j03L8N0J44o56K40J45M5j01j84L17m9l63J39J47J40j84j97J23o7J40J06
$$ y = [317, 98, 537, 619, 365, 147, -47, -53, 464, 352, 114, 36, -72, 69, 123, 368, 536, 342, 386, 444, -40, 118, 51, 619, 441, 90, -108, 141, 145, 764, 366, 270, 272, -12, 502, 102, 456, 417, 216, 192, 168, 180, 292, 465, 122, -56, -151, 343, 42, 318, 312, 503, -135, -432, -175, -236, 59, 176, 80, 29, -153, 226, 212, 52, -286, -48, -162, -151, -186, -121, -47, 61, -401, -38, -260, 119, 145, -191, 24, -127, -152, -316, -52, -67, -61, -199, -584, -674, -264, -97, -111, -303, 17, -701, -355, -78, 136, -105, -120, -214, -278, -345, -307, 294, 50, 75, -361, -283, 30, -37, 39, -127, -25, -68, -370, -101, 287, 497, -215, -140, -36, -263, -239, 26, 5, -65, -157, -96, 226, 181, 119, 219, 118, -274, -182, 62, 245, 366, 175, 83, -202, 44, 160, 66, 312, 140, 10, -300, 398, 470, 587, 130, 287, 252, 14, 260, -38, 339, 320, -52, -29, 271, 168, 206, 256, 400, -256, -16, 129, 174, 73, -111, 206, 157, -206, -67, 80, 220, 36, -161, -38, -105, 35, 141]
2731A41n9k43q1j92J26K69J05j33k35K45k34J03J02J95nm53l32L93K09J91k7k28
2753a43l24j3Q6J29K24j29l23K23MR5j3j9L79o97l05N61J10k52J78J58L2m06k3
2776d68O94j41n17M8j13N94j69k12L54l37n6j82J80M54k74j28J16j25m3J7M65
2797A57j11J44j34j26N9N7M11m11J79p6m0j72P7k5J23K17j13k48l3QL11KJ9jl99
2822a25L99j21j01L69k15k67j05L91K52j81k18m0J42k94N81r4N13j054J18J88
2842A38K05l76NM41n02k33P4O25K07j86l06J93n44J99j04M87K3m11m4J01M13k99
2864A06j8M76n20j78k08K72l3J46K11k58n5k55L03N2m1L2j01J41L0l7R7k17j69
2887b24N7r8K31J4K85l36j49j41K78K50l01K38J80m41k20J57K49j60j4L87l18
$$ y = [141, 82, -161, -242, -434, -308, -39, 66, -67, -302, -57, -291, -188, -86, 109, 104, -349, -681, -288, -79, 112, 85, -143, -467, -480, -394, -265, -41, -170, -493, -270, -266, -171, -184, -203, 176, -521, -826, -265, -155, -407, -229, -71, -39, -445, -468, 226, 85, -432, -384, -497, 97, -72, -284, 70, -267, -323, -505, -325, 129, -145, -273, -157, -282, -325, -308, 157, 46, 190, 56, -70, -11, 46, 457, 46, 225, 149, 109, -63, 14, -11, 112, 329, 216, -32, -65, -57, 254, 256, 275, 274, -125, 274, 153, 52, 421, 206, -61, -166, 225, 477, 296, 78, 38, 180, -114, 467, 373, 886, -168, -50, 138, 343, -33, -28, 413, -89, -322, -248, 377, 584, 398, 92, 285, -259, -60, -164, 323, 346, -65, -109, -8, 405, 106, 88, 564, 44, -134, -342, -70, -103, 43, 254, -4, -59, -314, -11, 41, 0, 32, -69, 72, 102, 65, 162, -55, -224, -167, -265, -34, -20, 265, -71, -220, -361, -83, 167, -134, 104, 284, -157, -377, -220, 29, -131, -145, 242, -76]
2908g6k36K8M32L26l66j03k22P1L0l2N11j54l97j24L22J79l40N6RL89m15R0K17
2931A95K05n04l1n1K17M77l20K10m6l56j67M07Mp1J99j64k0o1l9K67K39j96n15
2954a21J55L6K07O7m7l84J39k6KL89k63p8R8p2k43K63K12j60j75N9l59K02N16
2977D17m60ML48j54n20M20L6O2j39n9j07M6J15K59P6m08j37m88O04J71oo2Pk35
3001b10k8L3R0M04n35k3l68N14J09l03L50J15l73l37J29K17MK43k76K26m19K84
3023a54k07K18L23n74r1Q8j25N14O6k21l2l00J45P8M18l13M7j84l2o6L43m6OQ0
3047a9k30O7J67q8k5J16k37L35m10N86k64J19n8j77m3j39L96R3j71J11k08m7M94
3070C68j29K9m11p6K35p5K86Q4j28j29m11L42l00O60j70j11K75n60O7K37K59L0
$$ y = [-76, -312, -284, 148, 474, 108, 5, -217, -146, -116, -148, 363, 209, -188, -312, 10, 189, -151, -95, -86, 303, -112, -22, 195, 400, -104, -135, -186, 31, 508, 188, 398, 352, -4, -171, 236, 240, 169, 368, 204, 184, 123, 84, 351, 590, 394, -121, 34, 70, 277, 344, 297, -87, 52, 26, 28, 417, 154, 76, 174, 102, -141, 122, 334, 174, -1, 58, -301, -99, 417, -43, -39, 309, 155, -365, 55, 91, 153, 14, -45, -152, -106, 9, 268, 344, -64, -201, -689, -85, 86, 80, 18, 25, -210, -238, -205, -115, 289, -246, -269, -637, -123, -14, -317, 33, 148, -225, -562, -433, -216, -212, 31, -245, -19, -438, -154, -361, -143, 180, -394, -485, -397, -522, -8, 58, -163, -195, -495, -350, -272, 146, -167, -120, -304, -336, -402, -59, -105, -99, -19, -249, -182, -15, -103, -128, -12, -249, 86, -324, 262, -2, 117, 59, -118, -161, -300, 96, 189, 18, 129, -79, -126, 368, 239, 268, -143, -219, 16, -59, 227, 311, 183, 54, -357, -15, -315, 345, 175, 64, 339, -221, -154, 83, 342, 372]
3092C72k78j44k65N37j31K73l45m2o6J36J34MK9J2j67j48N7M1Q4Q3J68k85J72
3115B31k46j12M64l58M8J80l87L3K90L03m17n8l64L96l93N06j58j83J57q4k5K31
3137E4O1j17j82j69J24o7J97J80k34J65k45R6O2j52J85J01j98O5n1J12j08K93
3159A72r6j44o1l22N86nk27J72l26K4J34j60Q1J48N1q6N8j28L72o6k27j10P1j85
3183b74K92K75Nk25k27O8R9J88K11l98J82j74Pj25M27k39J26Q3k83j29L18Qj29
3206H6J93l65J05J0K53J9j11J72m47l8K42m2J52J60j87Nj24j59M82j60m9k81M9
3229c5K54K41k80K26l07K26j74k50L73o2l6m0l88K4R4J91j45J10J39k67J27K61
3251B82l2kn37L15p6J00n7J33K54o97L76M8J59m29N1M3k72Q9P5J94j24kJ19l25
$$ y = [372, 94, -50, -315, 222, 91, 364, 19, -23, -89, 47, 181, 185, 214, 226, 59, -89, -32, 9, 93, 176, 344, 59, 231, -15, -127, 337, -21, 27, 207, -180, -147, 143, 446, 29, -29, -393, 3, -390, 116, -42, -225, -68, -152, -177, 54, 115, -2, -184, -353, -229, -296, -99, 81, -153, 12, -233, -137, -75, -227, -42, 59, -139, -74, -125, -13, -121, 172, 76, -68, -129, -451, 135, 130, -97, 75, -251, -227, -93, -253, -172, -24, 27, -59, -1, -129, 243, 177, -50, -160, -89, -274, 18, 293, 298, 73, -154, -86, 13, 201, 412, 14, 196, 22, 29, -96, 331, 92, 218, 301, 18, -111, 207, 215, 86, 279, -86, 19, 29, 282, 301, 190, 362, -85, -123, 119, 77, 229, 389, 202, 207, 83, -76, 406, 246, 197, -84, -35, 219, 460, 180, 406, 99, 325, 151, -99, 274, 212, 176, 136, -252, -228, -134, 57, -88, 22, 161, -106, 21, 282, 250, 248, -289, 26, -50, 50, -7, 126, 380, -317, 59, 107, 266, -163, -112, -69, -341, -252, -177, 17, -107, -109, 10, -315]
3275c15L41O6J61m89J04j72N6m4M2K99l97L06j54k28J03J68R2L8j51j3J1n7O9
3298a64J52k38K44l40K70L30k72j16L09l38j83J51q7M55j31l1k62J94k91N49n16
3319c15L34J83k60M23m58J25O0r2r5j19K24K35l73K09n9k29J56q7L41J05M5l61
3341hJ82m40M09n4j70k25L60j08M9J12L4mN1Q9l39J93L4n3J02l50L29j46k39Q28
3365F36l43m5k68J07J14l03K77L1j11k76J28J98%l4k57j30J51k2J64j06J89J4
3387A14j12j28J6Q6J48K5k83l2K88k96K43l4l0p8j28K11m8R3j96L2q0R0l52N26
3411G5k6K5J3l86l44N12p8J21J59l54P0k15J50M80l00M7m69L39J89j1M7oL00m72
3435a34J9L61j52j22j83L07m5j82K21k18J92q2J33j19j50K09k8m1l3m8JK25k31
$$ y = [-315, 26, 92, 253, -236, -132, -304, -248, -292, -250, 49, -348, -42, -196, -424, -321, -153, -61, -23, -174, -187, -176, -233, -164, -12, -250, -6, -346, -76, 254, -18, -134, 175, -163, -346, -195, -282, 173, 42, 11, -251, -57, -348, 201, -315, 19, 202, -58, 365, -93, 32, 92, 0, -95, -214, 10, 245, -128, 81, 22, -207, -51, -138, 203, 308, 353, -8, 174, -266, 143, 89, -81, -306, 54, -54, -5, 107, 141, 137, 188, 277, -62, 131, 165, 112, 214, -136, 193, 47, -192, 636, 293, 248, -20, 87, 201, -102, 175, 206, 95, -181, -53, 145, 145, 111, -146, -276, -125, -147, 17, -89, 100, 114, 2, -126, -110, -24, 124, 149, -134, -166, 122, -174, 69, 35, 5, -73, -201, 10, -38, 55, -141, -109, -189, -99, -451, 75, 49, 74, 87, -299, -643, -131, -209, -88, 71, -283, -213, -428, -278, 202, -98, -51, -520, -181, 8, -3, 44, 38, 338, -134, -115, 246, 94, -28, -211, 96, 51, -131, 90, -128, 64, -18, 115, -4, -154, 55, 27, -14, -47, -95, -94, 131, -100]
3458a00K69L43l77R0j3p0K5J8L50l68j71M4M35j01j24k51J89l10K09j29M26lj48
3481B33l18J92J30l17K09o7J94l25O3N43j40K04n13r3L50k81o8K47l9m78M68k62
3503f8L19j20j10J05o8j01K07k25J58K03l62J47j35l0J84J05j09l94K90k07J97
3524a4j7j50L87m26o2J35J12M9j05p6l1j04K60Kq5J06k21J85p3n3K87l43L32j15
3548b0k41P4K31k93n5P1q8QK41m9J30j63k18J21j22L26K29k44m5K09r2l05J83
3571a12oL30l67j49M7L02j84K77P2j24J2p3j19M78j70l60K07j40L27k14K16p0
3593A80j51q3j75L27K73q8K27l37O3k96k57O52J00m48p8n3K1L82j07K23j31q8
3615A56j83J53J22j85j11J40j73l3J2N24l99j80K54l5L9j30J52Mj23Rm5n6k9J51
$$ y = [-100, 169, 512, 135, 225, 212, 142, 167, 185, 535, 167, -4, 40, 475, 374, 250, -1, 188, -122, 87, -42, 384, 381, 233, -85, 107, 237, -80, 129, 62, 256, -69, -6, 537, 397, 601, 88, -5, 345, 64, -4, 243, 204, -274, 194, -68, 251, 131, 21, 126, 58, -43, 164, -61, 97, 300, -62, 85, -50, -80, 104, 209, 100, -294, -4, -211, -14, -31, -181, 206, -220, -282, -147, -35, 14, -91, -167, -198, -302, -42, -40, -125, -19, -240, -55, -128, -181, 106, -237, 95, -20, -261, -187, 44, -249, -304, -233, -321, -313, -72, -121, 9, -154, -372, -251, -373, -47, 182, -62, -107, 102, 10, -295, -112, -118, 212, -155, -304, -257, 45, -139, 138, 210, 86, 98, 25, -94, 384, 214, -146, 61, -79, 248, 34, 250, 180, 29, -54, -229, 98, 371, 283, 510, 173, 236, -60, -317, 335, 435, -13, -91, -144, -123, 259, 152, 375, 244, 156, -27, 126, 248, 63, -48, 92, -81, -114, -102, 422, 23, -157, 97, 62, 101, -29, 123, 127, 4, 13, -32, -88, -117, 34]
3639C4J06k05l5o4J39l33K34R9j02J74L79m83J99m4r7K16l24j51L86%n7m16K56
3662h9r2K33k3j15j1j18J82J12k70J39J59j02j03j23k1J5M92m49R5j68M56m88
3684b89J82J78j69Pj76L60j29k66N51o6k79L28o83M74J18O8j54j38k19L54J95
3705B47j5j52j24k70J53J30M62j56k77L7l54M50n8rJ19j60j01q7J43M02J8n50
3727a52J82n8l3K32J47K8Pm24r8L26m3J48k16k02K09q5r3R0K88o5l92M9K75K26
3751C46n46K36Qj03o9LJ15m3J63j1m6M1k04Q5p2L44k9l20k18L46J47k47M16m14
3775g2j07L7J82q1Q8k60n1j8N6L07k72K76n16K20J49K84j96j88M8j6j17P1J43
3798c3J85k42r4n7k4K14k59M40l14M9p7J84j86J68k4n1j6J93k67L67j1j7m97M86
$$ y = [34, 140, -65, -100, -164, -25, -358, -124, -25, -127, 47, 426, -57, 142, 98, 1, 217, -107, -258, 128, 128, 71, -345, -89, -181, 52, 29, -86, -97, -215, -33, 79, -191, -52, 107, 5, -98, -221, -242, -227, 265, -184, -89, -257, 199, -289, -107, 71, -98, -91, -267, 93, -36, -302, 249, 183, -96, 232, -451, 23, 141, 209, 55, -83, -302, 52, 247, 232, 80, -44, -314, -161, -31, 431, 275, -2, 35, -319, 131, 73, 64, 183, 23, -78, -165, -22, 380, 398, -152, 30, -28, -61, 171, 318, 346, 353, -71, -169, 157, 114, 262, 46, -156, 53, -32, -125, -35, 253, 188, -204, -155, 120, 346, -200, 36, 44, -59, -128, -125, -10, -53, 110, 99, 53, 94, -110, -25, -97, 247, 218, -102, -320, 26, 173, -74, 342, -72, -179, -142, 40, -41, 47, -213, -264, -282, -226, 81, -191, 85, -431, -211, -62, 222, 26, -162, -114, -130, -247, -176, -33, 152, -90, -184, -241, -265, -51, -310, 130, -184, -135, -212, -28, -214, -46, -70, -121, -137, 56, -211, 156, 145, 128, -369, 117]
3822A17l24K14j5n9k48K23r4j79N57q6j18J76l45Q7J67j46m9j18j2L61O7k57r7
3845a78J90m9K84k95J07n6M1K9L6k59J9K81oJ38k15J90m42K35k16L58j2j40N4
3868I4J18l42J86K43j44j93j08K75K10k79K70m8j92l17J24Q1K35m3kJj72k96L12
3891A3J74k44K33l27J19J18m6l3K82k93J0J33j27q1K30K4k92k3k3j70J82K77k90
3914a54J74l22Q1J50L24j53l5j21O4M2m22L94j45m9K08Ro2L8j90P9L0m8J36k88
3938b60J22L07n8j44j80q3J79L71k77q0M3k4K09L3m09J57j45J31m7j3L70j16o1
3961B5j0j89L60nR6k35j00J32j92K85R2j62J9q2j79j10K08k16J69L43j65j11J68
3984A41j73KR8p9j17L5J30K04P0j04j73K4J83k58L37K6k78k11P5L0K83k44J01
$$ y = [117, -207, 7, -8, -67, -315, -92, -186, -365, 192, 106, -12, 164, -181, -94, 73, -73, -122, -240, -252, 109, 176, -81, -178, 12, -37, 247, -48, 59, 3, 44, 73, 109, -150, -131, 150, 144, 282, 67, 257, -185, 50, -166, 192, 180, 40, 94, 212, -130, 56, 299, 155, -38, -146, 129, 339, 60, 330, 282, 90, -227, -103, -22, 213, 170, 168, 169, -3, -299, 13, 187, -57, 176, -151, -32, 86, 40, 7, 289, -4, 6, 139, 12, -69, 161, 185, -107, -130, -153, -323, -141, 136, -154, 20, -302, -221, -71, 253, 100, 65, -56, 8, 50, -372, 22, -123, -172, 36, 45, -17, 21, -169, -90, -60, -108, 28, -260, -138, 169, 111, -33, -213, -296, -117, 254, -23, -103, -60, -84, 125, 158, -251, -94, -239, -108, -155, -168, 202, 86, 25, 15, -174, 186, 181, 277, 42, -58, 74, -118, 167, 259, 97, 116, 34, -145, -255, -47, -263, -94, 249, 84, -27, 141, -32, -30, 68, -11, -128, -93, 37, 241, 311, 207, 34, 58, 241, -17, 320, 346, 68, -143, -68, -38, 245, 1, 102]
4007A02j5o5L72k20k5j61k03K41k47J43L8J57kj10K8j3k3R5k65L0K43j91K40L4
4031A83j92K75j17m64Q5L06m9j25L61l17Pq2J28j83P6J08Jl39L40k89p2L42o8
4054h5o1l0L56j64n0j2j87m6J61k9J01j94O13q31K50k4Q1K28r1l21J92J20L6j13
4078a00O5L21m46j05L46k52J39RJ18k96J78j27K09Q6j15J36l97O6K09K1k58j0
4100b03K19Kl19P08l23J18l1n0n3j77L68k4R5k14j89o9J74PJ4j42J76m5k90J68
4124h0J12J00j28J2J12j76J22o6J6l55L71k17J73J76k49J79j11j3K51l73J83J82
4146B21l30K2p1L16l4r6J70j78p5m2o3L12l3pKj53J71M2k16j8K22L4K07m63P8
4171A8q4K0J45J34k77K6j23o8L27n92K95j60L04n9J50Q5k03r0J43J4k6q7K77k73
$$ y = [102, 87, 22, 394, 174, 149, -12, -215, 26, -221, -78, -40, 117, 115, 5, 33, 20, -3, 92, -173, -143, 100, -91, 149, 183, -9, 266, 149, -315, -230, 76, 27, -98, 263, -54, -47, -129, -1, -184, -108, 0, 1, -338, 2, -287, -359, -17, -85, -146, -176, 180, 16, -34, -46, -233, -279, -118, -147, -46, -240, 373, -458, -208, -232, -151, 77, -14, -335, -143, -23, 13, -100, -35, 286, -160, -265, 81, -171, -32, -23, 95, -201, -23, -150, 59, 145, 30, 166, -231, -165, 44, 65, -193, -203, 16, 18, -301, 407, 84, 202, 171, 121, 68, -109, 259, 235, 330, 116, -73, -142, 32, 39, 53, -89, 87, 42, -248, -80, 32, 132, 4, 16, 128, -48, 74, 8, 24, -331, 40, -177, -4, 172, -77, 102, -9, -22, 229, -144, 39, 221, -109, -87, -158, 158, 124, 28, 198, 20, -55, -97, -160, 152, 119, 112, 114, -39, 132, 174, -42, -60, 162, 196, 403, -60, 18, -66, -46, 99, 233, -44, -18, -141, -209, 118, -474, -179, -339, -35, -94, 56, 141, -62, -152, -9, 5, -21, -108, 169, -104]
4195a04P5j30l26L66O0Q8k16r3K51Q4O7m81L87j23J04k51K43J17L28l68j24J76
4217A30j35n5j44J4M42m36L54%k07K28m38L72k54J85N4M9k13k40M01Q2j38j23
4239g2K62j53j43K42J30m02J61J34M6k02J31N9l64L09O6k13l09M55j08J17K4R9
4261B69k1m2l12J98J64m36J40o4nk19J2K84p3J81j7j36J75J31K03l82j47K94l05
4284a08J23p9j8L11k31K6J63j75j04K83j30ol5j49J77n0K3M2k34N7o4P5J55k66
4308b14N6L68j38j03j12K26P9j06l17K33j39j00N2N3j89K51o9p8J92P8p6k64M10
4331I3m2KR1j40l02L97N0K4m37K37j73J88R6j00J7R8n1k38JK45j16Q2J61l76L20
4356A27j46q0J88rj63J21J15L4l64K59j04L8J81j63J37j2K24j84N6l45P1r4K56
$$ y = [-104, -29, -159, -485, -119, -59, 29, -187, -280, -29, 55, 122, -359, 28, -95, 9, -242, 1, 118, 446, 78, -46, 130, -5, -60, -204, -190, 252, -184, 170, 170, -37, 191, -247, 125, -129, 56, 110, 159, -54, -294, 107, 189, 51, -72, 190, 37, -106, 136, 266, -136, 25, 159, 205, 3, 134, 193, -171, 138, 204, -9, -318, 137, 29, 146, 170, 269, 248, 206, -106, 92, 256, -180, -40, -104, -109, -328, -316, -32, -105, 76, 59, -77, 98, 229, 432, 50, -97, 197, -108, 15, -64, -82, 229, -2, 24, 187, 12, -92, 191, 61, 55, 20, -129, 48, -2, 21, 63, -171, -114, -178, -103, 52, -214, -158, 210, 72, -31, -143, 83, 162, 56, -261, -28, -167, -267, -215, -162, -351, -100, -169, -247, -55, 23, -53, -317, 93, 51, 53, 144, 4, -298, 99, 149, 173, -264, -27, -200, -12, 84, -16, 1, 99, 48, -190, -189, 56, -60, 22, 183, -193, 127, -19, -99, 89, 80, -83, 38, 153, 187, -177, 82, -22, 16, 197, 34, 171, 159, 383, 199, 255, -90, -19, -113, 143]
4379A43k31P6o3O86o20N6K0n1K58j76J07j03Q3k88J45J95m17J74M4l14J21J95
4401D0J3o4o9K2j20J87J91j86M0p2R0K13J06l46k04K6J10k25L90k44J09J52j97
4424c8J85j09J16k67m5L5o5J52q0J09K62l82K44l85J49l0L83l4k8j98Nk9P5J8
4448D3q3J02j42j41M7QL22M5m08N5O9K60k45J0l2k17K20k7r6M68l16m48L92o9
4472a83L35m63M01K77m91L4K4J77k44J72j85q5M99j98K85l78J20Mm31L97K6p4
4494A9%j77J4J03j71O6L23l18J39pk7J62k64O6L03o4k02m9J52N1o4Kn2M13k75
4519A43j23K22p36M63M1K02j30Pj95K1J8J9J48o0l3l3J43k8m4Q6J0k8O1J9q0r2
4545B1K6j74j99M57k36J07K1j1J28QnJ27l78P9M47p01J64k25P1M55k52l8L98o20
$$ y = [143, -88, -12, -75, 611, -9, 47, 67, 16, 274, 98, 205, 102, 185, -103, 42, 237, -180, -6, 38, -276, -155, 40, 53, -11, -80, -58, -178, 9, 200, 14, 54, -18, 72, 285, 391, 45, -159, -133, -23, -248, 142, -102, 7, 159, -38, 147, 38, 154, -113, -158, -123, -188, -36, -116, -7, 255, -127, 117, -268, -119, -149, 234, 200, 172, -26, -21, -50, 25, 43, -40, 62, -80, -221, -174, -166, 156, 201, -207, -152, -83, 177, -68, -58, -90, -307, -87, -114, -210, 258, -58, -506, -114, -183, 152, -311, 90, 367, -124, -90, -66, 111, -133, 39, -146, -231, 268, 70, 355, -23, 97, 101, -330, 67, 93, 19, 19, -158, -144, -41, -212, -146, 177, -141, -2, -9, -36, 126, -138, -72, 231, 167, -35, -84, 68, 119, 55, 57, 5, 418, 143, 20, 242, -494, -31, 10, 212, 82, 89, -106, -85, -67, -48, 100, 40, 7, -26, 117, 89, 45, 131, 141, 113, 174, 193, 113, 21, 47, -127, -326, 131, -105, 2, 23, 12, 140, 148, 143, 270, -108, -29, 418, -283, -119, -344, -273, 182, -70, -108, 290, -330]
4569c30L52j17j79J93J06j40K65q7l78L37P8k30j37J32l9j05L68k71J32k54K43
4590f1p6K97j93P7N8j14m00m1M43j0j60O6K33l14J33M3j02j2K31J58l52j6k1J18
4614a5K72j95l99L03J5R4K8p9Lk25N55n29r2K85J97j90k35M37j22J00j40N9N0
4637A77k38J15Q6R5k29n1o7J67j28K08L7r8J80j36N6J34k68j46m2J49J46M6r4
4660I9j28J48p2j05R8J21l9j32k15L61J60n02M08j77L84l65j29k88O65k15O5Q2
4682B24l19K68j59J51j66R7k40J32O2j06J3j49J93j50l7Q3p8j2R5K31N5j85J54
4705A57l0J01l97J71K12l13k08K78J23k80n5Q9J68j27N8k36L09j1L2K9j11J62
4727A21j15P7k53kK0L01j22j07R1J31j77o8K44j53K01k78M9k28L93j42O4j87L46
$$ y = [-330, 22, -95, -274, -81, 25, -115, 150, 63, -315, 22, 100, -130, -267, -135, -174, -279, 89, -182, -50, -304, -61, -137, 160, -33, 44, 102, -12, -412, -453, -10, -20, -180, -114, 119, -195, -62, -19, -121, -133, 98, 256, -96, -112, -133, -15, 257, 62, -337, -34, -19, 75, 103, 24, 27, -198, 357, -172, -264, 21, 218, 28, -207, 230, 108, 208, 68, 127, 177, -61, 54, 140, 235, 6, -45, -112, 55, -73, 135, 172, 74, 254, 118, 174, 308, 40, -106, -148, 1, 147, 193, 99, -29, 119, 47, -58, 40, 161, 122, -10, -225, 136, 296, -206, 202, 25, 409, 44, -85, -373, 292, 77, 142, 224, -95, 173, 14, 165, -1, 96, -144, -12, 50, -56, -43, -192, 1, -149, -186, -103, -181, -193, -98, 133, 188, 3, 157, 127, 228, -169, 2, 214, -99, -307, -29, 94, -186, -241, -152, 16, -111, -53, -289, 20, 9, 41, 70, -41, 121, 6, 83, -170, -172, -152, 149, 27, -80, 11, 142, -35, -103, 141, -12, 189, -89, -40, -268, 125, -17, 47, -140, 206]
4750B06k67K66k99n3K24NR7j47K91k76m6Nj22K89n42K96K96j60j20L24p3j71n8
4773c5M8N0k0p2n0K61k32K94k11J25m74L36L30m85J88M6n1L19r2m28L19o4l6K15
4797B81m39N8J43L7n7j10j51K51k19L28o9j02k6J99j53k67P8J22rJ97k58pK69
4820I6m3K1L0k11L57m04M1J50L8k82n5n5L64k17Q6Q5k13K52j32K28j16j84K77
4843A13k79j17K41j23q5J66r5l00L10L02l91M33r8m7m4J40k31J87k15r0R4K29
4865A00J00j72k47kJL19k54M4L03m12M9J94j30O5Q3j76N06l35o6K6J53N5j01r
4889I4k92J66K13j57l8J54j88o5J20M3k09K90r0k2l20L98J35k09L95k84j68O6
4911C2R8o6j89K84l55L33j68J85J36m64J31K74k05j4N9Q7L9J49k77k18J76M1k21
$$ y = [206, -61, 205, -94, -147, 77, 82, 179, 32, 323, 47, 1, 6, -116, 173, -369, -73, 223, 63, -57, 267, 194, 23, -35, 13, 63, 43, -29, -79, 182, -50, 244, 33, 158, -316, 20, 350, -135, 53, 99, 48, 367, 275, -153, 166, 102, 66, 281, -158, -100, 43, 80, 23, -87, -238, 13, -206, 122, 53, -49, -75, 124, -29, -296, -218, -96, -105, 92, -166, -173, 96, 53, 74, 104, -107, 250, -154, -113, 37, 75, -207, -262, -317, 47, -170, -84, 1, -212, 40, -92, 136, 20, -164, 113, -166, -283, -42, -165, -250, -84, -179, -479, -169, 133, -258, 175, 77, 30, -14, 126, -105, 82, -133, -223, -129, 100, 200, 28, -219, -221, -220, 99, -155, -111, 192, -220, -171, 23, -107, -42, 41, -135, 371, 36, -30, -4, 149, 204, 103, 94, -198, -32, 181, 24, -14, 140, -48, -113, 7, 50, -159, 131, 41, 19, -301, 97, 232, 23, 418, 134, -34, 32, 130, 64, -125, 159, -196, 137, -31, 154, 290, -174, -43, 231, 26, 12, 71, 158, 197, 346, 69, -149, 27, 68, -153]
4934a53M58l38l35L35o6M6J82j33j50K06p2n3k7k17M0P6J27k28K86M7Q8k55k7
4957a63J94P8k83J12k32J02J92k17L84n42N56m15K39k70J24R8J49j12k4p7p7m6
4979b30J83o7Q9o4L11k90P7j62r7M21k41j50J24J30n9p1J94J2j13m5k5J90k71
5002a54L11j04q8P6kp0M9p8K51L7k69K7K94n03l14N51Q1k59J74R8l43J77K96k29
5026Ik54M82l66j16k2O1K39Q9j35J01j93J49j29J83K5K58l71j86K49K28p8k37
5048a4K20p51L85J15K32qj77L4M0R3J52l65N0r2k44K89L08j5k36j46J74m3J58
5071A59j74L44k32k08K31p2J23k77K74j51J12l51j8J84M1J92j63k62J38J46j7
5092A9k08M08J02l33j95L3K89l37J53rL3R2j9j40j05J08L1m0mj20K2K00K34j01
$$ y = [-153, 305, -33, -368, -33, -99, -53, 129, -4, -154, 52, -20, -73, -100, -317, -277, -201, -74, -302, -16, 31, 119, -136, -163, 31, 109, -174, -62, -294, -192, 0, -217, 167, -375, 181, -234, 5, -265, -141, -43, 106, -6, -30, -107, -184, -230, -47, -114, -25, -89, 222, -68, 9, -153, -250, 171, -70, -220, -96, 34, -25, -96, 98, 110, -3, -48, -73, 117, -154, 157, 53, -35, 41, 39, -31, 18, -60, 191, 228, -41, -14, 280, -223, -537, 14, 95, -164, 10, 108, -235, -58, 238, 9, -245, 237, -129, -245, -267, -206, 33, 122, -13, 88, -105, 44, -85, 98, 123, 381, 10, -176, 73, 301, 223, -14, 206, -545, -160, -45, 187, 179, 2, 36, 76, 169, 321, -44, 6, -86, -330, -41, 267, 252, 16, -130, 44, 1, 159, -15, 329, 97, -111, 120, 48, 171, -106, 168, 17, 129, -222, -240, -56, -15, 177, 14, -248, -110, 36, 19, -189, 219, 321, -12, -207, -174, 115, -222, -69, -78, -45, 47, 28, -112, -217, -109, -78, -118, -122, -242, -220, -20, 214, 113]
5116A13J5l45J76J74j27K0l32L54p1K2j20R1j48M1l31O00j24q7L1P2k05J05L24
5139B48n6P5p8k23P1k31J17L5J39K19n57K9K44k8RJ2L5j4k68M04q4k80L21k80
5163a41J38J67l82N34m70j6J27o4P2J41l4j72J82J3K35k64J36J5k98J17j54J97
5185G9j34nO1k14M04K9k66j45K78J91j55j64J37J28K62n74Q7O8J45N5j84m9j95
5208a61L19k56J54j61J09O0l2R4k69J28L4j62L1J4m3L34p67O17j98m0J9J29K6
5231b1j15Q9J16l01K96j47l08K56n6L51j09j42j66L36J37k20K7M0r5J39O3j15
5253E5j43j23N41m77n3M0o0J42m0K0j03N3j33L26J31L47l68k72J77N4o1k8K17
5276B42j74j27K15k39j29J56R8qJ09K43l07K20j02l81J67J57k7n4m9J80k48K29
$$ y = [113, 128, -217, -41, 133, 6, 26, -306, 48, -23, -1, -121, -30, -178, -137, -468, 132, 8, -79, -48, 24, -181, -76, 248, 192, 267, 189, -34, 37, -194, -77, -42, 97, 316, -241, -212, 32, 4, 13, 25, 60, 46, -222, 182, 98, -182, 139, -141, -3, 164, -218, 316, -154, -170, -43, -107, -35, 106, 72, -100, 82, 95, 330, 66, 202, 217, -81, 36, -118, 79, -55, -60, 1, -213, 191, 220, -46, -191, 87, 278, 123, -41, 96, 224, 486, -88, -1, 67, 212, 267, 83, 34, -161, 158, -98, 56, -105, 4, 64, 32, 126, -143, -15, 19, -143, -112, -98, -141, 193, -574, 43, -155, -195, -176, -47, -21, -136, -47, 69, -232, 64, -83, -391, -135, -191, 160, 51, -91, -257, 79, 216, -4, 23, 63, -32, 107, 170, 55, -88, -211, 330, -147, -200, -160, -220, -78, -118, -98, -201, -148, -281, 45, 176, 523, 155, -117, 60, 114, 53, 25, 242, 68, -59, 156, -83, -212, -56, 42, 34, 143, 386, 79, 299, 197, -184, -17, 140, 113, 59, 10, 190, -58, 171]
5298A71j45L6j7L72l92Q3r3K51k76K12j35j97M2LK28m03K32p8l1J19j13P1K41
5321A81j42K28k88J15j95N7j56kJ83J43j83k04J21M14k63J07m6Pj45R4r0j06J12
5344e8k08M95m95K74k30K78k13Q2L73n62L43k1k06M7K59j50J54j6k34q6K57m79
5366c96K84J91j15K91l43k42O8K89R1k61kq4q2K03K0j10M0K18j16N9M9j57J7P5
5390a3r3K9L7j61K72p7r3K3K32k54P1J48r4k16K99k22M0K15Q7J21m65M53q5l35
5414h1J08J78m0j15J21m59N64q1k13r9Q9K51k46J13k9J18l62R7Q3K14k79J04J85
5437B21k43J48Kk69L5K33j78J1L4Oj35K71k75J38r4K63j73K16j69J16o8%n3J60
5461A97l50M65m10k4L28j73j6L9k52Rj51L25qk89J33J9J58k06K92k13J46k74N4
$$ y = [171, 26, 62, 45, 417, 25, 108, 15, 266, -10, 202, 67, -130, -88, -85, 143, -260, -28, -106, -137, -18, -131, -60, 181, 39, 267, -21, 94, -101, -44, -200, -202, -19, 124, -59, -263, -142, 272, 9, 116, 70, 77, -68, 26, -64, -170, -58, -266, 229, -266, 8, -222, 56, -157, -75, 298, -264, 79, 58, -148, -101, 158, 8, 162, 146, -88, -174, 83, -396, -112, 79, -36, 255, -88, -330, -262, 27, 118, -143, -145, -229, -311, -108, -88, -198, -158, 60, -56, 3, 52, -105, -88, -13, -106, -77, -40, -201, 71, -6, -99, -76, 156, -98, -27, 121, 27, -189, 110, -112, -72, 143, 230, 351, -114, 339, 254, -81, 27, 205, 165, 50, 171, -288, 276, 195, -18, -117, -28, 223, -23, 90, 61, 179, -183, -86, -3, 211, -68, 36, 221, -22, 126, 128, -141, -106, 127, -51, -40, -6, 0, -135, 136, -139, -1, -95, 168, -5, 211, 42, 158, 90, 90, 37, 197, -153, 312, -98, -122, 206, 33, 17, 56, -196, -187, -338, -13, -21, -310, -177, -158, 0, -206, 86, -127, 19, -255, -201]
5484b01L56K1k15l8n4j11J05j12K98Q9m8j76J66k88M27q9k01J09p6j46K19K3k10
5507a52j05J52R2k6k02K82p8O4N0j17k38J56K5J04n9K69j1j9J5k99K92l7j58o1
5531f1N4p8L49j29J30k60J23q7k05J58n0j88L26K43l83J30p6K4J05l01L33k07
5553e0J41j3J44j07j30n0J30q5J30nL9j33J5J39k02q2M05j15j34K01k54oq3K27
5577A22Lq6r5K11k93j02N73k91j13j09K82P3l09J15R0j69O8K2j77K05j69N7J64
5600G2k3j81OJ56o2k43O1J46q6J57m8q4L4l7K19j73rN8J37R6l75J07j52K75k36
5625a85J95n1J7O1k13l2K08r2r2M31k53M25n29l67N03k9J42j85L52n95K99PN3
5648G0j40K89p3n2j80J82j09k15K67k8k90K85m8J97J01n72L04L49k35j35J20k77
$$ y = [-201, 155, 176, -39, -77, -131, -242, -137, -249, 49, 138, 90, -86, 80, -208, 219, 130, -71, 38, -38, -184, 35, 58, -152, -257, -105, -13, -39, -241, 41, -37, 27, 77, -40, -278, -122, -97, 7, -52, 217, 206, 187, 202, -97, 195, 158, 0, -61, -7, -85, 264, 135, 265, 5, 128, 41, -164, -6, -56, -244, 82, 325, -58, 72, -4, 20, 125, -176, 157, -50, 91, 78, 222, 115, -15, -65, 65, -20, 110, 105, 144, 11, 26, 165, -37, -119, 286, 171, 37, 238, -16, -22, -105, 122, 125, 39, -56, 155, -138, -240, 333, 42, -71, -180, 102, 175, -134, -19, 71, -98, -30, -8, -185, 20, -149, -92, 72, 49, -132, -126, 30, -32, -275, -214, -68, -154, 3, -45, -129, -95, -132, 87, -86, -95, -37, 100, 196, -179, -72, -224, 51, -185, 10, -41, -24, 37, -176, -208, 0, -92, -184, 247, -6, 419, -110, -477, 26, -3, 139, -46, 306, -289, 10, 17, 70, -70, 219, 146, 94, -86, 96, -13, -228, 39, 11, -279, 6, -42, 155, 256, -316, -12, 337, 102, -33, 87, -190]
5670a90K54N3j12L22j46l08J71j46J90N3k40J24j05J11P8L6r3j44M04l46j33L00
5692A33k69L82J03l69l6K25J44m27J19l12K71j16J65q8K58n0l49J46J03k41K33
5713B5o8J84l39K58J34j21oNl68j03M60j72MR1k4Mn8RJ0M0M3q4n9Q0n2Q7N2J01
5741A33k42J49K02k12N3j68j5J1M3l3n0J82j7r6Q8J7j9k87o1M24L9l92L82l83
5765b52L60j38l57L42p7J92M2q7j13o1J39K54l03K64k50PJ06j8j10p7M1Q5l3J81
5789A37j0o9j23j24n0P0K38j82NL17p3k50K16k35J8K48m9j90M58k10k38L7K14
5812A55r5m2r4J45q8K6p7K16J05l44L36j61K18k57j9L07k62k5K45m86K13k32O2
5835a54J03R7j57l8J18K20l84J44m9J43l24K35K74k36L0K33j07j31l04L18j7J93
$$ y = [-190, 64, 117, 5, 327, 181, -127, 44, -102, 88, 141, -99, 25, -80, 31, 109, 145, 52, -92, 312, -34, -167, 133, -136, 246, 349, -20, -56, 169, 313, -114, 5, -307, -36, -152, 13, -75, 183, 133, -216, -70, 33, -208, 25, -43, 141, -198, 60, 194, 73, 67, 72, -296, -399, 61, -111, -107, -16, -40, -36, -94, -85, -75, -35, 8, -76, -135, -55, -107, -20, 32, 133, -109, 40, 242, 30, 83, -85, -100, -89, -46, -79, -129, 53, 36, -60, 28, 45, 26, -261, -322, 102, 141, -251, 131, -252, 108, -30, -387, -45, -122, 70, 112, 25, -88, -149, -10, 244, -59, 205, -45, -38, 68, 50, -60, -137, -96, -11, -44, 137, 127, 58, -65, -189, -239, -169, 69, -113, -108, 209, 136, -114, 102, -133, -115, 133, 84, -106, 352, 142, -96, -59, 155, 60, 18, -76, 69, -19, 7, -70, 146, 251, -93, 243, 82, 300, 43, 24, 331, 69, 44, 289, -197, 16, -216, -154, -51, 46, -111, -149, -31, 189, -195, -51, -100, 43, -281, -46, 228, -8, 22, 255, 148, 17, -287, 31, 14, 207]
5857B07K6k77k77K55J57j35l9K8L8l08M12l81L38j12M07k86j90K99j55j7L2q9
5879f7K47k96L8J86l19L36l13L40l16J84k3k32K39l79K51K48lK6m4l65K51L08
5901B97l60K21p2j38J41N0m97L62K11n4o1k23L67k61P9j44j54J27K32k63M42j50
5923A52k75K07J33P6n59L16Q9j62J30L7j81k91M32j03k9q7J9J96j60L01j00p7
5945F4j55K79n4j99J0O8N9J36J21j56j50K19j95Q8M0k09j70l5J67L39m27J30K23
5968A93q3q8P9l6%K50k67j62N1J49O0j32k97L34K55k08j40K34j0k36k19N4L34
5991A15M1l99L28K4j00M6j21PK3j15K00N2k92L25j93M2K33l83P5K04J11m57M4
6014a90l7N33k92j84l1j9L47l2l57j3K46j99M4K38K7j52K51k42Q7O8j11p2J67
$$ y = [207, 233, -44, -321, -66, 91, -44, -83, -55, -17, -325, 87, -294, 44, -68, 339, 53, -137, 162, 7, -10, 22, -67, 180, -116, -78, 108, -211, 125, -188, 152, -164, 20, -3, -235, 4, -375, -124, 124, 121, 147, 103, -262, -11, 297, -63, 158, 86, -52, 89, 139, -358, 4, 215, 161, 100, -123, 244, -17, 62, -82, -236, -109, 123, -140, 302, 152, -123, 84, 217, 293, -266, 50, 139, -23, 107, 144, -37, -328, 104, 1, -28, -115, -96, 100, -60, 241, 141, 64, -91, 188, 134, -65, -55, 13, 72, 208, 329, 173, 23, 242, 47, 135, 175, -34, -204, -239, -72, 267, -160, -30, 193, 110, 22, 101, 65, 65, 315, 48, -114, -63, 86, 146, 14, -283, 51, 306, 98, -42, 192, 182, -54, -273, -219, 115, 156, -243, 85, 109, 9, 55, -66, -59, -36, -151, 49, 101, -191, 134, -59, -17, 216, -167, -92, 112, 223, -234, -190, -227, 306, 14, -170, -201, -220, 127, 95, -262, -275, -29, -228, -184, 54, 81, -71, 180, -62, 25, 93, -18, -90, 77]
6037G7J51j28q2jm7J35o8J67k22r3j2KM02j06m36J99P5j3r0R7j20K65j35K68l56
6062g1J65j80K14j74O2m28M70p4Q8Q3k48J28K24P1k98n1Kj62L64J5k24K31m24
6085b17M86m49L84l2k36k02m9O24l38Pk5R7R5j38k25N41k02k81K3J56j30J50j1
6108B8J4O1j69q9p5K15j21L62k31R4j58m7J49j20J36m6k21K58k59j48M45Jo0l12
6132b93K02J70j8k81M0R7j9oJ30k60K09r6J13l3J38k49J13J69O0j77J53m51K58
6155c1J76l40L15k73R4L4m25K27L57j02m9r5j60L12K0k47L36k32J27l2Rm17N23
6178A27j75m6J51j13j04J52M9R4k76L3K5L50j79j4kj47j34K96l43M90M5k05p7
6201cJ75j5r6L09K18n82k83M15J06k16j24J14n6j29k48N86J15n45L42j30J87L4
$$ y = [77, 228, 100, 18, 17, -30, 105, 37, 204, -18, -111, -123, -121, 281, 175, -261, -62, 13, 0, -90, 7, -113, 152, 17, 285, -71, 94, -86, 128, -46, 16, -412, 58, -16, 72, 155, -93, 35, 259, 330, 32, -19, -17, -179, 185, 200, -24, 207, -217, 269, -180, 204, 172, -64, -266, -315, 309, -29, -22, -47, 50, 145, 7, -218, 323, 121, -160, -137, 19, -111, 39, 28, 42, 103, -66, -155, -230, -15, -136, 226, -5, 89, -69, -116, 33, -87, 49, 3, -218, 40, -219, -367, 78, 79, 19, -293, -91, 79, 61, -220, -180, -83, -102, -108, 22, -238, -29, -125, -12, -45, 93, -156, -43, 126, 186, 9, 162, -289, -31, 145, -195, 120, -153, -59, -25, -450, -223, 134, 32, -17, -112, -272, 40, 60, -187, 149, -83, 44, 12, 21, -396, 127, -48, -94, 57, -56, -160, -8, 41, 135, -141, -108, -83, 267, 88, 74, 72, -75, -209, 87, -256, 234, 279, 74, -3, 172, 157, 61, 370, 588, 6, -277, 138, 244, 28, -96, 18, -38, -167, -415, 171, 286, -259, 83, -47, 140, 174]
6223A74k90P3j2K34rk21j03J90O1K4l99K11L26m8k59k0J62P5j83J9K6M6N5k13
6247h1N2J36P3j77k41J74n1J14p7J87p1j93K48j37M7k0l62J23J72O7J96Q2k73
6270a2l7Q4k3j33P3J34n3Q9o2kk00J64k49J39J33p9L3r6J32q8J03j36R6l1K35
6295B14j31j46j06K36j17J23j41j27J09O0RJ61Pm98M08J44j07m69K46r1J27J24
6317C5Q3J38jk16k80L10J6J96k88J63k75r7K61l7JJ46j53M4K62o4l65Jpq2R1m3
6343a61L20j74j02Q4K46k10j27o7O2J15Q3K7k97j25N35J3n09J74K93n8k0Ok8J13
6367A93K5m04L10K32m79J18J50j23j12J29j93J83r8L59l52l20M53m8O8j10nr4
6389a18K49l32K70j79L8Q3K4m2p6J65L3k84L9q6J97J87pm57M0J72M17l67J75o
$$ y = [174, -116, -43, -55, 179, 170, -51, -154, 36, 97, 121, -278, -67, 259, 211, -48, -68, 94, 169, -14, 5, 31, 77, 132, -81, -29, 107, 180, 3, -238, -64, -115, -1, -78, 109, 38, -155, 93, -44, 3, -17, -379, -256, -84, -17, 179, 261, -12, -49, 35, 12, -121, -48, 86, 33, 122, 60, 58, -142, 22, -227, -88, 45, -34, -1, -97, 35, -53, 50, -86, 10, -21, 214, 83, -63, -169, 67, -50, 73, -68, -195, -86, -26, -17, 144, 151, -347, 61, 205, 98, -371, -125, -216, -89, 35, 118, 256, 255, 39, -241, 69, 85, 281, -7, 156, -119, -216, 45, 8, 9, 155, 2, 46, 308, 244, -121, -120, -127, -209, -118, -161, 159, -15, -117, -33, 213, 3, -124, -191, -129, -14, 69, 96, -201, -326, 209, 222, -287, -113, 180, 122, 102, 108, 80, 193, 218, -186, 124, 356, -123, -5, 145, 22, -90, 39, -154, 29, -69, 290, -62, -382, 71, 23, 91, -19, -24, -118, 131, -201, 69, -110, -72, 11, 35, -7, -83, 82, 115, -169, -130, -216, -19, 168, 161, -296, -256, -84, 333, -34, 141, 135]
6413A35j9K74j77k18k24K66L9k22M1M55l70Nk08K56p1j35M03j76l79M55k82K3
6435a29K01k09j27J59J22j85q4L40K2o2J01l32L22j00k76K26J94J20l17J19l84
6456b79L47J36k05R0R0m3Qj18j21L15k01LK3j51K60r3l8J22j24q6R0Q0J06k27
6480a6K20k68J13P6k28l6p8K33Q7l21j86L89J85R2j34N1l93K43J26k86J45j1p1
6503f8lL00r6l25k7q9N08j51k5m4p6K6j6J47j68J44Jk37M11l61K31q2Q2j42K6
6528c4j2L64l79J1J88k12j9J52r4Q2k22l17M92J5J6j94M96n71K56J77j77L8K05
6551B61l62J91j43K54n18L52%O7j45l00L13M5q1O9J09j9l60J5r0N10R8j10J7j99
6575b6k7J14J40j88j83L44l34L3P9r6J83J06J5k07jJ61j21j09kR0R3J17k6j0j9
$$ y = [135, 116, 390, 213, -5, -229, 37, 76, -146, -105, 350, -20, -15, -223, 33, -38, -173, 230, 54, -325, 130, -152, -129, 72, -137, -264, -105, 17, -168, -252, 88, 110, 48, 149, -183, 139, 39, -237, -11, 183, 303, -14, 105, -279, 68, 204, -1, 89, 179, 136, 144, 26, -95, 220, 19, 22, 45, -106, 154, 61, 23, 145, 21, -65, 25, 105, 211, -16, 204, -64, 49, 125, -103, -139, -217, 16, 103, -218, -404, -15, 170, 262, 128, 179, -214, 29, 155, -131, 14, 3, -68, -71, 229, 133, -192, -219, -308, 200, 49, 24, -20, -96, -70, -86, 61, -107, 37, 38, -199, 212, -149, 82, 0, 82, -60, -34, -46, 318, -61, -50, 138, -74, -93, 59, -35, 47, -175, -492, 0, 15, 31, -163, 333, -238, 18, 195, 18, 56, 261, -101, 90, -53, 201, -317, 35, 35, 102, -43, -343, -30, 15, -66, 3, 112, 93, -267, -252, -342, 168, 266, 156, 173, -26, -53, 61, 201, 13, -170, 174, -160, -127, -48, -144, 39, 145, 160, -47, -48, 113, -8, -117, -119, -29, 64, 181, 155, 145, 126]
6600A26j64j76J35K35jj01Q9j56PK3P4J56l05j98L26n7l39K74o3j39K70J12j98
6623g0K52j67O8o7j34j18m5P4J99lO9l09L75j17J57l90J65J4o8K15j20M9K9l0
6647B8j9K43k86k6J77l54J19O1k16J14K78j93J81l6o0j35J37r8j8J52j09q5j72
6670c17K66K5l23K36l57P01l99J85J89j92J50k01R9j09p4R5j19M65l96J94j91
6691g3m4J96l74O44o11M98q2J77m21J18J1q0K28k92K55o3L05l86J05k77P7%K51
6714A62k00n8K41j57J19Jk04L04K21l46k08K23o3J42l50o5M13j6m6L2k50o6R4
6737g7M7Q2k39n4L73j32J10j59pJ05O2o2j34K23k89j0L00j26qM8p0rn6J68O0j8
6763A28J81l67J46l84L08P6k4R3j95l12J93M03k01j56j95J45j04J69k4o1j2L33
$$ y = [126, -38, -214, -79, 156, 155, 54, 143, -13, -6, 17, 91, 247, -58, -256, 70, 13, -326, -52, -115, -254, 16, 128, -70, 182, 15, 83, 16, -118, -236, -281, -207, -8, -11, 58, -251, 124, 7, 164, -226, -61, -47, -115, 100, -20, 29, 58, 28, 9, 252, -34, -60, 117, -237, -118, -57, -273, -159, 119, -74, 107, 71, 11, -124, 13, -85, -103, 49, -60, -145, -317, -51, -26, -349, -113, -470, 231, -168, 17, 206, 14, 164, -37, 62, -47, -121, -26, -145, 320, -76, 118, -73, -117, 79, -295, 349, -262, 236, 154, 331, -90, 28, 39, -41, 187, -105, 150, 87, 392, 6, 111, -166, -89, -89, 162, -38, -96, 145, -12, 107, 108, -96, 208, 429, 83, -125, 98, 35, 177, -173, -238, 175, 159, 113, 145, -105, -171, -77, -30, 52, -187, -241, 132, 0, 110, -49, -56, 49, 111, 49, -85, 138, -151, -161, 139, 13, 5, 53, -17, -26, -82, 86, 146, 128, 309, -58, 88, -296, 12, 88, 64, 157, -38, -350, -157, 246, 45, -111, -306, -161, -265, -96, -120, -181, -193, 140]
6785A40P2M4m63J46K4L03k57k85K36KP4j90L4M21k87k05L06j70n7K26r9K37q1
6808A71j42k07J79m2J06l6O0Q7m2k4k70K97j73j49R9L54k85O2k01j29M91l51P7
6831f8K14p7j17q6J80No6P8j41J77k06K00j01J32j71o0J44J14l34J90J78j68r0
6854g3ol1J99k00O5J82j55J39j13l3P9Q7j21J36L8m2n6Q2j35Q5l55J70k7N3K9
6879cK01j28Nj07K8R9J96k64j16Pk14J21K22r4j27Q0k00Q3K31Q7l3k55K78p8r3
6904g4J18m1J11o8J85L0n61J66q2J32K53j62R3q0K1R0K47l65k40L03L1k52R0O0
6928EO7m08L37q2J44p2j09J79j23J64k32k29N32l4j97k7L29k96j26J24J21m0k24
6951a97L90k33L0K17m64J44L64k72mJ98k6K4j46L3j38K67l78kL37J17k36k32k2
$$ y = [140, 212, 256, -207, -61, -37, 266, 9, -276, -40, -38, 36, -154, -120, 301, 14, -191, 115, -55, -112, 114, 15, 252, 171, 29, -178, 1, -41, 65, 29, 89, 176, 134, 110, -160, 137, -36, -185, -86, 268, -17, 45, -156, -285, 206, -145, -68, 146, 69, -48, -134, 46, 51, -15, 63, -78, 99, -107, 93, -8, 124, -47, -107, 37, 151, -183, 7, 185, 17, -73, -79, -110, 89, -111, -46, 136, -19, 120, 7, -26, 53, 140, 19, 155, 193, 151, 95, 177, 42, 127, -228, -58, -85, -32, -3, 198, 70, 75, -32, -4, 95, 291, 27, -89, -82, -296, -175, 47, -47, -174, -94, -294, -211, 20, 107, 74, -181, 97, 19, -74, 44, 3, 114, 46, 231, 261, -300, -134, -216, -84, 169, 7, 100, 20, 41, 131, 378, 13, -227, 76, 107, -145, -55, 5, 72, -336, 1, -81, 63, -9, -118, 61, -62, 102, -130, -359, 173, 139, -58, -85, 244, -52, -178, -54, 67, 27, -197, 193, -40, -10, 207, -257, -113, 251, -21, -25, 173, 147, 171, 25, 58, -80, 187, -191, -193, 144, 261, 25, -207, -229]
6974b29L05k03r2L55J69k73q5k77L16R5j57L27l33r6L19j3j6k37K98M6m57O8K60
6997I0K63l30J21k35P3J46k34R4l0K54k86K36m1k91J08J83k42L96l15j90J70K23
7019A63j83P2l2k50J39J9K53k03p1l3j18p0M72k54K17j74L50m00J54R5K5l83Q1
7042a31L61j00l43J72j0l3N0k93L13j64L19k31J0j04K55j55o7K59l50M50k18l3
7064d3K9J18j06N1r1pR0j6J98k00L49l30j93j5K28j22J13L5q8K67m88P4L23K6
7088B02k70M83o82L03J54J05m12K61m20L97k14j73N70j44l05L73L5k47n6P3N7
7109I0K2m8n9m3L7n1r0P6K09q3J9nO4L3o7m1j16J55j8O2j11j27M35k62o0j40K51
7136A32j66N6r9R2P4j52j03K08J0p8K05j05m52L93m02N05j16m1m59L40J98j18
$$ y = [-229, 76, -127, -219, 136, 305, 32, -53, -330, -14, 81, -76, 251, -82, -178, 141, 128, 112, -125, 173, 219, -238, -170, 90, 353, 23, 144, -91, -18, 128, -106, -12, -42, 212, -74, 162, 121, -170, -62, 121, -121, 275, -40, -230, -60, 163, -20, 52, 20, -230, -91, -72, 181, -22, -93, -126, -244, -314, 158, -96, 121, -53, 297, -103, 51, 146, 171, -212, -131, 230, 130, -213, -41, -51, -84, -34, -327, -14, -178, 141, -90, -80, -184, 71, -84, -151, 108, -242, 208, -10, -43, -14, 104, -2, 49, -42, -49, 41, 25, 223, 23, 372, 42, -151, -166, 62, -60, 53, 88, 0, 267, -221, -147, 176, 202, -68, 415, -267, 36, 190, 295, -117, 144, -276, 121, -93, -266, 304, 160, -145, 228, 263, 16, -40, 33, 90, 112, 64, 5, -38, -1, -52, -142, -66, 143, 60, 79, 74, 138, 171, 104, 63, -53, 102, 84, 146, 35, -92, 343, 81, 21, -119, 132, -34, 22, -77, 15, 89, -63, -166, 42, 52, -26, 179, 74, -378, 15, -387, 118, 2, -39, -498, -158, 40, -78]
7158g8K92l53M8J53m5J12m01Q0K30o1J18j29M8l8K83n62L09J32k22J74j44L77
7180C23n52P5K11n6l83M68M4L5j54J27m5l8J00k32p4R6J54k95L11j96l4K45k41
7203a11L06n71M32Q0r2j32k0M9J80k30J28J64k48P4o6K16l15J86JN3K44p3l12
7226e7N4k52J61J59l89M52m7J37j31m5K36k98j2pJ90j82j4L9L0M6m8p3l9K79m7
7251A42l50J75M48n47L65k72j6L09j34J5l04J20L5J31K32n7j52l2j04J9j76O7
7273h6K98j50Pk54R2M8L6P3L94n98j0N3k22L80j89P8M7O5l21j88R9K64N18o43
7297b09L73j55j79K80j64j3oO7k66O56n17K20j41K47m42nM61k02O0kJ18J11k89
7320Cl25K89K35l99K06k62J72l46L12K21l61L11k1J16k16Om3J39j36j10Q7l5K22
$$ y = [-78, 214, -139, -91, 62, 17, 129, -272, -192, 38, -23, 95, -34, 14, -24, 259, -303, 6, 138, -84, 90, -54, 323, -229, -154, 57, 1, -382, 86, 130, 165, 11, 138, 93, 55, 155, -77, -151, -55, 99, -196, 115, -81, -115, 130, -111, 195, -376, 56, 136, 44, -88, -108, -59, 121, -109, 19, 183, -65, 9, -57, 159, -156, 30, 31, 84, 328, 255, -57, -3, -255, -94, 65, -324, 128, 81, 218, 87, 42, 278, -20, -32, -39, 151, -31, -45, -6, 24, 70, 22, -51, -90, 189, 142, -208, -33, 415, -132, 233, -39, -55, 254, 120, 135, -169, -49, -14, 117, 349, 292, 140, 108, 4, 23, -153, -86, 212, 62, 69, -185, -93, -45, -9, 64, 458, -140, -150, -97, -319, 61, -128, -50, -3, 62, -259, -447, -348, -84, 434, -209, 164, 9, -170, 110, -54, -67, -73, -6, -272, 384, -133, 87, -54, 193, -249, -254, 207, 5, 65, 63, 181, 292, 3, -322, -33, 202, -197, 9, -253, -81, -427, -115, 106, -255, 56, 35, 151, -65, -59, -102, 37, -99, -209, -122, -157, 65]
7343F5L3M7j42K3K26k98j08j02L98k73%j6O9p0L5Q4P0oO8%J56k23p3J65j43ll
7370b1J56n7n4J48q5K0j86j32N87k05j3j85p3Q3k23M40m19J11J19K3R5P3l30K61
7394A33l5J4R6l12M17j65j93j10K87j04P0j69j5M77o1j93j20k7j79R9K70n7o52
7417e29O14K1n08L73kk80J69p9K01N8j04j35j7J31Q9Q9k1j99J97k60J74J56k06
7440f8k7J16l4m2K70l99M47l88L41r3m89L51%K8l5k48N22m08J13j3J60m7l0j4
7464A3o4K29l66K53p3o5p2m3K76l32L38k36k9K06j10J35J91r6p1j65j63L64k95
7487a75J02K21J00j42j66R0l06M3K94N5n4j75J26K78n07L20j20j73L90o0k51J65
7509E5k06M04R9j48k54L59m57L39n32O5L04j85j27J88M02k64P6j66L1K9J10l83
$$ y = [65, 98, 145, 3, 26, 252, -46, -154, -256, 142, -131, -131, -147, -78, -148, -113, -29, 41, 35, 103, 103, 259, 36, -37, 128, -15, -18, -21, 135, 78, 24, 172, 87, 107, -79, -211, 376, 171, 158, -27, -100, -17, -240, 200, -219, -108, 11, 34, 129, 202, -128, 133, 98, 112, 208, -104, 313, 148, -45, -155, 132, 28, 98, -71, -86, 391, 330, 137, 17, -10, -189, -90, 180, 123, -529, 85, 106, -402, -29, -31, -311, -142, -221, -20, 38, -66, -201, -218, -87, 2, 91, 70, -129, 68, -192, -18, 138, -68, -95, 21, -13, -55, 215, -184, 263, -125, 216, 123, -366, -15, -15, 13, -22, -270, 252, -156, -43, -56, 104, 57, 27, 13, -51, 178, -188, 65, -8, -73, -145, -188, 88, -244, 94, -142, -171, 35, -75, 60, 251, 155, 84, -81, -244, 120, -175, -73, 148, 248, 106, -60, 30, -276, -233, 61, 116, 62, -113, 13, 291, -216, 104, -16, -189, 201, 141, -110, 55, -151, 253, 352, 204, -50, 309, -148, 191, -341, -276, 28, -157, -284, -96, 306, 42, 118, -48, -17, 12, 122, -261]
7531b61L85J50m53J54k56K16O1j23L8n6L75n11R6O8MR4k2J07N9o1Mj25l13M49
7555G9j49Q0J2K7j15j45K32j06R1K10J07k84n44N41L08k21M7k63K03q5J0j8O5
7578H2J68l09K5J31k44R8o0J68o7J30Pl68J37J24l59K31J95l79J73K10r4j20K30
7601A09n9K2j61P0J49j3k24J43K13j69L5j08j39L41j43m6K41k92J24N0J68j81
7623A30o6j0o7J81j58k9Q1K7l53M07k61O8r1J76o9J66j97J76Q3R6j79k02N7n2
7647h6K45m52L97k6Q1l68j8J31J60Lj12J87k61mP9J21j45J4J81l22L39j7l02L00
7671A25l03J36J44n9N6Lk12J66o1k0J14k66j30M19k60Q3K31k82K24p7M3k51K15
7694C8J08p9k25Q3J34n5K01j18k05P7m0r6J61j90J29J5j10J51l2k3j46J61q7M93
$$ y = [-261, 124, 274, -179, -25, -281, -65, -4, -127, -89, -145, 230, -281, -185, -117, -113, -19, -41, 66, 125, 64, 68, -57, -370, 79, -70, 10, 22, 49, -66, -211, 21, -85, 6, 216, 323, 39, -505, 36, 344, 123, 170, -93, 110, 25, 35, 17, 82, 250, -59, -34, 97, -147, -49, -109, 59, -8, 122, 129, -239, -102, 22, -337, -106, 89, -290, -117, 93, -1, -121, 109, 50, 72, -89, -19, 130, 117, -107, 36, 249, 80, 115, 7, -132, 209, 66, 20, 261, -31, 93, 143, 311, 130, 64, 54, -13, 168, 10, -19, 62, 89, -264, 143, -118, -50, -141, 35, -34, 132, -65, 111, 194, 290, 111, -91, -34, -86, 159, -293, 104, 78, 159, -209, -227, -96, 64, 67, -45, 142, -119, -123, -44, 77, -68, -54, 127, -195, 144, 127, -175, 125, -178, -42, 102, 43, 99, 102, -110, 56, -5, -25, 89, -177, -307, 112, -148, -65, 166, -116, 108, 31, 74, -177, 38, 146, 67, -158, -75, 59, 4, 205, 87, -118, -41, -81, -177, -16, -206, -77, -62, -172, -21, -53, -76, -222, -61, -148, 345]
7718C45n15j5J54J08q5l53K13J11K40l79j42K62rp1L58k24p5L58k51k56L49l07
7740a84K40o0J6J76m61K46J71j13nJ34j92J84m9jo7k42K51K02k64j32K51j69J00
7763C2L1l58L36n8j14q1L41j87L79k63J05l26J01j55K64L7m1K06k75lK04l19K34
7786I0N6J45l61p2J88j23KQ9p6n5J56j03j9J19M7j18P0o6M5o0M3J81l77J53K39
7811A93j74J04j77K60j24K5Jj36q5M5K38j09j23K44J43j76j17K08k32j51K16J47
7833B20l08rK11q3j6q7M7J34J6o4j83j28J26J39m68L83N1k61N47k76j22J67J82
7856B18k78Q1K15l05n9K16j96K48k61J31M1k01QJ18J78J42L0m71K3L40j44m8j03
7879g7o0q6L97j42m04M90Q1l96L12K8J10k75J1J91j47k7k34J08o4Q3l1N8j77M87
$$ y = [345, -170, -185, -31, 77, -8, -361, -148, -37, 203, -176, -318, -56, -65, -136, 222, -2, -77, 281, 30, -226, 123, -184, 56, -4, 12, 188, -273, -27, 144, 31, 26, 160, -32, 152, 103, 102, 35, -207, 44, 246, -18, -150, 101, -68, 32, 63, -295, 41, -17, -131, -212, 129, -58, 321, 58, 163, -163, -62, -217, 47, 84, 43, 249, -26, -29, 175, -144, 90, 146, 291, -70, -142, 46, -77, -75, 14, -62, -117, 39, -64, -83, 36, 83, -35, 35, -31, 14, -46, -3, 178, -199, -46, 193, 19, 123, -54, 206, 82, 107, 108, -28, -113, -68, 170, 61, -62, 182, 325, 149, 32, 240, 8, -143, 73, 220, -88, -97, 114, 31, 15, -72, -25, 109, 125, 61, -122, -250, -124, 15, -453, -70, -19, -280, 267, -9, -131, 36, 218, -60, 21, 236, -69, -128, 88, -108, 140, -121, 10, 51, -150, -142, -24, 154, 296, 326, -145, -122, 218, 74, 26, -77, -137, -223, 174, 32, -372, 118, 199, -197, 115, 143, 253, -22, -11, 180, 33, 6, -228, -120, -184, -101, -132, -74, -251, 236]
7903B36j58k32M57k09r5L8R8j8l2j23J10m9J46p0R0l02l6j01J60J18N8j73J85
7926I8l5l70K57J52j31L10m30L79l01j60J69k11M28j65J40r0K9r2L0k19K45r4
7948f1j8j48J85r7q4K4M22j34j38M28l19L96m47j05P4J73n67M30j37K32K01l97
7970h7p5J43K77j49j55J91k04n1j7k37L51j7j00K66J1l21J91R1j75J54J07l50
7992a56M18m51l3Q5Q6L2m8K04p5n1o9J66N0j25j84J61M9j17J78L4or2l62N33m79
8017b52J87J84q7o1k60L04K4Lk42M90j82k28L04l78L9j45K3P8J39j41L03K2k83
8040a59K81j71K01R1j96kk18k6J19L71m61K74j15K02j55K5j24j90L75j06j18k28
8062c30L18o5P5J08l28K07L7l7k0M8R8o4l87L15l40M18qj44J92j89l3K81J16k94
$$ y = [236, 78, -154, 303, 94, -1, 37, 135, 117, 85, -38, 72, 23, 169, 99, 189, -113, -149, -250, -90, 28, 86, -87, 98, 63, -307, -50, 102, -29, 281, -149, 230, -71, -231, -62, -273, 155, -10, 130, 40, 69, -23, 7, -212, 33, -61, -79, -227, -42, -139, -223, -199, 223, 89, -49, 379, 60, 456, 9, -96, -22, 151, -416, 14, -123, 109, 310, -87, -162, -19, 258, 109, -46, 145, -59, -110, -127, -364, -13, -30, -130, 136, 147, -174, 17, 108, -67, 87, 194, -156, 262, -189, -222, -137, -51, -19, -67, 137, 62, 11, -58, 108, 158, 33, -151, 10, 59, -58, 120, 154, 148, 56, -306, 227, -252, -65, 119, 32, -29, -289, 15, 39, 42, -200, 290, 108, -120, 184, -194, -155, -300, -277, -199, -60, -201, 102, 124, -159, 122, -49, 152, 243, 47, 45, -173, -199, -80, 291, -170, 104, -11, 191, 36, 61, -63, -253, 122, 16, -102, -330, -12, -77, -2, 106, -222, -15, 22, -15, -35, 13, 111, 47, -340, -25, -365, 53, 45, -99, 93, -96, -129, 152, 268, -26]
8086b6j46J13j03J43k50M78l67K4Q5n9K86l30j49K89ok04L37l05N6K19r6j00k8
8109a39J49K5J49l03r0J04K74k14P7o8J47j97J17J07l10K85p3j63J83m1k74N1
8131b04M22l10L33j96kl74J64L6J58J80P7k0k06j79M6j9Q2M4j21K95k45r2J69
8154C8n1J81J80k50L2q8J23Q5l62j3J55m1K81l20K04k25r0k1M92l33N4k68K71
8177C4j2L2k93k8K42N1j76J84j20K55K03k62o9p3
$$ y = [-26, -172, -59, -162, -19, -269, 209, -158, -134, -49, -108, 178, -152, -301, -12, -18, -222, 115, -190, -134, 85, -11, -111, -139, 10, 35, 184, -119, -209, -105, 169, -45, 32, -36, 111, -86, 31, 138, -172, 113, 40, -123, 60, 19, -255, -204, 218, -92, 241, 45, 43, -331, -167, -131, 27, 207, 284, 264, 58, -121, -75, -94, -12, 32, -89, 206, -39, -131, 38, -13, 168, 348, 98, 130, 42, 165, 250, -112, -125, 30, -11, 270, -50, 154, -71, -161, -182, 310, -23, 31, -237, 34, 22, 54, -239, -267, -25, 26, -150, 34, -86, 169, 372, 110, 41, -32]
8191c2
$$ Imaginary data points
##PAGE= N=2
##DATA TABLE= (X++(I..I)), XYDATA
0@%%%%%%%mJ2j6J6j6K4l2L2m0M8n6P2q3R4j10J29j50J73j98K24k55K91l29L70
31A96m15M67n24N83o50P26q07Q96r93J100j219J348j492J653j832K034k264K528
49A335k833L189l614M134m783N618o744Q355j0864J5342k5768R1312N2577j79854
63e2598j5712R7880O0605n1102j3819P193l3443l8517O2220P3811j8239o1873
75A6406l413L343k8479N944P3233K2259o9655n1380L6116M1164k945J673J7376
88F1642l2628o5262m879O8878N9284M094l6873n5328l8383K4496O5767K3969l8251
101C6526l3240k791o054l246M1239N2838j1670o4745m1967J195K0436L7135M1813
114F7469p275o2277l5825L2565M2021K639p396m342l2867m1708K0516P2189K7602
$$ y = [0, 0, 0, 0, 0, 0, 0, 0, -4, 8, -8, 8, -8, 16, -16, 16, -24, 24, -32, 40, -43, 51, -59, 70, -80, 93, -105, 119, -136, 155, -174, 196, -219, 248, -276, 307, -343, 383, -424, 472, -521, 579, -640, 708, -784, 869, -963, 1071, -1193, 1335, -1498, 1691, -1923, 2211, -2572, 3046, -3698, 4657, -6207, 9135, -16633, 74679, 127256, -52598, -68310, 29570, 90175, 39073, 25254, 32447, -996, -39513, 22707, 96518, 78279, 16406, 12993, 16336, -12143, -6199, 67034, 89293, 19638, -31742, 4374, 45538, 42593, 44266, 61642, 29014, -36248, -41127, 27751, 87035, 91129, 54256, -1072, -39455, -14959, 50808, 74777, 36526, 3286, 495, -5559, -8805, 32434, 85272, 73602, 8857, -33110, -31915, -11479, 25656, 67469, 60194, -2083, -37908, -5343, 36678, 39317, 31921, 27579, -5288, -46996, -26480, 45709, 73311]
127G3311m3783l9668J088L229n234K1347L2588j2471n0522k1378K8842L4055J4933
140C6337K306j9914m7817l3308K8964O2010K4137k8034l6006j5048K72J2941K9914
153A6754K2397j7682m6729k5760J9500L8104K4931L166j7207l4991k9643P629
165c9531M0927K7018j1836k9027j8108j375J5291L0714K0731j8860m4664k3245
177e1965J7183L0534J9196L800j3613k9177j9387J6094L4615J5834j3284k5575
189a5745k1394n574K1390L7953J6869k3162l8455j9428P334K4397K7781J0451
201B2417k1234l3874j1124J8406K6400J5862k293k5586l3641q530K8915L4970
213A0688Q897j4079k0294k0088o515K2736L2903M025k9024k5513j679J1635J8336
$$ y = [73311, 29528, -10140, -9052, -5823, -11057, 10290, 42878, 30407, -20115, -41493, -12651, 21404, 36337, 38643, 18729, -29088, -62396, -33432, 28578, 52715, 24681, -11325, -26373, -26101, -13160, 16754, 39151, 21469, -25260, -51020, -31520, 6584, 31515, 34681, 17474, -17517, -47160, -39531, 1396, 28414, 16578, -12449, -30557, -31932, -16641, 14073, 34804, 15944, -28720, -51965, -34782, -4248, 14948, 18748, 5135, -24042, -43429, -27335, 7280, 23114, 9830, -15745, -37139, -42713, -21323, 16630, 33499, 10337, -28118, -47546, -40212, -15815, 11966, 22417, 1183, -32691, -43815, -25409, 991, 16853, 14560, -11026, -44667, -53197, -24282, 10688, 19585, 5506, -14788, -34876, -41391, -18655, 14248, 18273, -10751, -36264, -37943, -26308, -7972]
226g972K2714M598k9917l5924j33K9348K2502M003n274j7046k6290m273L0849
239a2815L1296m474k7708j8789n102N311K2997K9986J522l4086l0114L880K0686
252a7410J6115J0962K44k2657k7551K086L2012K3522l962j6854j8152j4803K014
265c4434K8487K8739l397k8792j9648N01J1901J8052J6343m105k8289k0655Q763
278b6534K6188J7210K012j1044k2579j8554P296K9238K0089n278j8292j5588p633
291b3469R787K5481J7164j1939k8169j4862P672J8103K0142J0396j1545k8054
303i293j6237J2295K2907J3114j507j1744j8410j0121J4046K7102J2047j3551
315B0648k1366j4223j246J4370K5316J3363j4283k6021j0260J0234J6934J1784
$$ y = [-7972, 14742, 19340, -10577, -46501, -46634, -17286, 5216, 9219, 3945, -13101, -39391, -43664, -12815, 18481, 14007, -13701, -32490, -37592, -32281, -9284, 20702, 22224, -11862, -41976, -38096, -17410, -1295, 9667, 9911, -12746, -40297, -38211, -6199, 17323, 13361, -3493, -21645, -36448, -34434, -5947, 22792, 19395, -9397, -29045, -28544, -16643, 1409, 17752, 13647, -14642, -35297, -26534, -346, 16864, 18876, 7832, -14747, -33301, -26005, 3233, 23322, 18044, -248, -15836, -23469, -13682, 11799, 28963, 17024, -11145, -26007, -18335, -232, 19910, 30306, 18761, -9293, -25530, -13235, 9672, 22786, 21279, 9535, -8875, -18996, -4950, 22152, 34199, 20648, -718, -14941, -16187, -1817, 23499, 36862, 22579, -3442, -13702, -3468, 13466, 25250]
327B5250J632j4367k2236o901J7678K4661R208q539j7425j7410n338J4725K3533
340B4471Q972j4077j9392q117O252J5674J6288J537j8860k3163n298J5232K0917
353B0436J1738l470j6861j8723m122J5187J8607L705j1752j6144r241N580J8278
366A3218J8171P89j9004k1386p361R373J8007J3889j992j6128j6583j23J5408
379F278J5802L211j1512j8920j2502M944J9651J8339K113j4783j8442q181O301
392g701J5701J1710l098j5818j3709M29J5065J6754N578j0684j9099j4499K426
405a6945J6748J6898L664j1080j5064o825P230J4279R151n182j6667j4076k9J4458
419c440J8351P876p931j7557j3251M44J3375J4008K143j1236j3987m810R356J6134
$$ y = [25250, 26882, 12515, -9721, -16622, 1056, 25717, 34925, 26386, 8961, -8449, -13787, 938, 24471, 33443, 19366, -26, -8143, -1891, 13783, 30071, 31608, 12748, -10415, -15713, -481, 20436, 32174, 28704, 11843, -6880, -11002, 4185, 22792, 26497, 14745, -1399, -10640, -5060, 13218, 31389, 32178, 13174, -8212, -15573, -6200, 11807, 25696, 23704, 7576, -9007, -9130, 6278, 22080, 25291, 13779, -5141, -17643, -12699, 6952, 25291, 27404, 12621, -5821, -14002, -7701, 8000, 19710, 16612, 794, -12915, -12486, 2579, 19333, 24911, 14227, -4872, -19371, -16945, -197, 16701, 20365, 9285, -5779, -12604, -5374, 8905, 18056, 12874, -3793, -17869, -17898, -3440, 14911, 22787, 14856, -2701, -15952, -15508, -2133, 11875, 14018, 2782, -11205, -16015, -6659, 9475]
433I475J0593m549j7270j7012k990J2773J6237R084m210j3996j1788O23J2214
446h16J2565N52j2050j4082o173P619J7003J3065j803j5446j5524l838Q149J2896
460B117Q099m175j2523r846L904J3735J1243o77j1417j5703q613O259J6397J3431
474A2231m96j2050j2143l896P231J2033O348o660j5322r997M281J4648J3388L001
488A2597q996j5941r218L217J3288J0707n2r225j0950l362P951J3386O143p294
502B251j4746r434J028J1707J4027N719p104j3929p894L623J0438P885j376r415
516g220j0608k331J0050J4612O902o246j2757j1041j820R145J3283O039o888j2279
530a1159n308N731J0278P639l26j0246j3075l794R553J4195P209l080r728j0219
$$ y = [9475, 20068, 15519, -1751, -18763, -21753, -8980, 7257, 16341, 12131, -1865, -13653, -13030, -816, 11749, 12301, 251, -13831, -20004, -12385, 4618, 17683, 15880, 434, -15090, -18928, -10779, 2117, 10216, 6041, -6482, -16328, -12424, 1311, 12554, 11877, 460, -15243, -23856, -17597, -1200, 12231, 11735, -315, -12458, -16354, -9123, 2910, 9258, 2598, -12724, -22721, -18440, -3792, 9596, 12597, 3601, -12340, -21558, -18341, -5053, 5654, 5602, -3623, -14573, -17935, -9984, 3402, 9545, 2251, -12495, -21929, -20901, -9194, 4833, 10552, 3448, -10481, -18375, -14752, -4314, 3571, 2195, -7220, -17828, -20159, -10109, 4503, 11405, 5159, -7598, -18639, -20459, -11314, 1969, 8008, 1120, -11159, -16467, -10736, -458, 7181, 6855, -3391, -16466, -20260, -10707, 3488, 10697, 7617, -2111, -12330]
544a2330l273P880J2667M138q567j0888l295N707R395Q855J687r377j4571n099
558a7071Q574J2569O315k393p212q777k226Q869J2422J681r246j0354m058L267
572g640Q935J1835L843r211j4532m522P295J0141N207k056p802q226n65Q971J1364
587A3037K702p198j0453o589J024R456J1126K708q513j0195k909N505Q110N430
601A3241j650r219r062j47Q927J0214M170n013j0838r047J724J0802Q794j008
615A1888p121o439l131K732R131Q861k697j2444q589J081O511P689O720m95j1948
630A749j0881L074J2062N601l131l889n242o880J113J3174R989o531j1966m221
644e979K020J343M782R770K13j3336r024O250R686J889n86q51q715j0128M658
$$ y = [-12330, -15603, -7723, 4944, 9082, 515, -10373, -13668, -7961, 1434, 10289, 11976, 2599, -11972, -17071, -8497, 4072, 10387, 7994, 782, -7995, -10221, -1352, 11070, 12751, 3505, -6849, -10907, -7640, 1295, 13130, 16973, 7762, -6770, -11292, -3997, 6144, 11351, 9295, 1493, -6733, -7298, 1673, 13037, 15739, 8541, -1912, -8501, -7477, 1979, 13105, 15813, 7300, -2895, -5804, -299, 7811, 13241, 11591, 2372, -6690, -6837, 2090, 12304, 16474, 11461, 623, -8424, -6700, 4102, 12896, 11888, 4767, -1672, -4803, -2071, 7060, 15921, 13224, 780, -7809, -6728, -217, 7472, 14192, 13697, 1749, -9132, -6058, 6004, 11605, 8474, 4585, -657, -7537, -6424, 6750, 16739, 10208, -1758, -5979, -3959, -2616, 2166, 11936, 12149, -1187, -10211, -3961, 5725, 7614, 7028, 6177, -2538, -12666, -8008]
659h008J6406P444q013r129k424j888K98R580R283n836j2832l545O160M519L612
674E627M271k273j2369p753O250J0869M202q87l380q451o630O057J2329L033q245
689B650o180j504o41M583R831L696r230j0109O86L651J741N363O048n452j3393
704h260j524J0850P286k258k561k427q907n136J1277J4810j722j2018m411J269
718c732j026J724R486M067j0072j0354L516P783K002J565L200n312j3002l313
732a3468J1111J0646j359n658l184l460k111O655Q904j737j0625m965K134M527
746b590L847M702Q2p374q051L64O203M858K008k113o297n491K121Q829O093j987
762E204p389o961l025M128R199N184k914p033m197L82L139M811L004l092o683
$$ y = [-8008, 8398, 15842, 7829, -1300, -3724, -5612, -5314, 4266, 13549, 7713, -5119, -8664, -2504, 2015, 5627, 9898, 7625, -4744, -12497, -6247, 4622, 8824, 7937, 4557, -3894, -10524, -4467, 7862, 10895, 2650, -3530, -5034, -5675, -1092, 8739, 12435, 3205, -6904, -6218, -2567, -826, 4537, 10585, 5133, -8260, -9784, 1066, 8352, 6094, 3533, 1106, -7801, -12937, -1660, 13150, 11428, -590, -5001, -3732, -4758, -3034, 6452, 10519, 447, -9907, -6391, 1392, 3394, 4959, 8159, 2847, -10155, -13468, -2357, 8289, 6930, 1272, -1912, -5372, -7483, -828, 8076, 6339, -4286, -9251, -7117, -2590, 1257, 5959, 6041, -1333, -9384, -9020, -2817, 2041, 4049, 1936, -4361, -9852, -7731, 1098, 7191, 5204, -2185, -9146, -12171, -8043, 1156, 6340, 3426, -3607, -7804, -7422, -4283, 528, 3532, 440, -6243]
777f243m539L286O527N502R65l970q338m906K965Q317M780k563n329l489O08M152
793b275M907K048l674p379m683K989O853N256O73l298n365m219J635P418M304
808E190k865o004l133M05M112O450M763l355j0114n279L622O253K887J335j020
823C247m497m683K494P373L022l729m254l216k394K865Q215O674m462q552k833
838d730L105K052K448K602j499p057l206N794P293J142k718l310m616l894L327
853c267Q618L246m446m558r85J35J443N565K739n246q512j490N386N726K825Q38
869H017l845o985l079M696N654K47k003k281k852j318M246P166L42o050n964j124
885e133J326L584N589J881n067o111N74M183J981R10n58l833n840N84P364N768
$$ y = [-6243, -10782, -7496, -969, 4533, 5498, 1528, -6810, -11716, -8751, -434, 4346, 1783, -3546, -7035, -6427, -2275, 2632, 4680, 1006, -6373, -11056, -8067, -1214, 4042, 4715, 1417, -3948, -8167, -6532, 886, 5190, 2325, -3679, -6812, -6407, -2295, 4155, 8918, 5563, -4551, -9830, -6208, 45, 2932, 4267, 3247, -1250, -5933, -3439, 3934, 6956, 3227, -1027, -4243, -6637, -3772, 4443, 11117, 6655, -1897, -4730, -1625, 427, 2875, 5477, 3978, -3079, -6285, -491, 6802, 7944, 5226, 1916, -2700, -6594, -3267, 5351, 8597, 4151, -407, -1392, -1257, 186, 5751, 8490, 3244, -5268, -6758, -1372, 4354, 7179, 8017, 4172, -2813, -5892, -1196, 4458, 4705, 2702, 421, -2431, -3749, 497, 7663, 8005, 1955, -4009, -5133, -3807, -223, 5366, 7247, 2180, -3931, -3357, 826, 2807, 3717, 3159, -674, -6514, -5930, 1434, 7202]
901G202j633l906k857l084j316M363O194N5n591m162J570K862K744K951n02o656
917a766o483J843O641L775k80r67k282m528q75N283M667k110m834k338J85J958
933b111M527M119r54o565m225N50L706K467J972n70l993l793K027N586K779j974
949C548l937k965k159K756N596L231j540m148l337k84K121L847K167k608m909
964b621k188K725M771K571k8k877m947k706K180N014K374p89l096k299j307K715
980e08L951J961l670m776j575J768L512L285J562k891n057k222K115M044J869
995C368j108k356l049o27L196M334J395k955m459k356K43L180L772J365k309m146
1011b512j779K043L156J967q67l298l621n00L453M135J848k177l795k520J30K155
$$ y = [7202, 5569, 1663, -1194, -4278, -5594, -1231, 4963, 5018, -573, -4735, -3165, -303, 2441, 5392, 4890, -1766, -8249, -6406, 235, 4010, 3730, 2763, 481, -4047, -4922, 361, 5028, 2918, -1916, -4254, -4069, -2111, 2416, 6535, 5581, -984, -5209, -4659, -953, 1514, 3486, 2916, -1077, -4870, -2843, 2743, 5522, 3548, -389, -3354, -5513, -2757, 2839, 6070, 4530, 382, -2955, -3239, -1118, 2729, 4896, 2288, -2621, -4809, -2084, 2687, 5258, 5230, 2353, -2594, -5300, -3120, 1894, 4268, 3479, 383, -1916, -3223, -508, 3443, 5404, 1734, -3042, -4617, -2849, 663, 3948, 5510, 2619, -2438, -4660, -2545, 1499, 3368, 2260, -96, -3145, -3772, -576, 3758, 5153, 2198, -2261, -4617, -4374, -1194, 2578, 3943, 1634, -2512, -4291, -2248, 908, 2875, 2008, -1290, -4911, -5411, -1958, 2177, 4025, 1848, -1947, -4467, -4337, -2182]
1027b182L593J078k547l315r11J673L069K458q31l383l763p38K940M191J785j259
1043A858l404k720j09L232K768O34k810l095j375J867L892K509j95l527l599p02
1059d776K372L174J969p93k682k689K77K872K907O48k572l328j722J072L775L370
1075C874Pl211k898o90J560K677J896q73l035k251M27L033L024O03j855l295k361
1092c368J333L341K852O4k781k214j090J745K736J680j208k895k532M86K730K745
1108C624J274j756l191k177O90K755K371l8j752k765r77J808L034J417j136k882
1124B99k684J91K402L140J136j717l122j748Q56K324K012nk157k517r02K001K959
1141B468J411p77k999k815k50K197K462J071j161k082j965L99K196K095M6k261
$$ y = [-2182, 1411, 2489, -58, -3373, -4284, -2611, 458, 2916, 2085, -1298, -5061, -5799, -2859, 1332, 3117, 1858, -1546, -4266, -4375, -1143, 1625, 2259, -551, -3646, -5021, -3154, 738, 3247, 3052, -475, -4074, -4776, -2404, 770, 2739, 1946, -736, -3425, -3148, -276, 2631, 3279, 707, -2621, -4343, -3271, 504, 3874, 3881, 670, -2228, -2918, -1358, 1319, 3215, 2342, -693, -2944, -2517, 516, 3540, 4143, 2288, -1007, -3368, -2035, 1306, 4158, 4222, 1441, -773, -1863, -118, 2618, 4298, 3090, 195, -2337, -1851, 879, 3624, 4898, 3142, -49, -2226, -1536, 1219, 3590, 3552, 1800, -965, -1942, -134, 2900, 4317, 3181, 299, -2385, -2194, 208, 3348, 4484, 2767, -355, -2103, -1247, 1077, 3089, 3084, 927, -1590, -2492, -491, 2468, 3879, 3102, 103, -2712, -2962, -765, 1697, 2768, 1607, -475, -2440, -2041, 155, 2250, 2296, 35]
1157C5k911l96J522K834J916m83k671k407o93K053J926J348j332k125j765O16
1173b533K655K014K20k351l024o88J009K743K042m75j899k341k02J663J812J466
1189B111j892k092j251J74K582K422O28j676k982j537J027K489J550k75j820j636
1205b178m2J351K499R87j500k628j715R27J550K792J117j422k762j301J299J645
1221F19J137k92j683j539q50K327K746Q94j497k390j528j97J430K444J282j695
1237A208k363o32J416J334J289k73j664k433p39J771K662J238m75j914j699o27
1253a901J236K046M02j629j679n57R49J852J827k00k492k564r5J373J747J339
1269A654k79j628j843J85J805J441K05j606j831j263N44K738K373o99j500j900
$$ y = [35, -2876, -3272, -1750, 1084, 3000, 2517, -154, -2561, -3254, -1201, 725, 2073, 741, -1384, -3149, -2533, 122, 2136, 2356, 5, -3019, -3707, -2698, 45, 2087, 1612, -287, -2628, -2830, -1167, 645, 2111, 219, -1873, -3124, -2950, -368, 2054, 2682, 1006, -1976, -3513, -2486, 3, 1553, 1278, -542, -2178, -2220, -869, 1630, 2617, 1117, -1511, -3226, -2299, -749, 2043, 3160, 1738, -1024, -2325, -1026, 619, 1756, 1464, -219, -1758, -2608, -281, 2465, 3359, 1862, -528, -2056, -2253, -823, 1621, 2903, 1208, -1155, -1787, -371, 963, 2252, 1979, 315, -2118, -2857, -1086, 1576, 2814, 2339, 425, -1274, -1901, -665, 1381, 1783, 154, -1525, -2082, -1133, 719, 2546, 2346, -146, -2710, -2805, -1432, 315, 1654, 1375, -253, -2096, -1911, -106, 1335, 1540, -66, -1897, -3160, -2616, 122, 2495, 1796, 296, -1604]
1285a604q86L11J627K019m27k383j386N79J860J563J60o16k287j947M27K204K037
1302A251m83r03p32q36J00J507J189o51k172j073P67J499J767N10o44j958j738
1319b600K87K171J242l1j620j039k09R64K029J410n60k639k123K45J849J617J095
1336B088J44j913j630m8J835J484k78r90j226j003P23K292J384Rj921j792k86
1353a128O74J429J004o15r83n85N96R92Q99j11r61k133l10J281J716R94n01q05
1371A453j520r96J134K238L50j325j668k15J31J192K135Q23j778l243l38J526
1387a01J158N2R14k84j755j648J348K501k14j255m65p62j260P11L015Q38j656
1404A137j858J08M77J28M34N44q10j756M53J518Q96l06n47p94j212l65J226J717
$$ y = [-1604, -2490, -2179, -552, 1467, 1040, -1343, -2729, -2150, -290, 1273, 1433, 817, -1470, -3417, -2990, -786, 1251, 768, -135, -867, -1703, -1603, -96, 1093, 442, -1730, -2803, -2036, -537, 1230, 1740, 1096, -862, -2600, -2313, -142, 1100, 1069, -551, -1590, -1799, -835, 1194, 2604, 2044, -595, -2718, -2473, -624, 993, 2088, 2232, 319, -1311, -1359, 476, 1960, 1682, 692, -534, -1537, -814, 1478, 2862, 2871, 950, -842, -1128, -454, 975, 1979, 1364, 381, -204, 392, 1384, 2283, 2172, 1211, -922, -1232, 49, 1765, 2759, 2258, 1453, -67, -1063, 71, 2309, 2659, 1334, -334, -549, -418, 774, 2909, 3732, 1954, -1289, -1627, -101, 1057, 1109, 2023, 1739, -16, -1664, -316, 2185, 1971, 716, 251, -511, -1771, -1060, 1955, 2793, 1137, -721, -613, -136, -8, 426, 970, 160, -1596, -1143, 375, 1271, 965, 418, -376, -1588, -1953, -727, 990]
1422I90L30j157j159n56K64J559J358o89j541j845j41J127J893J053m23j643j325
1439a905J47P56Q31O66k46p95j531L05J383J065k15o08j009p65K87J288J232l32
1457E54j420k88L54P23K66L84m72j410l94O46J852Q29j135n77p31p45L12J791
1475E39J201n99j738r91L59J224J226M33j78j873j640P16J432J532j30o97n62
1492B54p58p90J167J575K07j598o20K88J85N45N47M73j059j481L73J044M72l57
1510D67l50j91m85J71R79O87m10j689n76O68N77P45P65n64j061j245O57O37J122
1529I04K10r17j455q22J083J122O72J93p75j574o40Q49J188P96l41o42r81n07
1547a637M25J380O05j106r06j94M02L51M12J106p98j307n80J481L61q7n92K55
$$ y = [990, 1320, 163, -996, -1552, -1288, 271, 1629, 940, -601, -2446, -2587, -1460, 433, 1486, 1063, -580, -1905, -1758, -1002, -171, 495, 249, -546, -2077, -1772, -389, 676, 461, -147, -1156, -1921, -1634, -346, 886, 554, -866, -1154, -800, -77, 189, 573, 101, -1309, -1703, -1057, 795, 1624, 489, -88, -819, -1564, -1252, 539, 1740, 1141, -597, -1588, -1229, -5, 1221, 1654, 1476, -397, -2037, -1321, 111, 1643, 1513, 816, 254, -504, -1294, -127, 1448, 1655, 57, -563, -275, -90, 455, 1002, 1475, 416, -1065, -692, 352, 824, 467, 117, -74, -559, -388, 591, 1278, 868, -821, -1397, -729, -152, 593, 1358, 794, -267, -1512, -855, -218, 904, 1114, 197, -1258, -2080, -997, 125, 797, 990, 215, -1359, -1999, -1150, 38, 834, 493, -149, -1130, -1637, -1212, 168, 773, -333, -1239, -1433, -1031, -680, -268, 838, 40, -1267, -1847, -366, -5, -92, -684, -429]
1565d29q44j93P05J476o7j265r55N3N34Q28L83R63j209j680j28R92J397q9m6m79
1585e3q38n68R11J548L10r50j016l18L14N73J074L40k13r76q99N60R10P2J57m01
1605E37n31l81N62O95Q10r11o83j80j7O62L15N22o73q75J07O59O99L97l90n63
1625G61j109k27Q75Q96N87j87j053p56K02Q44K98K02l48o30m44J81Q25J127n02
1644A542j159o07K2J83M23Q44K27j156m23L71M76J10l37K15p70r17N88Q28Q82
1663A342j61r73l99o4P8J85M52J76q12q73L86R96M38O8k54j189o23j1R91O41P2
1684D66l22n52m43J79R87K95m97r58m50K65N06O32N91k76q00o19k7L04R01J03
1704B85l91p76r4L99P86M45k50p86p35j75O31Q51L18j49p55m8q7K36R58j80q53
$$ y = [-429, -1273, -1466, -761, 715, 648, -617, -1572, -1519, -985, -157, 226, 1189, -20, -1700, -1828, -836, 561, 472, 426, -53, -891, -1459, -548, 1000, 1310, 360, -656, -974, -660, -87, 987, 1327, 1114, 138, -761, -201, 709, 781, 938, 537, 6, -375, 187, 882, 1692, 781, 98, -82, -99, 563, 878, 1400, 727, -148, -41, 618, 1317, 1714, 1324, 761, -348, -575, 300, 1196, 1783, 1596, 543, -213, -11, 833, 1131, 1333, 985, 355, -89, 92, 917, 2044, 1542, 383, -224, -202, -19, 404, 1248, 1475, 319, -104, 267, 743, 853, 516, 731, -39, -956, -368, 460, 1342, 1181, 208, -191, -255, -177, 8, 460, 636, -176, -1049, -663, 333, 771, 839, 585, -604, -1227, -1238, -247, 394, 466, 144, -408, -851, -672, 315, 610, 113, -845, -1295, -1030, -524, 108, 699, 423, -377, -996, -1023, -719, 182, 285, -106, -882, -976, -577, 209, 654, 404, -382, -1117, -1292, -661, 190, 508, 359, -396, -444, -531, -295, 663, 483, -370]
1725c70l89l6J94Q32M87m2m48p04k65L01P16N06m57k39k11k14O93N56n86K37j040
1746d79n48P09N76M16K79m28q02K49j97P19K67l09o72m81Q2J049L07L88r61m61
1766b97k0k35M84L52M79n19k49k41N5P41M40q08m42l21k44L18P62K10r1m05n07
1787e38kL82M05j17k84q24q0P18O18J76K06r45p78K84J12M07M31o75J67m52J42
1808f47K14M98K44r38k63l23M00O05M43k05k07o59j94o9P55N45o12l28l37NJ016
1829e7J33L0k56q16p8J50N08M26R2l07l34k78N87O35j74j44p08l02o0N96O18K79
1851E40l42k32k86L26L01K60p6l10n92o6N96O25K23l21m33m68j6L95N43K67n22
1872D12k6l62J04M65M29j92k85p57J7O96L38J85j17j36o42j40M63M27j09r8l70
$$ y = [-370, -759, -795, -601, 231, 718, 676, 228, -476, -741, -440, 276, 782, 325, 86, -125, -339, 354, 910, 324, 561, -479, -1027, -318, 258, 674, 953, 525, -277, -28, -225, 494, 761, 452, -220, -701, -619, 430, 737, 1125, 164, -297, -317, -552, -68, 284, 763, 244, -5, -246, -191, 550, 990, 182, -260, -581, -825, -507, 255, 465, 374, -31, -538, -540, -158, 247, 130, -154, -978, -1058, -340, 278, 454, 660, -285, -1063, -779, -667, -260, 171, -504, -337, -789, -647, -433, 65, 309, -629, -892, -1215, -815, -210, 233, 28, -179, -838, -1032, -1101, -346, 199, -413, -741, -1078, -1073, -57, 76, 106, -150, -966, -1044, -894, -386, 40, 132, -175, -509, -787, -200, 435, 261, 117, -591, -893, -953, -357, 261, 540, 198, -34, -320, 6, 307, 567, 491, 181, -411, -477, 119, 744, 967, 646, 213, -255, -271, 124, 667, 934, 412, 386, 24, 128, 593, 1022, 830, 545, -212, -195, 501, 839, 1024, 907, 771, 129, -11, 452, 879, 770, 672, 302]
1893C02k24LO32M51j24l37n75P4l7K61J89L27l79l14k03N23J36K88p12J30o01
1914a90K18nN58N10n16m23j05J20K34r5N5k92m73l46R89L08k38J23o77k35J3K10
1936b57N41J36k25n68j78J25L50J80J30k53p08o0L5J099l95L8o40k93L67N7N09
1957a0m3j89k13n05J90O25N69k09l76l22j23k47M94R15k45p59k33N88J7K2O48
1978E94o8o65n96M87N29L0l26M22l61n81k41J178L94p93j76J56J84m71K32J018
1998I46m46p77n45Q96L30J43pk01n31n9J53N49O01m90m19l88P6K10N78J83k78
2019E24m64k15J27L00K52%m7n03J53q5R9L60Pl75m78J29L06J83l9M7J22j078J57
2042e18L77R28p50o12N48L9q03M23P77lp51q27Q91L16k60J75K84n29q83J6J044
$$ y = [302, 78, 81, 713, 1164, 1040, 703, 128, 202, 165, 426, 615, 942, 563, 249, 46, 569, 705, 993, 281, 411, -190, 28, 23, 581, 1091, 575, 152, 47, 167, 401, 306, 361, 69, -404, -750, 239, 547, 309, 432, -245, -480, -467, -257, 284, 420, 195, -373, -551, -426, -76, 104, 234, -19, -727, -787, -752, 347, -48, -10, -650, -943, -576, -519, -10, -53, -242, -455, -960, -770, -145, 424, 215, -161, -483, -606, -853, -359, 556, 311, -448, -681, -93, -76, -54, 594, 526, -139, -735, -248, 281, 311, -15, 407, 46, -535, -776, 402, 796, 3, -173, -17, 167, -304, -72, 946, 500, -277, -822, 74, 404, 547, 540, 339, -192, -251, -98, 451, 1052, 562, 143, -245, -169, 41, 619, 802, 524, 60, -155, -28, 272, 524, 524, 477, -26, 127, 42, 141, 501, 508, 133, -345, -216, 90, 273, 234, 281, 403, -675, -518, -141, 787, 37, -575, -27, 12, -791, -368, 409, 406, -345, -1172, -281, 35, -225, -50, 234, -295, -1178, -1162, -118]
2063a18L49l89k60L99o41l28L62R71k35p50l22K35L67J20K81K01m71p42K99j63
2083h35P57J55o34j23M70l26j32O22L37n12o81K38L97L41l30j1K98m07n83L89
2103e70J137j8j077k20N65K72m54M34Q08n17o80m72R84J49l80M31J34o63k05L40
2123bQ86j05n44k61J97j63M8M09N56k68q14k22P19L46l60p6L25l62l34N79K00
2144G54Rp2q26J04N27j2k20K10N23n25r46J51J491k08o38k00P48o14m68O70P26
2165A184m85q47J42M74m2m45K28O06q16r10P97Q95j71n57O5N44o34l57L68Q17
2185H56p20o57L50O06j7m35K24J98p32m21O40K15J98j40j84J80o25j17Q05J00
2205C24O2r22J15q7K64n5M56N0j29p26L40PL31m8k97j83N85k34K14j16J93l68
$$ y = [-118, 231, -158, -418, -19, -660, -988, -626, 345, 110, -640, -962, -727, -360, -240, 41, 242, -229, -971, -672, -835, -78, 77, -557, -680, -210, -536, -668, -46, 291, -221, -902, -664, -267, 74, -256, -267, 31, -376, -959, -570, 567, 549, -528, -748, -183, 89, -365, 69, 877, 360, -320, -792, 192, 341, -39, 392, 526, -137, -342, -2, 884, 779, 235, -26, 171, 8, 56, 465, 1021, 753, -61, -283, 436, 782, 422, 346, 671, 309, -25, 554, 754, 763, 691, -135, -31, 496, 484, 264, 474, 997, 472, -474, -323, 1168, 960, 322, 122, 870, 256, -212, 458, 1184, 699, -148, -6, 468, 426, -19, 209, 815, -1, -911, -114, 781, 610, 53, 118, 662, 28, -329, 39, 856, 136, -521, -171, 435, 418, -17, 207, 405, -327, -748, -108, 107, 305, 165, -19, 161, -464, -581, 224, 324, 386, -536, -421, -508, -244, -299, 157, 207, 78, -648, -308, -301, 30, -18, -315, -498, 87, -147, 67, -49, 144, -224]
2227b24p05O98J95K64k56m95M97Nj96J03O37j07o74o8K16J29l55M45M90l27r40
2248f68N68L86J59n11n2L02k62k20M02N21J99p07j65J75J56l36M27N49o04o06
2268b87K71N32J27l95O2l12P2j99M76M12n49P3l38J39L5j94L38M02p38r8JO76
2290E06j07k51K6j39n01L24K7M88O7m48O1l43J23L04K88n15k32L94m49K11M08
2311B42k6q8Q6l63K44n30K30L27k29k73n4L20j12P9J57k44j38l72J08N45J85l66
2333b72j58J72Kk83M33k6j16m26K73K16m0P8ro4o0m35K61L64J27k44k49N6n5J02
2357c53J46M26n08k31R8j72N97j15J78K17n71j8j04M20L9J48l16j96k68M30M17
2378B64M63n12m83K89N7J46k5p1J08j14k07n6O22k17J79n48L20k89j3L36O35l01
$$ y = [-224, -929, -231, -36, 228, -28, -523, -26, -21, -217, -114, 523, 416, -258, -326, -110, 19, -336, 109, 599, 272, -668, -100, 286, 445, -66, -118, 184, -78, -298, 104, 625, 824, 117, -48, 127, 283, -53, 374, 923, 319, -287, -16, 516, 643, 248, 310, -2, 70, -129, 347, 759, 210, 283, -55, 84, 119, -75, 263, 665, -73, -171, -170, 506, 399, 148, 174, 35, -466, -142, -115, 373, 440, -8, 53, -290, -167, 137, 425, -90, -322, 72, -377, -166, 242, 216, 128, 214, -149, 95, -435, -205, 122, -107, -380, -434, -114, -226, -147, 10, -234, -372, -744, -636, -91, 94, -272, -430, -258, -256, -539, -106, -132, -248, -674, -401, -185, -225, -147, -156, -220, -280, -715, -454, -90, 37, -207, -456, -400, -455, -353, -207, 219, -289, -520, -422, -594, 3, -112, 66, 283, -288, -306, -410, 10, 49, 197, -119, -315, -583, -153, 264, 727, 215, -268, 21, 78, 224, 199, 128, 236, 122, -85, -141, 481, 264, 443, -105, 215, -74, -87, 249, 884, 583]
2400E83m58j73P4L60K43j05m25O2l35M35m5N54k21k5m38j54J7M40j44K57j46j52
2422B04j79K75K24m57J03k62J45o7R3K90J98q44N00m22N32m2k49J88k93l86L43
2443a06R9L87j46k19j47k70K75J59L44k31j67n42K49K62p0n1L29m60l59K61K0
2464c83L10J30j2j59k4k53J94R8L15m62j06Ro8J62M28k84l59k6j9L09J37M32l71
2487bj68m20K85L31O4J03m05o7j78Q8K47K78l3j0j59k18K45J42o9J49l47J75P3
2510A04k97L05L33p2q4n24L33K54j7Q3m8l17m0J14J63L01m12rO1l91L89J33K55
2533F17l99Mk04O6L87R6K26o34j22l20O40J82k79K50m03l5n6O8J05M36m99Q6l07
2556i5P3L19k9L00j89n43K75l56K72L02j35l97K46K04l83L31j32m6O2l07r0L24
$$ y = [583, 125, -48, 26, 386, 629, 524, 99, 161, -174, 261, 216, 770, 549, 524, 86, -68, -51, 389, 245, 502, 356, 204, 25, 300, 524, 67, 170, -92, 53, -14, 79, 369, 567, -277, 223, -199, 333, 291, 42, 230, -63, -449, -106, -7, 380, 234, 15, -132, -402, -127, 32, 376, 145, -22, -564, -315, -53, -123, -174, 155, -305, -664, -403, -383, -73, 57, 45, -114, -138, -391, -197, -99, 216, -246, -352, -343, -411, -249, 179, -105, -464, -490, -509, -200, -63, 369, -2, -170, -590, -305, 26, 90, 193, -212, -279, -457, -369, -122, 156, 123, 113, -46, -264, -19, 123, 54, 203, -144, 31, 104, -193, 112, 445, 373, 289, -235, 98, 352, 335, 418, 370, 53, 13, 127, 290, 591, 179, 170, 231, -160, 229, 362, 617, 218, 222, 18, 84, 471, 567, 793, 159, 37, -283, 357, 539, 260, 510, 107, 72, 16, 84, 189, 625, 126, 212, -95, -22, 297, 268, 568, 379, -164, 111, -245, 27, 329, 194, -203, 43, 247, -136, 195, 63, 17, 79, -228, -318, 6]
2578FJ65Kk88k79J89Ol0M21j89k65l79L84K18k93L67K1k20j91r5L90Lq1l19J39
2602c18k02P5M24J99l11k80K2j70K84K13J8k44Mj65j66M22J71j16O3l49k2j56
2624f04M72O9j14K6l0k30L48J63k76K24r2q8k22K03O36k71p7k38M14m26J82K07
2646B76l50J13k27P6M78j44l1kj20k94J14K58K13j62k44M55q76L19J37J83M7j57
2668F2k15J98L31K28p1k57l7l09M1N6K35K08n24q6K66j97n4L6O33k25n42Q3J84
2691D4J12N6k24O6L3o6L5j26L90m72Q4K8p1L51L6M2m99j98k27N52K51P3m19j06
2715b55M7l11L82K7L30l55o4l08O1M32j59K31K47o77J73k00N44m21L23n19K91
2736a81j13J6M16P5m39j3j17M6K55k74J99L28K6n67K37J77o8r1n8j34M07k7j46
$$ y = [6, 171, 173, -115, -394, -205, -199, -229, 192, 3, -262, -641, -257, -39, -332, 35, 56, -164, -355, -450, -60, -57, -138, -457, -318, -520, -445, -21, 178, -133, -413, -391, -561, -277, -64, -46, -290, -286, -451, -617, -195, -24, -140, -77, -426, -448, -604, -132, -63, -177, -151, -181, -411, -63, 100, -176, 48, -44, -132, -354, -151, 485, 214, 137, -101, 313, -113, 69, 276, -74, 39, -188, -112, 366, 222, 191, 189, 69, -225, -111, 147, 360, 198, -46, 409, -467, -148, -11, 172, 219, 62, -153, 45, 376, 604, 533, 276, 239, -70, -29, 27, 262, 470, -54, -140, 126, -71, -125, -89, 544, 319, -223, -140, 44, 156, 212, -12, 54, 87, 21, 56, -70, 320, -152, -68, -40, -111, 240, 276, 318, -181, -379, -606, -54, 197, 270, -149, -255, -208, -519, -137, -110, 220, -135, -199, -507, -446, -14, -173, 58, 305, -372, -199, -399, 145, -276, 47, -472, -181, -294, -278, 138, 213, -226, -239, -356, -310, -55, -329, -130, 198, 224, -343, -106, 71, 3, -88, -146, -280, 127, 100, -46]
2759d6M35m18j41J13J62J48l92J83K8l2k05N1M04K59k01o50K26M1k12N72O09l16
2781F18o25J86m7L83n06O0K57J14n37L03L62kj27j16j23j53K19J13Q4j57k72R4
2803A28L72q4j79o6j02l71J49P4M59O7l5J06p21N60l66J77p7Q9J00o9n35M64K92
2826D32l51J40k42L8j69P4J13K61k34n17L42L18l14k4J39J89n33j04L46L49m66
2847b13J43J31l4k62j83P17l10k35j83L20R7j71j35L04R5l12k00K16K57k65P5
2868a48J40l72K01K20L3L74n71m70K62J60J14K11n6k01n6K48k46J3L17k05j97
2889b29J29J95m8n6L22l07j46q2Q6K9J63l42K77J06J80n12N12J8j28k18J2L00
2911B61n0j34J09J90j11k48J91K06k01j22K07J6k84Q1J08K63K1n36k86K75k2P2
$$ y = [-46, 389, -29, -170, -57, 105, 253, -139, 44, 72, 40, -165, -114, 290, 549, 348, -302, -76, -35, -247, 325, 934, 618, -7, 179, 132, 515, 9, 69, 326, 440, -97, 206, 568, 566, 439, 323, 200, 47, 266, 379, 463, 306, 34, 128, 500, 416, 237, 171, 69, -302, -153, -79, 380, 447, 412, 518, -203, 357, -9, 168, 91, 180, 280, 211, -324, 140, 432, 81, 221, -21, 17, -152, -78, 35, 296, 62, -455, -113, 205, -109, -133, 6, 195, -338, -442, -96, 253, -213, -70, 61, 27, -235, -418, 299, -11, -246, -429, -109, -12, -183, -318, -14, 81, -231, -431, -215, 42, -223, -148, -8, -380, -179, 41, 74, 448, -123, -593, -331, -171, -57, 154, 98, -103, -159, 89, -157, -144, 173, -32, -229, -100, 95, 47, -9, 313, 6, -140, -222, -136, -107, 56, -286, -9, 97, 277, -235, 277, 295, 167, -51, -39, 261, 211, 77, 186, 376, 265, 17, 208, 414, 213, 91, 298, 314, 30, 111, 219, 482, 503, -33, -319, -44, -66, 6]
2933FL44j7m43n1M30J11m12J03j16Q6O1k2R2L5l08l7J65K51k42k0L56l71j59J47
2957a1J07K99l20j42n3m54N64j29K19p1K48m49M6J89l76K37l0M4j69l6J06m5J07
2980a19K66l57M5l69L15J48Q4K2m02O4k41L55L7j69j21K09J7j03J82K18k62K31
3002E0m76J50n7J0L64n5l21%O1K90J53l14J81l69j45L40P1K43K64o20j97K60J
3025a16O9J95N3l67r6N3L02k0J10k37p0m9o8N92J04l17l7j02j2J91j50L49k32
3048A45j16k31J10M75K42o97k2M30r7j48J40j1j00j6K75k18j57R2L57n2k92k22
3070a13nJ16L09J9k31n1k24M47j08j48J9J22l14j07O66j16k68k15O9L19k60K1
3092e3J27K4K0n37L01M24j78j17J65k73o1l11N02p1o8L86j32k30L9k15L35M5n52
$$ y = [6, 350, 333, -110, -161, 269, 380, -32, 71, -45, 41, 102, 80, 172, 207, -101, -138, 27, 278, 36, 16, 372, 1, -158, -11, 96, 395, 75, -67, -120, -574, -10, -139, 80, 9, 257, -192, -146, 43, -333, -96, -126, -82, -251, -287, -181, -226, -119, 147, -210, -165, -534, -219, -71, 13, 35, -367, -303, -544, -189, -152, -321, -442, -233, -216, -319, -137, 81, -181, 50, -426, -276, -333, -323, 41, -14, -335, -335, -274, 16, 169, -145, 36, -333, -478, -138, -67, 176, 440, -180, -377, -117, -116, -47, 148, 201, -166, -262, -209, 93, 73, 183, -54, -124, -173, -241, 351, 455, 138, 101, -1, -13, 178, 28, 377, 145, 29, -202, -92, 383, 625, -72, -94, 336, 239, 91, 231, 220, 120, 104, 379, 161, 4, 96, 453, 401, 109, -113, -118, -2, 307, 326, 95, 44, -180, 267, 159, 11, 30, 152, -162, -269, 397, 281, 13, -202, -133, 186, -74, -53, 74, 98, 118, -419, -118, 306, 128, 11, 176, -97, -158, -469, 33, -38, -106, 280, 148, -82, -43, -258, 77, 122, -430]
3115d30J69j22p0M24L46j79k82j63K27k17J06j04N03q9j13m27L78K33l22L19j96
3136io0k80M76N6j52q2k04PL72j20L2j57k0N5K25J84m56J92K36l42k98L20L65
3159C40k02j09M6j83J12N3L57rk52m22M91k34K17L31nn93J69j49J59J41j55K2
3181A25k40K86m0j24L24k46R9l48P6K06R1k22K87q5j63k0rQ7L38l83R8j32p3J64
3205I6J06K36l00Mj53r1J26K70k27m03J34N9M7J25J20L2k42j39P5j4R3j3J07n3
3229el08M30j29j00P8m3k49L0J34k1K65j47l11L96m44J45K83n9J20k13P6k56J43
3252a85Q3l3J22k70J97K7l26N91n24L07m56K56j0j30J69N4J82l90R3J93j52L55
3274A53K18n51p0L73k57K78j83L71n86O3k24O18k68j07N22m20j54J22j06R5L87
$$ y = [-430, -261, -383, -453, -29, 317, 138, -144, -307, -80, -297, -191, -295, 208, 119, 6, -421, -43, 190, -132, 187, -9, -69, -349, 127, 183, 31, -51, -255, -248, 124, 4, 36, -121, -141, -86, 139, 323, -133, 59, 295, -47, -345, -25, 340, 138, 29, 75, -108, 4, 57, 414, 405, 153, -269, 222, -12, 205, 536, 531, -62, 107, -42, 117, 258, 103, 125, -115, 171, 131, 7, 331, 85, 184, -164, -88, 118, 209, -13, 274, 189, 26, 6, -3, 84, 422, 39, 137, 5, -68, 96, 202, 438, 138, 142, -11, -102, 24, 294, 67, -336, -202, -143, -96, 29, 149, 181, -61, -200, -125, -139, -46, -59, 48, -5, -313, 117, -12, -112, -34, -77, -326, -296, -162, -183, 82, -65, -376, 20, -424, -279, 4, -55, 65, -148, -72, -328, -185, -102, -135, -13, -283, -86, -59, -385, 206, -318, -11, -467, -211, -221, -351, -182, -128, 54, -336, -243, -50, -202, 153, 371, -180, -250, 123, -134, 144, -39, 332, -254, -191, -415, 203, -65, -172, 350, -70, -224, -102, -208, -113, 274]
3295B74j17m5m11M46K96l13%J27k29j02L68P3j86j57J78j37J91o7K14k81q4J87
3317B25l07M9K37j84j1J49l58M52l6n1j70K67j30m0J74j9P4J92m60o1j4MJ71O2
3341B15k23O1n5r4L56Q3l10J25j83k3n1M53j89%k06l08K35pM1J82pn14L33J16
3365C0Q9j42K54k19k51J12m1r9N28m03p5qJ31R0q2N4m8L6k42j4L07q4J11o1m18
3390d45M78l48O16l80K2j63m2N4J15k4J64P7l60J9K74P3N6j89K06J9o68M20L06
3413B80O4n2k67k6k9q8K26J21m3j50j87J3L43j01L18k04n6q2l38L91O3k12L48
3436C32l32mN7K42P5r0m38M10p8L9j09L92j49l25p3J62L43K2l80k15K75l69N39
3459C26k81J78j40l0K43p79N15J93l92M56n22M52k36N6j43m3M8MJ4K89L4l86J53
$$ y = [274, 157, 112, -299, 147, 443, 130, 130, 257, 28, -74, 294, 367, 181, 24, 202, 65, 256, 189, 403, 122, 38, 225, -82, -33, 204, 20, 9, 158, -200, 252, 216, 165, -5, 262, 132, 92, 266, 247, 321, 513, 53, -8, -22, -18, 153, 215, -8, 53, -2, -96, 260, 343, 33, 158, -25, -48, -99, 354, 165, 165, -41, -349, -114, -121, -80, 102, 95, -419, -86, 30, 119, -23, 231, 12, -239, -127, -168, -267, 261, -142, -217, -225, -94, -4, -86, -32, -80, -44, -286, -300, 7, -77, 34, -27, -445, 33, -315, 301, -79, -57, -220, -262, -208, -93, -117, 47, 124, -236, -217, 57, 130, 186, -3, 203, 222, -446, -26, 280, 344, 292, 25, -1, -30, -118, 108, 229, 186, 36, -151, -138, 205, 104, 422, 218, 162, 80, -258, 133, 196, -16, 332, 0, -4, 53, 295, 370, 280, -158, 252, 174, 213, 104, 496, 347, 22, -51, 111, 454, 476, 96, -119, 156, -213, 326, 45, 223, 83, 53, 296, -483, 32, 225, -167, 289, -233, 219, -17, 39, -104, -147, -99, -95, -81, 208, 242, -144, 9]
3482Ij53m8k3j4M35N8k73k4j20J35NP1J12m40j33M21l41K53j25J73j35l25N35
3505E3J1l01K70m43K15O3r0M34n5j15m67J57k13M5J87K7K08j03Q4j74M8Q3O4P7
3529F5n89J99L8K50O4mJ5j8k25j9L15j20j30L4J95Pp5L32k24J34l56j83K81J28
3553A14L6l6j67J34J07r2K45k60L8M3m09L11K13Q1m75L31L0J88k79j1j61R1J08
3576A80j07m9Q1K23k84R8J41o18M81k05M13l59j52K44MK71l16J1J60r3r9j25K09
3599A09K33k54K73m04p8J55qJ87Lk34k22L64k87J98o6P6l20J12o8J4J99k58L93
3622A17p7n9k75L31L23n00Oj25K29L5O2N2j23j29l16K00J98R0L1l13P3j5J99k44
3646b30K77k07J19M8m68M76j05J93m65K35P1m2N0j80J31J23R6m17N5L44k65K96
$$ y = [9, -144, -192, -215, -229, 206, 264, -9, -33, -153, -18, -13, 58, 170, -270, -403, 18, -323, -70, -195, -22, -157, -482, 53, 64, -237, 33, -410, -195, -132, -222, 212, 157, 42, -425, -268, -481, -436, -249, -222, -14, -117, -33, -207, -159, -76, -12, 65, -524, -325, -287, -37, 27, 23, 38, 20, -205, -224, 91, -29, -159, -125, 70, 77, 2, 334, 110, 244, -112, -295, -14, 114, 150, 114, -53, 81, 188, 96, 341, 81, 119, 162, -247, 64, 277, 358, -117, 214, 244, 432, 153, 142, -19, 72, 180, 73, 24, 105, 328, 44, 142, 283, -335, 146, -59, 354, -5, -157, 87, 91, 362, 46, 57, 217, 124, 25, -100, 109, 342, 88, 361, -43, -121, 34, 26, 213, 216, -18, -240, 124, -163, 35, -31, 45, -275, -163, -231, -217, -18, -276, 117, 40, -19, -294, 37, 360, -140, -134, -259, -30, 5, 67, 119, -4, -133, -449, -249, -51, 39, 70, -243, -170, -185, 14, -230, 47, -160, -41, 7, -461, 15, -90, 103, -362, -127, -56, -98, -48, -228, -97, 26, 122, -295, -240, 104, -161, 135]
3668A35j9j36J79o4K45r0j40j51O7J34l27M10k86J42n43L36nJ15m6L41j05j31
3690F1l19J86K08N5j72n5K43j63k0p7K30L00l92l05M57k4q8R7M6l32J62K26Q8
3713D12j29l23M05m53K88j27j6J1J63j15O9M1l79J13J67j92r1M31k19j02Q1n3
3735a8Q3m3l07K53n5J77o3j27N7r5K41l13j9N3K35k82n3L34l77P49m42k14Q1J08
3759c7K91k02J2j80j15L62k05n6L3J98m89K61KL26j44l20K55J73j58j43J09k45
3781b72K47k32j42L03J4L4N7R0l99L50p7n7J66j72J22k01L00k73J8O8l0j14N6
3804a44k3J17O4J25k54L01j00n3p3K56O9j79L4j50J46j59J63j80M02j93k22J67
3826A14j3J96j66Qm2P3j83L84j66k21O1J57m17K54L43k15O9n27m6M65K2k73L01
$$ y = [135, 116, -20, 159, 95, 340, 250, 110, -41, 26, 160, -167, 243, -43, 99, -444, -108, -113, 2, -44, 297, 192, 61, -258, -72, 136, 191, 19, -36, 207, 44, 24, -53, 177, 477, 85, -220, 237, 213, 125, 222, 268, -64, 98, 324, 412, 283, -40, 365, -88, 200, 73, 57, 68, 231, 116, 185, 226, -153, -40, 127, -65, -156, 275, 56, -46, 35, -18, 65, 22, -285, -32, -87, 90, 27, -100, -43, -138, 103, -210, -229, -176, 59, -223, -276, 58, -319, 430, -12, -226, -145, -37, 254, 52, 64, -116, -231, 131, -74, -130, -97, 101, -388, -127, -125, 201, 57, -263, -8, 165, 7, -136, -27, -272, -25, -257, -399, -96, -82, -48, 9, 99, -300, 50, -27, -84, 82, -90, 32, -169, 131, -142, -124, -56, -86, -200, -144, -167, -50, 14, 139, -115, 186, 86, 33, -40, 216, 285, 106, 140, -10, 136, -23, 140, -40, 362, 169, -53, 114, 101, 297, 131, 139, 97, 170, -13, 371, 205, -16, 45, 202, -215, 39, 382, 167, 236, -291, -337, 128, 150, -123, 178]
3849A78n7j90O6P0N88m74J6k26J21m3pNK52j49j70j63J86J52k32K1n4oK38n8k13
3874a49K21k4q7m65L58J75m2N3M6J82n59K95L7l6j76j21j87K91r3K4J97k13K44
3897b9n2j92L61k15L47n44M10j91k29M98r8j58n9K80l04K17o7j94J52kj6J68J25
3920B08l80K3J8k6K7K05j34l35L83j80J18q4K03k36L22L5Q3k29K14j2j24k07P3
3943c5j40K43k42M27J88n51l7K4K62n3J8q5K75r0L0j58K06J08j41r3k04j37M71
3966B86M9m21M28k50L75k08j93Q7m1J3j33j85K36j74J00K18J99m78K21j4l08J86
3988gQ5j47K72j82J78k72K52J66o64K65R8L0R7L3l27K67m76M56l0j67J78m41J64
4011a72J20L29k61j34L10N4l03J17j03j25K01r4l7L5m6R2J07Q1n07L1K37j65j7
$$ y = [178, 121, -69, -3, 67, 655, 181, 197, -29, 92, 49, 42, 47, 299, 150, -20, -183, 3, 155, -77, -56, -110, -116, 122, 64, -149, 72, 48, -39, -504, -146, 29, -13, 40, 86, 268, -291, 4, 41, 5, -171, -292, -479, -188, -281, -257, -60, -273, -29, -81, -273, 88, -127, 220, -324, 86, -105, -334, 164, 66, -92, -151, 129, -175, 42, -25, -219, -67, -69, -85, 83, 208, -172, -149, -131, -157, -130, 75, -59, -394, -11, -191, -73, -157, 46, -190, 132, 167, 250, 21, 235, 223, 99, -108, -35, -175, 68, -174, 253, 441, -110, -147, -123, 139, 86, 104, 19, 294, 204, 234, 76, 282, 390, 249, 156, -48, -185, 286, 335, -86, 342, 92, 467, 259, 66, 153, 112, 125, -8, -193, 43, -131, -31, 187, 386, -92, 129, 115, -193, -7, 78, -69, 203, 21, 199, -73, 179, 345, -319, -54, 44, 74, 171, 204, -123, 144, -332, 124, 94, -73, 105, -336, -172, -52, 277, 16, -118, 192, 246, -57, 60, -43, -168, 33, -61, -98, -63, -109, -17, 90, 171, -336, -305, -68, -233, -250]
4034b50K60j15j38L41k08j86M05m48K86j6R6Nj90K96k87R9j05j31L72K05l64K0
4056e3m2K12j57J65J24j70l3n5j92Q6M94n21M34l57r4O1J47Q2q3m2j93J04K68
4079A85l7j5k51k44K05J58L02M6m2j32k66l09M51J87r3J64q3q0o3j3r7k4P2K95
4103C16Pj08l77K48J73p6n6j62k42L91j07K6K50m08J47k07J05L77n32N00j33M
4125A36k16R5J26p2k17K15l07K33j36M14k66R1j29J11Q2k40o2J35k40R9J22k31
4147b57L44k7q0P6j18m7J19R7k29m7m04P18j97j89J28K97l51j85K31M6J7M5k0
4170c3k44J22J85r8O3K0M6l41K45J89j19q9J59l11J30K7l1R7l17L05l4l14L05
4193c8K71k84K49q6k65n8L77m30J53j66J35J99k42K73J14k37K52l03J81k22J62
$$ y = [-250, 10, -105, -243, 98, -110, -296, 109, -339, -53, -69, 27, 32, -158, 138, -149, -50, -155, -286, 86, 291, -73, -53, -95, 117, -40, 125, 249, 79, 46, -9, -201, -115, 379, -142, 292, -65, -159, -98, 49, 131, 48, 6, -187, -83, 185, 148, 133, -118, -362, -157, 1, 303, 349, 307, 175, -91, -400, 51, 238, 145, 309, 226, 146, 83, 70, -27, -51, 21, 316, 323, 215, -162, 86, 259, 183, 127, -35, -277, 114, 7, 33, 283, -125, 22, -185, -80, 297, -235, 265, 132, 136, -80, 15, 141, 69, -148, 67, -240, -7, -143, 271, 5, 96, -33, 78, 160, -80, -142, -7, -247, -148, -26, -257, 87, 60, -20, 56, -62, -109, 10, 107, -122, -169, -573, 145, -52, -241, -113, 184, -167, -352, -121, -75, -58, -13, -33, -277, -155, 30, -68, -5, 15, 61, -280, -35, 154, 35, -54, 105, -206, -76, -49, -80, 17, -300, 5, -29, -343, -38, 233, -51, 198, 112, -153, -211, 166, -264, -111, -277, -142, 57, -185, 88, 202, -35, 217, -86, 95, -127, 35]
4214C5L56l79L46k34k05J84J5j37q5L6J15M4J6q0Q0m02L11J01k77L94j03j9j59
4237d7j1n1K63nl86O11k29p1R2k58M79m55M09n24J89J02j97J79m1j63K13k30o5
4260a96K67k72K11j26%L35l28J53M30p00j00J61K23J20o6m2o5o5N5Rq9L11n21
4283b95K52j46M4j02L10m3j64P5P7J40K7j77k8r2P3j16K07k19K11J35k13M03l69
4306a0j21N3J35M4p8l75J20Q2j09K40k96O7K59j5J30j99K18j64r2K94k51R7PL5
4330G1j81NR0k7o5L78p4j30j21J44o2K88m0k64M9j87N10o4m00J31M9j26J89k29
4354f6J79j3k5k13J14J4p7K58N2k8k0K86k53k89n9L80l27N0O14m19l89N3J37j45
4378a86J77j24J35M7K88l63n8J57J55j47j21k36M40j34k1J49o1J54k61N4j50J68
$$ y = [35, 391, 12, 358, 124, -81, 103, 118, -19, -104, -68, 47, 91, 107, 27, 107, -295, 16, 117, -160, 234, 131, 112, -47, -58, -109, 154, 149, -237, 374, 145, 74, 166, -92, 387, -68, 341, -183, 6, 108, -89, 90, 49, -114, 99, -131, -196, 71, -201, 10, -116, -116, 219, -109, 44, 474, -226, -326, -165, 58, 178, 112, 70, 5, -60, -5, 4, -85, 226, -295, -43, -189, -145, -247, 63, 20, -144, -69, 8, 148, 175, -2, -30, -122, -49, -165, 42, -177, 34, 169, -44, 359, -10, -131, -78, 57, 101, 23, -352, -232, -150, -259, -19, -315, -248, 11, -4, 126, -73, 145, -19, -111, 183, -68, 29, 36, 71, -110, -105, -15, -42, -107, 271, 197, 67, -54, 90, 28, 316, 276, 12, 61, -126, 384, 320, -80, 51, 100, -26, 163, -66, 113, 100, 75, -138, -24, -10, -87, 171, 223, 195, 175, 461, 208, -81, -140, 240, -87, -37, 577, 158, -231, -178, -41, -186, -9, -133, 2, 49, 337, -26, -84, 73, 228, 81, -40, -276, 164, 30, 9, 158, 97, 251, -10, 44, -106, 62]
4400F2K60k61o4k49L07k12K61j35J27J71m78L06k16K62k68j04q7K64k1r5J99k69
4422b40K24l58O2J39K90j24k99J10p2L09j91l1J02J33O3l46LK98m4l8J18j83l65
4445d40K94M28l37n5l3o5K48K8j83j38L04j84R3n2QJ97j68R0j77M11m47R0J68
4468H0O6m2N1J0k5J01j44J82n4m04L3nK54K00k58R2r4l7Q2l9M9j64o2L82p8j61
4494A5L24m17m8L42j08K31j93k73J90j37K86r8m03M61R5m88K30K15k13J51j26
4515C6M5k2j66OJ14n3l8Q6J88k37J71l3L2j55N0K7k81L84k63j06k30O19m30N23
4539B67K1j79j68j14L40m81jM25j99k3J0R4k00L2J11o6J39p3p1L8J82L8j6l7j69
4564a00K22k29o9M98m27J80l31K32P0M5q3l1R1l34O29m02J28o8O2j53K2j61J97
$$ y = [62, 322, 61, -3, -252, 55, -157, 104, -31, 96, 267, -211, 95, -121, 141, -127, -231, -318, -54, -75, -170, 29, -240, -16, -374, -312, -173, 117, -7, -306, -196, -268, 41, -150, -181, -79, 54, 117, -229, -226, 72, 28, -10, 108, -75, -440, -146, 282, -55, -110, -143, -208, 40, 68, -115, -253, 51, -133, -40, -92, -84, 113, -55, 35, -142, 269, -178, -88, 80, 146, 104, 155, 165, 140, 241, 97, 279, 225, -179, -146, -151, 103, 303, 45, 137, 43, 6, 88, 49, 98, -66, -128, 254, 176, 15, 339, -78, -126, 216, 108, 339, 146, -127, 63, -74, 212, 114, -289, 172, 267, -221, 9, 224, 11, 162, 36, 81, 59, -107, -101, 13, -40, -78, 8, 196, -41, 130, 97, 129, -26, 24, 51, -230, 154, -109, -215, -445, 174, -256, 267, 288, 109, -59, -173, 167, -314, -315, 110, -89, -112, -102, -8, -208, -176, -65, -131, 8, -65, -136, -98, 84, 122, 106, 69, -100, 122, -107, -176, 322, -105, 75, -256, -24, 46, 91, 8, -23, 68, -266, 363, -39, 89, 21, 83, -70, -48, -209, -12]
4587a2N4J43p4r1mNmP2Q7j26k8J91l41L00j09k95J90J31k73o8M41j28J6q9l33
4612c45L15K92k87Q3J38m0k93L30K60k80j3k71O4K4J90k51P9K35q1O5o2q0j1M7
4636A08j11m4K20k83L7J62n7P4j33J61j17N0j42%K7j07k38L56J37k63L9r8L14
4659I2l82J68K13k56J92l34K99ql8J12j9j46m02M35K32k45k82Q6K04J62m1Q6k82
4682a54J07J7M9k11K31j96J43J03j12JJ4m5o9k64L68j01l9J35j91R1j84M22o7
4705D8k2n5l9l27M10P1J7J5K51o74M09j72L25j39j02N4k00L48P7l57K28q3l49
4728b66K48R0k45j64N05k10J9P0Qk27N6Q8O4n3K28j98K98l78J28k00P3K63j22
4751G5nj55M4K32l03K00O8j23J57j99K03j15J14l41q3O18J23l94p3j59M68m87
$$ y = [-12, 42, 185, 111, 20, 16, 21, 17, 89, 176, 50, 22, 213, -128, 172, 63, -232, -42, 89, -184, -252, 189, 61, 77, -12, -345, -30, 262, -25, 58, 196, 156, -137, 193, 453, 173, 160, -111, -47, -23, 167, -84, -5, 230, 149, 214, 152, 72, 61, 108, -3, -47, 173, -110, -73, 89, 32, 106, -27, 134, 17, 67, -75, -75, -48, -155, -393, -37, 100, -163, -124, -222, 92, -290, -122, 91, -165, 27, -307, -8, -16, -54, 58, 39, -107, -509, -74, 158, -87, -369, -283, -79, 83, 42, 128, -154, -47, -30, 19, -192, 39, -157, -14, 89, -23, -22, -8, -53, -122, -386, -18, -119, -158, -23, -214, -123, -307, 115, 48, 26, -29, -68, -395, 15, 86, 103, 118, 369, -305, 104, -68, 257, 118, 16, 70, -130, 218, 295, -62, 166, 83, -266, -18, 72, -173, -337, 168, -42, -23, 47, 55, -172, -116, -28, 36, -17, 211, 13, 311, -67, 61, -139, -66, 197, 75, 70, -85, -41, 191, -112, 88, 156, 33, 190, -9, 194, 79, 193, -148, -231, 387, 510, 116, 43, -116, 352, -135]
4773a35J60K71o18L59j29K60r8l7j47J40k48K85r0j32K2j1O9J61l22K18j01MK60
4796A41l01J7J62R5j97q0K92o3j91k4P6N0p0Q7J32k21J21kq8K34k54K28L1k62
4820h7K51l61J18J06l4Q0k65L72k2J80J7l07j96N8J44p0k69J88L1l5J43o9K94
4843B67l9k52no2J68j01P0o0k5J51l20P4J22K64l1j18l4k2O2l09Q4k1L27N8m56
4868b08L36j26Q2j93J71k4J13k43J52N5J42k48j4J92j47o6q0K84m1m9nj13j19
4891a49m0K48J15n14K09K61%k4q2K90l83M02j80k46M8J88k1o4J79k7j44O2k08
4914h0L20m1r5K1p6j62R3j96J23J26k76J85J43j25j13k28K17M05k62J25k12Q7
4936b1J57j4l35MK47j80J88k38j53K7M9L89M9j42p6R4l9j25k2J59K08K08k67k30
$$ y = [-135, 25, 296, -322, 37, -92, 168, 70, 33, -114, 26, -222, 63, -27, -159, -137, -148, -79, 82, -240, -22, -123, -119, 141, -160, -143, 19, 114, -83, -163, 129, 66, -125, -149, -73, -23, -93, -6, 126, -95, 26, 24, -64, 170, -84, 144, 175, -87, 164, -197, -79, 27, -7, 73, -192, 180, 158, 338, 355, 48, -148, -90, 54, -16, -285, -97, -66, -101, 42, -27, 267, 228, -24, -29, -91, 77, -24, 46, -14, -39, 112, -208, -134, -12, 252, 221, 103, 69, 47, 109, -200, -116, -137, 190, 248, -208, 128, 2, 84, -109, 62, 38, 151, -92, 60, 115, 257, 9, -5, 187, 40, -26, -106, 178, 137, 88, 83, -30, -149, -189, 59, 174, -340, -131, 130, 130, 106, 24, 314, -69, 333, 153, -93, -45, 143, 122, 58, 237, 210, 66, 128, -80, 240, 199, 104, 125, 49, -113, -20, -216, -93, 33, -243, -58, 85, -40, -153, -381, -164, 241, -21, 104, -108, -21, 136, 122, -213, -209, 38, -142, 46, -192, -345, -318, -269, 120, 169, 27, -49, 45, 6, -119, -141, 18, 226, 434, 167, -63]
4960f3J37Pj10k6P2K23j12l12L13k92K03k65K89M7O9j05q7jl16M70J2q9J01J4
4984A79k18l7J57j22K7K43J43k63m8k55M14k54j63J68M18l29J67n00M77l15J32
5005B1j53L18r1n1j55R1L95l51M2l0K7o3j39K03j39k00M50Rk04k16M25k45m9K12
5029A07J88j37m25L17j17L71n41N30l13K55j3k18j48M31k23k41K29j09k06K82
5049A9J7j6K16m53J85l3j46J90j94J58j63Q8K99o86M67P8j70J6J55k41O3L30l65
5072a86P7M6J68j90r2L40N6j86j13j48o4p2L38j48m1J06l2j10K26P1Rj31k8l5
5096a39L08l29K69k4l45M87q6k29K73k82J93o5N3q9k32L47q0pj53K29l42KR0K16
5120F5J99k76M96l12R2r6j81m5N9J75k02J16k95M0K70k2j94K45j53P9j30K72j43
$$ y = [-63, 74, 81, -29, -55, 17, 240, 128, -184, 129, -163, 40, -225, 64, 111, 180, 75, -12, -13, -329, 141, 153, 64, 165, 179, -39, -76, 81, -41, -14, 229, 372, 109, 61, -194, 220, -34, -197, -29, 389, 60, 227, -273, 204, -111, 21, -132, 186, 95, 44, -111, -20, 375, 24, 66, 36, 63, 0, -139, 64, -75, -275, 175, 184, -20, -236, 189, -56, -105, 107, 295, 158, -267, 50, -67, 304, -237, 293, -20, 235, 222, 4, -144, 287, 64, -177, 52, -57, -263, 19, 36, 20, 236, -217, -32, -65, -211, -21, -215, -57, -220, -132, 167, -519, -52, 26, -144, -128, 27, -214, -151, 179, -186, -109, -63, 105, -85, -177, 163, 219, 33, -80, -228, -292, -364, -26, -174, -215, -109, -141, -251, -25, 46, 55, -76, -104, -139, 169, -160, 109, 85, -260, 227, 141, -88, 185, -97, 96, 31, 84, -5, -237, 110, 30, 23, -130, 99, -243, -241, -151, 65, 264, -12, 484, 172, 264, 168, -13, -58, 1, 176, -26, 90, -205, -165, 105, 83, -111, 134, -19, 60, -70, 202, 59]
5143E9J30k62j30J62o6J70K82k54j7j27K03L8j57J07k38M47m96j9P6L5K23j59
5165Gl1L0J08N9j52L14l34N3M8n41L53M52j67k56J11j36j35K48j29M15l23k12
5187b18J16R9j82j19P11k42j93j1j20L70k79l3K24O8o0j46j42J61k67J58j58K11
5209e2r1K85l8k78L31j93J3Q2K7j73J13k05J82m6l5j7N44l33l47M80l54N4j80
5232b31J93N0k49J02K5L1J2K76k28R5j84K04M6Q8m90K90K39k95J40k33J9j5P7
5255c8m0L19K2m0n17L68J70k99l2K79k84K5J25Q4k6k27J68J3rJ99j37J41Lm01
5279a34L83K5j78M6j43K68k7k72K07OM7j03j09r6K94q9l10J58J06j43J22nj1K4
5303F6l92L53j8J95m5Q0l94J78N5k95K34j15J84l32K02K93k92k43J79K06o4q9
$$ y = [59, 189, -73, -203, -41, -107, 63, 345, 91, 74, -53, 150, 188, 31, 138, -100, 347, -149, -168, -92, -57, 166, 7, -24, 6, 114, 173, 21, 335, 1, 54, 102, -439, -86, 366, 199, -57, 54, -82, -217, 31, -98, 317, -6, -218, -102, -3, -185, -304, 407, 165, -28, -39, -159, 211, -68, -101, 123, 191, 131, -15, -157, 4, -263, -105, -263, -52, -143, 142, 104, -174, 157, -36, -23, 59, 86, -87, 26, -179, 3, -43, -78, -95, 449, 116, -231, 249, -105, -51, -231, -38, 12, -237, -135, -110, -79, -67, 209, -19, 76, -108, 96, 142, 230, -260, 30, 269, -26, 114, -119, -100, -115, -38, -78, 241, 263, 223, -294, 74, 244, -55, -87, 192, -92, -67, 58, 142, 116, -111, 57, 70, 61, 260, 123, 264, 267, -134, 249, 274, 96, 142, -1, 267, 240, -32, 175, 181, 228, 125, 16, -80, 214, 125, -185, -27, 79, -64, 58, 53, 42, 66, -326, 27, 9, 204, 159, 239, -155, 23, 78, -217, 17, -98, 86, -246, -44, 249, -43, -286, -107, 99, 35, -54]
5325e4k39L07q4K9M3k3j15Q4RJ55j43j72K25k09J58J86l59J38k91M77j61Q0O6
5348A07l75K54k60L25P6J57n17L69m69M09o5J50L8k01K01k24M0L8q4J41j02J10
5370A18j47K04k1j92Q6j9p8K50k45k45N67j89j49J04O9l4o4j99J93K43n22J87
5392h3K62J21q3m65J52k6J6j8P8l4L83o2l58O9J03l46O9J85l7J50N5j19k19L75
5416A68Q9m53K32K52m29L33k3J28k33O6j51r8L1K40j56m3J25l1k20O4J83p4N2
5439E2k2k49K10n0J45j12J08k58J66Q7p0M2k2L9j47P6n9J85l89J82L31j91j53
5462i9o6m4R0K38k17l3J65j80Q7j83L08r6J18O3j48M9N7j95K78k58K51l84K91
5485I2m06K99k8R7k06j73M47j04K95l7l81J05j24J1K90k31J10K18m01Q1qJ88m6
$$ y = [-54, -293, 14, -70, -41, 2, -21, -136, -52, -43, 112, -31, -203, 22, -187, -29, 157, -202, -64, -355, 122, -39, 41, 107, -268, -14, -274, 51, 127, 284, -233, 136, -333, 76, 11, 161, 199, -2, 199, -25, 15, 53, -31, 110, 8, 118, -29, 175, 154, -38, 48, 29, -49, 201, -44, -289, 278, 89, -60, 44, 113, 79, 15, -184, 9, 252, -270, -83, 179, 300, 217, -248, -96, -122, -106, -124, -46, -80, 303, 241, -117, -48, 55, -291, -222, -37, -74, 76, 131, 12, -207, 168, 257, -196, 36, 288, -141, 192, 169, 297, 64, 130, -21, -119, -88, 152, -4, -47, 78, 47, -173, -109, 74, 0, 52, 30, -219, -9, -59, 86, -26, 82, -176, -10, 77, 7, 49, 27, 66, -81, -5, -64, 121, -268, -86, 245, 54, -99, -165, -209, -119, 119, -98, -131, 34, -146, -59, -242, 66, -30, 88, 151, 3, 52, 109, -86, 192, -66, 185, -199, 92, -314, -15, -43, 54, -152, -325, 122, 18, 313, 276, -105, 0, -124, -113, 177, -54, 56, 274, -127, -46, -54, 134, 88]
5508H8l17L21J20j10J66k40k07K67j64o3m6J06L77l85M35j84k26J83j51J44k29
5529a15j01J70o0n6N7J27j95J38J81J03j4k17l3k11L64j96N84p19J98j17J88J03
5551A79l16J82j62J39J43n7p6K54l8k86k5L56k33k02K80k59K5M31l30K9j71M7
5573i0q1J33J14j68K02k18j25J40k39L14p5J77M6J42k77J45o10P98n81j07O4M5
5595b51J6mL78k31K29n2j82P1rJ02l34J63L6j48J1k43M36o6K15ll9p8J86k21O4
5620D6O4j15K20k07P9J07j41q3J33k49O5M4P9Oo3j66L52K18j92j98P0k43K89J96
5644C11k70J46l76K52j85L05j26m0N6j81M05j32nk98L8k26K38P3L10k45O4K13
5666C27k58k00k13N19l02o7o4P0L34K00k12j60R6j64j44L00j54j11R5K14jp5m9
$$ y = [88, -229, 92, 212, 102, 268, 28, -179, 88, -76, -139, -185, -79, 298, -87, 348, 164, -62, 121, -30, 114, -115, -216, -46, -106, -162, -105, 22, -173, -35, 146, 249, 235, 18, -15, -226, 138, -58, 526, -193, 5, -112, 76, 179, -137, 45, -117, 22, 165, 108, 32, 286, 248, -38, -63, 293, 60, -142, 138, -121, -96, 335, 5, 34, -137, -90, -171, -38, 76, -92, 110, -108, -233, -93, -332, -18, -93, 84, 130, 272, -5, 140, -470, 328, -253, -360, -296, -251, -235, -239, 139, -92, 137, 85, -97, -26, -35, 67, -267, -104, -68, -216, -205, -448, -12, -78, 137, 134, 95, 17, 203, -18, 46, 110, -5, 215, 8, 87, 194, 53, -30, 103, -146, -81, -37, 42, 48, -15, -181, 171, 389, 197, -1, 69, -174, 115, 311, 41, 187, -189, 63, -122, 183, 57, 17, 73, -108, 297, 165, 160, -138, -100, -326, -88, -15, 295, 50, 114, 327, 69, -131, -344, 175, -127, -194, -258, -188, 146, 346, 134, -26, 70, -94, -238, 62, -92, -203, -108, 106, 105, 30, -19]
5689a9k3P2m8L09J7k97m1K22j19l76N83l68k56N18m60J55RL65l41J09l6R0j10
5712d5RJ16p2j57kM43l10j92P2J20Q7j26j2O8J4O2L7q4k49K60l1j07k16Q5j00
5737c30L54k25K35j55M6j34N16p7m12J18K05r4oj8O9q5j80p3P1L04j90oK39j80
$$ y = [-19, -42, 30, -18, 291, 308, 11, -30, 192, 73, -303, 280, -88, -344, 174, -286, -131, -122, 243, -98, 11, -25, 65, -45, -36, 80, 8, -149, -151, 292, -18, -210, -138, -18, 69, -57, -69, -1, 13, 75, 112, 28, -221, 39, 8, -99, -315, -230, -330, 24, -201, 34, -121, -75, -209, 307, 230, -182, -64, 141, 47, 41, 23, 92, 7, -173, -246, -175, 129, -61, -67, 172, -8]
$$ [...]
8191i2
##END NTUPLES=NMR FID
##END=
