##TITLE=1H_SR59_oil
 D2O, 8 sc, 
 14.05.2021
##JCAMPDX= 6.0         $$ Bruker NMR JCAMP-DX V2.0
##DATA TYPE= NMR FID
##DATA CLASS= NTUPLES
##ORIGIN= UXNMR, Bruker Analytische Messtechnik GmbH
##OWNER= root
$$ XWIN-NMR		Version 3.5
$$ Fri May 14 09:50:22 2021 Russian Standard Time (UT+4h)  she@DPX200
##.OBSERVE FREQUENCY= 200.131506
##.OBSERVE NUCLEUS= ^1H
##.DELAY= (6, 6)
##.ACQUISITION MODE= SIMULTANEOUS
##.ACQUISITION SCHEME= undefined
##.AVERAGES= 8
##.DIGITISER RES= 18
##SPECTROMETER/DATA SYSTEM= spect
##.PULSE SEQUENCE= zg30
##.SOLVENT NAME= CDCl3
##.SHIFT REFERENCE= (INTERNAL, CDCl3, 0, 15.7039)
##AUDIT TRAIL= $$ (NUMBER, WHEN, WHO, WHERE, WHAT)
$$ ##TITLE= Audit trail, XWIN-NMR		Version 3.5
$$ ##JCAMPDX= 5.01
$$ ##ORIGIN= Bruker BioSpin GmbH
$$ ##OWNER= she
$$ F:/spectra/data/she/nmr/H-F/1/audita.txt
$$ ##AUDIT TRAIL=  $$ (NUMBER, WHEN, WHO, WHERE, WHAT)
(   1,<2021-05-14 09:49:10.42 +0400>,<she>,<DPX200>,
      <created by zg, POWCHK disabled, PULCHK disabled
       configuration hash MD5:
       00 E9 B6 7A A2 85 ED C7 34 08 36 98 17 FE 4E 26
       data hash MD5: 16K
       E4 6C 37 E6 DE DB 86 26 4A F4 87 E8 24 A7 26 AB>)
$$ ##END=
$$ 
$$ hash MD5
$$ 83 FD 44 B2 63 29 00 78 A6 90 7E D5 AF E1 8A 78
##$RELAX= 
##$RELAX= 
##$RELAX= 
##$RELAX= 
##$RELAX= 
##$RELAX= 
$$ Bruker specific parameters
$$ --------------------------
##$DU= <F:/spectra>
##$EXPNO= 1
##$NAME= <H-F>
##$PROCNO= 1
##$TYPE= <nmr>
##$USER= <she>
##$AMP= (0..31)
100 100 100 100 100 100 100 100 100 100 100 100 100 100 100 100 100 100 
100 100 100 100 100 100 100 100 100 100 100 100 100 100 
##$AQSEQ= 0
##$AQ_mod= 1
##$AUNM= <au_zg>
##$AUTOPOS= <>
##$BF1= 200.13
##$BF2= 200.13
##$BF3= 200.13
##$BF4= 200.13
##$BF5= 200.13
##$BF6= 200.13
##$BF7= 200.13
##$BF8= 200.13
##$BYTORDA= 1
##$CFDGTYP= 0
##$CFRGTYP= 5
##$CHEMSTR= <none>
##$CNST= (0..31)
1 1 145 1 1 1 1 1 1 1 1 1 1 1 1 1 1 1 1 1 1 1 1 1 1 1 1 1 1 1 1 1 
##$CPDPRG= <>
##$CPDPRG1= <>
##$CPDPRG2= <>
##$CPDPRG3= <>
##$CPDPRG4= <mlev>
##$CPDPRG5= <mlev>
##$CPDPRG6= <mlev>
##$CPDPRG7= <mlev>
##$CPDPRG8= <mlev>
##$CPDPRGB= <>
##$CPDPRGT= <>
##$D= (0..31)
0 1.2 0 0 0 0 0 0 0 0.06 0 0.03 0 0 0 0 0.0002 0 0 0 0 0 0 0 0 0 0 0 0 
0 0 0 
##$DATE= 1620971349
##$DBL= (0..7)
120 120 120 120 120 120 120 120 
##$DBP= (0..7)
150 150 150 150 150 150 150 150 
##$DBP07= 0
##$DBPNAM0= <>
##$DBPNAM1= <>
##$DBPNAM2= <>
##$DBPNAM3= <>
##$DBPNAM4= <>
##$DBPNAM5= <>
##$DBPNAM6= <>
##$DBPNAM7= <>
##$DBPOAL= (0..7)
0.5 0.5 0.5 0.5 0.5 0.5 0.5 0.5 
##$DBPOFFS= (0..7)
0 0 0 0 0 0 0 0 
##$DE= 6
##$DECBNUC= <off>
##$DECIM= 32
##$DECNUC= <off>
##$DECSTAT= 4
##$DIGMOD= 1
##$DIGTYP= 9
##$DL= (0..7)
0 120 120 120 120 120 120 120 
##$DP= (0..7)
150 150 150 150 150 150 150 150 
##$DP07= 0
##$DPNAME0= <>
##$DPNAME1= <>
##$DPNAME2= <>
##$DPNAME3= <>
##$DPNAME4= <>
##$DPNAME5= <>
##$DPNAME6= <>
##$DPNAME7= <>
##$DPOAL= (0..7)
0.5 0.5 0.5 0.5 0.5 0.5 0.5 0.5 
##$DPOFFS= (0..7)
0 0 0 0 0 0 0 0 
##$DQDMODE= 0
##$DR= 18
##$DS= 0
##$DSLIST= <SSSSSSSSSSSSSSS>
$$ [...]
##$SUBNAM2= <"">
##$SUBNAM3= <"">
##$SUBNAM4= <"">
##$SUBNAM5= <"">
##$SUBNAM6= <"">
##$SUBNAM7= <"">
##$SUBNAM8= <"">
##$SUBNAM9= <"">
##$SW= 16.9725357007746
##$SWIBOX= (0..15)
0 0 2 0 0 0 0 0 0 0 0 0 0 0 0 0 
##$SW_h= 3396.73913043478
##$TD= 16384
##$TD0= 1
##$TE= 0
##$TE2= 300
##$TE3= 300
##$TEG= 300
##$TL= (0..7)
0 120 120 120 120 120 120 120 
##$TP= (0..7)
150 150 150 150 150 150 150 150 
##$TP07= 0
##$TPNAME0= <>
##$TPNAME1= <>
##$TPNAME2= <>
##$TPNAME3= <>
##$TPNAME4= <>
##$TPNAME5= <>
##$TPNAME6= <>
##$TPNAME7= <>
##$TPOAL= (0..7)
0.5 0.5 0.5 0.5 0.5 0.5 0.5 0.5 
##$TPOFFS= (0..7)
0 0 0 0 0 0 0 0 
##$TUNHIN= 0
##$TUNHOUT= 0
##$TUNXOUT= 0
##$USERA1= <user>
##$USERA2= <user>
##$USERA3= <user>
##$USERA4= <user>
##$USERA5= <user>
##$V9= 5
##$VALIST= <valist>
##$VCLIST= <CCCCCCCCCCCCCCC>
##$VD= 0
##$VDLIST= <DDDDDDDDDDDDDDD>
##$VPLIST= <PPPPPPPPPPPPPPP>
##$VTLIST= <TTTTTTTTTTTTTTT>
##$WBST= 1024
##$WBSW= 4
##$XGAIN= (0..3)
0 0 0 0 
##$XL= 0
##$YL= 0
##$YMAX_a= 232235
##$YMIN_a= -193379
##$ZGOPTNS= <>
##$ZL1= 120
##$ZL2= 120
##$ZL3= 120
##$ZL4= 120
##$ABSF1= 10
##$ABSF2= 0
##$ABSG= 5
##$ABSL= 3
##$ALPHA= 0
##$AQORDER= 0
##$ASSFAC= 0
##$ASSFACI= 0
##$ASSFACX= 0
##$ASSWID= 0
##$AUNMP= <proc_1d>
##$AZFE= 0.1
##$AZFW= 0.1
##$BCFW= 1
##$BC_mod= 2
##$BYTORDP= 1
##$COROFFS= 0
##$CY= 11.3945322036743
##$DATMOD= 1
##$DC= 2
##$DFILT= <>
##$DTYPP= 0
##$F1P= 15.9154993809931
##$F2P= -4.1035820241983
##$FCOR= 0.5
##$FTSIZE= 0
##$FT_mod= 4
##$GAMMA= 1
##$GB= 0.15
##$INTBC= 1
##$INTSCL= 1
##$ISEN= 128
##$LB= 0.24
##$LEV0= 0
##$LPBIN= 0
##$MAXI= 10000
##$MC2= 0
##$MEAN= 0
##$ME_mod= 0
##$MI= 1.114404
##$NCOEF= 0
##$NC_proc= 0
##$NLEV= 6
##$NOISF1= 3.799351
##$NOISF2= 2.8
##$NSP= 1
##$NTH_PI= 0
##$NZP= 0
##$OFFSET= 15.70392
##$PC= 1
##$PHC0= -11126.97
##$PHC1= 7.401
##$PH_mod= 1
##$PKNL= yes
##$PPARMOD= 0
##$PSCAL= 0
##$PSIGN= 0
##$REVERSE= no
##$SF= 200.130013532006
##$SI= 16384
##$SIGF1= 3
##$SIGF2= 2
##$SINO= 400
##$SIOLD= 16384
##$SREGLST= <1H.CDCl3>
##$SSB= 0
##$STSI= 0
##$STSR= 0
##$SW_p= 3612.71676300578
##$SYMM= 0
##$S_DEV= 0
##$TDeff= 0
##$TDoff= 0
##$TI= <>
##$TILT= no
##$TM1= 0
##$TM2= 0
##$TOPLEV= 0
##$USERP1= <user>
##$USERP2= <user>
##$USERP3= <user>
##$USERP4= <user>
##$USERP5= <user>
##$WDW= 1
##$XDIM= 8192
##$YMAX_p= 0
##$YMIN_p= 0
$$ End of Bruker specific parameters
$$ ---------------------------------
##NTUPLES= NMR FID
##VAR_NAME=  TIME,          FID/REAL,        FID/IMAG
##SYMBOL=    X,             R,               I
##VAR_TYPE=  INDEPENDENT,   DEPENDENT,       DEPENDENT
##VAR_FORM=  AFFN,          ASDF,            ASDF
##VAR_DIM=   8192,          8192,            8192
##UNITS=     SECONDS,       ARBITRARY UNITS, ARBITRARY UNITS
##FACTOR=    0.0002944,     1,               1
##FIRST=     0,             0,               0
##LAST=      2.4114304,     0,               0
##MIN=       0,             -193379,         0
##MAX=       2.4114304,     232235,          0
$$ Real data points
##PAGE= N=1
##DATA TABLE= (X++(R..R)), XYDATA
0@%%%%%%%%%%%Qj6J6j6K4l2M0m8N6p2Q8j03J19j36J59j83K08k40K79l21L63m14
$$ 0 0 0 0 0 0 0 0 0 0 0 0 8 -8 8 -8 16 -16 24 -24 32 -40 48 -55 64 -72 87 -96 112 -128 151 -170 193 -221
33b21M70n30N97o70P50q39R38j044J158j285J423j573J739j918K113k330K565
$$ -221 249 -281 316 -354 396 -443 495 -549 609 -676 747 -826 913 -1005 1108 -1222 1343
50A343k825L115l432L784m180M628n137N720o396P190q142R306j0766J2660j5217
$$ 1343 -1482 1633 -1799 1985 -2195 2433 -2704 3016 -3380 3810 -4332 4974 -5792 6868 -8349
65h349J8875k4563L4626n7506J97988M8385l21084J24037j97644R3911K53825
$$ -8349 10526 -14037 20589 -36917 161071 209456 -111628 12409 -185235 -91324 162501
76A62501o0809l5051j69635q3679J96431L9516J10079r0792j98313L8092j2643
$$ 162501 101692 66641 -102994 -186673 9758 49274 159353 68561 -129752 -91660 -104303
87a04303K00291J32073k66215N100o2248o8139K96561L224j04142n2176j68231
$$ -104303 95988 228061 -38154 -33054 -95302 -163441 133120 136344 32202 -19974 -188205
98a88205J49547J05678q40P8952k31128q0539J55837K2337J35823n0281j76540
$$ -188205 -38658 67020 66180 145132 -85996 -166535 -10698 11639 147462 97181 -79359
109g9359L730m3986J50453J41897j38907m4772r5072j4135J80013J2816K4924
$$ -79359 -75629 -119615 30838 172735 33828 -10944 -106016 -120151 59862 72678 97602
120I7602r3480j78321J37286O2165L1773R5325j90816p9798O4770K3379J60427
$$ 97602 4122 -174199 -36913 25252 57025 152350 -38466 -118264 -53494 -30115 130312
131A30312l1425j33237j6148p1395J08618J29148n5865l5585j20239j3082J36095
$$ 130312 98887 -34350 -50498 -121893 -13275 115873 60008 24423 -95816 -108898 27197
142B7197K0385N9806p1571j63090O8046M4512O9106Q2026j40147o2863q660J1360
$$ 27197 47582 107388 35817 -127273 -59227 -14715 54391 136417 -3730 -66593 -75253 -63893
154f3893J60429q608q4301l6813q5892R3135J01856j4117l995j29390l2829J03403
$$ -63893 96536 87928 3627 -33186 -119078 -25943 75913 61796 57801 -71589 -104418 -1015
166a015K8803P8077m7840j38288J6306J1406Q7309Q2568j00917m8163m5815K880
$$ -1015 27788 105865 58025 -80263 -63957 -52551 34758 117326 16409 -31754 -77569 -74689
178g4689J39414O288l6131m9424r7054P6583P8560J9576J7726j24469m6203N8653
$$ -74689 64725 71013 34882 -14542 -111596 -35013 43547 63123 80849 -43620 -89823 -31170
190c1170L4821R2717l3309j04981j4168j6566Q7783P6480n9532l6294p1258k98
$$ -31170 3651 96368 63059 -41922 -56090 -72656 15127 91607 32075 -4219 -75477 -75775
202g5775J14557J9910J913n6126r9625M9159N6661M7527K9304j05597m9206J6014
$$ -75775 38782 58692 60605 4479 -95146 -45987 10674 58201 87505 -18092 -67298 -51284
214e1284L3026R6347j7500p4003l3157l2029P8185P0740k2551l0519q1970q775
$$ -51284 -18258 78089 60589 -13414 -46571 -78600 -415 70325 47774 17255 -64715 -73490
226g3490Q2156L8963K7884n7374q6720J6771L1167O7650L4265q2621m2236j6024
$$ -73490 8666 47629 75513 18139 -68581 -51810 -20643 47007 81272 -1349 -43585 -59609
238e9609K4721R5722L58n2601m3041m1925N6930P2423P564k9087p5079k3288M5429
$$ -59609 -34888 60834 61192 8591 -34450 -76375 -19445 52978 60542 31455 -43624 -66912 -21483
251b1483N4027M1099m6821o7765j3376J3635P4272L7250n4782m1740l6556J8897
$$ -21483 32544 73643 26822 -40943 -54319 -40684 33588 70838 16056 -25684 -62240 -43343
263d3343Q4886J9158k9606m9466n0971L4115O4494K9507j4215o6483l9030K2784
$$ -43343 41543 60701 31095 -18371 -69342 -35227 29267 58774 44559 -21924 -60954 -38170
275c8170N3090M6016k2994n7882l5519Q252O5053M1371k1215m6263n1304J2135
$$ -38170 14920 60936 37942 -19940 -55459 -47207 17846 59217 38002 -8261 -59565 -47430
287d7430O5554L4622l877n0660n6804J3986N1299M0566K805n3781n0026P063M7712
$$ -47430 18124 52746 48869 -1791 -58595 -44609 6690 47256 50061 -3720 -53746 -46683 1029
300A029M6278R24m8651n0245L81M9922M7667N073m3950n4075n547M5231M8501
$$ 1029 47307 48231 -420 -50665 -50284 -362 47305 52378 8428 -45647 -51194 -5963 42538
313D2538Q854m0109n3361j0852M3624M6981J0803l4967n5220j1043M0871M7434
$$ 42538 51392 11283 -42078 -52930 -9306 37675 48478 13511 -41709 -52752 -11881 35553
325C5553J8632l6363n4131j4215L0732N4663J9265l5313m5797k5969K9031N6685
$$ 35553 54185 17822 -36309 -50524 -19792 34871 54136 18823 -26974 -52943 -23912 32773
337C2773J2839k3173m7985l1413L5783M7317K1482j7432n7640k3448K5491M5020
$$ 32773 45612 22439 -25546 -56959 -21176 26141 47623 30191 -27449 -50897 -25406 19614
349A9614L5717k6489m8766k4328Q560N6391K8803k4976l4758m0855J5386N6689
$$ 19614 55331 28842 -19924 -44252 -35692 20699 49502 24526 -10232 -51087 -35701 20988
361B0988J9687o463m5474m2033K4277L8384L5963l296n5988k6303N017L7040M9037
$$ 20988 40675 34212 -11262 -53295 -29018 9366 45329 42033 -13955 -40258 -35241 1799 50836
374E0836j8613l8836k9356r826N4036L3827j1951k5995n0014N143M8082K5027
$$ 50836 32223 -6613 -35969 -45795 8241 42068 30117 4122 -45892 -40749 7333 32360
386C2360J2815m2682m6285J1888K3717M5778R071m9732k5429j2313K8822N4296
$$ 32360 45175 2493 -43792 -31904 -8187 37591 46662 -3070 -28499 -40812 -11990 42306
398D2306r019k6835l4827k1966M8109L3545M377j6099n7363k958L4817K6490K8732
$$ 42306 33287 6452 -28375 -50341 -2232 31313 35690 19591 -37772 -40730 -5913 20577 49309
411D9309l6228m4647p09J0023M9796J7496l8987k3196k6789K2042N4252l18j0557
$$ 49309 13081 -31566 -32275 -22252 27544 45040 6053 -17143 -43932 -21890 32362 32044 21487
424B1487m0162l2076M1065K6145K0729m677o0445p707J8358K3780M2709k9774
$$ 21487 -18675 -50751 -9686 16459 37188 32511 -27934 -35641 -17283 6497 49206 19432
436A9432l9970q809l729N0941K3528k5320k1491l8650J7287M5583Q684Q566m5457
$$ 19432 -20538 -29347 -33076 17865 41393 16073 -5418 -44068 -26781 18802 27486 36052 -9405
449i405l6374L1641J3826L4433N847n9479q859L068K0021N0008k0958l1375j9337
$$ -9405 -45779 -14138 -312 34121 39968 -19511 -28370 -25302 -5281 44727 23769 -7606 -26943
462b6943j2444M8204K3624o463j7279n0041J2329L5242J3473K3114m2713l6900
$$ -26943 -39387 8817 32441 25978 8699 -41342 -29013 6229 19702 42816 103 -36797
474c6797J7459O677M2883Q965m7186j1626j5704K4421M8538j4946j2041l2258
$$ -36797 -19338 -12661 30222 39187 -7999 -19625 -35329 -10908 37630 22684 10643 -21615
486b1615k4485N0011J7972N075m718n4898R99K7321J8333K6793l2774l2592j860
$$ -21615 -46100 3911 21883 26958 22240 -32658 -31659 -4338 13995 40788 8014 -24578 -26438
499b6438N648M7250O295k6020j5487l5253L0582M2592j1888Q551l8045l5546M4691
$$ -26438 -20790 26460 32755 6735 -8752 -44005 -13423 29169 17281 25832 -12213 -47759 -3068
512c068J6037J3009J968m9744q243J4275K3217L0857k3738k6973j6570J894M6584
$$ -3068 12969 25978 27946 -21798 -30041 -15766 7451 38308 14570 -12403 -28973 -27079 19505
525A9505O674q642j4824m6616K5154L7786l623J5108l4770l4325K4917J4968K8005
$$ 19505 26179 17537 2713 -43903 -18749 19037 15414 30522 -4248 -38573 -13656 1312 29317
538B9317j010m2893o690m074K3451L8509j8872j8256k3900q900M4926J0553j345
$$ 29317 28307 -14586 -21276 -25350 -1899 36610 17738 -518 -24418 -33318 11608 22161 20816
551B0816r687m5476R571L0497J1939J3619l3086k3518N582P120M2297k57l6215
$$ 20816 11129 -34347 -24776 5721 17660 31279 -1807 -25325 -19743 -12623 29674 29417 -6798
564f798o640j6516K1355L7894j0059q461k9335j6483L7972J3458O607p962m0139
$$ -6798 -13438 -29954 -8599 29295 19236 10775 -18560 -35043 2929 16387 22994 15032 -25107
577b5107Q69J6013K2592K0099l2656j8565l273q26M2535P528k4551j2756k3374
$$ -25107 -24238 -8225 14367 34466 1810 -16755 -20028 -20854 21681 29209 4658 -8098 -31472
590c1472K0125L0789j215J323l2722j9600K7370J3446J7565p883l5443k392K262
$$ -31472 -11347 19442 18227 19550 -13172 -32772 -5402 8044 25609 17726 -17717 -20109 -17847
603a7847K4438K7653k5609j7532j1167l543L6830J0771r714j5848k9114J5838
$$ -17847 6591 34244 8635 -8897 -20064 -23607 13223 23994 14280 -1568 -30682 -14844
615a4844K4859O900O813l0889j9829J3687J2689K6659n615l0221o440o181K2273
$$ -14844 10015 16915 23728 -7161 -26990 -13303 -614 26045 20430 -9791 -16231 -22412 -139
628a39K8707j3670j5020j9156n129L0269J2017J579j4773l1013Q886J7906J4840
$$ -139 28568 14898 -122 -19278 -24407 5862 17879 19458 4685 -26328 -17442 464 15304
641A5304J0749k7956j7948K487Q962L0996j63k3928j0601j2345J8993K6996m396
$$ 15304 26053 -1903 -19851 -17364 -8402 22594 22431 -1497 -12098 -24443 -5450 21546 17150
654A7150r435k3699q966K3655J4315Q655j2258k8686MJ1379K0127J3717k1630
$$ 17150 7715 -15984 -24950 -1295 13020 21675 9417 -19269 -19265 -7886 12241 25958 4328
667D328j6752p457O496L0471L955j4351j4060j8111J6028K4081K642l327k4839
$$ 4328 -12424 -19881 -13385 17086 21041 6690 -7370 -25481 -9453 14628 17270 13943 -10896
680a0896j3818J6914J5426J3701p496k5417p745N973K1047J5561j3019j5563j5274
$$ -10896 -24714 -7800 7626 21327 13831 -11586 -19331 -13358 7689 23250 10231 -5332 -20606
693b0606M561K6765P366m865j5814k1475J1637J8961R375K522k3978j5978R383
$$ -20606 -16045 10720 18086 13221 -2593 -24068 -12431 6530 15905 18427 -5551 -21529 -12146
706a2146J3370J7938j876k2237j1989L63J8398J7580m394j5026j8103N92K0212
$$ -12146 1224 19162 17286 -4951 -16940 -16577 1821 19401 15007 -19 -18122 -17530 2682
719B682J2525K519j6470k0921M851J3277J5900O189k0979j5516O93J0076K1452
$$ 2682 15207 17726 1256 -19665 -14814 -1537 14363 20552 -427 -15943 -15250 -5174 16278
732A6278K205j7536j3601n576J3782J9602K048j2488j8316m490J3293J6459P540
$$ 16278 18483 947 -12654 -18230 -4448 15154 17202 4714 -13602 -18092 -4799 11660 19200
745A9200j3967j8409l032Q595J8556Q868j4360j5938o348P781K0239P170j1093
$$ 19200 5233 -13176 -16208 -7613 10943 19811 5451 -10487 -16835 -9054 11185 18355 7262
758G262j6221r191R242J8134Q440q241j7940q874P779J6510J1176p976j7651r228
$$ 7262 -8959 -18150 -8908 9226 17666 9425 -8515 -17389 -9610 6900 18076 10100 -7551 -16779
772a6779N712J6890J1694o450j6765j1051M974J6485J1848m342j6619j1982M257
$$ -16779 -11067 5823 17517 11067 -5698 -16749 -11775 4710 16558 12216 -4403 -16385 -12128
785a2128J5328J2566k806j6074j2761L166J5124J2420r50j5363j4039K293J3958
$$ -12128 3200 15766 12960 -3114 -15875 -12709 2415 14835 13885 -1478 -15517 -13224 734
798G34J3614J10j5044j3535L23J3350J4481J28j3260j4038j522J3315J4501J171
$$ 734 14348 14458 -586 -14121 -13798 -448 14033 14161 901 -13137 -14659 -1344 13157 14328
812A4328j1442j5640k073J2924J3099M067j1553j6152j686R998J4949M951j2299
$$ 14328 2886 -12754 -14827 -1903 11196 15263 3710 -12442 -14128 -4130 10819 15770 3471
825C471j3671m787R387J6455L684r505j3635p414J0725J4444M799o608j6286o070
$$ 3471 -10200 -14987 -5600 10855 14539 5034 -8601 -16015 -5290 9154 13953 7345 -8941 -15011
839a5011R132J2705Q887q445j5493n297N084J5107Q922q908j2066r100N058J6623
$$ -15011 -5879 6826 15713 7268 -8225 -13522 -8438 6669 15591 6683 -5383 -14483 -9425 7198
853G198O038m352j3100j1109P140J2604Q611j797j6469q402M603J0724J3114m829
$$ 7198 13236 8884 -4216 -15325 -8185 4419 13030 11233 -5236 -13638 -9035 1689 14803 9974
867I974j3942p471k16J4584J0853m655r801j2281J456J4511Q044O67j1595j3571
$$ 9974 -3968 -11439 -11655 2929 13782 9127 -674 -12955 -11499 3012 11056 11723 128 -13443
881a3443L445R554J1594J753j4248r218n38Q802J4839j666j0309r402m778J2730
$$ -13443 -9998 -444 11150 12903 -1345 -10563 -11101 -2299 12540 10874 565 -8837 -13615 -885
895h85J1482j1o652j4446k339J1564R086N247r856j3393n60N872J3515M668j1197
$$ -885 10597 10586 3934 -10512 -12851 -1287 7799 13046 3190 -10203 -10763 -4891 8624 13292 2095
910B095q908n320O064J5866J197o663r913q354R843J0953M090l777j4542m498
$$ 2095 -6813 -12133 -6069 9797 10994 4331 -5582 -13936 -4093 6860 10950 7173 -7369 -11867
924a1867O601R638R259p754j2286l209J192J3817P798q277q059q264K965J4028
$$ -11867 -5266 4372 13631 5877 -6409 -9618 -8426 5391 13189 4912 -3147 -11411 -8446 5582
938E582M820k461j0827r672O246Q387Q610p95j4729m832J657Q121J3017n338j0854
$$ 5582 10402 7941 -2886 -12558 -6312 2075 10685 9890 -4839 -9671 -8014 107 13124 7786 -3068
953c068n221k327J2055J0064l936p499j0377P43J1071O827K504j1104j0533L282
$$ -3068 -8289 -10616 1439 11503 7567 68 -10309 -9566 1505 8332 10836 -268 -10801 -7519
967g519N418J1143K421j3107n749j685O009J3726j603q248p342n031J0262R369
$$ -7519 -2101 9042 11463 -1644 -7393 -9078 -3069 10657 9054 806 -6536 -11567 -1305 8064
981H064J208n448j2846n88P867P094O433r093j0960M68K839J1592M823r403p127
$$ 8064 9272 3824 -9022 -9610 -1743 5351 11784 2691 -8269 -7801 -4962 6630 11453 2050 -5077
996e077n057N114J2415J530m244r530o791Q211P762N027k661j3109k713M777O884
$$ -5077 -10134 -5020 7395 8925 4681 -4849 -11640 -3429 4333 9360 6699 -6410 -9123 -4346 2538
1011B538R148o598r966l344R63J1386N909n106o800q501L474J1102L294j66r539
$$ 2538 11686 5088 -4878 -8222 -7259 4127 10036 4930 -1870 -10371 -6897 4205 7499 7333 -2206
1026b206q311M997P030P263m52j1458m539P14O866R973l105q048o088j504J0453
$$ -2206 -10517 -5520 1510 8773 8321 -3137 -7676 -6962 -96 9877 6772 -1276 -7364 -8868 1585
1041A585O437j050n705j0266P94R178N478K191q111q353R00N002R458J527r170
$$ 1585 8022 6972 1267 -8999 -8205 973 6451 8642 531 -7822 -6922 -1920 7538 9065 -105
1056a05n774k494O085J0264n06n454p835l742Q508P094J424l702j0355j884O485
$$ -105 -5879 -8373 -2288 7976 7470 2016 -5819 -9561 -1053 6041 7465 3763 -6592 -8476 -1991
1071a991O715M561o572q548j446K985R525L906o412o449m894M286R562J961k201
$$ -1991 4724 9285 2713 -5835 -7281 -4296 5229 9135 2723 -3726 -8620 -4334 5228 7189 4988
1086D988q590o014O106O698M415k091r782l421L161P026O279l768q189m033J017
$$ 4988 -3602 -9616 -3510 3188 7603 5512 -4270 -7691 -4530 2496 8775 5007 -3182 -7215 -6198
1101f198Q865N216k923o338p064K562Q055M157L80p903o664L003N414O418K21
$$ -6198 2667 7883 4960 -1378 -8442 -5880 2175 6332 6712 -1191 -7855 -4852 562 6980 7201
1116G201r299m365L69N834P860j374o844n435j081P349O189L2n481p779L43O015
$$ 7201 -2098 -6463 -6094 -260 7600 6226 -618 -6053 -7134 215 6404 6436 955 -6824 -6481 -466
1132d66N948K351p184o490j26L768Q110J536o822n211k560M733Q179M93m254o497
$$ -466 5482 7833 649 -5841 -5967 -2199 5911 7447 625 -4586 -7146 -2413 5766 6259 2005 -4492
1148d492l053N590O477K235l646p799k168M154O614L517m671o474k849K740P886
$$ -4492 -7545 -1955 4522 6757 3111 -4688 -6856 -2702 3912 7429 2758 -3716 -6565 -3825 4061
1163D061K820l709n767m884L770P255K740k246o608m873L815O035M004j647p094
$$ 4061 6881 3172 -2595 -7479 -3709 3546 6286 4040 -2568 -7441 -3626 2409 6413 4766 -2328
1178b328m234K041O443M667k066o089m956J555O664M187j252n332n659J491O136
$$ -2328 -6562 -4521 1922 6589 4523 -1566 -6522 -4967 1697 5884 4632 -700 -6359 -4868 1268
1193A268M095J39o104n348J229N141N446l69n964m974J25N409N327j48m952n489
$$ 1268 5363 5502 -602 -5950 -4721 420 5866 5497 -467 -5441 -5316 93 5420 5272 320 -5169
1209e169q45N659N384N41m602n975q22N124N297J106m524n955j026M249N925J418
$$ -5169 -6014 -355 5029 5570 968 -5007 -5829 -705 4592 5698 1174 -4781 -5807 -1558 4367 5785
1225E785m201n673j850M162N767J297l160n740k124L715N416K333l107o073k456
$$ 5785 1584 -4089 -5939 -1777 3990 5287 2127 -3613 -5737 -2022 3394 5727 2620 -3453 -5909
1240e909L276N696K706k858n614l084K661N765K826k326n540l350K342N874K976
$$ -5909 -2633 3063 5769 2911 -2703 -5787 -3126 2639 5465 3139 -2401 -5751 -3409 2465 5441
1255E441j930n276l817J835N532L595j519n017m142J220N315L987j120n220m056
$$ 5441 3511 -1765 -5582 -3747 1785 5380 3861 -1156 -5298 -4078 1237 5224 4104 -1116 -5172
1270e172J217M819M140p47m871m177L19N189M048k08m486m771l0M696M809l93
$$ -5172 -3955 864 5004 4257 -614 -4791 -4472 717 4765 4557 71 -4700 -4730 -34 4775 4382
1286D382m234m699O9L961M585P82m310m794l66L514N088Q15l784m727j289L806
$$ 4382 148 -4551 -4482 -521 4064 4846 536 -4258 -4624 -1110 3978 4793 1009 -3718 -5007 -1201
1302a201M908J331l802m870j460L532M671J556l085m800j662K995M883K066l153
$$ -1201 3707 5038 1236 -3634 -5094 -1562 3109 4665 1580 -3220 -4882 -1887 2996 5062 1909
1317A909m523k231K367N146K231k826m415k545K306M795K255j807m539k916K206
$$ 1909 -2614 -4845 -2478 2668 4899 2073 -2342 -4887 -2581 2214 4469 2662 -1877 -4793 -2587
1332b587M484K669j491m904k831J672M630L065j695m533k752Q18M542L020q37
$$ -2587 1897 4566 3075 -1829 -4660 -2988 1642 4707 3012 -1521 -4273 -3455 1087 4107 3270
1347C270l969l914J182M260K951j74m343l484Q61L866L396m5m181l692L89L795
$$ 3270 -699 -4613 -3431 829 3780 3606 -737 -4221 -3360 506 3902 3857 -324 -4016 -3627 168
1363A68L480M45l801m200K3L953L262P26l452m395q2L351L596J208l499m077l36
$$ 168 3648 4093 292 -3908 -3885 68 3330 4056 604 -3791 -3873 -522 3074 4282 783 -3294 -3630
1380c630K494M129J140l065l986j026K797L867J233k454m559j035K945L388J845
$$ -3630 -1136 2993 4133 1068 -2918 -3944 -1147 2720 3953 1499 -3060 -4095 -1150 2238 4083
1395D083k325m512j230K405L685K068k161m273j740K104L825J934j615l972k441
$$ 4083 1758 -2754 -3984 -1579 2106 4174 2013 -2260 -4000 -1896 1929 3863 2248 -1724 -4165
1410d165J978M091J886j428l831k530J749L639K595j307m004k304Q63L780K743
$$ -4165 -2187 1904 3790 2362 -1469 -3999 -2250 1389 3984 2677 -1327 -3631 -2768 1012 3755
1425C755r80l639k914R43L883K200m29l413l216P13L690K790l38l153l306P5L402
$$ 3755 2775 -864 -3778 -2835 1048 3248 2819 -594 -3810 -3097 593 3383 3045 -108 -3414 -3339 63
1442F3L057j9l210l175J93K807L432j08k858l178m74L220L133L41k709l402n62
$$ 63 3120 3101 -109 -3284 -3091 -284 3148 3040 182 -2996 -3470 -250 2883 3224 515 -2887 -3449
1459c449K766L458Q28k840l411r49K560L711O46k424l108j393K415L417J137k107
$$ -3449 -683 2775 3603 763 -2648 -3597 -1037 2674 3320 896 -2212 -3605 -1190 2227 3364 1257
1475A257l450j214K072L523J226k025l229j742K049L351J660j758l429j691J391
$$ 1257 -2193 -3407 -1335 2188 3414 1389 -1840 -3582 -1533 1818 3478 1720 -1709 -3400 -2009
1490b009L525J694j383l053k473J514L496K081j312k935k693K287K674J874r64
$$ -2009 1516 3210 1827 -1226 -3699 -2185 1311 3392 2080 -855 -3548 -1261 1413 3287 2323
1505B323l358j963N78L337K241q56k666k570K75L246K405l47k973k537L93K858
$$ 2323 -1035 -2998 -2420 917 3158 2302 -364 -2934 -2659 587 2992 2645 -328 -2865 -2472 386
1521C86K483p8k868k894K26K530K927J02k726k770l27K723K795K62k376k893n01
$$ 386 2869 2791 -77 -2971 -2745 -215 2712 2814 88 -2682 -3009 -286 2509 2771 395 -2498 -2999
1538b999K521L095J23k156l052m30K294K811P20k177k734j130K253L126O41j802
$$ -2999 -478 2617 2740 584 -2468 -2898 -604 2207 2927 750 -1984 -3114 -861 2265 2906 1104
1554A104k807j372J994L129R51j755k848j536J935L053J086j465k858j749J649
$$ 1104 -1703 -3075 -1081 2048 2999 1244 -1604 -3140 -1205 1848 2934 1469 -1389 -3138 -1489
1569a489K898J420j169l151j471J420K805J515r15k918j953J171K960J800r54
$$ -1489 1409 2829 1660 -1491 -2962 -1542 1263 2778 1863 -1055 -3008 -1837 1123 2923 1969
1584A969k853j989R42K827J727m57k981k014O56K884K100n07k812j904O7K757
$$ 1969 -884 -2873 -1931 896 2623 2166 -815 -2829 -2173 711 2811 2304 -508 -2412 -2345 412
1600D12K296l87k517k198N4K480K372J09k705k343K8K152K530J82k141k762j19
$$ 412 2708 2321 -196 -2394 -2340 140 2512 2621 -84 -2427 -2399 -247 2283 2465 324 -2438 -2557
1617b557K340K536L2j898k443p13K321K417L65j913k372p08K116K563M68j664
$$ -2557 -217 2319 2351 453 -1990 -2703 -382 2035 2400 487 -1885 -2593 -477 2086 2554 890
1633H90k668q30J857K507P92j704k494j082J709K617J117j560k660p86J048K610
$$ 890 -1778 -2608 -751 1756 2548 844 -1650 -2732 -1023 1594 2711 1151 -1509 -2295 -1247 1363
1649A363J261j333k490j549J370K545J345j115k586j217Q63K532J540j167k230
$$ 1363 2624 1291 -1199 -2748 -1378 1167 2512 1397 -1189 -2406 -1543 989 2529 1362 -868
1664h68j671J043K565J415p46k531j711Q68K173J983n97k310j832N40K048K067
$$ -868 -2539 -1496 1069 2484 1738 -793 -2504 -1636 537 2520 1923 -387 -2219 -1679 369 2436
1680B436n17k314k106O21K185K050m32k159j849K62K024J998q2k100k040j41K063
$$ 2436 1919 -395 -2501 -1880 305 2355 1923 -236 -2085 -1823 201 2199 2117 17 -2023 -2164 -101
1697a01K160J52j978k227k50K153J888M75j946k097n09J853K065O25j873k181
$$ -101 2059 2211 233 -1994 -2244 -91 1797 2272 326 -1771 -2280 -427 1638 2263 390 -1791
1713a791m99J568K460N62j566k313p58J731K207O51j480k132r89J506K106R62
$$ -1791 -2290 -722 1738 2300 734 -1579 -2337 -606 1601 2252 772 -1360 -2349 -843 1263 2225
1729B225j298k114r99R77K445Q66j075k306r36O74K552J368q75k455j077P79K116
$$ 2225 927 -1187 -2186 -1209 1236 2102 1027 -1279 -2215 -1541 1011 2379 1504 -951 -2028 -1249 867
1746H67J197q04j914j685Q42K142J562o14k149j613N50K031J663l27k338j505
$$ 867 2064 1260 -654 -2339 -1497 645 2207 1593 -556 -2169 -1619 412 2075 1748 -590 -2095
1762b095M26K303J371j74k092j935N22J788J940j88k155j709J70J852K008k24
$$ -2095 -1669 634 2005 1831 -261 -2196 -1674 114 2054 1866 -289 -1998 -1828 24 2032 1808
1778A808j707j991K46J598J828p4j471j912k18J666K022L59j879k093jJ392K112
$$ 1808 101 -1890 -1644 -46 1782 1708 237 -1675 -1893 -227 1795 2154 275 -1818 -1819 -427 1685
1795A685K91j575j890n38J490K228K19j260j980p07J395J980O43j214k161p01
$$ 1685 1976 401 -1489 -2027 -537 1691 1910 650 -1330 -2037 -642 1338 1981 767 -1394 -2095
1811b095J458J937O82j155j813j053J169K082Q71j251j749j224J046J964J097
$$ -2095 -637 1300 1982 827 -986 -2039 -870 1212 2083 832 -917 -2141 -1095 869 1966
1826A966o41j849j420P96J948J142q34j682j176K59K096J337o20j623j631O83
$$ 1966 1325 -524 -1944 -1148 800 1942 1108 -574 -1750 -1491 605 1942 1322 -301 -1932 -1249
1842a249J949J120n98j626j481M98J881J337m79j669j470J56K075J401l60j650
$$ -1249 700 1820 1222 -404 -1885 -1387 494 1831 1352 -317 -1787 -1631 444 1845 1485 -165
1858a65j518J88J555J533O3j758j533J42J255J642K97j457j601l90J348J887K27
$$ -165 -1683 -1495 60 1593 1656 -102 -1635 -1493 -238 1404 1701 244 -1357 -1747 -399 1488 1715
1875A715j645j558j60J279J657L45j157j983k68J387J717N59j452j647l60Q51
$$ 1715 70 -1488 -1648 -369 1288 1633 476 -1507 -1775 -388 1329 1888 436 -1211 -1571 -720
1891g20K056K86r88j858m17R34K005M28j027j628r89J072J897O29q12j789r78
$$ -720 1336 1622 634 -1224 -1641 -707 1298 1726 699 -929 -1918 -846 1051 1680 868 -921 -1899
1908a899J109J485Q95o07j801q22L96J846J143p13j578j120N92J780J034o88j594
$$ -1899 -790 695 1590 983 -818 -1640 -1244 602 1745 1032 -546 -1666 -1074 706 1740 1052 -542
1925e42j221O76J632J040k80j687j473N06J589J383j65j994r34j7J726J575p84
$$ -542 -1763 -1087 545 1585 1305 -382 -1855 -1349 240 1623 1458 -536 -1470 -1487 239 1814 1030
1942A030j178j359RJ603J212K28j377j707K10J250J649j20j390j595k02J537J764
$$ 1030 -148 -1507 -1498 105 1317 1545 168 -1539 -1329 -79 1570 1450 60 -1535 -1737 -200 1564
1959A564j21j374j335j36J288J351K54r55j813j99J191J362M44j058j630k72Q86
$$ 1564 1443 69 -1266 -1402 -114 1237 1491 536 -1277 -1476 -285 1077 1521 463 -1167 -1439 -553
1976e53J432O99j238j538l63O76J906M99q25j601p20R86J498N12n98j602p42J131
$$ -553 879 1578 340 -1198 -1561 -885 1021 1520 695 -906 -1626 -640 858 1370 772 -830 -1572 -441
1994d41J072P83m49j724n67L45J542J011p52j408j282R70J690N51l83j330j105
$$ -441 631 1414 965 -759 -1326 -981 561 1572 820 -588 -1870 -900 790 1341 958 -372 -1477
2011a477M91J434R41l45j557q97L41J384J173m93j346p91J4J284J183k23j264
$$ -1477 -986 448 1389 1044 -513 -1410 -1069 315 1488 995 -351 -1142 -1128 156 1339 1116 -148
2028a48j343M02J301J213k97j042j464M43J005R67J67j470j076J47J069J397p7
$$ -148 -1491 -1089 212 1425 1128 86 -1378 -935 70 1037 1204 -266 -1342 -1195 -126 1271 1194
2045A194j002j342k8J119J419l53p55j473j87J263R73M70j059j408n7P66J373
$$ 1194 192 -1150 -1178 -59 1360 1007 252 -1221 -1408 -145 828 1298 239 -1169 -1226 -460 913
2062I13N52j202j211n95J096J445K85r29j175p22J195J153O85q45j435n40P86
$$ 913 1465 263 -948 -1543 -447 998 1283 354 -821 -1543 -348 805 1490 645 -790 -1330 -544
2079e44J149P36n84j599l68M01J137J044n20j502n51L73J291P38l80j030j123
$$ -544 605 1341 757 -842 -1210 -809 328 1372 852 -650 -1201 -828 463 1201 821 -209 -1332
2096a332M74J226J002n76j240q83N60Q89J214o74j166p66M7J486J045k93j126
$$ -1332 -858 368 1370 794 -446 -1329 -769 120 1334 660 -506 -1272 -1225 261 1306 1013 -113
2113a13j001J05J114J256k70j269q95J05J044R30m9j157q89rJ004J219j78j033
$$ -113 -1114 -1009 105 1361 1091 -178 -1073 -968 76 1006 957 -200 -1089 -1098 -94 1125 947 -86
2131h6j045k1J131R75K44j029j239k00J106R96J40p52j209j32P52J131M18q62
$$ -86 -1131 -1152 -21 954 1198 169 -1070 -1270 -164 832 972 220 -989 -1121 -369 762 1180 318
2149C18j210k88R04J467R8q68j154m56Q90J126M00n83j450n47R15Q70R49r18r75
$$ 318 -892 -1180 -276 1191 1289 421 -733 -1189 -299 827 1227 644 -806 -1353 -438 432 1381 463 -512
2168e12o33N70J011P92o88j099p19Q01J125N21n81j248n13O23R31P31k67j369
$$ -512 -1145 -575 436 1228 540 -559 -1278 -477 648 1169 588 -660 -1173 -550 381 1112 845 -524
2186e24n98M06J187Q08m72j444l97J39J229R27l87j047q42K00R62Q83l60q35p83
$$ -524 -1122 -716 471 1279 807 -637 -1034 -895 334 1261 874 -173 -1015 -815 147 1030 670 -165 -948
2205i48J57J022O71k01r13r09M9J055R81j74q18q09p8Q25J282l48r10o95k53R87
$$ -948 -791 231 902 701 -212 -1121 -1072 -17 964 790 -28 -837 -915 -90 1192 844 -66 -761 -1014 -27
2225b7J009n6r21p83k66P89J082J2n58j100k45N80J041N06q20q10k36N56R19L27
$$ -27 982 926 5 -778 -1044 -255 827 839 281 -819 -1064 -484 557 1063 243 -567 -803 -247 672 999
2245I99p81r10k70O95R45K05m25r40n95O69R91N28p47q48o00N36J051O29q73o33
$$ 999 218 -692 -962 -267 678 883 458 -482 -1077 -408 583 1111 364 -484 -1084 -548 503 1132 259 -374
2265c74p04N02R77O03m15r87n82N46R81M36l19j037p17N35P98M72L1j232m19L83
$$ -374 -1078 -576 401 1004 589 -398 -980 -434 547 983 664 -373 -1090 -555 243 715 746 -486 -905 -522
2285e22P11Q88k98r57o47oJ105O16j51p12r67J98Q93O57j11o47r08L64M04R28
$$ -522 189 1077 779 -178 -825 -831 274 890 739 27 -940 -742 151 808 697 50 -858 -494 -90 838
2305H38K06j172n50m35J185Q80j48n08j063k00J060Q17J50q69j089K53M90R57
$$ 838 1044 -128 -678 -1113 72 952 804 296 -767 -967 93 910 1060 191 -898 -645 -155 802
2323H02J28r10o10k20N41P70M24p10o84l00N34R47l7k22j066l62R05M54N25o12
$$ 802 930 20 -590 -810 -269 501 925 215 -469 -769 -235 712 675 453 -613 -975 -70 384 909 297
2343B97j106J16K58Q58P41q61o31n29M09Q93L74o95n47o22P06P29R3J01r05o56
$$ 297 -809 -693 -435 423 1164 303 -328 -857 -448 445 819 124 -423 -1045 -339 390 483 584 -321 -977
2363i77O11M87P58l37r14j85l1Q50O08l84o50o93J66R02N81p8q37p67M50M78M72
$$ -977 -366 121 879 542 -372 -557 -588 262 870 486 -164 -857 -691 211 792 714 -123 -890 -440 38 510
2384E10K47r26o37K79N14Q61M1r18p25j5P81Q11l21m32p52j05J020J67K40n31
$$ 510 757 -169 -806 -527 -13 848 889 -29 -754 -769 12 823 502 70 -682 -787 233 400 640 109
2404A09r61L03N52M62L87r23m53q0M36J071k84m68m38n09O33O23R0R6j267k68
$$ 109 -852 -549 3 465 852 -71 -524 -604 -168 903 619 151 -287 -796 -163 460 550 646 -621 -889
2424h89R92L43M02m93j027J29J03P14M93o15l00n12J25J197j10l76l73o45Q07
$$ -889 103 446 848 355 -672 -543 -440 274 767 152 -148 -660 -535 662 552 176 -197 -842 -35
2443c5M87O0q6q32l53N17L17N60l20o67k62pQ87O19n08l23p53J83J005J17j59
$$ -35 452 512 426 -406 -759 -242 75 635 315 -352 -614 -621 266 885 377 54 -699 -516 489 606 447
2464D47n52q87M95P48K49P1p94l94K23M16P47l85n53l52k99Q06O43k71n1r33O8
$$ 447 -105 -992 -497 251 500 571 -223 -617 -394 22 769 384 -169 -521 -820 -14 629 358 307 -626 -558
2485e58O48K55K56n54o94L80R4N24L70r34m45P8J78J262j77p33m12l92Q76L74
$$ -558 90 345 601 47 -647 -267 -173 351 721 -213 -658 -580 -402 860 683 -50 -462 -854 22 396
2505C96m0k12p23K41L35N2O83o85p56J85K03R25L17q55l98m51L59P92K20k95m33
$$ 396 356 144 -579 -338 -3 49 732 47 -709 -524 -321 604 921 66 -332 -783 -424 368 588 293 -140
2526a40n42P15K23L40j46j047P8N29Q4N85k89r67K82n6O07K53m32k19n92L74O44
$$ -140 -682 33 256 596 450 -597 -519 10 94 679 390 -577 -295 -351 256 509 77 -142 -734 -360 284
2547B84K05j36n76m72M95M35K46J13r93k04L16J98O93m8p12j16l34P03N38m50
$$ 284 489 353 -223 -695 -200 235 481 594 -399 -603 -287 -89 604 556 -156 -272 -606 97 635 185
2567A85k17o69J28O11K55N18r38n48K85L94M38Q9q46j16lK16P14j61k23o69n5
$$ 185 -32 -701 -573 38 293 811 -127 -675 -390 4 442 531 -315 -431 -434 -218 496 335 112 -557 -612
2588f12O79L66j35op70Q3M81J48M52o54m35j00M06M82L08n87l50m86M21Q00j08
$$ -612 67 433 298 292 -478 -395 86 234 686 32 -403 -503 -97 385 693 106 -244 -730 -309 491 383
2609C83k25l66m24M01N70J59j12p51j24K98K82N24l04o23j66K69N14J98l11l73
$$ 383 158 -208 -632 -231 339 498 386 -365 -489 -191 91 615 311 -312 -478 -209 305 503 192 -181
2629a81k72J83N76k6O0n32m36L17M43M83k17r20P4J79O44J67l14l30l03K7M87
$$ -181 -453 -270 306 280 340 -192 -628 -311 132 615 398 -522 -448 -269 375 542 228 -102 -405 -378 109
2650A09L12j58k99n50J11O77J31o6k94m96L30O8O39j71o04k95K61M39L26m8k67
$$ 109 421 263 -36 -586 -475 202 333 267 -27 -523 -193 -125 514 343 -261 -556 -295 144 470 422 155
2671A55o25j0M92M69j47m17l24o5M50K94K15n08l73j5J80P86j48m30j04m34L62
$$ 155 -470 -480 12 481 334 -83 -407 -472 -22 272 487 -21 -394 -409 -229 557 409 -21 -125 -559 -197
2692a97N07L6l02n79J93J25N75K44n29l77j73K09M02J93j39n99j84N98J87J27
$$ -197 310 346 44 -535 -342 -217 358 602 73 -304 -477 -268 134 327 188 -411 -595 3 190 317
2712C17p9l85k21J4O35J93k45n65k13J51N17L82k10l23k63Q5N42p2j31l01j56
$$ 317 238 -147 -368 -354 281 474 229 -336 -549 -398 119 501 291 -32 -295 -210 332 260 129 -172 -328
2733c28R0L05L66k79n44N0p3N41L02m36j7l31M7O42R5n2l32n01K77K48J65K14
$$ -328 -238 67 433 154 -390 -340 -413 128 430 -6 -23 -354 -307 335 430 378 46 -455 -178 70 235 449
2755D49o01j76J76J17L93J81m96k57k14M72M10k16j29o44J61M64J98K10m80k03
$$ 449 -152 -328 -152 -35 358 539 43 -214 -428 44 454 238 109 -535 -374 90 288 498 18 -185
2775a85j24N5N11J38n44P8o9N5N17P0l64l47j71L09P17m00j97k91k20N05MK10
$$ -185 -309 -254 257 395 -149 -71 -140 -85 432 502 138 -209 -380 -71 646 246 49 -242 -462 43 47 257
2797B57q0o42L04j63N47K33m86L3l56j0Q00j36j48l93k07L64K45K64l19l66M4
$$ 257 177 -465 -161 -324 223 456 -30 3 -353 -363 437 301 153 -240 -447 -83 162 426 107 -259 -215
2818b15J43Q7L41r7m63j06M6L70M68p09L90p70PP24k97L98l09m48M53J23LK16
$$ -215 -72 15 356 259 -204 -310 -264 106 574 -135 255 -515 -508 216 -81 317 8 -440 13 136 139 355
2840C55m77j72J56K21M71m80l57R6k77O68M5m62L96o12J44M99l34M63m58l96M55
$$ 355 -122 -294 -138 83 554 74 -283 -187 -464 204 249 -213 183 -429 -285 214 -120 343 -115 -511 -56
2861e6j76L05M97p50j10J12L5P23l29k01l6m07L90J55q8K03m70rL75k25M83m34
$$ -56 -232 73 570 -180 -290 -178 -143 580 251 50 14 -393 -3 152 64 267 -203 -212 163 -62 421 -13
2883a3m31M40o6M26L0n72l5J87k11P60m36p6L2o61N26J55R5K65o63j16M50nQ6
$$ -13 -444 -4 -70 356 386 -186 -221 -34 -245 515 79 3 35 -626 -100 55 150 415 -248 -364 86 81 167
2906A67O1m47K06j33K46K67l29o0j70L5L44Jm8j3o80O03o0J76J37m89O2k86K82
$$ 167 228 -219 -13 -146 100 367 38 -22 -192 -157 187 188 140 127 -553 50 -10 166 303 -186 -124 -410 -128
2929a28O20l40m07J83n4M57N8m66J68m58L1N55q6O1k27l79K92K2L94J2p38K51
$$ -128 492 152 -255 -72 -126 331 389 -77 91 -367 -336 219 133 194 -33 -412 -120 -98 296 308 -430 -179
2951a79J31o8N26l68q3j12j66M33J0L7R5o22J49K66j8J98k44k82K41k21M06L64
$$ -179 -48 -116 410 42 -41 -153 -319 114 124 161 256 -366 -217 49 31 229 -15 -297 -56 -277 129 493
2973D93o30J13l38K38O23l51n8k98k40P71l82J29L73p07l6L30j77M73j99k45J31
$$ 493 -137 -24 -362 -124 499 148 90 -208 -448 323 -59 70 443 -264 -300 30 -147 326 127 -118 13
2994A3j72N40K7m36j40j27J50M83j94r2j25m62N30lO3K29m14R2j99J88M55l20
$$ 13 -159 381 408 -28 -168 -295 -145 338 144 52 -73 -535 -5 -8 55 284 -130 -38 -237 -49 406 86
3016H6k2j94j84M78K82l41n8l50K66K98R0r6l75l61K91K74K19L7n89J17n7J71
$$ 86 64 -130 -314 164 446 105 47 -303 -37 261 351 255 -120 -481 -190 84 303 340 -249 -132 -189 -18
3038a8K86k34k5Q2n44P84j33oq2k86o4M06n3K12l95j33j3J63J52J66k60k60J23
$$ -18 268 34 9 91 -453 331 198 192 110 -176 -240 166 113 325 -70 -203 -216 -53 99 265 5 -255 -132
3061a32Q0L18k26pj30k86L61L29j17k3l80k0J83J79K67l73j35P3l00O05j56k0
$$ -132 -52 266 40 33 -97 -383 -22 307 190 167 -213 -233 -50 129 396 23 -112 -39 -339 266 110 90
3083I0J20k19j57J81J0k5k10r7M65M0P1j20l64qj8L55J15r2M44p83J48K29J86
$$ 90 210 -9 -166 15 25 0 -210 -307 158 198 269 149 -215 -223 -241 114 229 137 581 -202 -54 175 361
3106C61j51j73l87K48J94J86o1j42k42K21k21M80l0l20k14O2R4J63j44q0R7j71
$$ 361 210 37 -350 -102 92 278 217 75 -167 54 -167 313 283 -37 -251 -189 -95 68 -76 -156 -59 -230
3128b30L83j02L5j06k79pK39J99L8j79k86K29O1J30J05j35k63j34K93J49J0j19
$$ -230 153 51 86 -20 -299 -306 -67 132 170 -9 -295 -66 -5 125 230 95 -168 -302 -9 140 150 31
3150C1j20l65M93J65J8j05j70j26J47L72j69k01k2j53m3J93M14k33k58k17L21
$$ 31 -89 -454 39 204 222 117 -53 -179 -32 340 171 -30 -52 -205 -248 -55 359 126 -132 -349 -28
3171b8R4J43l5k59n8L0K97J2j17O8l20J8J18p9K84m38m4L60K27j20m2k10j53K01
$$ -28 66 209 174 -85 -143 -113 184 196 79 147 -173 -155 -37 -116 168 -270 -314 46 273 153 111 -99 -252 -51
3195e1J53J25l52J00qj20K60N7N6m17j08J70R4M2J85l72J12O7j01K10Rj11j86
$$ -51 102 227 -125 -25 -33 -153 107 164 220 -197 -305 -135 -41 1 186 -186 -74 -7 -108 102 111 0 -186
3218a86R6n6M33n1k23j97o2N59l42K72l27m9k9QM34Q3l77q6P3l28M75K2N2l16
$$ -186 -90 -146 287 236 13 -184 -246 313 -29 243 -84 -133 -162 -154 280 363 -14 -100 -27 -355 120 142 194 -122
3242a22J9J26R3k15J24m35J31K32K30j28M3k72J37rJ14J83l03j34J41k40M15Q2
$$ -122 -103 23 116 -99 25 -410 -279 -47 183 55 98 -174 -37 -46 68 251 -52 -186 -45 -285 130 212
3264B12j14j34k13L02J00mO4k68j32PJ15L70l21k08o6J87L64q6k85L35k16k97
$$ 212 98 -36 -249 53 153 149 213 -55 -187 -180 -65 305 -16 -224 -290 -103 261 175 -110 225 9 -288
3286b88N68j85O8k38j29K28l7J2K34k53j63P4O1M47l05j38m4k06J66L30k79K17
$$ -288 280 95 163 -75 -204 24 -13 -1 233 -20 -183 -109 -48 399 94 -44 -88 -294 -128 202 -77 140
3308A40k66M8K86l33M78l26n1kK6j2K77k81M1k47J18N38k21k06r9j43M96j67J4
$$ 140 -126 -78 208 -125 353 27 -24 -26 0 -12 265 -16 25 -222 -104 434 213 7 -92 -235 261 94 108
3331A08m4R3M1l72k63M79L55n42M93n22L18K05j33n6k95oN60m39P8l43N41M5l05
$$ 108 64 157 198 -174 -437 42 397 -145 348 -174 144 349 216 160 -135 -141 419 -20 58 -285 256 301 -4
3354dJ10r1j48o68J262j85l82J63p7N35p10L9n5K13K43n20J85L88k40q7K69o01
$$ -4 106 15 -133 -801 461 276 -106 57 -20 515 -195 -156 -211 2 245 -275 -90 298 58 -29 240 -361
3376c61K51R8K05k95L5P4j04J23L28j83j05O0k59K36J12l23L29l64J00K33k99
$$ -361 -110 -12 193 -102 -67 7 -97 26 354 171 66 126 -133 103 215 -108 221 -143 -43 190 -109
3397a09K43j28k68L67k15J48J03q2j1j03j54J79l5J47j16q7J93K12k72J16n82
$$ -109 134 6 -262 105 -110 38 141 59 48 -55 -209 -30 -65 82 -34 -121 72 284 12 128 -454
3418d54K16L80k67K86k92N8M1j86L72j16m0J0k67K82L07m83J88j03l12M90n7j11
$$ -454 -238 142 -125 161 -131 -73 -32 -218 154 38 -2 8 -259 23 330 -153 35 -68 -380 110 53 -58
3440e8K30j97p3M2r8M82m64P0l9K27R4J82l39M6j64j07M14n31J65Q2p7J85l85
$$ -58 172 -25 -98 -56 -154 328 -136 -66 -105 122 216 398 59 105 -59 -166 248 -283 -118 -36 -113 72 -313
3463c13M20J15l37P3K1qK72k66o4r3J68J38j20J00k7k36n5K01J64j03q3q5J30
$$ -313 107 222 -115 -42 -21 -29 243 -23 -87 -180 -12 126 6 106 79 -157 -212 -11 153 50 -33 -118 12
3486A2m7K42l53j3L46k96j13M45j46j77k04K6L89n7M0N8l12K36M0j0M8k61j15
$$ 12 -35 207 -146 -159 187 -109 -222 223 77 -100 -304 -278 111 54 94 152 -160 76 116 106 154 -107 -222
3509b22L46j73L70q5k85K07m59L77j00k3k08J62M1K05l72M14p2k75J07j28K59
$$ -222 124 -49 321 236 -49 158 -301 76 -24 -47 -255 -93 -52 153 -219 195 123 -152 -45 -173 86
3530H6K42l96J57j49RL00j46pQj39k1MK29J67m19p5K15Qj30K62k41p5mJ77K37
$$ 86 328 -68 89 -60 -51 249 103 96 104 -35 -56 -52 177 344 -75 -150 65 73 -57 205 -36 -111 -115 62 299
3555B99k63Oj23J52k09L87k08J15j39L0m2K6N4N8k56J11M8r1J35j74J64j01Q0
$$ 299 36 42 -81 71 -138 249 41 156 17 47 5 31 85 143 -113 -2 46 -45 90 -84 80 -21 59
3578E9l8Pl2j31o6L60o7r9%r9R1OJ8K61j87K5k62jK64O5k39O2j89M0L75n1j62
$$ 59 21 28 -4 -135 -201 159 92 -7 -7 -106 -15 -9 9 270 83 108 -154 -155 109 174 -65 -3 -192 -152 223 172 10
3605A0j90p8L08J39J2j32o8o4J2j4P6L3q7p2m4K36o6Q0pk33K59j97K12J3j49p5
$$ 10 -180 -258 50 189 201 69 1 -63 -51 -65 11 44 -43 -115 -159 77 11 91 84 -149 110 -87 125 138 -11 -86
3631h6jK58o8k31N8o4j62N48j46k52K07N5k7j68K50n2k19P5j55K79J9j68O5r5
$$ -86 -87 171 103 -128 -70 -134 -296 252 106 -146 61 116 89 -79 171 119 -100 -25 -180 99 118 -50 15 -80
3655h0P6J46l4m1j84k3K8K90l30M30j15q1k15J84p1J55o9J5m3J4j2K01J12m80
$$ -80 -4 142 108 67 -117 -140 -112 178 -152 278 163 82 -133 51 -20 135 66 81 38 52 40 241 353 -127
3679a27J67j56N9L76j14l94J25j58L94k2l14j17J57K28k5j32P4j4P7J62k38M1
$$ -127 40 -116 -57 319 205 -189 -64 -222 172 150 -164 -281 -124 104 79 -53 21 7 84 246 8 49
3701D9LO3M5p6j12K0M9k00n0J86J55R4k06k79J93m7K31Q2j96j7K3J23k38L31j3
$$ 49 52 115 160 84 -28 -8 41 -159 -209 -23 132 226 20 -259 -66 -113 118 200 4 -13 10 133 -105 226 213
3726B13k90j71L19j39K30N2k59l8j37K93M9j44K17l32J81n7N7mK35k05q2j59L19
$$ 213 -77 -248 71 -68 162 214 -45 -83 -220 73 122 -22 195 -137 44 -13 44 40 275 70 -12 -171 148
3749A48J28m64J14j2O1o9K51j18k0rm6qK08k7k08q2K20l34K82R2l98J66K55l20
$$ 148 276 -188 -74 -86 -25 -94 157 39 19 10 -36 -44 164 137 -71 -153 67 -267 15 107 -291 -125 130 -190
3773a90L58k62l4J32r0K17j31o6R0n3J14p0K11j75k41L22j70K39o6j28j13j9J8
$$ -190 168 -94 -128 4 -86 131 0 -66 24 -29 85 15 226 51 -190 132 -38 201 135 7 -106 -125 -107
3796a07L82k05Jn2j47J35l7jQ5j74N1k0O3J06Kj67k22L22P7oj3j2j38J4K93J9
$$ -107 275 70 71 19 -128 7 -30 -31 54 -120 -69 -89 -26 80 82 -85 -307 15 92 86 73 61 -77 -63 230 249
3822B49k81P6j41Q6J76o4M4k73k37M65l8J5J17l58J30j78L51J76l39o7Q3j35K31
$$ 249 -32 44 -97 -11 165 101 145 -128 -365 100 62 77 194 -164 -34 -212 139 315 -24 -91 -8 -143 88
3845H8J05m2J28l70N9K31k75J46j7p4L2k89K49K58k38j73K13M4M7j63P8k76R8
$$ 88 193 151 279 -91 -32 199 -76 70 53 -21 11 -278 -29 229 -9 -182 31 75 122 -41 37 -239 -141
3868a41N2L00m4j44j88J79Q2n9J40j54J46l87r6M91k63R7j04J11j03L22j45Q3
$$ -141 -89 211 167 23 -165 14 96 37 177 23 169 -218 -314 177 -86 11 -93 18 -85 237 92 175
3890A75j20k46K38j20K29o4k85n7J24l7L47k47J10k19O8J03K42l81K64r3n6O4
$$ 175 55 -191 47 -73 156 92 -193 -250 -126 -163 184 -63 47 -172 -104 -1 241 -140 124 31 -25 39
3912C9J91Pk38k32K87j40J65J30k57j11O1L30j98K4J1M4j50N2J74l21J56l1o1
$$ 39 230 237 -1 -233 54 -86 79 209 -48 -159 -98 232 34 58 69 113 -37 15 189 -132 24 -7 -68
3935f8l0J74J40k78M8m7K0O2j05J76j84L9j47J87J69k23j6n7Q6J79k46L39k36
$$ -68 -98 76 216 -62 -14 -61 -41 21 -84 92 -92 -53 -200 -13 156 -67 -83 -140 -54 125 -121 218 -18
3958a8L1k20J42P5J09q5k26k3L62j17m0J6j89rL85j30K00k61j2l8p0J66P8k60
$$ -18 13 -207 -65 10 119 34 -192 -215 147 30 -10 6 -183 -192 193 63 263 2 -10 -48 -118 48 126 -134
3982a34J37qm4J84k88J9k7k6M05j26j65K10j03j24J28m2K43k42k30J21Q5j49K54
$$ -134 3 -5 -49 135 -153 -134 -161 -187 218 92 -73 137 34 -90 38 -4 239 -3 -233 -112 -27 -176 78
4005G8Oj28j8k8J00J96k17K07l49J79LJ40r4L1m3p9J3J84k22k30L12k14M85l75
$$ 78 84 -44 -62 -90 10 206 -11 196 -153 26 29 169 75 106 63 -16 -3 181 -41 -271 41 -173 312 -63
4029f3J75j13j63j52O31l2j46j72RJ15j25P1j19m5J07j40K66j28K19O0l43J87
$$ -63 112 -1 -164 -316 315 283 137 -35 -26 89 -36 35 -84 -129 -22 -162 104 -24 195 255 -88 99
4051I9J18j60r3Nn8R6K22l1p5j88o7J78M3j6j08k8J03q3J36j45M5KK1m3J36j66
$$ 99 217 57 -36 -31 -89 7 229 198 123 -65 -132 46 89 73 -35 -63 40 -43 93 -52 -7 -5 16 -27 109 -57
4077e7N8j42r9P4J74R8qj17nj58J31K39j28n0k87J62K67K9p1q2p9j06o2K74O9
$$ -57 1 -141 -240 -166 8 106 98 -19 -24 -182 -51 188 60 10 -277 -115 152 181 110 28 -51 -157 -219 55 124
4102A24k72K8J06j37J99J54j72j86j65L84p1R6j38o4K64l05L36j0j14j1k80K27
$$ 124 -148 -120 -14 -151 48 202 30 -156 -321 63 -8 88 -50 -114 150 -155 181 171 57 46 -234 -7
4124gJ66j90K05l27P6r5J24N9l5j13j37L31k10K47l17L11k63Q9K22K8j60m5L5
$$ -7 159 -31 174 -153 -77 -172 -48 11 -24 -137 -274 57 -153 94 -223 88 -175 -86 136 164 4 -41 -6
4147fM8J9J94l7j74k18J32J22j16O4j44j27J00M7L11k01n6j85N5j3M29k99K3j48
$$ -6 42 61 255 218 44 -174 -42 80 -36 28 -116 -243 -143 -96 215 14 -42 -227 -172 -185 244 -55 -32 -180
4171a80j6K74n2q1K50l46j08J99K37J47l04j68n1J13K56J1j42M6k52J89K35j09
$$ -180 -196 78 26 -55 195 -151 -259 -60 177 324 20 -148 -199 -86 170 181 39 85 -167 22 257 148
4193A48k8ql98L76Q5K4j93m1k3k18L57Q2k68J01j27K30j98O0K05k01j25n8J67
$$ 148 120 112 -286 90 175 199 6 -35 -58 -276 81 163 -105 -4 -131 99 -99 -39 166 -35 -160 -218 -51
4216e1J33k3K1l36K24M2r0j27K65j57J50j65J21%k65J64j5J09j59K39k25NJ01
$$ -51 82 59 80 -256 -32 10 -80 -207 58 -99 51 -114 7 7 -258 -94 -109 0 -159 80 -145 -140 -39
4239c9N2J52j09l1j30J99j58K35n8m1j58Q4k2j15K81N0k45l13K44K42J04k85r5
$$ -39 13 165 56 25 -105 94 -64 171 113 72 -86 -2 -24 -139 142 192 -53 -366 -122 120 224 -61 -156
4262a56J62k87M36k36N4J04j23m0j6K90n8j76j93J38J89K5J5j81k05J78Q4K23
$$ -156 6 -281 155 -81 -27 77 -46 -86 -102 188 130 -46 -239 -101 88 113 128 -53 -258 -80 4 227
4284B27l43J14k62K18J3J36j16p3j29K25J37j51K0o1j59N7J55K50Nl04L9J17R8
$$ 227 -116 -2 -264 -46 -33 103 -13 -86 -215 10 147 -4 16 -45 -204 -147 8 258 263 -41 -2 115 213
4307B13k44J77m48J84l1K22L6R3j45M1k85J69J31j4j96k71L45l8J66j7K4p0K3
$$ 213 -31 146 -302 -118 -149 73 109 202 57 98 -187 -18 113 99 -97 -368 -23 -61 105 88 112 42 65
4330F5k49J04K64j87j08J12l3J52j20%j54k6K74j40K99l87j10R8J14K12j32k31
$$ 65 -184 -80 184 -3 -111 1 -32 120 0 0 -154 -180 94 -46 253 -134 -244 -146 -32 180 48 -183
4352a83L02K2l6Q4q4m8k94Q1J59J09j33J68j89j88J88K94k51J9k8q5J48K17k06
$$ -183 119 141 105 189 105 57 -237 -156 3 112 -21 147 -42 -230 -42 252 1 20 -8 -93 55 272 66
4375F6j30k4o4N5J72q2j14J02j59J65Q3M5j00k08J1o5K95O4o9l02J46K08j57M4
$$ 66 -64 -88 -152 -97 75 -7 -121 -19 -178 -13 70 115 15 -193 -182 -247 48 112 43 -259 -113 95 -62 -18
4399a8Q9j89O2J3K64j77K2j0p2l2J69j53mq1j9J27J07R5L4k16Jm7J4K85l32J24
$$ -18 71 -118 -56 -43 221 44 66 56 -16 -48 121 -32 -36 -117 -136 -9 98 193 227 11 12 -35 -21 264 -68 56
4425E6N8j12P2K21k31R7j09j26K30O7q1qk41O7j04J10K32k21q0k57K63K49n2j25
$$ 56 114 2 74 295 64 161 52 -74 156 223 142 134 -107 -40 -144 -34 198 -23 -103 -360 -97 152 100 -25
4449b5J17l63K59J5N4J0K7j65q4K52n1K05l20qJ25J15j4l2j82N0o1J95n6Q6k19
$$ -25 92 -271 -12 3 57 67 94 -71 -155 97 46 251 -69 -77 48 163 149 117 -65 -15 -76 119 63 149 -70
4474g0k92M09R5J35k28j61J61j6o8J59k14p9M1PR4J28n2J1k53J33J21Q0j47P0
$$ -70 -362 47 142 277 49 -112 49 33 -35 124 -90 -169 -128 -121 -27 101 49 60 -193 -60 61 141 -6 64
4498F4j2k60K5J78P4j33m1r9M67j58%r8k29K14J34j62J52l06J83k62J21Q2J29
$$ 64 52 -208 -183 -5 69 -64 -105 -204 263 105 105 7 -222 -8 126 -36 116 -190 -7 -269 -148 -66 63
4521F3L0l55J23J05L67m03J18n9o8P4K81o6k07j96K9K01m4J82l2k89l3K21N2j47
$$ 63 93 -262 -139 -34 333 -70 48 -11 -79 -5 276 210 3 -193 -164 37 -7 175 143 -146 -179 42 94 -53
4545e3J65k48J63J61N3K1k71k5Q6p4K58j61J8j03j60K55m2M6j32k21K84r8J59
$$ -53 112 -136 27 188 241 262 -9 -34 52 -22 236 75 93 -10 -170 85 43 89 -43 -264 20 -78 81
4568H1j48J08j95J74k9j69L07k16j69q5K98J02J58j97Qm7J07j36j32L80o2j22
$$ 81 -67 41 -154 20 -9 -178 129 -87 -256 -341 -43 59 217 20 28 -19 88 -48 -180 200 138 16
4590A6P1j6rJ92l75J05K46j68K7kN2k99J86j20L63p2n23J33j29L20O3K15k93k23
$$ 16 87 71 62 254 -121 -16 230 62 89 87 139 -160 26 -94 269 197 -326 -193 -322 -2 61 276 -17 -240
4614b40R6L3K59J04j45l73R4O5j9K27l35J51J8R1N9j40K33q4l29K51k1J15N4k67
$$ -240 -144 -111 148 252 107 -266 -172 -107 -126 101 -234 -83 -65 26 85 -55 178 94 -235 16 -5 110 164 -103
4638a03q3J80J04Oj72j16J5l7K48L30l98j0k0J4P5lJ56j9j25k04L02lk06L8j36
$$ -103 -186 -6 98 104 -68 -184 -169 -206 42 372 -26 -36 -56 -42 33 30 186 167 42 -162 140 137 -69 -31 -167
4663a67K56j99J36P7l54J90l8KM31k36n6k91J03L07j11j86J9J0k01L27J53l6j70
$$ -167 89 -110 26 103 -251 -61 -99 -97 334 98 42 -249 -146 161 50 -136 -117 -107 -308 19 172 136 -34
4686c4r2q2K20J38j65n5l2J8J76k3q4K00k45j15Q6N3j19K05j26k04L09J22R5k22
$$ -34 -126 -208 12 150 -15 -70 -102 -84 92 69 -15 185 -60 -175 -89 -36 -155 50 -76 -280 29 151 246 24
4710B4j03j25J72J6J77j80K8j43J89Q2J83j56j18p2j55K24oP2k33Q0J18k33K66
$$ 24 -79 -204 -32 -16 161 -19 9 -134 55 137 320 164 46 -26 -181 43 37 109 -124 -44 74 -159 107
4733A07j6Jk86K05J74J5j72J01l08R6n0K14j26j15J84k34J76K64P9n13K34J9o
$$ 107 91 92 -194 11 185 200 28 129 -179 -83 -133 81 -45 -160 24 -210 -34 230 309 -204 30 49 43
4756D3l9K04k30k14J53R1K4K39k37p0J1J16J92k94j31J03q1K0J78p6K0r8Q1J09
$$ 43 4 208 -22 -236 -83 8 32 271 34 -36 -25 91 283 -11 -142 -39 -120 -100 78 2 22 -76 5 114
4780A14J28k66j3k4j9L28J9l03J14k03m2J66R0M3j2k00Q9J16k6L3j74qj08L70
$$ 114 242 -24 -37 -61 -80 248 267 -36 78 -125 -167 -1 89 132 120 -80 9 125 99 132 -42 -50 -158 212
4804B12l39J88j35J20J0j75K87q0q6p2k4K2K33%k65L4J38J15j56P8j33O2R2o2
$$ 212 -127 61 -74 46 56 -119 168 88 2 -70 -94 -72 161 161 -104 -70 68 183 27 105 -28 34 126 64
4828F4K21k20J1j83j1J61k99N50l88N9j76RJ37k5J83j27l1k4q4L43k42p9r1K78
$$ 64 285 65 76 -107 -118 43 -256 294 -94 -35 -211 -202 -65 -90 93 -34 -65 -89 -173 170 -72 -151 -242 36
4852C6K6j99J20JK06j12Q0j22l1j91J53L5j6OQ5J01p6k11L84m4j73j45q1J60k21
$$ 36 62 -137 -17 -16 190 78 158 36 5 -186 -33 2 -14 -8 77 178 102 -109 275 231 58 -87 -168 -8 -229
4877b29K92K2L1q2P6q4J09j40n5nJ38J6k94K43k02J74k31K82JQ8k25J19r2rJ64
$$ -229 63 85 116 34 110 26 135 -5 -60 -65 73 89 -205 38 -164 10 -221 61 62 150 -75 44 -48 -57 107
4902A07l7n8j14o8J00J30J15j73j75J48m8P8K7L4q3k50J51J49M9j10o4p9K89p7
$$ 107 70 12 -102 -170 -70 60 175 2 -173 -25 -73 5 32 66 -17 -267 -116 33 82 -28 -92 -171 118 41
4926D1Mj48K1l3M5J05m4J79j61l6j40K67j03J23l08Q3J07j87L68r8j23l05J51
$$ 41 45 -103 -82 -115 -70 35 -9 170 9 -27 -167 100 -3 120 -188 -105 2 -185 183 85 -38 -343 -192
4949a92J37P3J71j56n1Pn5J36R6k25Kq9J79p3K13j07j30j2J53j2Q8Rj01j28O3
$$ -192 -55 18 189 33 -18 -11 -66 70 166 -59 -57 -146 33 -40 173 66 -64 -76 77 65 153 162 61 -67 -4
4974dK29j96R9l58K98j77K1K82m14J11J26j75J53J85m34K27l3J80l6N5l9j37L0
$$ -4 225 29 128 -230 68 -109 -88 194 -220 -109 17 -158 -5 180 -254 -27 -60 120 84 139 100 -37 -7
4997gj52L38j6k31j2j01j42M72k53N1p3o7Q2J56J11p0k30j3K21k44K75J1k02j62
$$ -7 -159 179 163 -68 -80 -181 -323 149 -104 -53 -126 -193 -111 45 156 86 -144 -157 64 -180 95 106 -96 -258
5021b58L75k6K2n3j55RK87k03o2Q0j84k30M20O6j69K03j21j57K62j28O9k19K55
$$ -258 117 91 113 60 -95 -86 201 -2 -64 16 -168 -398 22 88 -81 122 1 -156 106 -22 47 -172 83
5044H3q6j45J48R8J08j38j6j98J34k59N68n93L02q6J22k0o0J24m8J5J82k51k56
$$ 83 -3 -148 0 98 206 68 52 -146 -12 -271 297 -296 6 -80 42 22 -38 86 38 53 235 -16 -272
5067b72L28R1k98M9R7Kj65J49l0J35k5J74k0m47J68K2j47L15j18J05k92qK41J63
$$ -272 56 147 -151 -102 -5 -3 -168 -19 -49 86 61 235 215 -232 -64 -42 -189 126 8 113 -179 -187 54 217
5091B17j36j47k5r3p8J24J55j44J89k8M1j80J05m5nL7M2K34l08j3j4q8J72j52
$$ 217 81 -66 -91 -184 -262 -138 17 -127 62 34 75 -105 0 -45 -50 -13 29 263 -45 -58 -72 -160 12 -140
5115a40K57j10p4L2J60M5j45j5J2k05K38m2K76k11j21K42k68J89O1k16q6R4k3
$$ -140 117 7 -67 -35 125 170 25 10 22 -183 55 13 289 78 -43 199 -69 120 181 -35 -121 -27 -50
5138e0R3J45j69p4m3N9RJ53J02k65P3R0P5P7l65K36k35J6J73J55l02K4Q9O7j61
$$ -50 43 188 19 -55 -98 -39 -30 123 225 -40 33 123 198 275 -90 146 -89 -73 100 255 -47 -23 66 133 -28
5163b8j15J80j22J38j35p4L20l49J61o4j18M27l62K73k52p7L33n7o6J2K5n2K5
$$ -28 -143 37 -85 53 -82 -156 164 -185 -24 -88 -206 221 -141 132 -120 -197 136 79 13 25 50 -2 23
5186B3Q1k71K63n9j14L4J87J10j40k0r9O0p2J70j86J64j50Q8l2N8k23L5K20l18
$$ 23 104 -167 96 37 -77 -43 144 254 114 94 -5 55 -17 153 -33 131 -19 69 37 95 -128 -93 127 -191
5210a91O1J33j5l6j13Q9N2q3J6Q8j73K98k63L39Q9k82k09J73m2K81j36l3p2J76
$$ -191 -130 3 -12 -48 -161 -72 -20 -103 -87 1 -172 126 -137 202 291 9 -200 -27 -69 212 76 43 -29 147
5234A47q5j03P2k61J33M8j5K16m7j94k5j26L49k04N1o4RJ86R2k81L9K73k48K3
$$ 147 62 -41 31 -230 -97 -49 -64 152 105 -89 -114 -240 109 -95 -44 -108 -99 87 179 -102 -63 210 -38 -15
5258a5j24J37J96j84j00j29R3L09p2k31M9j08j5K49j24m2J72k73L46l6Q4o7j7
$$ -15 -139 -2 194 10 -90 -219 -126 183 111 -120 -71 -179 -194 55 -69 -111 61 -212 134 98 182 115 98
5281I8k13j24J54j7j52O5L9kM9M9O5q4j4j6K81j68R2l52L55J03k07J75j73k12
$$ 98 -115 -239 -85 -102 -254 -189 -150 -152 -103 -54 11 -73 -87 -103 178 10 102 -250 105 208 1 176 3 -209
5305b09J00j55K46J4j31Q6P3m8L33l08J20j01N4Pj86J05K21k04j14J19j79L86
$$ -209 -109 -264 -18 -4 -135 -49 24 -24 309 1 121 20 74 81 -105 0 221 17 -97 22 -157 229
5327B29k96j7n6K44j00M5j98K35j84Q1J13j3M4k49N9J28j10n4J06j98K97j16j07
$$ 229 -67 -84 -140 104 4 49 -149 86 -98 -17 96 83 127 -122 -63 65 -45 -99 7 -191 106 -10 -117
5350a17J99J2Lj00j77K65J8j9j59R6O5k17Q9K50j11j10r7j00K17K9M1j92K02q3
$$ -117 82 94 97 -3 -180 85 103 84 -75 21 86 -131 -42 208 97 -13 -110 -210 7 36 77 -115 87 4
5374Dj71J24L4j02m1K24k10Q9j33K14p3p5K20O1j46j30M5j0P4P3p3j8j90P6L20
$$ 4 -167 -43 -9 -111 -152 72 -138 -49 -182 32 -41 -116 104 165 19 -111 -66 -76 -2 71 -2 -20 -210 -134 186
5399A86j76j33O9K9m0J41j67K61k08L8r3j7J55J76l12J70j47Q5Q2l2j05n6k57
$$ 186 10 -123 -54 -25 -65 76 -91 170 -38 0 -93 -110 45 221 -91 79 -68 17 99 67 -38 -94 -351
5422c51K40L11j76J28j29M6ql7j33J33Lp7J75k33K20o6l21J41M0K22k2J7j18j70
$$ -351 -111 200 24 152 23 69 61 24 -109 24 27 -50 125 -108 112 46 -275 -134 -94 128 106 123 5 -165
5446a65J3m1L13o3O0n6k31J06L21l84L44q8k50M6J85J03k11j00J21N4k51L30j40
$$ -165 -152 -193 120 57 117 61 -170 -64 257 -127 217 129 -121 -75 110 213 2 -98 23 77 -174 156 16
5469A6j6k64K74r9p2J0M4L6j26M04l09J38k28K87N2K9p9J23k76N0J11k5K72m25
$$ 16 0 -264 10 -89 -161 -151 -107 -71 -197 207 -102 36 -192 95 147 176 97 220 -56 -6 105 80 352 -73
5493g3L5l9k7m2J47jj08QK15j4j94%j2J31R3j61J49m7P8k63K84J70j50j52j54
$$ -73 -38 -77 -104 -146 1 0 -108 -100 115 101 -93 -93 -105 26 119 -42 107 60 138 -125 159 329 179 27 -127
5518a27K82o3J13k50M3M8j64N4R8J11j67l1N6k75K43j51R4J74j05k18J80P4m8
$$ -127 155 92 205 -45 -2 46 -118 -64 34 145 -22 -53 3 -272 -29 -180 -86 88 -17 -235 -55 19 -29
5541b9L5k31K50k0J70j82J66j75l2Q8J71j22j84J8L3K25j03m7j15l0J69J3q7J1
$$ -29 6 -225 25 5 175 -7 159 -16 -48 40 211 89 -95 -77 -44 181 78 31 -84 -114 55 68 -19 -8
5565hj1j75J41K00k66J78j56K2J5Q1O2j1j63P8n9J27o4N6j95Q5N4r0N7J87j32
$$ -8 -19 -194 -53 147 -119 59 -97 -75 -60 21 83 72 -91 -13 -72 55 -9 47 -148 -63 -9 -99 -42 145 13
5590A3m0q9J39K00l48o3K51K6q2J06j00o2r9r5K05q1P6Q8r5j16K82qk52K41k97
$$ 13 -27 -116 23 223 -125 -188 63 89 7 113 13 -49 -148 -243 -38 -119 -43 45 -50 -166 116 108 -144 97 -200
5615b00j0J83J43j23J33l37J83J29j2K5%j37n0rR2K00j79r0k08K04J8L0Rq8pJ60
$$ -200 -210 -27 116 -7 126 -211 -28 101 89 114 114 -23 -73 -82 10 210 31 -59 -267 -63 -45 -15 -6 -94 -101 59
5641E9m3j4M9J01j38N4j52O3o6p7K90j21p7K61m3j42j13J61Oj62M6p1QK01j35
$$ 59 16 2 51 152 14 68 -84 -21 -87 -164 126 5 -72 189 146 4 -109 52 58 -104 -58 -129 -121 80 -55
5666e5j90K67k8Q6n7k16K6K79%k52J19J7K03k34j5R5p6n6%l6L1J83j58N6J90j80
$$ -55 -245 22 -6 80 23 -193 -167 112 112 -140 -21 -4 199 -35 -50 45 -31 -87 -87 -123 -92 91 -67 -11 179 -1
5692aJ33j83K6Q3o0N3Qj0j33K17j03K85j40o2k96L49o4r9j0j71M7K89r9j00J45
$$ -1 132 -51 -25 58 -2 51 59 49 -84 133 30 315 175 113 -183 166 102 3 -7 -178 -131 158 59 -41 104
5717A04j06r0J29rl68L60n8k6J80l3j56K17k50J31N5K4j66m6oP6l8J13J05k04
$$ 104 -2 -92 37 28 -340 20 -38 -64 116 83 -73 144 -106 25 80 104 -62 -108 -114 -38 -76 37 142 -62
5741f2K3%M3J6o0k9j31k12L96q7K74o8j37p5J84j5J64k18r1R1M9m1J8K0j50l5
$$ -62 -39 -39 4 20 -40 -69 -200 -412 -16 -103 171 103 -34 -109 75 60 224 6 -85 6 55 14 32 52 -98 -133
5767a33l4R1N9n4LM7j03k9J65L4q8Ro6M3J76k65J61Q7j93J00j29N7j1J86k27K58
$$ -133 -167 -76 -17 -71 -68 -21 -124 -153 12 46 -42 -33 -99 -56 120 -145 16 103 -90 10 -119 -62 -73 113 -114 144
5793A44p8j75M5o0J73J51k57P3j64L48m26K01J68j85J3m9J69J60j69j17K6j50
$$ 144 66 -109 -64 -124 49 200 -57 16 -148 200 -226 -25 143 -42 -29 -78 91 251 82 -35 -9 -159
5815a59J33L5L2K0q2J35p5J9O8j86J32j82K3K40j24p2k8L17l00k7K29j34j69J06
$$ -159 -26 9 41 61 -21 114 39 58 126 -60 72 -110 -87 153 29 -43 -71 246 -54 -81 148 14 -155 -49
5839d9k2j8m3J71L2O0r1j36J1%K20j94l7N4J94k87L34j32j38o9J14J41r9Q2k15
$$ -49 -71 -89 -132 39 71 131 40 -96 -85 -85 135 -59 -96 -42 152 -135 199 67 -71 -140 -26 115 16 98 -117
5864a17Rk8L43k62lK16l26J21j22K14J7j77J39j56%J46p3p2Mk7L31q3jj51J37
$$ -117 -108 -136 207 -55 -58 158 -168 -47 -169 45 62 -115 24 -132 -132 14 -59 -131 -127 -154 177 94 93 -58 79
5889G9j85P6q7j82Q4K70J19j94j5J81o8L00o05J76J46K3nl2jLm3J13O7k66N7o7
$$ 79 -106 -30 -117 -299 -215 55 174 -20 -35 146 78 378 -227 -51 95 118 113 81 80 83 40 153 220 -46 11 -56
5915e6M9P4l7J12r6j27P6rp1O9j02J66L3p0Mj5j11L08j98l6l2j31J14J67j54Q1
$$ -56 -7 67 30 142 46 -81 -5 -14 -85 -16 -118 48 81 11 15 0 -111 197 -1 -37 -69 -200 -86 81 -73 8
5941Hl8%j1J69O7L9l28J12j12J38K0J89l41J86K4k59J20J4k6o0kp5J16m0L8n7
$$ 8 -30 -30 -41 128 195 234 -94 18 -94 44 64 253 -88 98 122 -137 -17 -3 -29 -89 -91 -166 -50 -90 -52 -109
5967a09K8L1j47K65N4k99j07P8K76j36q5%R9R1KK15j60k46K56j87j25J69J61j32
$$ -109 -81 -50 -197 68 122 -177 -284 -206 70 -66 -151 -151 -52 39 41 256 96 -150 106 -81 -206 -37 124 -8
5991hk26K57R4o4j80K18p5k3J71P0j92o0j8Oo2l8J04m1Q3J21j01r7l6J45j85J83
$$ -8 -234 23 117 53 -127 91 16 -7 164 234 42 -18 -36 -30 -92 -130 -26 -67 16 137 36 -61 -97 48 -137 46
6017D6L6j86J07O2l37M40k27J79L4j29M3j53K35j24o1O2m1K88l40J14L2M8j44
$$ 46 82 -104 3 65 -272 168 -59 120 154 25 68 -85 150 26 -35 27 -14 274 -66 48 80 128 -16
6040a6N9J58k77M5m0Nk5l8K03K4N7k27J67j66K08q5L6n9J23j92j09J85K1lJ1o6
$$ -16 43 201 -76 -31 -71 -66 -91 -129 74 98 155 -72 95 -71 137 52 88 29 152 -40 -149 36 57 54 65 -1
6066aK5P6O6k44O7j15K46k43q2R5K6O5M1J7j44K59q5r3j1K48j87Jo5K54l0p3o1
$$ -1 24 100 166 -78 -11 -126 120 -123 -205 -110 -84 -19 22 39 -105 154 69 -24 -35 213 26 27 -38 216 186 113 52
6093E2j24kOJ84j73K2r4O1o9J71K44l24PN3J30k13J45L9k1P8k80J32j17j10K69
$$ 52 -72 -74 -68 116 -57 -35 -129 -68 -137 34 278 -46 -39 14 144 -69 76 115 94 172 -108 24 -93 -203 66
6118F6k3k33K76J19p6j34J0q0jR9J24j16j5ok36J21j29K47m2J36K9k45K6p1N2
$$ 66 43 -190 86 205 129 -5 5 -75 -76 23 147 31 16 10 -226 -105 -234 13 -29 107 136 -109 -83 -154 -102
6143a02J84j50J16m8q8K0n5o3K10L1n7m4r5L74l38J8K39j92J64j80m8Q4P2k6j43
$$ -102 82 -68 48 0 -88 -68 -123 -186 24 55 -2 -46 -141 233 -105 -87 152 -40 124 -56 -104 -20 52 26 -117
6168a17kL02k19M6O3l14L1L25k08L24k84N4j57P6K50j11j2j53o8K26P1p6K9j04
$$ -117 -119 183 -36 10 73 -241 -210 115 -93 231 -53 1 -156 -80 170 59 47 -106 -174 52 123 47 76 -28
6192b8J53j17K54m29K45j37M6n7P7n7q6J14k03R7J05L13l87R5j4jK7k09J3Q6O6
$$ -28 125 8 262 -167 78 -59 -13 -70 7 -50 -136 -22 -225 -128 -23 290 -97 -2 -16 -17 10 -199 -186 -100 -34
6217c4L3J80l68J42j1J16k4j30J63J60j71k7J3L7K1m1j75J69Rm5K86k85k24L43
$$ -34 -1 179 -189 -47 -58 58 34 -96 67 227 56 29 42 79 100 59 -116 53 62 17 303 18 -206 137
6241A37j80J28J4j15p4M6j28J87r7m5M3k1K5l6K06k37J91n6l2K23l36J82j68l5
$$ 137 -43 85 99 -16 -90 -44 -172 15 -82 -127 -84 -105 -80 -116 90 -147 44 -12 -44 179 -157 25 -143 -178
6265a78K02P9j91J27j36J82j83J36K2n1j3j72J49j21J59j21Q8J4J2Qj04O5k8J36
$$ -178 24 103 -88 39 -97 85 -98 38 60 9 -4 -176 -27 -148 11 -110 -22 -8 4 12 -92 -27 -55 81
6289H1k58L91k12r7K3Q4P4J2k15K02L7P9n6j06L0j92L53k44J53r9j5Jn8j13J66
$$ 81 -177 214 2 -95 -72 12 86 98 -117 85 122 201 145 39 69 -123 230 -14 139 40 25 26 -32 -145 21
6314B1j8q1j5K22j02L0nN4l2k3j30l8O5N6q7j67M39k20j9J19J38k17J24j28n6
$$ 21 3 -78 -93 129 27 57 52 106 74 51 -79 -117 -52 4 -83 -250 189 -31 -50 69 207 -10 114 -14 -70
6339g0J56j41K24j05q0r8K50j14k1l7j60K03n4m9K11k73J48kj34J65J1J90l28
$$ -70 86 -55 169 64 -16 -114 136 22 1 -36 -196 7 -47 -96 115 -158 -10 -12 -146 19 30 220 -108
6362a08L0L5nm8Q7j53P8O1j9K9m7L6j4j84L16q3k1k78J60M06n00L21q2k56Q3K83
$$ -108 -78 -43 -48 -96 -9 -162 -84 -23 -42 -13 -60 -24 -38 -222 94 11 -10 -288 -128 278 -222 99 17 -239 -156 127
6388A27j67j14Q2L9j39M5R0J60lj93n7OJ45M9k3k98K60k5q0J50O6k04j10L11m3
$$ 127 -40 -154 -72 -33 -172 -127 -37 123 120 -73 -130 -124 21 70 47 -251 9 -16 -96 54 120 -84 -194 117 74
6413G4j66P3J84l79L62j02L6P4n2j05K8N3j04j97K53j56K31m4p9j45J59J68k1
$$ 74 -92 -19 165 -214 148 46 82 156 104 -1 27 80 -24 -221 32 -124 107 63 -16 -161 -2 166 145
6436A45M4K6j58k4j20k9K21q3j7J47k87R8k07K82n8J26N9k5k64R0K87l21l6J29
$$ 145 189 215 57 33 -87 -116 105 22 5 152 -135 -37 -244 38 -20 106 165 140 -124 -34 253 -68 -104 25
6460B5N3j8L4j11l0J01p0J00j05K21J08k72q3j72L12l09L30Rr6m8M6Jj55K36k13
$$ 25 78 60 94 -17 -47 54 -16 84 -21 200 308 36 -47 -219 93 -216 114 123 27 -21 25 26 -129 107 -106
6485a06K57N9j63k3j92J55p3L40k57o5j56J11K04m9j56K13n2p0r8J94J8l7n9O9
$$ -106 151 210 47 24 -168 -13 -86 254 -3 -68 -224 -113 91 42 -114 99 47 -23 -121 73 91 54 -5 64
6509F4m3M0Q3K0qm28K41Q7k24K7J03P1K5J1M7r4l4j36K70p2J1r5o6J36k8K21j72
$$ 64 21 61 144 164 156 -272 -31 56 -168 -141 -38 33 58 69 116 22 -12 -148 122 50 61 -34 -100 36 8 229 57
6536E7J1J25k35Q0K8NJ15r8J3o5J34r4j18n1q6P8J46N8J6n1m0k9k46K11q0N9j9
$$ 57 68 193 -42 38 66 71 186 88 101 36 170 76 -42 -93 -179 -101 45 103 119 68 28 -1 -247 -36 -116 -57 -76
6563g6q3o1K42p3k63J49M4L3N1L17o1k55K2J51k03J75k53J30K02k53L3j57K79
$$ -76 -159 -220 22 -51 -314 -165 -121 -88 -37 280 219 -36 -14 137 -66 109 -144 -14 188 -65 -32 -189 90
6586I0j20J38j12O8J12p6O0k66K7M8N2J07k52r0L22L6K0n8j01m1j83k2K37q7p6
$$ 90 -30 108 -4 64 176 100 160 -106 -79 -31 21 128 -124 -214 108 144 164 106 5 -36 -219 -241 -4 -91 -167
6611a67Q7P2m9P7KN3j37o4J72j93J58kO2j04j8J66q8M5q1l6J3J72kq6j2j52K9
$$ -167 -80 -8 -57 20 22 75 -62 -126 46 -147 11 9 71 -33 -51 115 27 72 -9 -45 -32 140 138 52 40 -112 -83
6638h3J05K2L2r6j7J73n5K4k4j58r5J00P4J10l63M40j08P4j06j07R2K2P4k36Q2
$$ -83 22 44 76 -20 -37 136 81 105 81 -77 -172 -72 2 112 -251 189 81 155 49 -58 34 56 130 -106 -24
6663b4K6J11O3k75J31K12m49M33j40n4J37k29p5J85J6m68M28M2pj17m4J49m1M6
$$ -24 2 113 176 -99 32 244 -205 228 88 34 171 -58 -133 52 68 -400 28 70 63 -54 -98 51 10 56
6687E6j51J38P8M7l06K3J61J29j60l8mO5J09j65q3j6L20j79M6j64Q8M5j91j25
$$ 56 -95 43 121 168 -138 -115 46 175 15 -23 -27 38 147 -18 -101 -117 203 24 70 -94 -6 39 -152 -277
6711b77L78r8M5j28j81L83J02l49R7o3J64j77M9k9p7L19o7j97j1Q2K9k04R6L06
$$ -277 101 3 48 -80 -261 122 224 -125 -28 -91 73 -104 -55 -84 -161 158 91 -106 -117 -35 -6 -210 -114 192
6735A92n8j12j72n9L20j20J16k01J78j19J11M5n5m8p2J59j52J61q9kP4p8J26J09
$$ 192 134 22 -150 -209 111 -9 107 -94 84 -35 76 121 66 18 -54 105 -47 114 25 23 97 19 145 254
6759B54k97Q2n0o1N6J31k43J89j59q7K68m7R4o7j23J91k19J34r3J35J28j6k73
$$ 254 -43 39 -11 -72 -16 115 -128 61 -98 -185 83 36 130 63 -60 131 -88 46 -47 88 216 200 -73
6782g3J56p8K37q1k32N9K3K9P9Q5Mj90j21K30j33J2l4q5Q2pJ55k18J47J13j89
$$ -73 83 5 242 161 -71 -12 11 40 119 204 208 18 -103 127 -6 6 -28 -113 -31 -38 117 -101 46 159 -30
6807c0Q1p2J79j78j35J50N0j2j04j4K02j2q0J29M2j64pj13o4K54j97J09K9J16
$$ -30 51 -21 158 -20 -155 -5 45 33 -71 -85 117 105 25 154 196 32 25 -88 -152 102 -95 14 43 159
6831A59j31Q4m0j74R3k07K79p8O1j11m3J62j05l1jO1J1M7p1M2JJ20j32k12j6J35
$$ 159 28 112 72 -102 -9 -216 63 -15 46 -65 -108 54 -51 -82 -83 -22 -11 36 -35 7 8 128 -4 -216 -232 -97
6857i7J64K6o5j55O6PK62k16n0L16j94k19K85r5l1j06L09l51L3K9j41L62m1j23
$$ -97 67 93 28 -127 -61 -54 208 -8 -58 258 64 -155 130 35 4 -102 207 -144 -111 -82 -223 139 98 -25
6881b5J0Q9j19J54P1l13K23m2j51j8Q0J14Q1k04J25o7J2k38J42n4K83l02J53k
$$ -25 -15 74 -45 109 180 -133 90 48 -103 -121 -41 73 154 -50 75 8 20 -218 -76 -130 153 -149 4 2
6905BMP5j83K20j00j48K09j88j6l1K79r4J73l43J1J56j7n4M3J19l1p8R8J4k82
$$ 2 6 81 -102 118 18 -130 79 -109 -125 -156 123 29 202 -141 -130 26 9 -45 -2 117 86 8 106 120 -162
6930a62L35j40k05%K27ok81K37K6J4m1k2N1k3p5J14R9j2j86p5%J35K4j63J11k2
$$ -162 173 33 -172 -172 55 49 -232 5 31 45 4 -18 33 10 -65 49 148 136 -50 -125 -125 10 34 -129 -18 -40
6956d0j4J81Q1j94J39j86J4R7R5k51K0J19Ln0J93j57O1j49R7r9N1l0m2L3J0k5
$$ -40 -54 127 208 14 153 -33 -19 78 173 -78 -58 61 64 14 207 50 111 -38 59 -40 11 -19 -61 -28 -18 -43
6982d3o6J06j88MN5K57j90O3j9q7P9n8m8J71j75j5M1L21k16lP1P8k91J67J2k0
$$ -43 -109 -3 -191 -187 -132 125 -65 -2 -21 -108 -29 -87 -135 36 -139 -154 -113 208 -8 -11 60 138 -153 14 26 6
7008FQ5k36O0J81J7N4j43%j21O3J05q5P1j57J14p6K4J30j42J73j55k0J80k90K44
$$ 6 91 -145 -85 96 113 167 24 24 -97 -34 71 -14 57 -100 14 -62 -38 92 -50 123 -32 -52 128 -162 82
7033H2ln7j64J43K29r1Mr8k68K53L5J20m34O01m21J44k15J79QJ58k45p2R3P6K00
$$ 82 79 22 -142 1 230 139 143 45 -223 30 65 185 -249 352 -69 75 -140 39 47 205 -40 -112 -19 57 257
7058B57l60k0J90j24Ok8J95j11Q9J07k61J65j36J06j65Oj32J96j6K73k44j07R4
$$ 257 -103 -123 67 -57 -51 -79 116 5 94 201 -60 105 -31 75 -90 -84 -216 -20 -36 237 -7 -114 -20
7081b0k47L96j10KJ53j31lL5rk56P1k4J80L1j03L1j23J29JJ71j84j82L44k01K27
$$ -20 -267 129 19 21 174 43 40 75 66 -190 -119 -143 37 68 -35 -4 -127 2 3 174 -10 -192 152 -49 178
7106A78m9N2j26j14R6Jm9K6M7K0q3J0J1J70j65K65l29N0N0J4j04m0J58j07j8P0
$$ 178 129 181 55 -59 37 38 -11 15 62 82 -1 9 20 190 25 290 -39 11 61 75 -29 -69 89 -18 -36 34
7132C4j45J22J21J6j60J58K3K6k00P9j39j77L13j59K63k71K45j17J32j56J45k38
$$ 34 -111 11 132 148 -12 146 169 195 -5 74 -65 -242 71 -88 175 -96 149 32 164 8 153 -85
7154h5K63K35l85J91l49J37m4N4K4K9m4j06O3O2N7k29K06l0q4l9n5K0R8Pj58L10
$$ -85 178 413 28 219 -130 7 -37 17 41 70 26 -80 -17 45 102 -127 79 49 -35 -74 -129 -109 -11 -4 -162 148
7180A48j45p7K37Nj24P2J29j85j70p9PL08j10ql1Rj62J14K2o4J36n3p0oJ10n8
$$ 148 3 -74 163 168 44 116 245 60 -110 -189 -182 126 16 8 -23 -14 -176 -62 -40 -104 32 -21 -91 -97 13 -45
7206d5oj74J99j7m6N3M8J17p9rJ59j01q1l7j3J84l07K13J8j45l3O7J36o7p0j29
$$ -45 -51 -225 -26 -43 -89 -36 12 129 50 41 200 99 18 -19 -32 152 -155 58 76 -69 -102 -35 101 34 -36 -165
7232a65L04k19J17J70k79K14J8j34j03k18J27J25P4l7j44L44k97J93j70M5J15
$$ -165 139 -80 37 207 -72 142 160 26 -77 -295 -168 -43 31 -6 -150 194 -103 90 -80 -35 80
7253H0J64j99j9q0q7J94k21O0K58j23q4K02k9k31J10j05K57j47P3n9Q7k22J88
$$ 80 244 45 26 -54 -141 53 -168 -108 150 27 -57 145 116 -115 -5 -110 147 0 73 14 101 -121 67
7276F7j79j19J73R3k9o1r3K73k24K4O1J32q8k32J53Q0J07k5r6Q9O0j81k0Q1jp6
$$ 67 -112 -231 -58 35 6 -55 -148 125 -99 -75 -14 118 30 -202 -49 31 138 113 17 106 166 -15 -35 46 45 -31
7302c1J6q8J28J93k98J82M1k18O4j00k0K01o1jL9J10j92Rq4l2J83j77N3K8M7k6
$$ -31 -15 -103 25 218 -80 102 143 -75 -11 -111 -131 70 9 8 47 157 -35 -26 -110 -142 41 -136 -83 -55 -8 -34
7328c4o4j97K36n3M2J70K9j15j34J38k11J98l6j50Q0K06j33J74q0j06K39k23J27
$$ -34 -98 -295 -59 -112 -70 100 129 14 -120 18 -193 5 -31 -181 -101 105 -28 146 66 -40 199 -24 103
7351A03k53J94j98Q3J68oo8J79j66j63J15K2Q7j02k05K47j12j0J8P5Q5k80M18
$$ 103 -150 44 -154 -71 97 91 23 202 36 -127 -12 10 97 -5 -210 37 -75 -85 -67 8 93 -187 231
7374B31l10J1J63M5j04j33R3j47K39j47R9r3J18O0m08J25K00p6l8K10k56k6L45
$$ 231 -79 -68 95 140 36 -97 -4 -151 88 -59 40 -53 65 125 -283 -158 42 -34 -72 138 -118 -144 201
7397B01j9j54R0l49K99o9J40l50J64J05j0j84n4J89J33j12J4p4j47K28l8J24k47
$$ 201 182 28 118 -231 68 -1 139 -211 -47 58 48 -136 -190 -1 132 20 34 -40 -187 41 3 127 -120
7420a20J58P8r5q2J44j64J3P4k73K20j60K54o4O2j0J6o4j14M13j53Q2j03k30M7
$$ -120 38 116 21 -61 83 -81 -68 6 -267 -47 -207 47 -17 45 35 51 -13 -127 286 133 215 112 -118 -71
7444g1n5J93j19m7l5K86m4J4N5j63k9R9k0j37P4p3K3R8j72QP3J02n7R9N1J54k89
$$ -71 -126 67 -52 -99 -134 152 108 122 177 14 -15 84 64 -73 1 -72 -49 49 -123 -115 -42 60 3 102 153 307 18
7471A8Q5j31L7o0N6J41j04J97o3j60j95K76j14L6j7M2j82M6o7J92j38J54J30k61
$$ 18 103 -28 9 -51 5 146 42 239 176 16 -179 97 -17 19 2 44 -138 -92 -159 33 -105 49 179 -82
7495h2J57L4O2l3j79q9K97j34j18N6R3K1r5j41J81j44J63q5J5j35K6K7J61j6P9
$$ -82 75 109 171 138 -41 -130 167 33 -85 -29 64 85 -10 -151 30 -114 49 -36 -21 -156 -130 -103 58 42 121
7520A21k40K15q9l5R6k09k8J87j51J05J17J9j08L7O5j84J74r4L0p2J34l40K50
$$ 121 -119 96 7 -28 68 -141 -169 18 -133 -28 89 108 0 37 102 -82 92 -2 28 -44 90 -250 0
7543@J08j26n8M4OL7jJ8N2J7j83q2K28J40l01K95j00j47R4P4Jj24L06k12j73J46
$$ 0 108 -18 -76 -32 -26 11 10 28 80 97 -86 -168 60 200 -101 194 94 -53 41 115 116 -8 298 86 -87 59
7569E9k23J82j32K20M3j19m1j43q6M03k85L02r1k34J51n9J96k71P5L0K10J3Kl02
$$ 59 -164 18 -114 106 149 30 -11 -154 -240 163 -122 180 89 -145 6 -53 143 -128 -53 -23 187 200 202 -100
7593a00M0N4j4k60L56j18N8k6K06j33k49K27L0l4k15J52L4k42K38l8J01N3r3M
$$ -100 -60 -6 -20 -280 76 -42 16 -10 196 63 -186 41 71 37 -178 -26 8 -234 4 -34 67 120 27 31
7617C1J9k3j18J19p1Q8l06K69O6R5k39J31P1j90R6O6r9m3n1J55j6j23K00k92L28
$$ 31 50 27 -91 28 -43 45 -261 8 74 169 -70 61 132 -58 38 104 5 -38 -89 66 50 -73 127 -165 163
7642A63p3j93K20j69K9R9m7J04j90J58ll2p0mLq2j23J19n5P3J95n3qj7o6J18n3
$$ 163 90 -103 117 -52 -23 76 29 133 -57 101 98 66 -4 -8 -5 -87 -210 -91 -146 -73 122 69 61 44 -22 96 43
7669D3J44j84p6K7o2L7K41k46PN9n8j4j61L76j07o0J31j29jJ5NN1J34l35L0Q8
$$ 43 187 3 -73 -46 -108 -71 170 -76 -69 -10 -68 -82 -243 133 26 -34 97 -32 -33 -18 -13 38 172 -163 -133 -45
7695d5R2k7k75K86K9j21n6L27k22j94J07K05k42L55j80k4n3n1PJ52l35J93M6N4
$$ -45 47 20 -255 31 60 -61 -117 210 -12 -206 -99 106 -136 219 39 15 -38 -89 -82 70 -265 -72 -26 28
7719B8n3J34m02L88k81J75o4l5j00K36j16J22j05p4J62M1p7J25r7n9K08j92J08
$$ 28 -25 109 -293 95 -186 -11 -75 -110 -210 26 -90 32 -73 -147 15 56 -21 104 7 -52 156 -36 72
7742G2j57R8m3J39M9k18l6K40o4m7N3j8j68O1J2l5O2N4O0l4P7j27R1j57J8k5Q
$$ 72 -85 13 -30 109 158 -60 -96 144 80 33 86 68 -100 -39 -27 -62 0 54 114 80 157 30 121 -36 -18 -43 -35
7769c5rK0l9qk1K5J83j60J63m3KK1l59K94o1R8n8j19K31l0J04k62o8M2J14j9K0
$$ -35 -44 -24 -63 -71 -92 -67 116 -44 119 76 78 99 -260 34 -27 71 13 -106 125 95 199 -63 -131 -89 25 6 26
7796B6O4k57oL27j44k02J57J14N6j25J12q0R9o6j74P0R3o7J95j76l3O8jkj8j31
$$ 26 90 -167 -173 154 10 -192 -35 79 135 10 122 42 141 75 -99 -29 64 -3 192 16 -17 51 50 48 30 -101
7822a01J19K09k73J7Q9n1J40k6k85K20j7j71J35k24L02N2O9l50K16K5k46J63n0
$$ -101 18 227 -46 -29 60 9 149 123 -162 58 41 -130 5 -219 83 135 204 -146 70 95 -151 12 -38
7845c8R3j10J02j70k1L85k77O4p2j44J21K1K45k66M0K13k15J48k87K05J37q3j30
$$ -38 55 -55 47 -123 -144 241 -36 28 -44 -188 -67 -46 199 -67 -27 186 -29 119 -168 37 174 91 -39
7868c9j4P9Rk38K25o6R3l3k1J33m3L6k63J90j29J30P3j58j4J73j27O9m9j46K52
$$ -39 -53 26 35 -203 22 -44 49 16 -5 128 85 121 -142 48 -81 49 122 -36 -50 123 -4 65 16 -130 122
7893A22j44j5O9l7q6N6%k20L32r1M6l8k10O9O2k8j15K51J06k15RK43r7q1k8J87
$$ 122 -22 -37 32 -5 -91 -35 -35 -255 77 -14 32 -6 -216 -147 -85 -113 -228 23 129 -86 -77 166 69 -12 -40 147
7919A47k69L9J45O3k42J81j75K91l66J92j58p5K92L4j28J13J6j37K99k79M9N9
$$ 147 -122 -83 62 125 -117 64 -111 180 -186 6 -152 -227 65 99 -29 84 100 -37 262 -17 32 91
7941I1q0K84k72O6k67J92J41j16l8o8R3m5K05j12j38J75j66J16N9j72RO1J73j41
$$ 91 11 295 23 89 -178 14 155 39 1 -67 26 -19 186 74 -64 111 -55 61 120 -52 -43 18 191 50
7965E0k18k6P5J45o2k17J03J06J14j40L9j6j30L40m51L58K9R1q7j2pj58L38l23
$$ 50 -168 -194 -119 26 -36 -253 -150 -44 70 -70 -31 -47 -177 163 -288 70 99 190 103 91 84 -74 264 -59
7989e9n4q9q7M77k02j77J07J66l8k3l0j05r1J69k35J69K32j59J26L4j92o5k8J69
$$ -59 -113 -202 -289 188 -14 -191 -84 82 44 21 -9 -114 -205 -36 -271 -102 130 -29 97 131 -61 -126 -154 15
8013A5j37M7R1j82J06nkK0K0P9j29J18m8M4k39R6J7J03o2j4n6K99j69k54K59Q2
$$ 15 -122 -75 16 -166 -60 -65 -67 -47 -27 52 -77 41 -7 37 -202 -106 -89 14 -48 -62 -118 181 12 -242 17 99
8039I9j73K66n6l25L76p5l11P7K04j60k5J49J36l05O6RJ25R6mj41j4n5J93j54
$$ 99 -74 192 136 -189 187 112 -199 -122 82 -78 -103 46 182 -123 -57 -48 77 173 169 28 14 -41 152 -2
8063bj51J09M6J6j52K5J95j26Q7Q9q8P4J05l70J31l8J4J02J3n5J7K4j77J36m0
$$ -2 -153 -44 2 18 -134 -109 86 -40 47 136 48 122 227 -143 -12 -50 -36 66 79 24 41 65 -112 24 -16
8088a6j29J89j80J75l0R8r0R7l3p8R6Mq0KJ98k10pk02L19j56l2L2J46j08j56R7
$$ -16 -145 44 -136 39 9 107 17 114 81 3 99 103 23 25 223 13 6 -196 123 -33 -65 -33 113 5 -151 -54
8114e4M8m6R7L8k9n3O4j68mQ3j02K70k90J34J72k50K95k28L6Q0J8k29O1J9r9K5
$$ -54 -6 -52 45 83 54 1 65 -103 -107 -24 -126 144 -146 -12 160 -90 205 -23 13 93 111 -118 -57 -38 -137 -112
8140a12qJ54j70%J55J8j52K4qM6K0np1L2K08l0p6j17K2k8J33j59J49J49l95L54
$$ -112 -120 34 -136 -136 19 37 -115 -91 -99 -53 -33 -38 -109 -77 131 101 25 -92 -70 -98 35 -124 25 174 -221 133
8166A33o6j10j18J51mj81R8j5p6N2O1K13l13K67J4j74J34J11j49n6J29O3j51P8
$$ 133 67 -43 -161 -10 -14 -195 -97 -112 -188 -136 -75 138 -175 92 106 -68 66 177 28 -28 101 164 13 91
8190I1j8
$$ 91 73
8191G3
$$ Imaginary data points
##PAGE= N=2
##DATA TABLE= (X++(I..I)), XYDATA
0@%%%%%%%%%%%%qJ6j6J6k0K8l2M0m8N6p2Q4j00J20j36J56j81K09k40K76l16L59
$$ 0 0 0 0 0 0 0 0 0 0 0 0 0 -8 8 -8 8 -12 16 -16 24 -24 32 -40 44 -56 64 -72 84 -97 112 -128 148 -168 191
34A91m09M62n19N83o51P26q14R10j009J121j242J372j517J673j844K032k241K469
$$ 191 -218 244 -275 308 -343 383 -431 479 -530 591 -651 721 -796 877 -967 1065 -1176 1293
52A293k718K995l304L650m035M474m977N555o235P047q032R259j0839J2955j5966
$$ 1293 -1425 1570 -1734 1916 -2119 2355 -2622 2933 -3302 3745 -4287 4972 -5867 7088 -8878
67h878K0662k9390P6315k34460O7454P3754l8793L05571j36398j44041o1678n0298
$$ -8878 11784 -17606 58709 -175751 -108297 -34543 -73336 232235 95837 -48204 -109882 -160180
79a60180K28403O4562o0093n2695k08931R8721J08138P6603J09178k80754p8696
$$ -160180 68223 132785 72692 19997 -188934 -90213 17925 94528 203706 -77048 -155744
90a55744J35022o2558K29658L4376k45521p811o0093J14417J77806j12312k000
$$ -155744 -20722 -83280 146378 180754 -64767 -72578 -132671 -18254 159552 47240 45240
101D5240j35226j03393K42703M3612n129k9284k03253M9838P6603P5367J26006
$$ 45240 -89986 -193379 49324 92936 87807 58523 -144730 -94892 -18289 57078 183084
112A83084j80862j03933L0514j227J77279Q022j00534m3800j34283J36627J47228
$$ 183084 2222 -101711 -71197 -72424 104855 112877 12343 -31457 -165740 -29113 118115
123A18115p5285L3723j36359j05447J65452M5228O3751k3375j85689K1146L0568
$$ 118115 42830 76553 -59806 -165253 199 45427 109178 85803 -99886 -78740 -48172
134d8172O7727J28287j09723q8863l4763j766J61535J3093m9664m1675j40846
$$ -48172 19555 147842 38119 -50744 -85507 -87273 74262 87355 37691 -3984 -144830
145a44830Q8239J23960q059L6130j29052q6564Q8078L1162J05424r284j52260
$$ -144830 -56591 67369 59310 95440 -33612 -120176 -32098 -936 104488 95204 -57056
156e7056n645r839P2442J17791p4890n4519o5836k5805J46735K9953j4568l6493
$$ -57056 -62701 -72540 -98 117693 42803 -11716 -77552 -103357 43378 73331 58763 22270
168B2270j35833M5704Q7760L4569N3376j16889p6528L8203J7920J14494P18j08657
$$ 22270 -113563 -67859 19901 54470 107846 -9043 -85571 -47368 -29448 85046 85764 -22893
180b2893k3463m3845P4301J08041m2656k7703q4509m1420J16003M0665K3255l4637
$$ -22893 -46356 -90201 -15900 92141 49485 21782 -62727 -104147 11856 52521 75776 41139
192D1139j23134J8048M8415N4803O1896r3267o3687m138J2703J14675Q036o8611
$$ 41139 -81995 -63947 -15532 39271 101167 7900 -55787 -59925 -47222 67453 75489 6878
204F878l6818o5780O5124R4307o539q310r1924m7724P7009M1231N0288k7438j04823
$$ 6878 -29940 -95720 -30596 63711 57172 48862 -43062 -90786 -13777 27454 77742 50304 -54519
217e4519l855J9873O2567O4172o5007n5691l3843Q364J01694K4554l1176n1645
$$ -54519 -58374 -38501 24066 88238 23231 -32460 -66303 -57939 43755 68309 37133 -14512
229a4512p1717M7384O8898K7002P416r1000m4851M1364L3408O7479j5346q9236
$$ -14512 -86229 -38845 30053 57055 64471 -26529 -71380 -30016 3392 70871 55525 -33711
241c3711k0965K476N8499O9030l2455n5845m8266J792P4416M2882j038n6439o6427
$$ -33711 -54676 -52200 6299 75329 42874 -12971 -61237 -59445 14971 57853 56815 376 -66051
254f6051K1851M5824M9113J6326p8111m5424J1489L1921P2796j232o8069l6715
$$ -66051 -44200 1624 50737 67063 -11048 -56472 -44983 -13062 59734 58502 -9567 -46282
266d6282j4780N0405O9125m485m3137n6190j5287N3657N1595J4627m3704o2243
$$ -46282 -61062 -10657 58468 53983 10846 -45344 -60631 -6974 44621 59248 15544 -46699
278d6699o378L6560N7797K0068n2294m9686j7532L3093O9606J2929l9902m8121
$$ -46699 -53077 -16517 41280 61348 9054 -40632 -58164 -25071 44535 57464 17562 -30559
290c0559l1859L8498O3359J4904k6790n5526l1196L5574N5511K2609k7742n5978
$$ -30559 -62418 -23920 39439 54343 27553 -27973 -59169 -23595 31916 54525 26783 -29195
302b9195k9454K8198N8240K7561k5701n2980l4481K3132N8279L1810k0606n1120
$$ -29195 -58649 -30451 27789 55350 29649 -23331 -57812 -34680 23599 55409 34803 -16317
314a6317l6057J6289N5895L3513j9590m7661l8891J3444N5688L3662j2995m8338
$$ -16317 -52374 -36085 19810 53323 33733 -13928 -52819 -39375 16313 49975 36980 -11358
326a1358m3132J4090M9634M0077n002n2870l7502N958M2489M8793j0031m6805
$$ -11358 -54490 -40400 9234 49311 44309 -8561 -46063 -40105 2384 51177 41146 -5659
338e659l4389o159M8767M5438j0167l6262m6752l869N0117L8280P410m0788n0223
$$ -5659 -40048 -46207 2560 47998 37831 1569 -45183 -49052 1065 39345 46755 5967 -44256
351d4256L239L2228M6945J3550m8828l6055q988K7153N8022J06l6677l6342k3215
$$ -44256 -41017 -8789 38156 51706 2878 -33177 -42165 -15012 43010 43116 6439 -29903 -53118
364e3118M2227M6908N355k1832n4975j3282L7544L4681K8043l2266n2541l714
$$ -53118 -10891 36017 41372 19540 -35435 -48717 -11173 23508 51551 19285 -33256 -36970
376c6970J4374M8592K6441m1093l2695k3112J6398N9720R000j9877l7897l7265
$$ -36970 -22596 25996 52437 11344 -21351 -44463 -28065 31655 40655 20778 -17119 -54384
388e4384L4583M0385J8851n472n7607j9081K2941K8561M1520k3485m7924j2776
$$ -54384 -19801 20584 39435 33963 -23644 -42725 -19784 8777 50297 26812 -21112 -33888
400c3888l25M9190L2992k8646k6058l7376P074N6387J4432j322l5467m5575K3933
$$ -33888 -34213 14977 47969 19323 -6735 -44111 -37037 19350 33782 32460 -3007 -48582 -24649
413b4649L0339K8828P191n4629k2115P464K3602M9728j5513l7887k0942j5903
$$ -24649 5690 34518 41709 -12920 -35035 -27571 -3969 45759 30246 -7641 -28583 -44486
425d4486M9254L4690j4613j4009m9569j780M8889J5082J6623l1107n0274J5616
$$ -44486 4768 39458 24845 10836 -38733 -40513 8376 23458 40081 8974 -41300 -25684
437b5684J8131L4546J8284m8273k3460q557K0154N2942q219k0920k9235k9894
$$ -25684 -7553 26993 45277 -2996 -26456 -35013 -14859 38083 29864 8944 -20291 -50185
449e0185M7597K9089L42r90n7700p300L8098J2882L0934k5640m8646M034P444
$$ -50185 -2588 26501 26843 25853 -31847 -39147 -1049 11833 42767 17127 -31519 -27485 -20041
462b0041M0610K2514l6050k0104k6733J5983N2913k526m750l1572l8402L9002
$$ -20041 20569 43083 7033 -13071 -39804 -23821 29092 26566 21816 -9756 -48158 -9156
474i156K3229J4169M608n6384r812J9032J7315M1359k5660l6113o901j1232N0066
$$ -9156 14073 28242 32850 -23534 -33346 -14314 3001 44360 18700 -17413 -24314 -35546 14520
487A4520K5683k9071r384l7248L394N0639O270K942k9737l7224K1477J9349K8986
$$ 14520 40203 11132 1748 -35500 -32106 18533 24803 27745 -1992 -39216 -17739 1610 30596
500C0596K514m6838r746n928K4492M9281k7796j9317j3009k9283N1086K9017j9415
$$ 30596 33110 -13728 -23474 -29402 -4910 44371 16575 -2742 -15751 -45034 6052 35069 15654
513A5654m174m0094m766L9015J4554J2589k8539l5046P400J3141L8165M546l6005
$$ 15654 11480 -28614 -33380 5635 20189 32778 4239 -30807 -23407 -10266 27899 32445 -3560
526c560r318k3107K1540N2339j9245j1454j7533l1619L8473K6377Q95n822m4373
$$ -3560 -12878 -35985 -14445 37894 18649 7195 -10338 -41957 -3484 22893 23788 17966 -26407
539b6407k009K3269J4963K7534k6751l3396k80K005M2022J1905k9200q871k7374
$$ -26407 -28416 -5147 9816 37350 10599 -22797 -23077 -21072 20950 32855 3655 -5216 -32590
552c2590J1054M6361j542p190k6228k4352K6119J5522K0891k207m8539j772J1154
$$ -32590 -21536 24825 23283 16093 -10135 -34487 -8368 7154 28045 25838 -22701 -24473 -13319
565a3319J4361L4870k0776k6685r074p669M1345J7265j9795r393k9674N750L4251
$$ -13319 1042 35912 15136 -11549 -20623 -28292 13053 30318 10523 1130 -28544 -22794 11457
578A1457R639M930l2746k4399J9850Q056K7156N975m1812q973l91J7793L4335
$$ 11457 21096 26026 -6720 -31119 -11269 -3213 23943 29918 -11894 -20867 -21258 -3465 30870
591C0870j4388j6564j6941j4513L7173J8171o246r990l4104M890K2833J2845J7068
$$ 30870 16482 -82 -17023 -31536 5637 23808 17562 7572 -26532 -21642 1191 14036 31104
604C1104l0202k6747J0140N896K9454Q429k8817j2707j2937J8007L3276p379q998
$$ 31104 902 -25845 -15705 -9809 19645 28074 -743 -13450 -26387 -8380 24896 17517 8519
617H519k1694j7424K8538J6949P410r127l5191J043J4014J5127K2270k2702k4772
$$ 8519 -13175 -30599 -2061 14888 22298 13171 -22020 -20977 -6963 8164 30434 7732 -17040
630a7040j999L793L0509R801j7992j3815k0267J4224K9447J572k581k5525j7728
$$ -17040 -19039 -15246 15263 25064 7072 -6743 -27010 -12786 16661 18233 15652 -9873 -27601
643b7601J9629J3929J7044m366l3613m512O147J6452K4447j5084k0477j0588j295
$$ -27601 -7972 5957 23001 18635 -14978 -19490 -13343 3109 27556 12472 -8005 -18593 -19888
656a9888K9143J2938r445j3975k3142Q054K3714J0300K600k5283j8073R749J1969
$$ -19888 9255 22193 12748 -1227 -24369 -16315 7399 17699 20299 -4984 -23057 -13308 -1339
669a339K2736j199k7129q810k997J7064K5666r122j5044j5411p386K5325J6150
$$ -1339 21397 20198 -6931 -15741 -18738 -1674 23992 14870 -174 -15585 -22971 2354 18504
682A8504j886j2349k4038N40J8634J5403O899k0413j7961q45J0755K4878J734
$$ 18504 16618 4269 -19769 -19229 -595 14808 21707 1294 -16667 -17512 -6757 18121 19855
695A9855j8463j2722j0802J6409K4280k775q480j9486j1473K0192J6192N334q495
$$ 19855 1392 -11330 -22132 -5723 18557 15782 7302 -12184 -23657 -3465 12727 18061 9566
708I566k4279m968J3077J7064J0907j3913j8789p559Q304K2892O732j0199j6027
$$ 9566 -14713 -19681 -6604 10460 21367 7454 -11335 -18894 -10590 12302 19034 8835 -7192
721g192j4766J2592J9848O141l590k1789j2600J2926J4439J2445m704k2837q812
$$ -7192 -21958 -9366 10482 16623 13033 -8756 -21356 -8430 6009 18454 13750 -9087 -17899
734a7899O491J6057J5231p382j8406j1873M224J8982J1906l354j7509j5669O592
$$ -17899 -11408 4649 19880 12498 -5908 -17781 -13557 5425 17331 13977 -3532 -19201 -12609
747a2609J5898J2326O61j9745j4493N092J3270J5990l02j8490j3144O52J4866
$$ -12609 3289 15615 16276 -3469 -17962 -12870 400 16390 16088 -2402 -15546 -14894 -28
760b8J6040o93j4852j5736n31J5247J4599J695j3794j6746j011J3649J5205L471
$$ -28 16012 15319 467 -15269 -15800 -553 14046 15741 1947 -14799 -15810 -2161 13044 16515
774A6515j3872j6207k526J2521J6087L864j2062j6427m501J1926J6378M470j0516
$$ 16515 2643 -13564 -16090 -3569 12518 16382 4320 -12107 -16608 -4682 11696 16166 5650
787E650j6598n812J1085J6285N423r389j6122p614J0298J6380O223p915j6403
$$ 5650 -10948 -16760 -5675 10610 16033 6644 -9478 -17092 -6794 9586 15809 7894 -8509
800h509q365R479J5138Q558p494j6441q078O444J6138R318p319j4642r893N338
$$ -8509 -16874 -7395 7743 16301 8807 -7634 -15712 -9268 6870 16188 8869 -5773 -15666 -10328
814a0328J6680Q712n052j4511j1570N628J5262R475k509j5987j0978M682J2953
$$ -10328 6352 15064 10012 -4499 -16069 -10441 4821 14296 11787 -4200 -15178 -10496 2457
827B457J2508l051j5493r871J016J4605J2385l616j1759j2587K91J5171J0618
$$ 2457 14965 11914 -3579 -13450 -12434 2171 14556 10940 -819 -13406 -13115 2056 12674
840A2674m3j1961j4613J953J2006J1458K932j4428j2275M7R747J5135N89j2382
$$ 12674 12631 670 -13943 -11990 16 11474 14406 -22 -12297 -12250 -2503 12632 13221 839
854H39j0914m364J2121J3960L73q077j4720l643J2427J0872N091r197j5738j454
$$ 839 -10075 -14439 -2318 11642 12015 3938 -10782 -14425 -1998 8874 13965 4768 -10970 -12424
868a2424Q015J2706O750j1444j1863m700O326J6302L529q247j1235q576R273J3240
$$ -12424 -4409 8297 15047 3603 -8260 -12960 -6634 9668 13197 4950 -6285 -14861 -5588 7652
882G652M266m048j5023o825Q593R731R670o308j4997m040K605J3382R808p988
$$ 7652 11918 7870 -7153 -13978 -5385 4346 14016 7708 -7289 -11329 -8724 4658 14466 6478
896F478j0306q212K251J5450O214l561j0759j1303O009J0803P774L54j5347p513
$$ 6478 -3828 -12040 -9789 5661 11875 8314 -2445 -13748 -7739 3064 10838 11192 -4155 -11668
910a1668L654Q150J3045l059j3351o168j600J1951J1775m089q323j1143n81J3189
$$ -11668 -8014 136 13181 10122 -3229 -9397 -10997 954 12729 8640 317 -10826 -11407 1782
924A782P322J899r930j2925L021P343R990M477j3415q988J52N695J3963P14r743
$$ 1782 9104 11003 1073 -11852 -8831 -1488 8502 12979 -436 -9424 -9272 -3577 10386 11100 1357
939A357q530n334J0438J0973R28n097j3755k737J0304O544P073p353j4340N23
$$ 1357 -7173 -12507 -2069 8904 9832 4735 -9020 -11757 -1453 5091 12164 4811 -9529 -9006
953i006M592J0025P634r926r732m023M642J3095K939m795j0061q146Q580R344
$$ -9006 -4414 5611 13245 3319 -6413 -10436 -5794 7301 10240 5445 -4616 -12762 -4182 5162
967E162M370j226j4852m451O883O194R534m507j3029l081J524J0663Q518n862
$$ 5162 9532 8306 -6546 -10997 -4114 2080 11614 7107 -5922 -9003 -7479 3184 11702 5840
981E840p828q551K509J2278M440r03q880j0827N664Q156O500J436j2552o939K689
$$ 5840 -1988 -10539 -8030 4248 8688 7785 -1095 -11922 -6258 1898 8398 9834 -2718 -9657 -6968
996f968O712J0704k347r520o077k294J0893Q560k399n377j1184j00J0682N334
$$ -6968 -256 10448 8101 -1419 -7496 -9790 1103 9663 7264 1887 -9297 -9397 1285 6619
1010F619K831p754j1355K108O017Q523L441j0121p197j834N699J1685l89o570
$$ 6619 9450 1696 -9659 -7551 -1534 6989 10430 309 -6888 -8722 -3023 8662 8273 1703
1024A703p095n262Q915Q646J098l763j1655j947P063O625N583o070j0569j224
$$ 1703 -5392 -10654 -1739 6907 8005 4242 -7413 -9360 -2297 4328 9911 3841 -6728 -7952
1038g952L604R583M952p330o566n442L514J1792J957l674p670p122O008P908M837
$$ -7952 -4348 5235 10187 2857 -3709 -9151 -5637 6155 8112 4438 -3232 -10354 -4346 3562 8399
1053H399j719j1351l996M319O151P790l899q996m061M68R525O462m232n955p000
$$ 8399 6680 -4671 -8667 -4348 1803 9593 5694 -3302 -7363 -6895 2630 9092 4860 -1095 -8095
1068h095J025R811M276l64p704p809L237O254O677N27r391n591N12O081Q740j385
$$ -8095 -7070 2741 7017 6653 -1051 -8860 -5623 631 7308 7835 -1556 -7147 -6635 -554 8186 6801
1084F801p164n708k375Q677P191j298m685q325j155Q108N816K056o322q663K30
$$ 6801 -363 -6071 -8446 231 7422 6124 1439 -6886 -8041 67 5883 7939 1617 -7046 -6816
1099f816M967P659K545o838o763k592N219Q807Q50m520p020m474P035O891J843
$$ -6816 -1849 5810 8355 1517 -5246 -7838 -2619 6188 7038 2518 -4502 -8976 -1941 4950 6793
1114F793k887r222k654N385N994M651m268q564k143K902P446M599m384o758m437
$$ 6793 3906 -5316 -7970 -2585 3409 8060 3792 -4772 -6915 -4013 3433 8032 3648 -3110 -7547
1129g547L177Q175K970k101p479n365M457N815M777j115r054l626K581N551O559
$$ -7547 -4370 3805 6775 4674 -2805 -8170 -3713 2102 6879 5764 -3290 -6916 -4335 1216 7775
1144G775k701p173m117M48P096N762j939o080n884J042O777N293j84o825n908
$$ 7775 5074 -2099 -6216 -5768 1328 7090 5151 -929 -6813 -5771 1006 6299 6115 -710 -6618
1159f618J137N552O089K79p000m891n54N266P271p62n315n492j542O106O003K53
$$ -6618 -5481 71 6160 6439 -561 -5452 -6006 -740 6531 5769 454 -5038 -6580 -474 5529 5782
1175E782m437o646j416N813N808J501m888o147j726M463O655J605m708n426k844
$$ 5782 1345 -5301 -6717 -904 4904 6405 1517 -4630 -6356 -1893 4762 6367 1659 -3767 -6611
1190f611M162O891J506l603n958l015M245O145K345k968o559k934L429O061L190
$$ -6611 -2449 4442 5948 2345 -3613 -6628 -2383 3762 6107 3139 -3420 -6354 -2925 3136 6326
1205F326l256o065k825K036O666L185k744n559l874K093O530L409k048n750m175
$$ 6326 3070 -2995 -5820 -3784 2882 6067 3323 -2236 -6110 -4017 2513 5922 3874 -1876 -6051
1220f051K205N510M160j503n741m071J051N528M684j541n377m114M47N615M614
$$ -6051 -3846 1664 5824 4321 -1420 -5491 -4440 1088 5772 4231 -1146 -5260 -4813 802 5416
1235E416p96n308m508L27N233M598j20n130m789K20M667M951K90m831m842l40
$$ 5416 4620 -688 -5196 -4869 364 4962 4842 -288 -5077 -4857 -190 4761 5051 220 -4622 -4962
1251d962M509N104M80m414m889j179M444N228P04l680n323j412L960N243J410
$$ -4962 -453 4651 5131 717 -4172 -5351 -907 4321 5025 1345 -3978 -5390 -1430 3813 5223
1266E223l461n270j666L458N051K035l423n367j777L057N289K083l109n167k357
$$ 5223 1762 -3508 -5174 -1716 3335 5370 1947 -3420 -5197 -2140 3149 5232 2123 -3044 -5401
1281e401K796N268K535k520n236k508K367N242K526k074n091l128K022N060K915
$$ -5401 -2605 2663 5198 2678 -2558 -5066 -2699 2543 5069 2995 -2096 -5224 -3202 1858 4773
1296D773j500m716l499J491M905L578j246m919l751R77N006L766j103m559l933
$$ 4773 3273 -1443 -4942 -3451 1454 5032 3786 -1133 -4884 -3907 1099 4865 3762 -797 -4730
1311d730P80M750L460l33m389m060N80M359M154m52m269l857j69L941M568l70
$$ -4730 -3950 800 4260 3927 -462 -4522 -3942 417 4571 4119 -150 -4007 -4176 -235 4333 3963
1327C963l845l960l61L800M222N05l575m345q58L711M256R19l480m496r31L452
$$ 3963 118 -3842 -4203 -403 3819 4324 749 -3596 -4454 -743 3513 4432 952 -3544 -4475 -1023
1343a023M475Q44l245l814j855L074M640J101k590m397j852L188L902J845k343
$$ -1023 3452 4296 1051 -2763 -4618 -1544 3096 4197 1607 -2790 -4642 -1454 2448 4293 1950
1358A950m396k111K695M376J887k255m359k010J894M466K148k066l616l058J893
$$ 1950 -2446 -4557 -1862 2514 4401 2146 -2213 -4223 -2329 2137 4285 2219 -1397 -4455 -2562
1373b562M455J878j120l983l106J903M003K391q27m228l006J009M468K578q81
$$ -2562 1893 3771 2651 -1332 -4438 -2535 1468 3859 3032 -1196 -4202 -3193 1275 3853 2972
1388B972l778k975M47M345K713p91l270l309L90L800K935L9l646l748M42L536
$$ 2972 -806 -3781 -3334 1011 3724 2933 -337 -3646 -3256 544 3479 3518 -128 -3876 -3434 102
1404A02L479l19l104l371m10L311L618j03k666l677p47L422L526M05k649l885
$$ 102 3581 3262 158 -3213 -3623 -312 3306 3203 537 -3140 -3887 -465 3061 3466 817 -3068
1420c068n33K860L584R78k732l686j128K530L947J029k598l519j388K268M072
$$ -3068 -3601 -741 2843 3821 1089 -2597 -3725 -1195 2752 3781 1183 -2336 -3724 -1456 2616
1435B616Q60j801l645j974K395L701J714k096l562j811J728L725J878k048l198
$$ 2616 3476 1675 -1970 -3944 -1549 2152 3866 1770 -1792 -3603 -1875 1850 3728 1680 -1518
1450a518k221J501L886J879j556l230k515J353L827K162j204l299k612J095L267
$$ -1518 -3739 -2238 1648 3527 1971 -1259 -3774 -2421 1406 3568 2364 -935 -3547 -2452 815
1465H15K794j057l762k153P25L522K611o86l409k530R0L531K684k49l194l029
$$ 815 3609 2552 -1210 -3363 -2638 884 3495 2809 -600 -3130 -3040 491 3175 2926 -268 -3297
1481c297M84L022K937P5l319k767k74L148K922J82l139k667n24K866L134L03k716
$$ -3297 -2813 209 3146 3221 -98 -2865 -3139 9 2931 3113 -26 -2693 -3217 -351 2783 3086 370
1498C70k867j131L386J914N52j165l492p09K349K996J135k309l357q80K047L435
$$ 370 -2497 -3628 -242 1672 2224 1059 -2433 -3142 -793 2203 3338 1029 -2328 -3208 -1161 2274
1514B274J069k086l346j315K028L274J270j565l445j453J713L171J815j848l156
$$ 2274 3343 1257 -2089 -3404 -1376 1898 3168 1603 -1842 -3295 -1582 1589 3404 1556 -1600
1529a600j470J471K967J818j249l271j766J127L192K103j229l458j819J078L216
$$ -1600 -3070 -1599 1368 3186 1937 -1334 -3100 -1973 1219 3322 2093 -1365 -3184 -2106 1110
1544A110K194j121k912k328O72L314K077q53k818k028R0L213K150m63k690k422
$$ 1110 3304 2183 -729 -3057 -2385 929 3006 2153 -665 -2693 -2603 610 2760 2297 -393 -2815
1560b815L02K561K607J7k592k464k80K870K419k7k467k452l36K463K660R0k211
$$ -2815 -2513 48 2655 2672 80 -2384 -2664 206 2625 2598 131 -2321 -2657 -194 2466 2556 345
1577C45k746l82K561K449M05k061k579p19K214K686O86k010l009o99K025K722
$$ 345 -2401 -2783 -222 2227 2632 571 -2008 -2727 -513 2173 2859 849 -2160 -2859 -834 1888
1593A888Q29j681k849j137J933K905R60j586l053j077J585K749J390j531k639
$$ 1888 2717 1036 -1813 -2950 -1017 1888 2848 1262 -1791 -2868 -1283 1466 2856 1325 -1314
1608a314j169J106K732J570j465k720j169P27K734J857j104k851j645J223K362
$$ -1314 -2483 -1377 1355 2925 1460 -1260 -2429 -1702 1032 2889 1785 -1066 -2711 -1488 874
1623H74J933q18k977j688R75K383J922o91k344k223R09K361J985m88k496j984
$$ 874 2807 1989 -988 -2676 -1701 682 2604 1913 -431 -2654 -1745 616 2601 2113 -383 -2367
1639b367M44K149K103L6k602k238L19K325K247k37k055k375J40K306J893P0k133
$$ -2367 -1923 226 2329 2365 -237 -2475 -2156 169 2416 2179 124 -2251 -2111 195 2088 2158 25
1656B5k121j86K185K116L73k115k318j60J882K176P68k173k560k32J890K119P87
$$ 25 -2096 -2282 -97 2019 2392 277 -2041 -2201 -319 1857 2625 452 -2108 -2340 -450 1669 2456
1673B456j769k536n78J537K420O55j319k507q92J702K286J183j465k704p81J401
$$ 2456 687 -1849 -2427 -890 1530 2185 866 -1641 -2533 -831 1455 2638 1173 -1531 -2312 -911
1689i11K113J561j565k636j015J182K352J300j056k471j357J078K478J436j178
$$ -911 1202 2763 1198 -1438 -2453 -1271 1081 2381 1325 -1146 -2503 -1425 1053 2489 1311
1704A311k203j347O70K425J432p72k168j654M44K617J483n97k090j790L43K233
$$ 1311 -892 -2239 -1569 856 2288 1516 -652 -2306 -1862 755 2238 1641 -449 -2239 -1896 337
1720C37J858m43k212j969N33K251J676Kk414j691N6K272J792J2k207j757nJ819
$$ 337 2195 1752 -460 -2429 -1896 355 2031 2033 -381 -2072 -2016 256 2048 2060 -147 -1904 -1909 -90
1738i0J937K59j943j971l32K046K015K01j774j981m59J814K029N21j823k104n80
$$ -90 1847 2106 163 -1808 -2140 -94 1921 2122 348 -1633 -2092 -278 1751 2272 449 -1655 -2235
1755b235J762K208M40j441k271o80J557K390M07j387k106r38J626J875J016j179
$$ -2235 -473 1735 2175 734 -1537 -2217 -660 1730 2137 750 -1356 -2294 -668 1207 2223 1044
1771A044k311q03J268K040N62q40j913j299J181J917J394j076j990j461J151J886
$$ 1044 -1267 -2070 -802 1238 1800 960 -953 -2252 -1071 846 2240 1164 -826 -2287 -1136 750
1787G50J168n10k262j230O68J972J528o08k217j208M89K040J379m78k011j359
$$ 750 1918 1408 -854 -2084 -1416 556 2084 1476 -741 -1949 -1460 580 1959 1481 -530 -1889
1803a889L46J806J734k24k111j738L38J951J756r5k258j433J57J614J946k10j696
$$ -1889 -1543 263 1997 1773 -338 -2076 -1738 213 1969 1874 -384 -1817 -1660 -46 1900 1690 -6
1820fj458k03J461J990K49j940j799j10J538J902K77j654j817k50J204K085M20
$$ -6 -1464 -1667 -206 1784 2033 93 -1706 -1816 -278 1624 1901 247 -1570 -1820 -616 1469 1889
1837A889j559j747n97J608K020K42j338j727n72J208J789P36j197k017n00J162
$$ 1889 330 -1417 -2014 -406 1614 1856 518 -1209 -1781 -573 1216 1952 755 -1262 -1762 -600
1853f00J817Q62j390j685p87Q86J725J170j034k120o45R08J914R55r62j828j146
$$ -600 1217 2079 689 -996 -1783 -897 828 1998 964 -1156 -1801 -893 1021 1976 1014 -814 -1960
1870a960J089J620J251p38j880j195O69J854J140o94j801j071N15J707J124l50
$$ -1960 -871 749 2000 1262 -618 -1813 -1144 710 1850 1156 -645 -1716 -1201 506 1630 1280
1886A280j825j263M64J546J421oj768j466K32J434J762l86j535j390J43J525J529
$$ 1280 -545 -1808 -1344 202 1623 1617 -151 -1617 -1385 49 1811 1425 -110 -1500 -1357 168 1697
1903A697k07j555j454r0J555J540m2j221j863QJ672J476K61j756j472p3J124J693
$$ 1697 1490 -65 -1519 -1609 -54 1486 1444 223 -1640 -1632 40 1516 1777 21 -1451 -1524 -400 1293
1921A293M34j420j619k80J415J564J37j033j517q79J466J455P06j199j613m57
$$ 1293 1727 307 -1312 -1592 -177 1387 1524 491 -1026 -1905 -439 1016 1722 523 -1090 -1547
1937a547J123J550N64j026j569o29Q75J422R07j087j483o99Q51J687N72n01j871
$$ -1547 -424 1126 1690 664 -905 -1534 -659 763 1670 583 -900 -1599 -748 939 1511 1010 -861
1954h61p76P98J537P15n38j646p18O62J318J122p52j442j088N89J656Q49l73j544
$$ -861 -1637 -839 698 1413 875 -771 -1489 -827 491 1613 861 -581 -1669 -1080 576 1425 1052 -492
1972d92j041O15J341J171m00j488j367N81J225J226j86j456p95m86J508J398k84
$$ -492 -1533 -918 423 1594 1194 -294 -1661 -1080 145 1371 1185 -271 -1066 -1552 -44 1354 1070
1989A070r76j219n11J852J186k06r87j651L28J234J014K32j286j414J03J060J435
$$ 1070 94 -1125 -1636 216 1402 1196 209 -1442 -1114 120 1134 1366 80 -1334 -1231 -171 1264
2006A264R6j287j142n05J418J324R1r54j361n65J404J240L86r33j731m15J274
$$ 1264 1360 73 -1069 -1574 -156 1168 1259 305 -1056 -1621 -217 1023 1409 476 -1255 -1670 -396
2023c96J256Q50j293j358n00O83J770L95p05j169j017P37J627M31n58j587p28
$$ -396 860 1710 417 -941 -1441 -758 1012 1407 702 -467 -1484 -747 880 1311 753 -834 -1562
2040a562R83J075Q67o03j557o29N70J275J161p89j326q32L97J577R58o53j060
$$ -1562 -579 496 1363 760 -797 -1426 -856 419 1580 791 -535 -1367 -970 607 1565 912 -148
2057a48j431P54J208P35j70j325r50M91R29J265l78j280r16K84J047J116k82q91
$$ -148 -1579 -825 383 1118 948 -377 -1327 -836 93 1358 980 -300 -1216 -932 115 1231 949 58
2075E8j246l4J475J004J1j205j307J24J010J290l9j217j014R6Q99J031K28j027
$$ 58 -1188 -1222 253 1257 1268 63 -1244 -1120 -110 1180 1141 -76 -1090 -994 -95 936 1164 137
2093A37j023l05J040J250j94p35j186l25J359P92L68q22j370j11R20J165M01r62
$$ 137 -886 -1191 -151 1099 905 170 -1016 -1341 18 810 1178 356 -1014 -1125 -205 960 1361 399
2111C99j327k32O68J277L41o57j046r80R99J428L04p14j402k85O48J182O81m02
$$ 399 -928 -1160 -492 785 1126 469 -577 -1557 -558 870 1174 460 -942 -1227 -579 603 1284 882
2129H82j385n62M31J174P30p37j119n53L39J212P16m68j116q80N58J139Q96m32
$$ 882 -503 -1065 -634 540 1270 533 -586 -1139 -800 412 1128 660 -456 -1336 -778 361 1257 825
2147H25j281o76K35J157R46k77j315n98J10R31J150m01q41j081Q7J180Q65l7r09
$$ 825 -456 -1132 -897 260 1206 929 -386 -984 -874 57 1207 806 -35 -1116 -1029 151 1016 979 70
2166G0j228J55J233Q51o8j142p34k17J224Q55j48r23q02k84J082J038K74r01j129
$$ 70 -1158 -1003 230 1081 1013 -129 -863 -1080 144 999 851 -72 -874 -1158 -76 962 1236 335 -794
2185g94j75O36J177K56q98j205j56P55J316J16o99j088m65R13J077K97o51j235
$$ -794 -969 -333 844 1100 202 -1003 -1159 -404 912 1028 329 -759 -1224 -311 766 1063 412 -823
2203h23k09N23J113N24n85j017n96P39Q25P88r32q75n54P10Q95M87l89j264l20
$$ -823 -1032 -509 604 1128 543 -474 -1070 -331 494 1282 350 -525 -1079 -369 526 1013 624 -640 -960
2222i60K70J147O47m70j167m31M78J012N95j90j650o17O44J124M51k49r43p32
$$ -960 -690 457 1104 634 -533 -964 -486 526 1121 931 -719 -1336 -692 432 883 634 -309 -1041
2240a041M19Q63O55j46j030q04K96Q87R26m28o88n56k20J073N99K09j115q00l
$$ -1041 -622 241 896 750 -280 -1084 -788 99 1025 597 -91 -647 -867 206 805 1014 -101 -901 -904
2259i04J060N01R3p11p94n8P81J056P9j152n53j28P06Q13n8m73j127J8O49J182
$$ -904 156 657 750 39 -755 -813 -32 1024 1103 -49 -602 -730 -24 789 731 258 -869 -851 -202 980
2279I80n5p22r82l02Q64J068K39q44r20k19P37O77M06n62q90n97O83J080L48o39
$$ 980 925 203 -779 -1081 -217 851 1090 246 -674 -893 -156 521 927 365 -525 -1122 -439 641 989 350
2299C50r45l30M70J015L57m01j026l76M71Q99O32o51p34l91Q3J138M35m87p85
$$ 350 -595 -925 -455 560 917 516 -510 -886 -415 484 1116 465 -269 -660 -577 561 996 509 -276
2318b76p47P99P09K13j17q33n99M90O29M95O0j215n56L57P03Q38l74p23m47j16
$$ -276 -1023 -224 485 698 581 -252 -851 -361 268 763 823 -392 -948 -591 112 950 576 -147 -594 -710
2338g10J016L95p4m43j119L65R30K80M29j072p11K19M45Q26J09r97l81n12Q92
$$ -710 306 701 627 184 -935 -570 360 640 1069 -3 -714 -495 -50 776 885 -112 -493 -1005 -113
2357a13Q49o8o23q82j15J034O03J67n16r04j60N66P65K36p65q25J74J68R70L95
$$ -113 736 668 45 -837 -952 82 685 852 336 -568 -728 -162 603 839 74 -751 -577 -409 561 956
2377I56r82l55k65K91R44qj83r16o13J305J17M46l28q20m02M97M79Q41p64n95
$$ 956 -26 -381 -646 -355 589 581 398 -518 -1131 174 291 737 409 -411 -813 -316 163 1004 240 -355
2397c55l38J07J156K56p53l55o86P48R32j62K04j109l80N14L05P04k37r23j44
$$ -355 -693 -586 570 826 73 -282 -968 -220 712 550 754 -355 -735 -221 84 788 551 -372 -516
2416e16n9P37Q80n66p10l87k43J375J81j08n32r60L20R59R6J74q00n75K16L86
$$ -516 -575 162 1042 476 -234 -621 -864 511 692 584 52 -908 -588 371 467 641 -159 -734 -518 -132
2436a32O98Q1r58k7l47N66R26n56q6q23J12O09L45J73m20j157N94K71N28K80p75
$$ -132 566 647 -311 -338 -685 -119 807 251 165 -658 -546 63 408 581 161 -996 -402 -131 397 677 -98
2457i8n61J7L31R56j4p43l64j70O20N52Q6k65q54k64R73M6O01n09p51pJ22O05
$$ -98 -659 -642 -311 645 631 -112 -476 -646 -26 526 612 347 -507 -771 202 248 849 340 -411 -418 -296 309
2479C09O65q50k75l49j34J123K04o87l86o11Q16M31J58pr97p9N46K26O94l45r79
$$ 309 974 124 -151 -500 -634 489 693 6 -380 -991 -175 256 414 407 -590 -669 -123 103 797 452 -527
$$ [...]
8191A44
##END NTUPLES=NMR FID
##END=
