##TITLE=1H_SR59H.AcCl:Ac3O.1:1
 , 8 sc, 
 4.06.2021
##JCAMPDX= 6.0         $$ Bruker NMR JCAMP-DX V2.0
##DATA TYPE= NMR FID
##DATA CLASS= NTUPLES
##ORIGIN= UXNMR, Bruker Analytische Messtechnik GmbH
##OWNER= root
$$ XWIN-NMR		Version 3.5
$$ Fri Jun  4 14:04:17 2021 Russian Standard Time (UT+4h)  she@DPX200
##.OBSERVE FREQUENCY= 200.131506
##.OBSERVE NUCLEUS= ^1H
##.DELAY= (6, 6)
##.ACQUISITION MODE= SIMULTANEOUS
##.ACQUISITION SCHEME= undefined
##.AVERAGES= 8
##.DIGITISER RES= 18
##SPECTROMETER/DATA SYSTEM= spect
##.PULSE SEQUENCE= zg30
##.SOLVENT NAME= DMSO
##.SHIFT REFERENCE= (INTERNAL, DMSO, 0, 15.7039)
##AUDIT TRAIL= $$ (NUMBER, WHEN, WHO, WHERE, WHAT)
$$ ##TITLE= Audit trail, XWIN-NMR		Version 3.5
$$ ##JCAMPDX= 5.01
$$ ##ORIGIN= Bruker BioSpin GmbH
$$ ##OWNER= she
$$ F:/spectra/data/she/nmr/H-F/1/audita.txt
$$ ##AUDIT TRAIL=  $$ (NUMBER, WHEN, WHO, WHERE, WHAT)
(   1,<2021-06-04 14:02:14.17 +0400>,<she>,<DPX200>,
      <created by zg, POWCHK disabled, PULCHK disabled
       configuration hash MD5:
       00 E9 B6 7A A2 85 ED C7 34 08 36 98 17 FE 4E 26
       data hash MD5: 16K
       63 77 84 91 56 9E 1E D1 2E D7 49 11 4C 83 17 2E>)
$$ ##END=
$$ 
$$ hash MD5
$$ EF CF A2 09 9F 36 3C 0B 0A B5 3B 35 B2 D7 F5 78
##$RELAX= 
##$RELAX= 
##$RELAX= 
##$RELAX= 
##$RELAX= 
##$RELAX= 
$$ Bruker specific parameters
$$ --------------------------
##$DU= <F:/spectra>
##$EXPNO= 1
##$NAME= <H-F>
##$PROCNO= 1
##$TYPE= <nmr>
##$USER= <she>
##$AMP= (0..31)
100 100 100 100 100 100 100 100 100 100 100 100 100 100 100 100 100 100 
100 100 100 100 100 100 100 100 100 100 100 100 100 100 
##$AQSEQ= 0
##$AQ_mod= 1
##$AUNM= <au_zg>
##$AUTOPOS= <>
##$BF1= 200.13
##$BF2= 200.13
##$BF3= 200.13
##$BF4= 200.13
##$BF5= 200.13
##$BF6= 200.13
##$BF7= 200.13
##$BF8= 200.13
##$BYTORDA= 1
##$CFDGTYP= 0
##$CFRGTYP= 5
##$CHEMSTR= <none>
##$CNST= (0..31)
1 1 145 1 1 1 1 1 1 1 1 1 1 1 1 1 1 1 1 1 1 1 1 1 1 1 1 1 1 1 1 1 
##$CPDPRG= <>
##$CPDPRG1= <>
##$CPDPRG2= <>
##$CPDPRG3= <>
##$CPDPRG4= <mlev>
##$CPDPRG5= <mlev>
##$CPDPRG6= <mlev>
##$CPDPRG7= <mlev>
##$CPDPRG8= <mlev>
##$CPDPRGB= <>
##$CPDPRGT= <>
##$D= (0..31)
0 1.2 0 0 0 0 0 0 0 0.06 0 0.03 0 0 0 0 0.0002 0 0 0 0 0 0 0 0 0 0 0 0 
0 0 0 
##$DATE= 1622800933
##$DBL= (0..7)
120 120 120 120 120 120 120 120 
##$DBP= (0..7)
150 150 150 150 150 150 150 150 
##$DBP07= 0
##$DBPNAM0= <>
##$DBPNAM1= <>
##$DBPNAM2= <>
##$DBPNAM3= <>
##$DBPNAM4= <>
##$DBPNAM5= <>
##$DBPNAM6= <>
##$DBPNAM7= <>
##$DBPOAL= (0..7)
0.5 0.5 0.5 0.5 0.5 0.5 0.5 0.5 
##$DBPOFFS= (0..7)
0 0 0 0 0 0 0 0 
##$DE= 6
##$DECBNUC= <off>
##$DECIM= 32
##$DECNUC= <off>
##$DECSTAT= 4
##$DIGMOD= 1
##$DIGTYP= 9
##$DL= (0..7)
0 120 120 120 120 120 120 120 
##$DP= (0..7)
150 150 150 150 150 150 150 150 
##$DP07= 0
##$DPNAME0= <>
##$DPNAME1= <>
##$DPNAME2= <>
##$DPNAME3= <>
##$DPNAME4= <>
##$DPNAME5= <>
##$DPNAME6= <>
##$DPNAME7= <>
##$DPOAL= (0..7)
0.5 0.5 0.5 0.5 0.5 0.5 0.5 0.5 
##$DPOFFS= (0..7)
0 0 0 0 0 0 0 0 
##$DQDMODE= 0
##$DR= 18
##$DS= 0
##$DSLIST= <SSSSSSSSSSSSSSS>
$$ [...]
##$SUBNAM2= <"">
##$SUBNAM3= <"">
##$SUBNAM4= <"">
##$SUBNAM5= <"">
##$SUBNAM6= <"">
##$SUBNAM7= <"">
##$SUBNAM8= <"">
##$SUBNAM9= <"">
##$SW= 20.0188882624521
##$SWIBOX= (0..15)
0 0 2 0 0 0 0 0 0 0 0 0 0 0 0 0 
##$SW_h= 4006.41025641026
##$TD= 16384
##$TD0= 1
##$TE= 0
##$TE2= 300
##$TE3= 300
##$TEG= 300
##$TL= (0..7)
0 120 120 120 120 120 120 120 
##$TP= (0..7)
150 150 150 150 150 150 150 150 
##$TP07= 0
##$TPNAME0= <>
##$TPNAME1= <>
##$TPNAME2= <>
##$TPNAME3= <>
##$TPNAME4= <>
##$TPNAME5= <>
##$TPNAME6= <>
##$TPNAME7= <>
##$TPOAL= (0..7)
0.5 0.5 0.5 0.5 0.5 0.5 0.5 0.5 
##$TPOFFS= (0..7)
0 0 0 0 0 0 0 0 
##$TUNHIN= 0
##$TUNHOUT= 0
##$TUNXOUT= 0
##$USERA1= <user>
##$USERA2= <user>
##$USERA3= <user>
##$USERA4= <user>
##$USERA5= <user>
##$V9= 5
##$VALIST= <valist>
##$VCLIST= <CCCCCCCCCCCCCCC>
##$VD= 0
##$VDLIST= <DDDDDDDDDDDDDDD>
##$VPLIST= <PPPPPPPPPPPPPPP>
##$VTLIST= <TTTTTTTTTTTTTTT>
##$WBST= 1024
##$WBSW= 4
##$XGAIN= (0..3)
0 0 0 0 
##$XL= 0
##$YL= 0
##$YMAX_a= 587346
##$YMIN_a= -542202
##$ZGOPTNS= <>
##$ZL1= 120
##$ZL2= 120
##$ZL3= 120
##$ZL4= 120
##$ABSF1= 10
##$ABSF2= 0
##$ABSG= 5
##$ABSL= 3
##$ALPHA= 0
##$AQORDER= 0
##$ASSFAC= 0
##$ASSFACI= 0
##$ASSFACX= 0
##$ASSWID= 0
##$AUNMP= <proc_1d>
##$AZFE= 0.1
##$AZFW= 0.1
##$BCFW= 1
##$BC_mod= 2
##$BYTORDP= 1
##$COROFFS= 0
##$CY= 11.3945322036743
##$DATMOD= 1
##$DC= 2
##$DFILT= <>
##$DTYPP= 0
##$F1P= 15.9154993809931
##$F2P= -4.1035820241983
##$FCOR= 0.5
##$FTSIZE= 0
##$FT_mod= 4
##$GAMMA= 1
##$GB= 0.15
##$INTBC= 1
##$INTSCL= 1
##$ISEN= 128
##$LB= 0.24
##$LEV0= 0
##$LPBIN= 0
##$MAXI= 10000
##$MC2= 0
##$MEAN= 0
##$ME_mod= 0
##$MI= 1.114404
##$NCOEF= 0
##$NC_proc= 0
##$NLEV= 6
##$NOISF1= 3.799351
##$NOISF2= 2.8
##$NSP= 1
##$NTH_PI= 0
##$NZP= 0
##$OFFSET= 15.70392
##$PC= 1
##$PHC0= -11031.04
##$PHC1= 9.801008
##$PH_mod= 1
##$PKNL= yes
##$PPARMOD= 0
##$PSCAL= 0
##$PSIGN= 0
##$REVERSE= no
##$SF= 200.130013532006
##$SI= 16384
##$SIGF1= 3
##$SIGF2= 2
##$SINO= 400
##$SIOLD= 16384
##$SREGLST= <1H.CDCl3>
##$SSB= 0
##$STSI= 0
##$STSR= 0
##$SW_p= 3612.71676300578
##$SYMM= 0
##$S_DEV= 0
##$TDeff= 0
##$TDoff= 0
##$TI= <>
##$TILT= no
##$TM1= 0
##$TM2= 0
##$TOPLEV= 0
##$USERP1= <user>
##$USERP2= <user>
##$USERP3= <user>
##$USERP4= <user>
##$USERP5= <user>
##$WDW= 1
##$XDIM= 8192
##$YMAX_p= 0
##$YMIN_p= 0
$$ End of Bruker specific parameters
$$ ---------------------------------
##NTUPLES= NMR FID
##VAR_NAME=  TIME,          FID/REAL,        FID/IMAG
##SYMBOL=    X,             R,               I
##VAR_TYPE=  INDEPENDENT,   DEPENDENT,       DEPENDENT
##VAR_FORM=  AFFN,          ASDF,            ASDF
##VAR_DIM=   8192,          8192,            8192
##UNITS=     SECONDS,       ARBITRARY UNITS, ARBITRARY UNITS
##FACTOR=    0.0002496,     1,               1
##FIRST=     0,             0,               0
##LAST=      2.0444736,     0,               0
##MIN=       0,             -542202,         0
##MAX=       2.0444736,     587346,          0
$$ Real data points
##PAGE= N=1
##DATA TABLE= (X++(R..R)), XYDATA
$$ [...]
2664B380p50k742n69J658J110l62q68n62k8Q42J087l36j864p57J989K033j285
2681I76l045j09L374J764k773l309J388M188N25m128k518L111L992j285m633r07
2697c389M343K829l034m168J190M582Q06m053k463K770L391j156l465k83K789
2712F89J251j702j529P05J038m9k30J03n36q58R47J964o01l094n71L805K240l634
2730f2m101K532N590o23o317j726O033M005m709n760K646O591l18o365j827N292
2746H81L322l698l985K094L824q05l173J85K329j31j790N86J771j141k319J363
2762f87L339r75m453j34N198J864n272l856M442N676k728o894M27P133K031o336
2778a225m178M702N532k533n976L80N387J422m171k451K687K651j381k197O57
$$ y = [2380, 1630, -1112, -1681, -23, 1087, 725, -143, -705, -733, 109, 1196, 860, -1004, -1761, 228, 2261, 976, -2069, -2178, 1196, 2960, 187, -3122, -1734, 2454, 2979, -1149, -3667, -556, 3436, 2151, -2482, -3389, 954, 3783, 749, -3419, -2229, 2353, 3159, -894, -3357, -587, 2804, 1648, -1817, -2100, 689, 1940, 238, -1291, -586, 452, 403, 173, 276, -260, -1118, -171, 1793, 1192, -1902, -2473, 1332, 3572, -62, -4163, -1631, 3959, 3336, -2981, -4707, 1326, 5331, 622, -5138, -2492, 4099, 3781, -2584, -4411, 881, 4203, 505, -3480, -1386, 2438, 1633, -1540, -1355, 974, 843, -947, -361, 1410, 269, -2050, -687, 2652, 1677, -2776, -2910, 2288, 4152, -1120, -4976, -534, 5142, 2414, -4480, -4053, 3080, 5111, -1225, -5403, -701, 4831, 2298, -3678, -3298, 2089, 3511, -660, -3111, -424, 2227, 846, -1351, -694]
2793f94J363m91p20R47N38j637r41K152J875k176l075J510M123j47m660j583M339
2810G23L359l187m682J436N202O18m854k493L640L763j884m174qL742J580k615
2826A66k519J154K614K42k009j177R57J477Q5j085q55K95J038N52n58j156l02
2843a081J191J260n84j915n44K009J828j307k895OL350J617k969l207J822M275
2859B856p4m557j867L918L528k518m568P82M669J048m073k425K862L157j470l172
2875a904K84K610M16j777n50J073J92p86M32J041r49j746R91K742m21l662p42
2892b756M071K382l786m002K658N319r02n939j130N625L133m519m629K795N347
2907C667q74n217q77M402K090l175k580J942K401j047j878O84J311q61r83J329
$$ y = [-694, 669, 178, -542, 405, 943, -694, -1635, 517, 2392, 216, -2859, -1349, 2774, 2627, -2033, -3616, 723, 4082, 895, -3787, -2351, 2851, 3469, -1385, -3878, -238, 3525, 1641, -2533, -2541, 1201, 2781, 166, -2353, -1199, 1415, 1657, -352, -1529, -572, 905, 990, -95, -950, -655, 383, 935, 377, -779, -1081, 110, 1370, 786, -1129, -1673, 336, 2164, 857, -2038, -2032, 1318, 2935, -34, -3241, -1419, 2856, 2782, -1775, -3642, 276, 3804, 1286, -3282, -2500, 2169, 3217, -856, -3281, -419, 2738, 1268, -1904, -1620, 990, 1406, -371, -921, 152, 344, -442, -10, 1031, 82, -1664, -673, 2069, 1648, -2014, -2756, 1315, 3697, -89, -4091, -1433, 3886, 2984, -2955, -4085, 1540, 4673, 154, -4475, -1680, 3667, 2793, -2424, -3301, 1101, 3191, 16, -2564, -622, 1779, 732, -1146, -462, 849, -12, -995, 334]
2923C34J187j824j942K006K953j543m050N04M761J037m793k785M099M332k683
2938A593n300Q01N510J113m887k723L603L736j972l974L78L532P73k542j412J487
2954b84J370o43q25K25J53l52L31R34m44j651JK150R58k259k043J706K984n68
2972A743l474q85L247K289k288l325Q54L678Q08l267k226K130L134o43l280q53
2988b358K693K028j585k557K55K445Q64j768j557Q35J660O4j225o43M87P33J95
3005E66k68o19m53M97J234Q8j660j125J587K183q61l025m01L366J894k928l312
3022c237J766M299j92m524j575M023L086k856m041J285M309K67l852j466K929
3037B21K137j851k226R73J840m49j317M16R72q38r29J320J369j615k220J476L205
$$ y = [334, 1521, -303, -2245, -239, 2714, 1171, -2879, -2375, 2386, 3423, -1370, -4155, -56, 4276, 1593, -3707, -2906, 2604, 3717, -1170, -3893, -290, 3446, 1474, -2500, -2122, 1410, 2183, -359, -1771, -284, 1086, 443, -382, -157, -4, -356, -25, 909, 465, -1186, -1185, 965, 1923, -336, -2379, -673, 2311, 1743, -1731, -2616, 631, 2920, 632, -2693, -1839, 1839, 2647, -620, -2846, -716, 2418, 1775, -1505, -2358, 335, 2363, 778, -1779, -1524, 921, 1785, 17, -1540, -705, 955, 1019, -206, -849, -362, 371, 566, 298, -321, -774, -277, 957, 1045, -615, -1740, -153, 2030, 1169, -1856, -2257, 1109, 3003, 75, -3237, -1471, 2828, 2636, -1888, -3463, 560, 3646, 790, -3251, -1966, 2343, 2610, -1242, -2708, 221, 2358, 507, -1719, -746, 1094, 645, -672, -256, 716, -122, -1051, 269, 1638, 23, -2197, -721, 2484]
3054B484p27m058n11M373K071m061l555L012M732j444n313l33N066K108m227l343
3070c726K839L974j300l959j7L378Q67k462j251J623J121j055o91R66L05j259
3086f47k28J798N42k237j308K334K346j947l308R38L990M47m077j920L390L233
3102C346k174m004O45M039R25l435k157K336K753r67k768k15K187J004j302j257
3118a044M15R76K41l83m19k72J39O88N06p43j175L24J644M89j714j423J291K134
3136A674l10k488q61K197J979j335k734J26K852J242k330k410J317K972Q7k991
3152a013j381K324K342j243k753J7K600R77j941j561J085J634k82j306j72P27
3168E4J59j73J96j6q00j77J309Q42j505j791J260K662m33l264q19L395K172k861
$$ y = [2484, 1757, -2301, -2812, 1561, 3632, -429, -3984, -972, 3760, 2316, -2997, -3330, 1736, 3844, -383, -3726, -887, 3087, 1787, -2172, -2189, 1189, 2056, -406, -1657, -34, 1087, 32, -659, 307, 612, -647, -875, 923, 1465, -772, -2080, 254, 2600, 653, -2655, -1717, 2273, 2720, -1357, -3277, 113, 3346, 1172, -2832, -2187, 1852, 2777, -658, -2815, -479, 2274, 1307, -1461, -1676, 511, 1515, 213, -1044, -629, 347, 588, 205, -214, -486, -347, 341, 847, 104, -1071, -747, 897, 1386, -328, -1751, -460, 1674, 1364, -1124, -1985, 212, 2191, 856, -1878, -1752, 1100, 2342, 12, -2398, -1081, 1891, 1978, -1013, -2394, -70, 2272, 1029, -1724, -1707, 893, 1870, -71, -1632, -547, 1087, 805, -501, -673, 54, 213, 40, 236, 220, -580, -757, 552, 1394, -111, -1902, -642, 2020, 1587, -1677, -2496, 899, 3071, 210]
3186B10l353J753M132l16m289j211L850K451k821l259J559L487l43l168o09K476
3202E49J107j747j130J152Q63r20n38J109L26j476n47J947J145k198k035J982
3218d11L021j220l812M5M109J432l840k825K963L843j633m277J16M028J413l486
3234e34k237K285K701j078k627K19K065K80j467l23Q79K08o83J61P62m59j256
3251a104O24J748j37k209o42K253J699k019k551J209L047Q0l304j188K689K393
3267B588j732k959N91K830O47k433j431J352K005k57k038m64J353J022m58j346
3283g30j37J033O13m35o67k28M72N22J27o75o07K04R68N14r54j184M50J690L39
3302A315j773j326J402K172n72k623n42K592J666k012k547R83K998K37k927j342
$$ y = [210, -3143, -1390, 2742, 2426, -1863, -3074, 776, 3227, 406, -2853, -1294, 2193, 1850, -1318, -1927, 549, 1656, -91, -1221, -69, 794, -126, -664, 445, 771, -705, -1252, 695, 1840, -358, -2393, -411, 2610, 1390, -2422, -2377, 1732, 3164, -676, -3501, -538, 3305, 1672, -2605, -2489, 1539, 2952, -534, -2771, -486, 2215, 1137, -1490, -1271, 794, 1074, -393, -716, 163, 371, -312, -151, 611, 152, -1104, -480, 1268, 1131, -1078, -1720, 533, 2232, 213, -2338, -1129, 1918, 1998, -1306, -2494, 195, 2588, 856, -2103, -1512, 1318, 1965, -468, -1899, -547, 1458, 1201, -837, -1301, 52, 1074, 616, -730, -867, 166, 779, 344, -323, -551, -79, 443, 570, -105, -712, -508, 460, 974, 20, -1164, -714, 976, 1315, -458, -1784, -382, 1790, 1218, -1405, -1947, 645, 2311, 299, -2248, -1265, 1733, 1970, -957, -2299]
3318b299K325K156j387k518L96K397M78j931j001J308J086p20q51M06M65m66j59
3335c15P94J41j274m96J658J218j735k081J307K902m43l429p14L410K001k863
3351H1l072J838L710n43l803p62L365J822k543k428J531K586o25k285m2J810K99
3368I39j292k64J000K1r79K02J283k96j727RK187O29k413j497K184K487j594l162
3386b283N23L509O77l309j843K573K717j511l097L16K950P56k347j448J478J708
3402A369o61j518K1J059K83n37j77J49j70n8N76K99q12q10P99J356m04j766k97
3421a299J852J128j573j805Q52K253O7k258j016J774J816r51k211j8K070R47j551
3438G7j579P13J838J10j614q24J071J236l56j299k34R31O57m38p00l2M55K66k0
$$ y = [-2299, 26, 2182, 795, -1723, -1327, 1070, 1548, -383, -1384, -76, 1010, 290, -561, -155, 310, -156, -315, 479, 620, -654, -1150, 508, 1726, -9, -2090, -783, 2119, 1676, -1753, -2467, 943, 2944, 81, -2991, -1153, 2557, 2014, -1789, -2551, 814, 2636, 93, -2335, -804, 1782, 1157, -1128, -1170, 640, 939, -353, -617, 383, 404, -575, -373, 910, 614, -1113, -1104, 1083, 1712, -701, -2198, -14, 2473, 879, -2283, -1760, 1749, 2426, -883, -2726, -153, 2564, 1053, -2044, -1728, 1222, 1978, -369, -1817, -339, 1369, 708, -810, -789, 270, 553, 16, -161, -12, -182, -240, 336, 635, -177, -987, -188, 1168, 764, -1002, -1299, 553, 1681, 108, -1697, -845, 1408, 1475, -783, -1799, -25, 1791, 840, -1371, -1389, 681, 1628, 77, -1502, -789, 1049, 1159, -455, -1279, -208, 1028, 672, -627, -861, 70, 727, 289, -411, -443, 12, 278, 258]
3457B58j87l84j35N33O85l85j210j03J502Q56j413j677R41K276q0k533r50K366
3475C60J906j751k621Q01K897K56k728j183K176J823j431k054O08J951J8j598
3491e70l39J128M00q14j91O93j5q64J38J236k1j648m39J938J146j910j926J482
3509e76K660o64l114l63L051J480k577k359J733K877p19k937l07K579J096j949
3525h9j522J197J615n73j366J77R85r5o94K43N58m56p38O81J094o39j534K79J924
3544A047L20k064j073J853J838j318k362M93K546M66k347j321J792J887r54k100
3560a297Q3J874O41j369r98O58J127q8q60l18M34L96J3k49k66j32K96M76m5o83
3580c07l67O34Q12k96j113k55J103Q45p49j333J72J496N90j320j261Q11J669l0
$$ y = [258, 71, -313, -448, 85, 770, 385, -825, -928, 574, 1430, 17, -1660, -719, 1557, 1477, -1056, -2006, 360, 2266, 515, -2106, -1305, 1592, 1848, -880, -2063, 113, 1936, 505, -1549, -941, 1010, 1028, -570, -909, 219, 619, -195, -386, 307, 292, -572, -434, 802, 781, -867, -1306, 632, 1778, -132, -2058, -576, 2084, 1420, -1694, -2057, 994, 2474, -103, -2462, -729, 2148, 1429, -1508, -1815, 764, 1860, -89, -1611, -414, 1201, 628, -738, -561, 424, 329, -365, -122, 436, -20, -758, -77, 1017, 378, -1156, -877, 1047, 1367, -697, -1770, 83, 1921, 603, -1759, -1266, 1280, 1746, -601, -1922, -130, 1757, 803, -1297, -1214, 660, 1301, -68, -1066, -408, 719, 631, -229, -547, -113, 283, 296, 47, -219, -351, -55, 421, 376, -307, -674, -40, 772, 476, -637, -892, 211, 1056, 307, -1026, -854, 642, 1232, -88, -1349, -538, 1131, 1101]
3598A101j765p79J491J427q59j817J14J824O31j484j189R11J419k83j336k08R98
3615A96N18o31n04K29L12r3JJ99k33n06K63R37n9j255m76J418J140j293j782P71
3635h48K251L6k392r36K148J756j550k299P14K517J47k317q74J800J387j223j501
3652a184O14J406k31j080L8P96j06o33K63P17m45r75M49J353k38j722k55J934
3670G01R32j857j653J436K255p38k552j61K531J027k146j694J432K097o68k067
3686a125q0J774O35j311q55P51Q60l82o10K04L25k36j32M31J62p06m03Q83P74
3705I59p55j281M61J563J52j678p97J437J383q87j783J84J803N73j523j174R46
3722d17J518k53j498m29J186Q80o46j050O0R55M05o42o35K02O18K03m15l61L5
$$ y = [1101, -664, -1443, 48, 1475, 616, -1201, -1087, 737, 1368, -116, -1305, -394, 1025, 742, -594, -802, 196, 714, 83, -421, -192, 120, 27, 28, 227, -6, -512, -249, 688, 629, -626, -1102, 316, 1456, 163, -1619, -848, 1403, 1439, -953, -1889, 259, 2015, 465, -1834, -1120, 1397, 1544, -773, -1647, 153, 1540, 317, -1184, -570, 836, 605, -475, -437, 359, 253, -380, -117, 600, 155, -820, -371, 982, 744, -978, -1233, 701, 1633, -224, -1877, -441, 1814, 1076, -1476, -1637, 894, 1921, -225, -1919, -487, 1610, 942, -1125, -1205, 569, 1204, -107, -962, -211, 649, 267, -343, -139, 186, -50, -182, 249, 411, -295, -698, 185, 959, 204, -1077, -616, 947, 1099, -579, -1376, 61, 1444, 557, -1226, -1042, 761, 1334, -189, -1363, -417, 1101, 848, -650, -1079, 107, 987, 341, -709, -649, 306, 711, 69, -566, -364, 254, 457, 42, -319, -284]
3741b84L86K54j57l81k23L47N00Jp17m14O30Q80k82j164l03J208R18r28j461L61
3761h29J751L56j686j087J300J640o94j898l1J825O65j439j168R60J315m17j222
3778f59RR73J88o72j51M48Qm07J78N96k84r29K09J285J28j518o60J526J275j260
3798B83j857P12K237J1k284q06J996J502j461j938P45K061qj910n20J448R10r70
3816A51r83N72Q20l19o22K95M23m00l95N88N44p20q98O95J313m02j618j54J811
3835G01P42j655j344J221J846o03k030j61J931Q36j522j328R43J504k94j415k45
3852h73J104N58o71o28K48M92lk10n3o2j09J92L92j32o58q7P62M75p13q75M51
3873d00J129L8j183n65R85J001n06j292q7J266O83r40j106M13J275J81j133p43
$$ y = [-284, 102, 356, 199, -182, -405, -58, 442, 443, -274, -688, -58, 822, 540, -624, -927, 281, 1199, 271, -1190, -829, 922, 1278, -408, -1495, -195, 1445, 751, -1147, -1178, 647, 1312, -127, -1295, -335, 980, 563, -659, -650, 323, 511, -161, -312, 136, 144, -263, -85, 511, 227, -702, -493, 792, 920, -598, -1258, 268, 1543, 283, -1574, -862, 1375, 1386, -898, -1704, 292, 1794, 333, -1605, -860, 1201, 1193, -717, -1237, 211, 1121, 151, -832, -260, 560, 241, -381, -86, 337, -63, -458, 130, 674, -46, -944, -249, 1064, 662, -956, -1110, 701, 1443, -212, -1556, -335, 1511, 908, -1122, -1283, 648, 1484, -38, -1366, -423, 1081, 787, -628, -873, 231, 789, 118, -510, -262, 230, 227, 17, -36, -98, -207, -15, 377, 245, -413, -500, 262, 737, 24, -851, -400, 729, 767, -416, -981, 4, 1005, 499, -793, -880, 386, 1069, 129, -977, -564, 711, 892, -241, -984]
3891i84P73J080k70j142k48R62O39o00q11J92P53J32n38k87K15K96k2o9q2j97
3911b08k1M02L16m57o95K68J071N0j196o04J160J113p92j553K41J775L88j667
3929d09j015J305J500p38j698J04J638M18j328p76R23R09n17q65K47O64j55m57
3947b50J99L72l61m98N44P37n68j080L75J449J6j638o16J621J209j298j733P39
3965g81K060q8k046o22J807J179j287j537O74J639j54j405l04J093N18p25n08
3982d87M28L89l36j76L52P6n23j29P44L28q62o98P99J098n03j433K8J576N09j405
4002b25j075J023J455m48j566k21J433P59j040j102N17J159L8r74m26N94O45k15
4020C31o15j22L88L11j00k77j25R7K42J54j89l86j6N00L07m06o12J34P66K58p18
$$ y = [-984, -211, 869, 599, -543, -791, 171, 810, 210, -601, -409, 344, 476, -62, -349, -134, 162, 140, 71, -11, -208, -229, 173, 489, 32, -663, -395, 676, 726, -470, -1074, 86, 1199, 407, -1146, -905, 870, 1258, -409, -1424, -119, 1381, 643, -1055, -951, 687, 1105, -223, -999, -76, 833, 316, -549, -302, 362, 207, -250, -51, 321, -40, -538, 6, 743, 175, -905, -530, 919, 935, -703, -1319, 302, 1511, 213, -1520, -781, 1279, 1191, -855, -1477, 330, 1509, 222, -1315, -641, 998, 844, -561, -865, 228, 746, 21, -487, -59, 330, -6, -182, 170, 246, -277, -406, 338, 666, -196, -894, -95, 1003, 500, -933, -905, 671, 1180, -225, -1300, -277, 1178, 730, -836, -1057, 376, 1135, 95, -1007, -490, 669, 707, -267, -693, -99, 546, 331, -284, -406, -18, 293, 193, -84, -209, -112, 130, 284, 95, -291, -307, 193, 500, 94, -518, -384, 382, 640, -78]
4041g8p00N15R70n2j113m51R63R25o05j204L7J260N47j110r27O55J222j77j202
4060e25l24J006O37o36p85K79P22J9n51j01K99K8j23J37J52l48l38M64O65m09
4080B68j022J50J261L42j381q44J192J356p76j756K22J816M72j700j011J307J381
4097A277p39j567J85J479K45j172n35Q49O02n26n23L47L87l75k36M64K69o78l95
4116f42P91P14p67j092N55J422q7j648m44J571J022j269j500P74J739j11j749
4133g21n07J473R57j002j218N08J181l5r86k59O70L59l78k79K02J15j85O2K86
4152B43j23m92N1P15J65q18n25P60Q58m32j174L8J240M58j091q70P15J162k08
4171F72j229k92J008P22o17r69J76R39K77p40n84L82O88j3n79k88L23M26l6l77
$$ y = [-78, -778, -263, 707, 655, -458, -909, 54, 979, 374, -830, -793, 467, 1014, -96, -1023, -368, 854, 677, -525, -849, 157, 794, 158, -627, -348, 374, 393, -158, -259, 40, 68, -55, 82, 234, -114, -452, 12, 677, 268, -754, -604, 657, 999, -382, -1226, -34, 1322, 546, -1210, -988, 828, 1300, -400, -1411, -104, 1277, 538, -1029, -844, 635, 880, -292, -827, 22, 624, 98, -425, -78, 309, -66, -302, 162, 431, -247, -642, 149, 863, 96, -996, -441, 981, 894, -754, -1198, 373, 1395, 126, -1374, -600, 1139, 1028, -721, -1228, 245, 1202, 200, -1018, -510, 671, 636, -350, -609, 61, 420, 42, -237, -35, 80, -105, -43, 243, 120, -372, -321, 394, 559, -259, -784, -24, 834, 402, -772, -734, 506, 964, -127, -997, -282, 880, 672, -557, -849, 159, 881, 264, -705, -529, 410, 687, -53, -637, -255, 433, 420, -159, -447, -124, 302, 266, -111]
4191a11j44J36K21R0j33k49j05K85L75j15n98j88O80N53n28r19J81J156K56j101
4211b58q03R01J220m66j438p5J428O13j189j036P63J277k99j245j65J060M44p39
4229gn58M24N21k46l69J81K24l08j33M44K74o29n01O94Q44n91j202K44J471K84
4249A061j545q29J346J340r22j671L04J816K73j605q43J262J195p75j321L02J207
4266E95Q7r66k98O97L21m78k37M01J00m60l5O18Q5p99l05R16O54r00j000O28J372
4287I96k62j513k91J469Q16j168j249O88J481j64j406l72J171P36p36r21K87Q40
4305D02Q3o18k74L46K86j04j33j0o7m2K47K11l01m37J85O26J01p28m19N54Q06
4326G14l08j016p4R85N46q00r08L99J083J00j043n83Q07R24l82j068q4R78M91
$$ y = [-111, -255, -119, 102, 192, 59, -190, -295, -10, 365, 250, -348, -536, 144, 697, 169, -750, -569, 587, 843, -258, -1061, -160, 1060, 594, -844, -919, 509, 1122, -67, -1103, -340, 937, 638, -607, -772, 288, 732, -7, -565, -141, 380, 134, -235, -54, 170, -138, -271, 173, 447, -182, -683, 11, 855, 264, -938, -694, 777, 1061, -484, -1313, 33, 1373, 451, -1220, -916, 900, 1173, -432, -1275, -13, 1182, 407, -914, -612, 595, 682, -284, -582, 115, 436, -42, -279, 122, 222, -238, -273, 345, 430, -369, -674, 242, 896, -4, -1004, -376, 996, 734, -779, -1070, 399, 1215, 47, -1202, -514, 967, 803, -603, -975, 196, 932, 196, -725, -438, 402, 485, -133, -407, -61, 225, 121, -12, -22, -89, -131, 116, 327, 26, -411, -226, 400, 501, -227, -646, -92, 714, 406, -610, -684, 301, 847, 47, -861, -462, 621, 721, -322, -905, -98, 826, 444, -624, -708, 270, 761]
4345G61p08p32L13Q25N5p12k96M60L88j70l26j9J59O8K0K8j31k59R8N26Q6o80
4367b46m09O69Q02m75j134Q1J292M62j258r68R41J381m91j556q6J515N88j217
4385a09r90Q14J187l77j175pR90K61p18l57N32K68m12j51M37O2n54q8P33K69q54
4406b39o03Q72R71o90j308K93J548K30j592p52J328J259r05j578L91J585J96j430
4424d24o46J076R01o17j007K75Q30K9o55j08M37N8k87N8L31j97m55K03O93o4q92
4445d61j97R52O00q72r60N89J223j50j315l86J233P96q68j135M14J252P2j104
4463c17n32Q12P78m14q34QO74K99m14m13J14L27J19j48j75r1J26K30Q5k42l29
4484c37J08M93J39m69m79L57P36m1q55l74P51P67m10j073J4J114M83r52q98N67
$$ y = [761, 53, -679, -366, 459, 514, -198, -494, -34, 354, 184, -142, -161, -2, 66, 86, 114, -17, -276, -178, 348, 434, -246, -655, 14, 816, 341, -793, -712, 580, 1042, -216, -1184, -243, 1138, 647, -909, -995, 520, 1108, -109, -1099, -285, 902, 525, -650, -657, 333, 594, -124, -481, 51, 319, -93, -244, 193, 255, -299, -387, 346, 615, -239, -842, 30, 1001, 311, -997, -704, 844, 1074, -518, -1270, 58, 1317, 412, -1166, -775, 810, 1006, -424, -1070, 6, 907, 290, -717, -442, 388, 417, -238, -346, 91, 149, -138, -80, 251, 54, -401, -198, 495, 431, -461, -658, 294, 894, 22, -938, -349, 874, 724, -591, -977, 256, 1052, 184, -951, -537, 715, 787, -317, -849, -37, 741, 327, -507, -499, 175, 474, 60, -353, -239, 88, 207, 59, -116, -207, -81, 149, 234, -8, -337, -229, 264, 403, -66, -545, -188, 548, 507, -348, -722, 29, 796, 386, -687, -673, 441, 924, -28, -926, -359]
4504c59J174j15j223l16J028O93p02r18K90R58K2p91k46N44L38k94l19K08J29
4523A01k03j3L37j9n50n7O69L73p87p08P03J066l79j364l2J413N77j277j078R60
4543b68J399m40j537r7J438N63j132q92P47J020l54r73P0P74N5n68p7M53Qm36
4563b47Q7N33j53p03J1R31K47j050n98R57J011o90j362L04J516K11j468p29J213
4582B1J144p87j342K55J369J86j092n90P87P59m57o70J27N25N2l80l2R4Rj32K54
4603A00J79l11l90L20O39j77q70j29R00N13p09r15M72J037J1j167l88R28Q19n02
4623C60j041N6J054L79q76p13N06Q82j12q24k36N77N42l99m52k6M85J60k67k52
4643a97P4J94M1L0k4k30j27K65M28k93o22M3Q07L05q05p48O69J031k69j199k91
$$ y = [-359, 815, 700, -523, -839, 189, 882, 180, -738, -448, 510, 532, -259, -505, 39, 377, 83, -236, -28, 101, -102, -115, 222, 203, -347, -404, 265, 638, -149, -857, -154, 912, 533, -831, -863, 550, 1127, -150, -1228, -268, 1131, 691, -846, -943, 495, 1058, -74, -966, -219, 801, 447, -526, -456, 318, 373, -195, -272, 181, 189, -247, -160, 373, 220, -483, -472, 459, 706, -344, -942, 15, 1026, 336, -1026, -722, 794, 1005, -463, -1192, 21, 1165, 378, -964, -709, 660, 846, -246, -836, -49, 710, 253, -417, -290, 235, 287, -93, -125, -31, -22, -154, 100, 279, -32, -422, -102, 537, 360, -510, -639, 261, 774, 65, -850, -378, 659, 670, -497, -885, 43, 862, 360, -681, -625, 429, 808, -68, -781, -275, 607, 495, -329, -565, 12, 554, 155, -297, -323, 162, 322, 55, -197, -123, 71, 112, 142, 118, -112, -239, 26, 454, 161, -461, -418, 389, 694, -111, -859, -190, 841, 572, -627, -918]
4664i18J299O92j061j031N33J228J5j248m04R45Q48p47r23L77Q99m3p05j43M79
4683I2J78l81l7K98M1m82J49O05j24q03j54R71N17j014p80O77J377o49j523Q6
4703i56J449P41j305j192J126J204l82j576j59J624L79j046q00O84R63n76o07
4720d29K15N08j63l48J44L33j75m97M22M44k70p61J88J006K11j206n44J023J007
4739A108p74j321K83J449K91j494o21J068J019n99j216J49J095L22q82n43M90
4756a76O78j96n70m3L69J40j37j36J3k4j3K25R6l04l01L07M98j04o69j62O66M97
4778F54n13p76K30R30J94q92o30O69R06k81j006k19R57O00o80q87K90R41J45q37
4798b05m49N60O29k28o52j5M94J55k88j95J38Q9o4Q4J31k24k89K39N36j01p82
$$ y = [-918, 381, 1073, 12, -1019, -486, 742, 757, -491, -895, 50, 898, 151, -772, -395, 504, 461, -244, -387, 92, 270, -111, -148, 150, 191, -291, -142, 463, 339, -464, -618, 353, 870, -144, -924, -247, 1130, 481, -1042, -956, 493, 1234, -71, -1263, -137, 1067, 685, -891, -1050, 574, 953, -93, -893, -209, 754, 178, -429, -214, 294, 131, -217, -73, 260, 85, -412, 10, 454, 184, -577, -389, 617, 828, -378, -922, 101, 1108, 334, -987, -704, 745, 1036, -458, -1079, -11, 1008, 409, -807, -658, 437, 759, -123, -666, -176, 502, 306, -264, -307, 62, 202, 65, -71, -58, -82, -95, 130, 226, -78, -379, -72, 426, 322, -347, -509, 157, 654, 141, -635, -405, 525, 719, -173, -803, -134, 772, 491, -515, -734, 223, 823, 143, -744, -454, 487, 632, -205, -654, -94, 535, 307, -345, -360, 134, 289, 1, -194, -56, 33, -31, 53, 184, -40, -329, -90, 446, 345, -437]
4819d37j67Q84N38q21r26N71J205j24j362l47J264Q33r79j167N46J323r7j256
4837e19l54J057O53p47p52M04P29j78n58J3M60j08l18J85L45k88n07L23P18j72
4857C86r85o5J146L98j061r12Q94J264m80j489NJ506N21j298r79R35J220m49j285
4876g28RJ130L70q86n39N58N75l01m75J78L03j50k28K63J83l66k88M40N13m38
4896A23p47K49R12J16j049m48R34Q11o35j102K30J178K62j074o48P48R03l08r85
4915e30r5Q51M23n79o00K23N99R6m31k74K14L02k7j76j08mJ16J47K8k38k05J59
4937a09M14J1n24k92N22N64l09p81r0Q95M27p27q37M70J044m1j092m08R36P96
4957H69o09j023K12J038K26q86n00O17O14l07o33Q7M84N1l03j5J64q9j48K11K74
$$ y = [-437, -604, 280, 818, -3, -929, -358, 847, 723, -639, -986, 278, 1111, 132, -1035, -489, 834, 737, -519, -873, 184, 837, 90, -662, -258, 471, 293, -265, -252, 208, 100, -218, -33, 312, 24, -483, -160, 558, 386, -599, -664, 482, 880, -181, -1093, -199, 1065, 585, -904, -899, 607, 1128, -170, -1149, -214, 1006, 557, -728, -719, 411, 781, -105, -644, -86, 489, 188, -287, -109, 194, 44, -184, 79, 262, -104, -392, 48, 561, 123, -624, -375, 537, 653, -396, -844, 90, 901, 266, -836, -606, 572, 834, -240, -888, -140, 763, 455, -530, -625, 226, 649, 70, -530, -307, 292, 388, -43, -317, -103, 199, 172, -4, -112, -116, 0, 147, 175, -63, -268, -109, 305, 316, -208, -500, 22, 586, 277, -504, -594, 301, 728, 1, -836, -366, 678, 637, -455, -863, 73, 869, 260, -763, -551, 487, 713, -173, -673, -56, 558, 251, -382, -295, 189, 240, -63, -78, 86, -3, -151, 60, 334]
4978C34l02n01K56P50q9r39k38J025O45r07j044N80J341j57j452l21J298Q15j006
4997H8j151O14J254j54j201k17R80M92p14n54M42N21k51m17J80L24k50k99L78
5016F5L51m44n55M65P83k94j018K1J132L68j096p86Q85J113m74j338qJ362L94
5035I26j064q13P29R94l29r86m3Q22K99n54m26L22L40q6k24M3K4p0N3L42j06l41
5057a48j15M42K04l30o14K66P21J10r24l73P08Q03l99r62N1J009K30p75o93M83
5077c06R21q3q80l12P07N35l88o56O9O04K03m13l66K06L26N6k68j24R2O2J19K7
5099A31j40k07M1M07J35m61m15L68P21j48q77k50R23N88o90r65L74J165L9j129
5119c90n00R70Q27o49j031K64J026J47r35l63O59N05m26n03K27M01j59k55J89
$$ y = [334, 32, -469, -213, 537, 448, -491, -729, 296, 941, 34, -1010, -430, 911, 754, -698, -1019, 279, 1094, 88, -1063, -449, 805, 651, -550, -767, 213, 705, -9, -563, -121, 400, 149, -268, -88, 236, -14, -313, 65, 416, -28, -583, -118, 665, 371, -647, -626, 506, 874, -222, -1008, -123, 990, 516, -822, -830, 532, 926, -138, -951, -222, 772, 443, -543, -586, 236, 535, -19, -445, -123, 217, 131, -93, -50, -26, -96, -43, 299, 193, -148, -263, 179, 383, 53, -561, -295, 426, 536, -388, -761, -53, 750, 351, -611, -560, 449, 679, -96, -789, -306, 615, 532, -348, -660, 47, 582, 194, -462, -393, 211, 414, 1, -365, -159, 167, 223, -45, -169, -77, -15, 104, 131, -9, -216, -175, 232, 367, -94, -509, -141, 580, 432, -445, -695, 228, 816, 126, -839, -465, 700, 739, -390, -890, 80, 907, 258, -773, -509, 517, 664, -271, -634, 25, 530, 104, -399, -172, 229, 70, -185, 4]
5138DK15l02k58M17L98m54o36L79Q87j40j099j78J119O24r81j009O70J283k44
5157F95j387k25J273O64j014r29N90J043j94r78j14Q14K69n62l44L87K89k86j61
5176a70K67J11l91j26N01K68n91m55N41P37m05r91J34J071K93j067o58Q58R74
5195I01m75j146M6J136L54r31o65O09P99k32p69j04N96L28l67l56J29K63qo1o8
5216b1n6l8J52J77q8l58q1M73K77m13n17J97P00P5p05m00N44P02k94q34r1Q42
5238B43M54o59p36L22Q97M6q26m02O80N90l40p29O9O65J57m65l29K85L21j09k24
5259i0LJ09m1oJ61nl20j02M60K94m80n77L78Q22j15r62k61R42O93q15r97M63J179
5282G33J2j218l91R91P52o86r39L43R18pq00j82O12K99m24l12L24K14k72j47L42
$$ y = [4, 219, -83, -341, 76, 474, 20, -616, -237, 650, 510, -589, -767, 352, 976, -5, -1014, -344, 939, 695, -692, -917, 356, 1020, 6, -923, -333, 710, 516, -462, -576, 238, 507, -55, -399, -12, 277, -9, -170, 97, 208, -183, -309, 192, 460, -131, -586, -45, 692, 287, -704, -570, 501, 794, -273, -931, -73, 901, 426, -720, -674, 462, 816, -115, -780, -171, 628, 396, -373, -477, 119, 447, 80, -276, -147, 116, 108, 47, -21, -77, -115, 37, 214, 126, -232, -313, 160, 437, 24, -493, -296, 404, 479, -226, -626, -82, 620, 326, -508, -599, 243, 697, 38, -698, -376, 521, 567, -259, -661, 19, 609, 269, -460, -391, 274, 431, -34, -363, -78, 243, 134, -90, -87, 22, -19, -25, 136, 131, -189, -291, 169, 463, -17, -594, -216, 606, 491, -471, -732, 210, 903, 88, -909, -446, 733, 745, -473, -864, 127, 879, 193, -746, -403, 515, 508, -292, -474, 138, 437, 13, -299, 25, 239, -33, -180, 162]
5303A62J46n02j95N75M03n94p02M13J022k60j079j99J229M92j016r66P73J203
5321I05l07j282r6J153M92r92o83O19P87k41p57QN30K41m47j72K88M5k01P3K25
5342A88q7m87J62N61J00p14l02O37N85l87q63J46R90J54r15n75O67R24l99r65
5362e80K3Q23M40p48n89L92P23j02o20j88L96L98k41l44J5K76Q9j34n9m1j8R8
5384IJ71q3k74r7L53L16l05m80N6O48K23o20n27M31P75j10r09k25Q10N97o03q52
5406f96K36R55J40q91m34O38O89l71p46P4O62J63m99k90L43K27j95j47J64O3k02
5427a17l5L76N2m99k08N62M85n63p61L95R90p0j128l08J085P11q60j069N27J213
5447G78p8j197l51J048O29p30p96M05P93j12o95o6N12J22l61p0K92k2l18O0M67
$$ y = [162, 308, -194, -389, 186, 589, -5, -707, -294, 728, 468, -611, -810, 419, 911, -105, -1071, -298, 905, 598, -684, -780, 373, 865, -127, -810, -191, 596, 355, -402, -394, 136, 377, -70, -242, 46, 91, -110, -37, 188, 101, -386, -224, 337, 437, -277, -579, 58, 643, 256, -607, -461, 529, 683, -232, -807, -140, 784, 385, -580, -557, 266, 706, -42, -631, -239, 484, 382, -238, -426, -30, 368, 127, -217, -202, 74, 163, 29, -30, -71, -89, 9, 180, 97, -177, -274, 79, 395, 90, -390, -334, 314, 537, -83, -610, -179, 596, 486, -423, -648, 162, 759, 156, -696, -460, 495, 635, -256, -690, -52, 637, 266, -480, -406, 256, 419, -80, -370, -27, 200, 5, -142, 22, 85, -117, -152, 224, 276, -223, -431, 131, 616, 53, -708, -313, 677, 607, -521, -829, 256, 967, 107, -962, -435, 778, 700, -497, -848, 200, 829, 99, -697, -292, 501, 389, -306, -372, 140, 262, -99, -169, 123, 101, -217, -157, 310]
5468C10m3o19q9P24L30p44o40O18R38l50j118j2J167M39j040p92P18J051l47j101
5488f00o4J004L97p55o12M65O55j82n66n4M31Q0k24n8J10k7j19J58K02j85m09
5509c53J38N46L7o24l11O14N68m19q03J25R14K35q09o10N85Q34k34q97j29P91
5529A98M48n17o74J98P15J02n98l22L69M36j38m25m7K76J71j28j36K5NM4J17L5
5551A54k30k24K49L97r4o05j35O92M31o10p59L85R48Qj018m17R24P72o33j025
5571g90K85J074J33r87m58P56O75m68p16J33O83L6n03j32L69Q8k74JK70p8l98
5592c01J08N44K1p37k26Q19N35p61q66N21J148j53j280k64J166P28r68j034O09
5611c91J203j65j221k11J041N04p29o78M58O65k11n44M3M27n7l05J31K90k17l75
$$ y = [310, 267, -352, -441, 283, 613, -131, -771, -153, 785, 435, -683, -695, 472, 911, -129, -921, -203, 848, 501, -600, -664, 340, 737, -18, -630, -165, 490, 308, -258, -312, 119, 199, -25, -83, 27, 0, -119, 39, 241, 56, -353, -215, 331, 368, -256, -567, 47, 615, 196, -607, -482, 432, 667, -142, -752, -167, 667, 433, -464, -593, 198, 646, 129, -545, -347, 368, 470, -128, -450, -81, 355, 217, -208, -255, 21, 192, 64, -72, -47, -42, 2, 119, 154, -76, -300, -51, 346, 252, -353, -488, 204, 635, 25, -734, -349, 599, 607, -411, -828, 96, 868, 235, -790, -505, 569, 702, -285, -743, 13, 688, 220, -496, -363, 320, 356, -147, -279, 90, 178, -96, -95, 175, 97, -301, -193, 351, 372, -365, -591, 228, 763, 2, -864, -343, 805, 652, -628, -892, 274, 1002, 34, -1000, -391, 812, 647, -574, -785, 256, 760, 31, -647, -189, 476, 265, -279, -236, 191, 134, -171, -40, 250, 33, -342]
5631c42K51N53j87p50M1Q23L15r04o05P26R30m47j137L9J147M00r68p66O50R69
5651G38k64j000j05Q44L95n94n24K51N75l9m26j03K51J34o3o5mm9m0J74J77k37
5673B6l53J58M68R9n78l30M97N99l21p58j8Q21L69o91p06M17Q98m1r07l71P64
5694D2O75m76q42J09Q44J98o43m63M22N22j52m92k9L57J18j76j04Q7n4l2J57J89
5716B57k44l78J99N61j4p60k27P88N85o56r32L65J154M0j197m56J040Q70p60j112
5736h77L64J136Q2j073l73Q17O03n57o73L26N51j20m25M4L32j14k87K07L78k90
5756E1n17K62P31r5q96j91R83N46r31q74O47J188k71j329j73J251O08r96r33O34
5776c05J078k13j073j48R01M07o39n18L75M51j71l46R8K36j36j68K23K07l42l42
$$ y = [-342, -91, 462, 275, -475, -434, 389, 704, -200, -805, -79, 851, 404, -733, -694, 453, 853, -115, -881, -231, 738, 474, -526, -631, 213, 608, 14, -510, -259, 316, 277, -149, -252, -1, 133, 70, 5, 1, -48, -88, 86, 263, 26, -327, -169, 299, 398, -180, -510, -13, 586, 265, -493, -511, 310, 679, -12, -718, -301, 597, 556, -351, -722, 42, 717, 241, -601, -492, 352, 550, -93, -556, -134, 388, 236, -256, -285, 72, 190, 14, -90, -3, -57, -89, 68, 257, 13, -365, -166, 395, 381, -379, -606, 182, 767, 111, -821, -456, 698, 738, -459, -915, 125, 995, 235, -877, -513, 623, 705, -368, -741, 76, 679, 122, -551, -225, 326, 206, -219, -175, 157, 43, -244, -37, 341, 51, -466, -204, 527, 432, -464, -655, 328, 874, -57, -931, -284, 904, 633, -696, -869, 382, 990, -6, -939, -305, 773, 560, -513, -661, 240, 647, 8, -510, -135, 316, 145, -201, -103, 133, -3, -171, 52, 259, -83, -425]
5796d25L72N59k98p50J08Q62K21q60o07P36Q83m01j062K6J020M35q76p19N19R03
5816F46j22r00k40P21M69m05n93J15N46J05l51k68J74K17L3j59p7nK6J41J23j66
5838C0l35J00M33J57n14l72L67O68j39q11k04P76N97o25r00L28J042R9j025n10
5858h38Q59P99n07r56J23R39K31p87m49N10N68k63n32R2L81j6k62R2J59j98j89
5879b44K72L53l20n81K31Q16j7r59l13R47P51q44j055N05J259m0j294m43J172
5898A96Q07q42j060M53J135l8j029l00Q17M87n90n01L60M25k37l10K06K75l17
5917f3k59M14L72m65n98L91Q59k08j038j10J107M91j026q56P14J173l18j313j30
5936h63J231N60r52q72N71R90j68r39j36P33L40m42l99K18K88m1j92L4O8j28J1
$$ y = [-425, -53, 506, 208, -542, -434, 428, 649, -211, -818, -82, 801, 400, -662, -636, 384, 819, -57, -776, -257, 646, 524, -376, -616, 105, 574, 169, -424, -309, 237, 342, -9, -277, -103, 114, 147, -12, -89, -94, -68, 73, 196, 30, -305, -205, 228, 385, -129, -501, -134, 534, 395, -416, -620, 156, 753, 128, -772, -444, 598, 697, -328, -838, 21, 820, 313, -643, -520, 419, 650, -137, -586, -76, 492, 229, -303, -211, 170, 154, -108, -16, 143, -55, -244, 28, 381, 61, -520, -289, 527, 510, -449, -762, 185, 936, 92, -963, -458, 801, 761, -533, -976, 196, 1003, 161, -899, -446, 689, 651, -378, -678, 139, 626, 36, -465, -105, 320, 83, -227, -21, 254, -63, -322, 92, 464, -1, -599, -208, 651, 443, -595, -705, 402, 893, -133, -989, -275, 898, 580, -733, -863, 368, 928, -24, -896, -325, 665, 497, -442, -578, 155, 495, 53, -346, -128, 160, 119, -73, -39, 29, -99, -88]
5957h8K67O0m12k03M34M18l19o83J41P92K19p99n44O09P95k73r75j14R49M76p01
5978D9q01L72R21L4q81l98O70O37l55p00KO39K47m61l21K06L15k0j90n1M2KO6
6001B4J55o5l41n6M55K94m70n64K96Q65n4r60l45R17P28o75j066L20J194J34j170
6022c84n52R40Q88n96j027J90R98J46q23l92O25M43l72m14K31L20k00k29K63K33
6042B88m14l12N29M89n07p73L85J006o3j190l16J188P48r84j160O71J357j49j427
6061f34l46J278P45r41j019N44J034j33r38j97P55L15n06l03L26J98k32j15K74
6080A05P5m16j22N61K84o03n55N72P97l29j050K7J119M20j019q36P79J079l31
6099E57j240r2J131N13q71p96M94Q96j06q57j71N84L95l22m16R4K97M3j30l6m3
$$ y = [-88, 179, 239, -173, -376, 58, 476, 157, -526, -385, 407, 626, -173, -717, -108, 687, 414, -561, -675, 274, 750, 49, -752, -380, 541, 575, -306, -704, -34, 603, 248, -452, -450, 189, 436, -25, -346, -140, 175, 155, -35, -86, -44, -42, 24, 179, 114, -227, -283, 172, 466, -4, -568, -272, 593, 539, -421, -766, 151, 879, 204, -862, -542, 652, 786, -384, -936, 4, 892, 296, -731, -541, 457, 603, -220, -612, 13, 456, 84, -330, -99, 221, 21, -208, 55, 288, -126, -438, 91, 580, 73, -700, -315, 691, 628, -562, -878, 310, 1058, 74, -1086, -415, 942, 793, -634, -980, 298, 1043, 102, -917, -373, 661, 528, -410, -607, 148, 463, -43, -346, -20, 178, -54, -169, 105, 180, -236, -358, 203, 487, -116, -671, -99, 698, 369, -681, -654, 465, 885, -134, -970, -191, 888, 557, -683, -775, 356, 869, -2, -798, -304, 592, 486, -371, -542, 42, 437, 115, -301, -207, 90, 133, 3, -33, -76]
6120g6m0O2K37k8l69j47L99M14l00o45Q8P41K38o83n98M87Q69j63r62k53Q98O49
6142H18o55q89K44J016J48r35n17O79P33l28p96L4O88K12n16l36L19L03j40j91
6162a09Q0P3j57KL20J5m74j96N77M88n62p96L71J028mj173l97J092Q31q08j188
6183i87M17J343P9j310n09J050Q44o85j002L05R96Rq38k32O11L02m08k73L25J51
6203A88l45q3M25J29n76k49O98M70o80p94N29J052j63j280k22J291O48j054j079
6222a095P43J290k47j370k20J224N75q71q29M97R16j85p77q6N81J88l49j77K05
6241A3Q2j76L5K93p6n05M5O15J50o94m52O32P37l93r67M4J056L52r38p25O37R97
6263G62k62j065j67R37N72o83p72L27Q00M6o97l11M47M77k07m37j6L10J36j14
$$ y = [-76, -116, -54, 183, 155, -214, -361, 38, 452, 152, -493, -405, 336, 574, -109, -707, -220, 649, 486, -476, -729, 169, 818, 163, -726, -482, 534, 682, -253, -770, -91, 642, 314, -482, -448, 240, 452, -64, -400, -81, 222, 82, -109, -29, 44, -113, -111, 209, 224, -250, -446, 131, 619, 57, -739, -368, 660, 656, -517, -914, 178, 1009, 201, -987, -570, 773, 852, -458, -967, 83, 927, 242, -760, -455, 541, 550, -288, -520, 91, 393, -15, -288, 37, 188, -157, -240, 185, 314, -262, -511, 187, 657, -23, -817, -288, 764, 601, -679, -901, 390, 1038, -16, -1095, -352, 938, 691, -679, -899, 325, 900, 29, -800, -303, 613, 428, -349, -435, 146, 334, -15, -192, 13, 95, -81, -46, 247, 171, -334, -289, 326, 476, -218, -670, -38, 699, 306, -661, -617, 439, 791, -147, -872, -235, 762, 500, -565, -732, 205, 777, 94, -678, -351, 449, 495, -202, -513, -66, 411, 204, -233, -249, 61, 197, 83]
6283H3j36j1m1Q9J73L5l14j89L16M06j82o51l8P09M10o74p18M13R74l6j068m00
6305h50R60P71o32j061K45J097K24j005n59P07P80l65q33Q6O99J74n60k28L46
6324dK18k24j05K15K4l39K5M77R6o68k67O83O26o62r17M17J182l8j298m20J175
6345A96Q73r24j186N17J360k3j340m16J093P49p60q85M11Q31j00p02q3N33J00
6364B44l75n1L34l0m08J23N15m5p11j11Q23M33q19p66O41J053l21j237r1J221
6384D22N62j030r46O89J142k54j153j96R93N14p03o94L81O86p0o01q2L74J50j77
6404Gj04J23o7q1J36K45k06m24J25N58J39o75l90N91O89l67q88OR33M14q08p48
6426g92N12R65j09j011l17Q46O81n43q40J40Q25K30o81m56L76N72j36m93n0L13
$$ y = [83, -53, -64, -105, -16, 157, 192, -122, -311, 5, 411, 229, -422, -460, 249, 659, -15, -733, -320, 654, 618, -450, -850, 110, 881, 249, -812, -567, 530, 754, -251, -810, -103, 677, 312, -521, -435, 264, 438, -122, -350, -4, 214, -10, -115, 100, 124, -215, -190, 287, 383, -285, -552, 131, 757, 95, -822, -405, 777, 739, -559, -979, 196, 1069, 145, -1041, -524, 836, 813, -527, -943, 150, 899, 139, -746, -335, 496, 396, -306, -389, 144, 244, -131, -182, 152, 122, -286, -163, 352, 307, -404, -515, 308, 741, -78, -844, -203, 850, 529, -708, -799, 422, 984, -46, -992, -303, 839, 585, -568, -764, 229, 743, 40, -654, -273, 413, 343, -258, -340, 34, 184, 7, -97, 26, -41, -122, 14, 259, 53, -371, -246, 312, 451, -224, -614, -23, 666, 299, -589, -583, 350, 764, -44, -792, -280, 685, 576, -435, -752, 94, 775, 232, -608, -468, 357, 587, -94, -550, -174, 398, 262, -231, -281, 32]
6446C2J61j64j26M1j8jJ70J01k50k93K12N31n2p11k44P78N68o01r06L19J132Q3
6468G62j193n15R93R44o63j202K47J238K08j117n28Q10P50m85q03K06P00J6n60
6487a92o5L55O1k80L2L37j48m70R9O92M4q64l03R03O57q04j002M86J297j06j349
6508f20l59J228Q23r61j127N46J286j05j202l10R88N95o94o99L92O19j21n39N8
6527b02L59k9k97J48K84k72l71K60O13k19p81l2R03L61q91p59P42J031l56j183
6547f91j15J205N03r40q82O11J020j59j001k46Q23N25n02o46J79O04P3m36k25
6566c00K35J97m3p4l0q2j8J82J77k07l49R6N06J39n83m25M78O81j99q65j37Q40
6588B19N55o97q49L26J043P0r73n15P89Q05m40r45M0R28K73p05n35M77N61j63
$$ y = [32, 193, 29, -97, -56, -74, -75, 95, 196, -54, -347, -135, 396, 344, -367, -611, 167, 735, 134, -772, -453, 679, 762, -431, -946, 47, 991, 328, -874, -627, 611, 819, -298, -826, -16, 734, 249, -554, -348, 352, 368, -192, -257, 98, 159, -121, -89, 248, 100, -370, -271, 421, 465, -399, -702, 201, 858, 54, -948, -462, 835, 729, -620, -979, 249, 1072, 111, -1016, -470, 816, 711, -491, -801, 187, 782, 88, -611, -219, 400, 279, -260, -202, 157, 128, -169, -21, 263, -9, -380, -120, 493, 274, -507, -539, 364, 725, -166, -925, -183, 848, 492, -691, -806, 399, 902, -38, -920, -309, 711, 552, -449, -695, 128, 653, 151, -495, -316, 288, 361, -75, -300, -65, 132, 89, 15, -15, -97, -115, 67, 244, 37, -312, -216, 290, 429, -154, -579, -101, 580, 381, -484, -621, 219, 774, 77, -772, -446, 597, 667, -306, -821, -32, 773, 333, -612, -572, 356, 629, -76, -611, -134, 427, 264]
6608B64n26QL53J07k39l6J43r6j42J93K86k51n03J96P18K5q35l79Q26P72o99j058
6630h73L13J234J32j207o12J035R73o66j224K97J188J56j063m69Q15O31n24o31
6648d95K45N66j08m38R5L49k01k74K37M22k89o49K81Q23n5j000k64J024O81r13
6668C7j034N94J302j87j343l27J247P29r27j046N35J116j20j020k33P84M78n25
6686F0n10K63M34r5k98P8J49j13j09K48J40l38l34L70N61k53p53K0Q64L08q18
6707a26o62N99R41k57j069j65J014N69p61q80M26R20K1q79l62O56O04l69o09n
6727c94N60J86l46l06J57K52M5j59n4n2J7J34J59j22l35OM26K86m81n03L04P30
6749E10j2q56l32P89O97n46r82J77J091K53j020o36P64R23m20j015J2R40K97p27
$$ y = [264, -262, -254, 99, 206, -33, -69, 74, -22, -164, 29, 315, 64, -439, -243, 475, 500, -335, -714, 112, 884, 185, -873, -560, 674, 806, -401, -1013, 22, 995, 329, -895, -598, 590, 746, -317, -786, 29, 660, 136, -495, -250, 316, 208, -230, -135, 214, 13, -261, -24, 398, 109, -540, -259, 564, 509, -491, -755, 269, 950, 37, -997, -403, 899, 712, -631, -958, 289, 1018, 91, -955, -420, 696, 576, -444, -677, 107, 585, 60, -450, -187, 247, 152, -146, -68, 81, -32, -141, 107, 247, -91, -425, -55, 506, 253, -500, -480, 384, 692, -126, -788, -189, 752, 495, -574, -739, 275, 844, 83, -797, -371, 549, 570, -309, -671, -15, 589, 220, -389, -394, 166, 352, 6, -300, -143, 109, 154, -5, -59, -111, -94, 40, 199, 77, -258, -252, 174, 460, -21, -524, -220, 510, 498, -358, -690, 99, 796, 250, -732, -555, 536, 789, -231, -867, -103, 820, 400, -615, -603, 337, 634, -93]
6769i3m78M38N65k36m99R2L50n0k53J44K00k44k88L47M42k96p14J80R19R7j035
6790d12m43R59Q74p50j148L40J323J26j302n58J046R37p22j116L04J128P5r42
6808b81l62P00M75m63m51K57L87k11k64K26J96l11k56M26L80m52o13L64Q75j35
6828D87j025k12J023O29r02r73O14J154j31j243k91J088O84q04q76L89R60k7q34
6847b90k87O33L82l00m14P7L07K0j58K0L9j39j2K89P2l74k60L58N15k48o71l4
6869d75P53L48o76o64M46Q59m9r59k97P89O77n30q97J68R28K25p70n41M92P14
6889E41j77p11j12N83K94l38l92J55L14j3j82JK1m7K5J86J8l44k07M82M10l69
6911A38p31J95Q69J62r28n68Q27Q95n07j141R9J213L32j088o93P81R41l92j022
$$ y = [-93, -571, -133, 432, 196, -303, -211, 139, 89, -164, -20, 180, -64, -352, -5, 437, 141, -573, -393, 526, 623, -412, -855, 104, 978, 228, -920, -580, 743, 869, -433, -991, 55, 992, 270, -846, -542, 586, 661, -281, -643, 57, 532, 69, -382, -125, 262, 51, -213, 13, 209, -102, -358, 68, 448, -4, -617, -253, 622, 487, -538, -750, 273, 902, 0, -973, -359, 795, 664, -579, -870, 218, 902, 98, -778, -389, 571, 544, -290, -577, 56, 438, 138, -276, -199, 108, 128, -30, -10, 29, -110, -122, 167, 239, -135, -395, -37, 478, 230, -441, -475, 278, 626, -50, -714, -268, 591, 542, -417, -714, 75, 752, 222, -675, -507, 421, 646, -124, -665, -173, 541, 364, -347, -459, 124, 418, 80, -312, -157, 157, 144, -38, -37, -16, -63, -38, 148, 166, -178, -385, 97, 507, 138, -593, -398, 471, 633, -295, -863, -36, 859, 352, -789, -690, 523, 855, -233, -926, -145, 796, 404, -618]
6930f18L1R37K71p55m46N24M52k95l68J98K63k17j61K75K16m13l34M75N55m37
6950A53q23K53J043P4j151m65J078Q38q08j165L85J345N3j295m85J073Q06o93
6968B16r99L25R57L5q05k45N78L15l64k83K44J60k10o6K97L7m20j34N22L52n43
6989c1n92M43Q07j63r85j73R89N59q33q76N13J046j05j032l45Q97O19n58q09K15
7009d14Q14R3o49l49M08M47j53l99j7K09J22o9n3l4q2O8K14N3l10k49L02M39j28
7032B63o18j22O80M15n45o99K64Q68J19q85m85O95P98l85r91J7R55L57p61o48
7052g08M82P76j46p48j41O07L13m18l64K16K97j02j65R1Q7k00m1L29J16m50l16
7073d85N00N98m07q60J64J036K04j070o30R11J024n97j221J32J283L11j136o95
$$ y = [-618, -587, 350, 621, -134, -580, -56, 396, 101, -267, -69, 194, -23, -184, 91, 307, -106, -440, 35, 590, 153, -670, -417, 626, 700, -451, -916, 162, 1000, 192, -973, -588, 757, 810, -485, -970, 103, 909, 216, -783, -458, 499, 534, -271, -516, 62, 377, 13, -270, -26, 134, -76, -142, 155, 192, -228, -362, 160, 512, -31, -623, -180, 627, 464, -521, -694, 295, 854, 21, -855, -342, 704, 599, -433, -778, 119, 738, 180, -629, -414, 400, 493, -156, -505, -97, 350, 197, -202, -219, -10, 112, 43, -10, -44, -126, -58, 156, 209, -101, -350, -48, 391, 263, -355, -477, 203, 618, 73, -626, -362, 506, 625, -260, -745, -50, 748, 363, -628, -611, 344, 701, -60, -708, -226, 550, 404, -344, -485, 122, 435, 17, -347, -131, 166, 64, -101, -10, 77, -123, -164, 165, 281, -169, -485, 15, 613, 206, -654, -490, 546, 750, -320, -950, -39, 985, 388, -833, -701, 582, 893, -243, -938]
7091i38Q58R06m84r75J44Q68J37p18k68N00K61l21k22L05R9l32n8M48J15n61l22
7112e58O29N82n37q73L54J057Lj136l96J060P94q01j097M23J201K2j148m16R25
7131H8P26o24q33K55Q00K9o09k14M18K15k06j74J49J0j31O5K61p3m46j4N36K57
7153D85n78n15M37P62k08q63j83Q92M91o69p88L53R55M0r07m07O77O80l80p89
7173e15O8P06K71n37m59K78M93k4m15j34K58J56p1j11l3j8O4J22P3k35k42J85
7195a20M34%n82k50N87N34m33p92J20R86K11r22o22P36R07l81j063k9J030M12
7215G63q38o53N18Q13k15p86n4O17K42m53k74L30J93k33r7K50L4l55m5M71J95
7236D23o12m09O16O79m48r84J68J140K09j125o09R37R47n94j180K02J212K00j058
$$ y = [-938, -80, 826, 342, -633, -489, 379, 516, -202, -470, 30, 291, -30, -252, 53, 152, -180, -238, 210, 325, -236, -558, 71, 653, 116, -757, -403, 654, 657, -479, -875, 185, 979, 178, -919, -496, 705, 727, -421, -837, 88, 814, 190, -643, -388, 412, 441, -168, -382, 36, 251, 45, -129, 20, 30, -101, -36, 225, 152, -294, -308, 228, 485, -93, -608, -171, 591, 383, -480, -663, 229, 720, 51, -737, -384, 571, 611, -296, -703, -26, 654, 274, -515, -447, 259, 530, -7, -466, -188, 305, 281, -134, -268, -10, 146, 75, -36, -69, -87, -23, 99, 172, -63, -305, -120, 314, 314, -268, -518, 69, 603, 170, -622, -502, 484, 695, -227, -849, -113, 794, 413, -650, -679, 351, 763, -75, -728, -210, 603, 388, -398, -452, 165, 407, -46, -320, 10, 203, -30, -127, 123, 157, -198, -243, 228, 423, -189, -598, 18, 697, 249, -735, -567, 573, 782, -343, -952, -15, 932, 338, -842, -640, 572, 772, -286]
7255b86n70Q34P46m64q30J75P31L1n64j25M04J06k78o6L31n1l93O9N24M7o73k38
7277e40P17N13o38p86M03J026p0j101l41J006O82p37r52L76J030K2r35l86P25
7296A4O06m11o80J00O18J00m06k26K15K01r0n9rk6l9J25J96j35l48J1M51K11m98
7319g9m50L93O33j02p87j89P26N68n42q15K28Q81J65q34n22O06P57k67q08j12
7339e50P57L49n22n27K62N45j4m50j62L15J73j69p6O0qr2J21K18j46l81N4N53
7361C10J26o15m31N92P07l85r31N6J024L59j003o92P38R84l75j128rJ059L81q97
7381a30o12N89P55k90p24K4O32M6m33r1L21L6k75N1L48j05m94L8O57J57p73l98
7403f71P35P36n76j039K87J189J15j144n42R74Q98o94j063K41J116J20r63m27
$$ y = [-286, -856, -22, 724, 260, -570, -395, 336, 367, -197, -322, 82, 188, -90, -156, 175, 124, -269, -200, 324, 371, -302, -540, 177, 690, 52, -734, -331, 695, 625, -476, -817, 189, 871, 134, -818, -442, 588, 610, -325, -711, 14, 620, 209, -471, -371, 247, 347, -59, -285, -70, 131, 41, -18, -27, -53, -92, 33, 229, 94, -254, -243, 208, 419, -79, -529, -136, 497, 395, -392, -581, 145, 713, 171, -644, -416, 465, 630, -204, -726, -120, 637, 370, -438, -550, 207, 556, 34, -493, -231, 314, 300, -150, -312, 3, 176, 7, -69, -9, -17, -109, 12, 230, 84, -297, -243, 310, 436, -179, -610, -18, 689, 304, -627, -571, 453, 812, -191, -883, -145, 839, 464, -664, -673, 386, 767, -130, -742, -153, 602, 312, -412, -388, 244, 290, -143, -234, 87, 123, -152, -101, 247, 142, -352, -314, 343, 500, -273, -671, 64, 800, 224, -815, -528, 661, 776, -368, -910, 64, 962, 268, -795, -554, 562, 682, -281, -708]
7421g08P28N95m21o48J85N11J9l94n5K61j9j69J04K18k05l37J76N41q0o88j18
7442e04P36M11o39p26M45R27q9j003k74Q81O10o22q41K74R26Q2p94m18N74N72
7462E28k58o20LM85K02k84k90J33J90K8r3n4l1pR0J57r9l22k3M13K21l74m55K17
7486b43O58Po91l54O39O22l88q50N5R08L17p88o16N16Q52j99q83j37P72L99n58
7507C8n51L14N47o3m75m5L14R3k16j0J36p9k32K05L47j90n21N6O75J88p42n13
7529g24O90P88m27j026P9J130K81j006o83P67R78m56j063N8J006K91q45m86N67
7548h1N97l07n45J21M63o0l34P2K41j37k58K04L86k25n79J58P24O3q61l19Q11
7569A34O68o60r46L52J095L9j109m04R08P57o26r45K78R36O6p58l56N78M36l15
$$ y = [-708, 20, 615, 194, -454, -269, 242, 261, -133, -188, 73, 54, -115, -11, 207, 2, -335, -159, 382, 302, -386, -504, 232, 643, 4, -722, -277, 650, 561, -442, -716, 165, 775, 153, -688, -414, 512, 594, -200, -618, -44, 528, 270, -350, -347, 138, 340, 56, -234, -101, 89, 117, 24, -30, -61, -68, 22, 179, 80, -242, -265, 148, 369, -5, -460, -243, 415, 422, -269, -623, 16, 638, 250, -600, -545, 363, 680, -108, -724, -208, 644, 445, -438, -575, 197, 596, 38, -513, -199, 348, 285, -190, -235, 79, 172, -44, -54, 82, 3, -229, -24, 323, 133, -388, -332, 343, 531, -211, -724, -34, 754, 327, -699, -620, 510, 791, -215, -898, -131, 847, 391, -672, -614, 392, 683, -162, -648, -81, 516, 209, -336, -215, 248, 188, -146, -74, 167, 30, -228, -24, 362, 137, -442, -284, 440, 503, -358, -677, 134, 802, 142, -804, -452, 643, 682, -427, -831, 77, 834, 208, -737, -459, 477, 543, -215, -571, 7, 443, 128]
7589A28m40J19L27j1j86K6J06r9o7J97J48k79l05K52M75j08o45r5O95L67o17o18
7611f30L72Q10o9q34k97P25N98m68q11J45Q25J84o68m45M22N87j38n91j15M58
7631F0K71k52l12N2K46O5j31m7Nj8M8J69k4k98j31L59L46l04n28J09O91J55p22
7654a91m59O03P09k97r60J5R33L91q10p09N62Q61k21q93j24P78L91o08m65L30
7674a64N29j54m32M8K95m5j97R4K07k20k63K62M41k28o19P2P79J97q52n20P83
7695A3Q16n29j034J51J141K27j035o15Q37Q50n02r66J59Q84J58p22l58N09M09
7714C93l07l63J79K62j36j94J91J78k96k38L75L70l93n28K81P08l5q29k83Q45
7734A80N64o52q28L64R70L6r95l65P95O48n19p78J72P77J23o15l24M07L94j93
$$ y = [128, -312, -193, 134, 123, -63, -37, 69, -30, -97, 100, 248, -31, -336, -84, 391, 283, -362, -457, 238, 605, -12, -630, -258, 552, 483, -351, -648, 77, 675, 207, -604, -459, 366, 550, -118, -563, -141, 446, 308, -283, -398, 60, 331, 79, -233, -181, 65, 130, -1, -48, -43, -61, -13, 156, 132, -166, -297, 62, 408, 104, -424, -315, 376, 531, -191, -650, -47, 662, 365, -595, -580, 353, 744, -66, -775, -213, 648, 427, -466, -590, 188, 579, -29, -494, -164, 365, 211, -221, -173, 122, 77, -120, -26, 181, -39, -302, -40, 401, 173, -446, -374, 405, 602, -250, -770, 13, 829, 300, -734, -583, 558, 785, -250, -865, -28, 822, 320, -646, -487, 397, 555, -167, -525, -16, 393, 86, -277, -98, 164, 28, -166, 25, 203, -93, -331, 44, 414, 21, -507, -226, 482, 447, -382, -665, 180, 744, 92, -736, -372, 598, 634, -361, -726, 69, 717, 198, -580, -408, 369, 492, -123, -447, -40, 354, 161]
7754A61l49J8K25M4r6k3J9j02J6K25P2l24k09K47M53j62n30j19N73L84m78n99
7776e54K16P78O8p44l70N56O71l24p83k4P55L71o16n65L54O53n5n85k07M47L18
7797C60k50l67R8K90oj73RM8r0k2K32P4l25k30L51M53k77o79R2P88K26p92n67
7820g57O74Q19l49j009j4J023L84q81o69O21Q24k81q85KP66K40n88l34L60L73
7840C19k28l02J65J97j87j34K57K03l62l48M02N10l08p45J32R14J35r39m68Q12
7860B5P85n57j031K32J092J81j013m91P58P19m68q05J69P66O9n68k50L83K70k31
7880C5k11J58J14j80LK50J5l61j43M71K89m39n14L02P05j05p95j84P28N44n75
7901A07p57K55Q64O8q28l43O08O21l72o62K3O38K22m75l69K41M21n0l22o8J65
$$ y = [161, -188, -170, 55, 99, 3, -20, -1, -103, -87, 138, 210, -114, -323, -76, 377, 215, -315, -434, 139, 523, 45, -554, -338, 440, 508, -236, -606, -50, 621, 297, -486, -510, 245, 616, 0, -565, -211, 442, 387, -198, -405, 42, 360, 110, -257, -159, 131, 125, -48, -39, 9, -81, -103, 129, 203, -122, -352, -1, 452, 175, -504, -412, 376, 602, -190, -757, -83, 736, 387, -622, -636, 387, 771, -110, -779, -158, 666, 385, -500, -498, 268, 508, -80, -414, -54, 319, 91, -211, -46, 151, -36, -170, 87, 290, -72, -420, -18, 492, 184, -561, -429, 485, 620, -319, -787, 25, 810, 253, -778, -546, 546, 727, -286, -777, -19, 700, 232, -573, -404, 362, 431, -137, -387, -4, 266, 35, -176, -18, 96, -84, -81, 169, 184, -177, -320, 151, 440, 1, -513, -211, 494, 389, -406, -590, 138, 682, 107, -650, -395, 469, 537, -291, -634, -26, 595, 223, -439, -416, 222, 444, -31, -400, -159, 262, 212, -110, -178, -13]
7922a3J44m2r9l1o1N1J67N4k14k32K10L88m4m94j99M80M54l76o24J09P64J88p07
7945a27n58N33P63k28q45j28Q08M12o12o03L17P08o6o50j42M91K81l36k50J32
7965a00K36q0j33J22N0k15n4L13J78m02l51L97N81k78p57jQ96K80q53o19O60R10
7987G80l89j014LJ038L30q85n99N89P50k92p65L1O78J43n05k13L37J94k38j26
8007a53K32M8l03l6M25J20n29k99N61N01m24p44K38R05M6r23l99Q02P07n65q86
8028f76K31R17J41q47m24O20O20l65o42Q8N81Q3l91k14K35J95j00j14M0Or3P3
8050c6K13p8l23o1M35K23m08m37K83N83rp10j97O28M76m24p04J58P72J38o65m21
8072e64M60O22k11o70p9N66L26l77m45J63M16M8l33j59J87J58m5r2l1pQR9J00
$$ y = [-13, 131, 89, -10, -41, -102, -51, 116, 170, -44, -276, -66, 322, 278, -216, -415, 65, 519, 143, -481, -372, 392, 580, -127, -685, -152, 611, 383, -462, -590, 218, 630, 18, -585, -268, 440, 374, -276, -418, 73, 354, 18, -232, -100, 136, 56, -77, 45, 95, -120, -174, 139, 317, -85, -436, -39, 542, 264, -493, -494, 402, 682, -171, -790, -130, 780, 391, -623, -620, 418, 748, -137, -736, -147, 603, 311, -454, -423, 255, 398, -107, -320, 17, 211, -27, -153, 79, 127, -176, -212, 213, 333, -196, -495, 66, 567, 143, -601, -363, 542, 588, -335, -734, 68, 775, 210, -676, -445, 472, 613, -234, -658, -38, 582, 217, -425, -337, 244, 327, -64, -278, -43, 152, 52, -62, -22, -16, -109, -36, 177, 99, -224, -285, 150, 373, -35, -472, -189, 394, 385, -325, -522, 106, 582, 158, -546, -388, 384, 522, -143, -564, -104, 518, 307, -363, -442, 124, 450, 73, -372, -209, 207, 255, -78, -237, -50, 108, 63, -29, -60, -67, -59, 40, 140]
8095A40j10k75R0L63J02m66k94L93N57k39p35j3P86L29p01o04M89Q20j98r00j30
8116e96Q16M26o20o06L65O61j22o07o3M54K01l25j87J93J35j96j3K22jl60n6M58
8138A79K00n34l66M54O47l26q32Q1R02K86r03n76O97Q51m13r57M9R37K71p73n03
8159f29N41O12k76n97L6N33P8l81r9K16Q9j99J3J99n9l16P7M21K6n32k07N58M34
8182E38m39o65K35Q15J6q13l74P34N96
$$ y = [140, 30, -245, -155, 208, 310, -156, -450, -57, 500, 261, -474, -487, 299, 628, -73, -677, -188, 632, 434, -466, -596, 220, 646, 26, -580, -215, 446, 324, -283, -346, 108, 309, -16, -203, -10, 125, -71, -84, 138, 137, -223, -279, 179, 379, -155, -521, -67, 580, 254, -578, -497, 405, 691, -212, -788, -91, 760, 347, -610, -561, 376, 647, -126, -629, -88, 524, 248, -349, -313, 220, 298, -83, -182, 34, 123, -76, -63, 136, 77, -239, -162, 259, 285, -247, -454, 104, 538, 99, -566, -331, 484, 500, -313, -687, 47, 643]
8191F43
$$ Imaginary data points
##PAGE= N=2
##DATA TABLE= (X++(I..I)), XYDATA
0@%%%%%%%%%Oj4J6j6J6k4L2m0M8n6P2q8J04j20J36j60J92k24K56k93L38l86M40
32B35n02N68o41P21q10R09j016J133j262J401j552J721j905K103k322K563k823
49a479L108l426L776m160M590n072N614o229O937p763Q731r891J1317j3109J5441
64H385j8618K3222l0518M3851p5905K89212K92528p67421l06488N50901N25127
75E34276l88873n66950J44581N74317K1119m70207j62273L65017K03156k40723
85A3440k08108J75175J63835j43023j39156J67725J33778j99436j84907K27416
95F739K68662k04188l77886J26769M65105J3980n06196j86291M69802L62537l58214
106H0819m98096J81219N66003K5228n46223k23654M46098L72759k87707m48881
$$ y = [0, 0, 0, 0, 0, 0, 0, 0, 0, 0, 6, -8, 8, -8, 8, -16, 16, -24, 24, -32, 40, -48, 56, -64, 72, -88, 104, -120, 136, -157, 181, -205, 235, -267, 301, -340, 381, -429, 480, -536, 597, -665, 736, -816, 905, -1000, 1103, -1219, 1344, -1479, 1629, -1797, 1979, -2181, 2409, -2663, 2951, -3278, 3659, -4104, 4627, -5264, 6053, -7056, 8385, -10233, 12989, -17529, 26322, -49583, 239629, 532157, -235264, -541752, 9149, 534276, 145403, -421547, -276966, 297351, 318470, -151737, -314010, 51007, 254163, 13440, -194668, -19493, 144342, 1319, -137837, 29888, 163666, -35770, -220677, 6739, 275401, 71213, -306673, -179904, 285201, 299181, -207015, -393306, 76496, 439033, 80819, -417277, -236058, 329945, 355173, -191050, -414704, 31394, 404153, 116446, -332435]
116c32435J09271M44056N2225l72228j65673K60448K16487j44169k07890N4407
126h5501J60902r790j04770J0426O7749m0577o7554P4759J06669q6144j71662
137a45493N5761K37078K1013k74109j31536K60201K50137j87147l45704O3199
147a96600L90837Q8618l69403k36405K81477L47739j44270l99057j2939L81950
157A31947J57303l04786k61014J89388L08139o4633k97925m0895K44230J07605
167A69359j71087j29465J04264J15149o3533q3547N6994N7458p9374n6434J13856
178C3640Q9929j37446j54038J28959K32029p6718k99571j7776L32416J39482l13519
189d2613k63682K38413L62592j17511m12938k6573M03067J65298l36021k72032
$$ y = [-332435, -223164, 220892, 273117, -99111, -264784, -4336, 212151, 67982, -139908, -85501, 75401, 65611, -39159, -28733, 39016, -1561, -69115, 5644, 112313, 26169, -145493, -89732, 147346, 168359, -105750, -237286, 22915, 273052, 85905, -259799, -196600, 194237, 282855, -86548, -322953, -41476, 306263, 161993, -237064, -250003, 131947, 289250, -15536, -276550, -87162, 220977, 156344, -141581, -182476, 61754, 169359, -1728, -131193, -26929, 88220, 24687, -58860, -1866, 55592, -23782, -80216, 33640, 123569, -13877, -167915, -38956, 193073, 116355, -183216, -200992, 131424, 270906, -42613, -306295, -67882, 294710, 177199, -235739, -262312, 140755, 306053, -29968, -302000]
199c02000K28230L29157j04685l31982q043K89631Q9037k21506j28647J51121
209i687J30471r8843j08801P5741Q3612q1287p3769J03857R1127j25113j36490
220a49182J25788J99315r2470k60821K2178K99859P6267k99360j84511K51579
230a1358K79435j60899l39460M3028L50752P9089l11337j81377K31525K45361
240B24759j30783k62859L2432K37653M3136j84240q3721J22955Q8590p3618o7989
251e3685M9580L9035n3899k0106P8966K4760j09259n7329J26462J11491j15899
262B0117j71997P1268K19594L022k36932r2764K13997J77988j51348k38385O0105
273a25335K59392M0713k36083j29652J74620J88575r0351k07480L447J86823O6770
$$ y = [-302000, -73770, 255387, 150702, -181280, -189323, 100308, 189345, -32161, -160808, -9687, 120784, 21941, -86860, -11119, 72493, -8794, -82563, 21294, 112421, -12692, -149182, -23394, 175921, 83451, -177370, -155192, 144667, 220934, -78426, -262937, -11358, 268077, 107178, -232282, -189254, 161498, 240587, -70750, -252127, -20602, 224759, 93976, -168883, -136451, 101202, 144338, -39902, -123623, -668, 87922, 14304, -53685, -4105, 34930, -18969, -39075, 39891, 64651, -44608, -101937, 24525, 136016, 20117, -151880, -80612, 138982, 142004, -94928, -187692, 26305, 204293, 52945, -185440, -125335, 134057, 174770, -61313, -190965, -16345, 172230, 81879, -125601, -122154, 64669, 131439]
284A31439j37086j07030P5403J13303k0079r1806j4439N6183K2035k3337o024
295a438P554k1911j6430M6071M8109n1525r1705K9091J31127K0876j49521q8781
307a38483J35174J57883q5187k09279O843K27412Q4189k04733j68091J44167K26146
318A76041n8075k46253l4938K25983J15285j72756j67963J01740J86087l0899
328I4252j72573k4127J38283N4331r8472n9485O7756M7563n5617l1678O3496K5612
340D9341q4781l9067J06882P4558j15446j26151R9105J81055n3133k23317j8360
351a49314K38392J03491k17699j85325J61251K46527p8114k73939j6213K62577
361I1634J03435k16507j67772J47840J99822p3055j98920Q262J72771L5201j34693
$$ y = [131439, -5647, -112677, -37274, 76029, 55950, -35856, -50295, 5888, 27923, 4586, -1438, 6116, -15795, -32225, 13846, 61955, 10430, -81275, -52184, 78943, 99819, -49702, -138483, -3309, 154574, 69387, -139892, -133049, 94363, 178552, -26181, -194272, -50105, 176041, 117966, -128287, -163225, 62758, 178043, 5287, -162676, -60936, 125151, 94252, -78321, -102448, 35835, 90166, -8306, -67791, -35, 47528, -8089, -39767, 23729, 49341, -35440, -74507, 32375, 106933, -8513, -134664, -35559, 145496, 92363, -130954, -149314, 89078, 192569, -25130, -210455, -49204, 197323, 119209, -154730, -170943, 91634, 195069, -21438, -189210, -41370, 158452, 85397, -113523, -105261, 67510, 102711, -31982]
372c1982n3785R9248N2097p7722m0835P4682L2938q6733l9279J04166O4664j14098
384a6639j06318J05050J54415p0629j95238J2258K15188O1039k04918j34949J62534
395a8207J93742r4216k24752J2966K21499O5255j86017j25331J27744J57192o0981
406F8894j58268Q32J33808M0857r5132n8549N5851N4218k7982l6234J8319J6469
418A3083k6429o561M5583J3708o4542l8552P1625P4936n8633j11551K3585J35421
430G1673K8351j36343q5783J09762J34721n8835j62334o429J60820P1990j29941
441b348j23256P6689J49446j3701j46452m4593J17754Q6021p3063j03701K5465
452e1739R7409J3023p3943l4250M4333L5942j9867k2620R123L729j5322J0090
$$ y = [-31982, -85767, 13481, 65578, -12144, -52979, 21703, 54641, -32092, -71371, 32795, 97459, -16639, -122957, -17907, 136508, 65879, -129359, -117101, 98087, 159126, -45792, -180741, -18207, 175535, 81319, -143433, -130467, 91032, 156287, -29730, -155061, -27317, 129875, 68894, -89374, -88542, 45266, 86123, -9009, -67558, -11707, 42511, 14529, -21705, -3386, 13083, -13346, -19907, 25676, 39384, -25158, -63710, 7915, 82851, 24218, -87333, -63748, 71673, 100024, -36319, -122102, -12340, 122381, 63546, -98788, -105217, 55603, 127593, -2348, -125604, -48915, 100531, 86830, -59622, -104215, 13539, 99560, 26497, -77204, -51739, 45670, 58693, -15250, -49500, -5167, 30775, 10908, -11712, -2589, 1140, -14182, -4092]
464d092L5116r800o0166q782P9272M3513q2210q6423O3117J25756k2237j49617
476g6553l3731J49403R3170j22296j42947P2437J71866r862j73721n2334J49225
487B4657J01601j05661j29146N4415J32533p784j16014k4425Q8682L7917o1650
498d875l4853M4608K2636m2419j1385N4077J0371p2980k5260Q9270N5736r2829
510g903r5742P6701J35115l9678j62379j3606J68559P3324j49538j27281J07359
521c5069J64311m9951j77058j1233J64318O4126j30833r9472Q6094J13048m1376
532D6905j06478O505Q6696J2489o3385j5433M6188P329m1358L250N0101p202o8156
545d2549k228Q7225K7000r7573o3432R1209J03178o4834j35414K0810J50428L3122
$$ y = [-4092, 31024, 21224, -38942, -47724, 31548, 75061, -7149, -93572, -30455, 95301, 73064, -76553, -110284, 39119, 132289, 9993, -132954, -60517, 111349, 101487, -72234, -124568, 24657, 126258, 20597, -108549, -54134, 78399, 70615, -45399, -69824, 18858, 56775, -4875, -39728, 4880, 27516, -14903, -26288, 27789, 38160, -34820, -60080, 29190, 84926, -7903, -103645, -26944, 108171, 68493, -93886, -107492, 61067, 134391, -15147, -142428, -35069, 129242, 79291, -97767, -109000, 55318, 119444, -11389, -110861, -24767, 88281, 46905, -59573, -53068, 33628, 46117, -17268, -32701, 13487, 20816, -20542, -17292, 32809, 25607, -42549, -44777, 42448, 69448, -28125, -91557, -348, 102830, 37996, -97418, -76608, 73820, 106942]
557A06942j42458q5795J11330J25789o2758j44683P048J39245M4009j12361q0387
568i4079P2084R6274k8889r1710o941P1846K8379m5447l3293K2008K4864q742
580F354j0290Q647j916j9694M577L5779N843m8611k8094N0360N6383l6462q1808
593e8932O973R5534L2805r1173p4006O6874J06538k6172j21694k2901J15034O9696
605I8576q7475j04074M5162J19135K172j12986m4206Q9136P2654n5260q3490K0913
617c9743P7839N416o1439j8790M2503J9109k8913j0714K5767R22l3880K672M9377
630C0126N436o5103k6609P3014N7373o6659r0525M3398J17195n333j29286m1020
642i7993J21847Q6517r4771j21619N2763J39077m058j36091m1665J14598P5918
$$ y = [106942, -35516, -121311, -9981, 115808, 53050, -91633, -84585, 54660, 98669, -13692, -94079, -21995, 74279, 45390, -46320, -53261, 18585, 46964, 1517, -31776, -9768, 15096, 6354, -3936, 4711, 2795, -16899, -12322, 23457, 29300, -19311, -47405, 2955, 59338, 22876, -58932, -51959, 43575, 76380, -14793, -88799, -21925, 84613, 58441, -63253, -86154, 28880, 98576, 11101, -92973, -47811, 71324, 73496, -39490, -83696, 5440, 78094, 22834, -60656, -39743, 38096, 43512, -17927, -36717, 5786, 24895, -4018, -14732, 11035, 11957, -21923, -19251, 30126, 35562, -29541, -56150, 16864, 74237, 7578, -82947, -39549, 77646, 72313, -56973, -97993, 23854, 110371, 15600, -106019, -53256, 85821, 81763, -54328, -95993, 18605, 94523]
653I4523q0913r3581M3671R4148j1540q1593r396O3105J7205m6638j4282L8258
665A2967O669m0631j608N1936N390o6624k1050P7088M7373p6370p8824O0393J07313
678H4022k9102j24863j2619J25372N6822j07089r4289P2861J17334k9633j21775
689f2959j3604J08110M8221q1164o8407M8692P2343j8951o2741j476M5712R491
701B3267k8636o292J8023l399j7594J3015K6997j6092m2256Q549N6905J0080o4110
714b1543l6296N8947O3497l9780q4113R189R1742K6721q3158n9843N9207Q2532
726F7102k4943q9554j1960P9840M3142n6470o2180K6091O5916L450n5676k5012
738d0254L6405L4396j5099l1489j254J9783Q119n477m490m837o961O296K0770
$$ y = [94523, 13610, -79971, -36300, 57848, 46308, -35285, -44681, 18424, 35629, -11009, -25291, 12967, 19636, -20995, -22603, 29333, 34723, -31901, -52951, 24137, 71510, -4860, -83684, -23291, 84022, 54920, -69943, -82562, 42810, 99632, -7457, -101746, -28885, 88449, 58816, -62959, -76563, 31547, 79768, -1396, -69803, -21111, 51232, 32281, -30460, -31936, 13776, 23267, -5369, -11661, 6362, 2963, -14631, -1616, 25381, 9289, -32967, -24418, 32487, 42567, -21543, -57839, 1108, 64605, 24825, -59288, -50099, 41643, 68364, -14794, -74637, -15430, 67102, 42159, -47395, -59355, 20485, 63627, 7157, -55023, -28932, 36984, 40434, -15242, -40254, -3849, 30547, 15448, -16041, -17295, 2488, 10607, 5130, 640, -4197, -11158, -4862, 15908]
751A5908K663l0269k0069L0214M0534j8075n7182m960O3871L3996n6800o2007
763f2176L5766Q1823m465q7969l0608P8427O1767n5075q2331K3138Q8512J0062
775E6871q0025l7533O0509N4114l5973n8127J3270N1491K221l9147p867K7236
787G040M677k1186L201K3872r880l4836R781N0115N83o3730k1227O9350M8678
800F6438o2511p6685M1939R8091j0103j06989k7193J00324O2568p8864q8917M6883
812c5019J01483j1112r8932k1244Q3669M4417o0955n5543L7213N5287j8173m7350
824b6259P360L7148n163l0014Q786K9652j3515l6754J4131M8959o796o1490r739
837d3694O8814L3432o6248n9525N1435Q1827k5578r4318p175R3257M0386p8028
$$ y = [15908, 18571, -11698, -31767, -1553, 38981, 20906, -36276, -41236, 22635, 56631, -169, -62176, -26410, 55413, 50948, -37021, -67629, 10798, 72565, 17490, -64841, -41703, 46809, 56871, -23154, -60687, -178, 53936, 17963, -40164, -26894, 24597, 26818, -12329, -20196, 7040, 11717, -9469, -6268, 17604, 7724, -27112, -17331, 32784, 33367, -30363, -51590, 17760, 66438, 3927, -72758, -30819, 67272, 57169, -49820, -77013, 23311, 85879, 7015, -81902, -35019, 66464, 55352, -43580, -64824, 18845, 63262, 2307, -53236, -16023, 39264, 21091, -26259, -18899, 18249, 13086, -16928, -8142, 21510, 7995, -28759, -14628, 34331, 27535, -33955, -43694, 25120, 58552, -7696, -67221, -15786, 66041, 40463, -53855, -61030, 32227, 72613, -5415]
849e415o7270N1646Q2420j9639q3528j1053P1677L4242n1087m6155K7855M6355
861C0048q072l7582l957K4908O685j3732j941Q472o147j1013J2532K0088j2778
874G511l1998M725M1572J0928m4172l0612L6895M8988j9580o0654m719O1579L0773
887E1236n0347n2668K8895O5028j555o5053k5504N2825M6384l1611n6880O783
899c2467N5533J5750m4145l0965K6915L6423r360l2563l591K2682Q838j1643o097
912d690M258j933m008J0897J1469j5803k4416J2842L8456p81m8231j8732M9337
925H665M1307l9425o1339J9267P3390P552p3983l5384O2325N8457m0955p1904
937e2027J4410P3704J1398o4544l1413M7957M2373k8993m3691J2610L7676k502
$$ y = [-5415, -72685, -21039, 61381, 41742, -41786, -52839, 18838, 53080, 1993, -44162, -16307, 30048, 21976, -15606, -19563, 5345, 12030, -1702, -3643, 4829, -1318, -12331, 201, 20289, 7511, -24487, -19762, 21810, 32738, -11434, -42046, -5151, 43837, 24257, -36397, -41116, 20463, 51236, 889, -51779, -22884, 42144, 40589, -24464, -49968, 2857, 49241, 17630, -39250, -32467, 23066, 38816, -5329, -36294, -9379, 27044, 17684, -14879, -18470, 4212, 13050, 1407, -4690, -432, -2365, -6373, 4524, 15993, 190, -24226, -11384, 27072, 26291, -21940, -40672, 8665, 49972, 10547, -50792, -31525, 41865, 49417, -24566, -59950, 2375, 60832, 19877, -52027, -37617, 36087, 47485, -17059, -48472, -515, 41858, 12865, -30826, -18216, 19460, 16958]
949A6958k8409j16K0569l328j7910R328K2048j3395l1970J1522M4384j625n4535
962b6479j5888N7958L7869n1480n9526L4710P5415r942q1354j8225P5525M4049
974F2632n8920o2448L5242P0201r751o6936j2117N4985K6441l8829l1606K3337
986g769K8948j2682k1865Q886J4784j1356j1785J7343J5064k2732k4321K3360
998d125L7111j6666m9211K282N6202J7497n4652l8541M3339N5952k3643o5346
1010c9801p32O4241K4716n2705m3329L3426N2925j0953n2137r615M2316K4007
1022C2359k7074k9834J0997K7280J420j8874p324Q734O175j068J63j046q060l352
1036i504J3450J2660j2915k3552N172L1713Q639l3340k5184K6387L9928j1334
$$ y = [16958, -11451, -11567, 9002, 5674, -12236, -2908, 19140, 5745, -26225, -14703, 29681, 28056, -26479, -42367, 15591, 53460, 1980, -57546, -22836, 52579, 42637, -38717, -56942, 18583, 62632, 3712, -58736, -23494, 46707, 36956, -29980, -42097, 12888, 39329, 500, -31106, -7769, 21179, 8497, -13368, -4482, 10302, -1054, -12839, 4504, 19568, -3164, -27485, -4125, 32986, 16320, -32891, -30609, 25593, 43090, -11562, -50103, -6764, 49188, 25545, -39801, -40533, 23708, 48424, -4281, -47610, -14184, 38741, 27788, -24349, -33964, 8352, 32359, 5285, -24549, -13552, 13728, 15148, -3726, -11050, -2316, 3859, 2791, 2954, 1908, -6152, -9504, 3946, 16606, 3691, -19861, -14689, 17024, 25663, -7677, -32861, -6474, 33454, 22120]
1048B2120m8452q892M7759K9780l7219m6406J8762N4820L616n3153k4957M2120
1060a02M0712k4616m8072N120M6298J1985l7328k3173K4565K7027j2193k4389
1072a4166L645J8071q76j1581L384Q545q992j1000J4223J8912j5375l0168R940
1085a5438M1150K569m7759k0450M6770L9970l6713n6627J8541O6297M508o6325
1097b3507k7921N6582M6973l9190n8089J7997N9965K262n3378j7812M1465K6270
1109C1617k8115k7701J7194K4127j1147j8900J0410J5518j3452j6516J7371K2500
1121B2906j8693l2201J4662M2649m223n0189j1615N1571K9953m4837m6979L0293
1133a6703N8666j0172o2168j1662N6535L0898m3032m3845K4853M8411o093m4751
$$ y = [22120, -26332, -35224, 12535, 42315, 5096, -41310, -22548, 32272, 35888, -17265, -42222, -102, 40610, 15994, -32078, -26958, 19340, 31325, -6003, -29176, -4611, 22416, 10223, -14166, -10521, 7550, 6674, -4907, -1523, 7022, -1970, -12970, 1253, 20165, 4790, -25378, -15438, 25712, 28281, -19478, -39928, 6842, 46812, 10099, -46528, -27987, 38310, 42818, -23507, -51428, 5154, 52127, 12937, -45152, -27155, 32810, 35072, -18306, -36118, 5347, 31617, 3502, -24199, -7005, 17122, 5975, -12925, -2515, 13003, -449, -16965, 406, 22906, 4213, -27988, -13326, 29323, 25100, -25089, -36704, 14867, 44820, -17, -46996, -16703, 41963, 31791, -30377, -42039, 14496, 45394, 2362, -41483, -16630, 31781, 25688, -19063]
1145a9063r149L4975J8161k2713k0029J1733J6181n120r543M156L651q058j550
1158f368J4340M805j9653j2969K0696K3725j5610l3614M482L9101J0654l7719
1170h130k6304K8795L8580j3814m4222m105M1783K0826l1790l2571J6606L7119
1182B2773l8l3888j4047K4396K2640j1647k4478n82K0130R184j1958j2301L183
1195f633R901K996l726m564l185R94P747O324p560j4574J774K0434Q534k1115
1209b653k0683J5212L1127l213l6565j2463L4805K8175k5521m0161J0484M5472
1221B4016P074m2924k3285L3448L4617j9407l9237M411L7007Q014k9672j5574
1233b1512K0247J7539j1830j5056O964J0547o586p002J0007O843j5000j1234J8595
$$ y = [-19063, -28212, 6763, 24924, 2211, -17818, -6085, 10096, 4976, -4567, -411, 3240, -4818, -6368, 7972, 12777, -6876, -19845, 851, 24576, 8966, -24648, -20166, 18935, 29589, -8130, -34434, -5639, 32941, 19127, -25095, -29200, 12583, 33409, 1619, -30952, -14346, 22773, 22735, -11153, -25200, -804, 21836, 10189, -14289, -14871, 5259, 14443, 2485, -9816, -6633, 3268, 6264, 2538, -2026, -5211, -4217, 3530, 9854, 2294, -12280, -10506, 9928, 18462, -2653, -23336, -8124, 23003, 19790, -16775, -29238, 5567, 33742, 8221, -31940, -21456, 24016, 31090, -11834, -35119, -1671, 32946, 13539, -25698, -21287, 15720, 23734, -5938, -21512, -1265, 16274, 4444, -10612, -3648, 6899, 313, -6689, 3318, 10161, -4839, -16073, 2522]
1246B522J9728j8124l0185J1970L9574j79m4730j5457M3366L1805l4649m5366
1258c9725J9750N3074j436n3206j6779M5844L1375l2921l9825J7525M1297l170
1270B1803l6813p245K8769J2340k0314j2391J4224R379j2169o043J4154N048j8552
1283g810q180K2751J5572k3818k5750J9755L5992j0036m3176m116M4653K0137
1295C5974l9256l4549K7466M4137j1419m6911n563M2450K0063l2115k9325J8512
1307a0536L2112n043k8810n407K1384J0908j2584j1267N353P762j735k728K371
1320A780j177o390J877J1659J670j5643q679J5863J7292j1187k4661J942K8081
1333A2427J0042k5832k1853J7644L0443n026l3375r338K9726K2044k0165l0291
$$ y = [2522, 22250, 4126, -26059, -14089, 25485, 25306, -19424, -34881, 8485, 40290, 5641, -39725, -19975, 33099, 31663, -21543, -38322, 7522, 38897, 5976, -33849, -16324, 24973, 21803, -15010, -22255, 6514, 18854, -1460, -13851, 373, 9752, -2417, -8460, 5694, 10742, -7810, -15990, 6761, 22333, -1485, -27235, -7480, 28512, 18476, -24700, -28816, 15837, 35974, -3282, -37831, -10365, 33772, 22353, -24558, -30121, 12329, 32392, 277, -29048, -10536, 21576, 16533, -12277, -17684, 3700, 14608, 2024, -9243, -3890, 3872, 2137, -591, 1780, 603, -5787, -3910, 7749, 9419, -6224, -14903, 960, 18252, 7065, -17596, -15654, 12427, 22469, -3363, -25216, -7572, 22871, 17845, -15530, -24868, 4858, 26902, 6737, -23554]
1345b3554P055L2271O587k8045j7479J8999K3554p921k4058k218J9815R004j2879
1358A131j1374O006R594j484n345O23J111l513R51Q550Q18j3545o578J6071J5058
1373A8074j4125k4101P195L0787L996l2928j7111K9131K9380j9577l7974O077
1385b1176M0773Q720l7296k1689K8411L0370j6475l3341M302L0895N420k4711
1397e797j0878J7261J1829j1104r463Q133N908q884l631J2435M543j6892r356
1410a5896J9701J7414j8712k6718J2790L4711k398l8744j0863L7289K4229k9960
1422B843l4894J8013M0587l778m0309r813L4416K0219k4700k5671J3655K5985
1434A6553l996k2185k295J6273M520j0764l185P614%p844K776J1213l112j6285
$$ y = [-23554, -16499, 15772, 22359, -5686, -23165, -4166, 19388, 11467, -12591, -14809, 5006, 14010, 1131, -10243, -4237, 5357, 3873, -1472, -849, 262, -3251, -2300, 6250, 7068, -6477, -13055, 3016, 18074, 3949, -20152, -12957, 17830, 21826, -11102, -28213, 918, 30298, 10721, -27253, -21176, 19597, 28317, -8979, -30668, -2257, 28113, 11638, -21703, -17401, 13494, 18914, -5797, -16675, 586, 12415, 1311, -8152, -19, 5889, -2995, -6626, 5809, 10352, -6540, -15896, 3805, 21219, 2507, -24211, -11421, 23290, 20892, -17852, -28715, 8574, 32803, 2843, -32051, -14038, 26549, 22771, -17538, -27351, 7065, 27284, 2584, -23087, -9432, 16553, 12557, -9628, -11923, 4350, 8870, -1894, -5079, 2535, 2535, -5309, -2533, 8680, 5568, -10717]
1448a0717q6K0708O911k2342j5938J9537K4914j2058l1285J004L2980J1397k9111
1461d086k2457K0340K9595q417l1404l873K7604J4023j9673j9815R761K0596m68
1474A1726j7025n956J0841Q374m364o990k18L123J607J229L57m002m583L685R218
1489G022J0j2187o264J1820J3254p412j8775m51K0773J0079j8094j9117J0841
1502h501K5183l57k6539j1075K2632K0851j4242k6778L308K7638P664k3591j6254
1515b0061J5960K0851p049k0914q56J7391N947j2106p409P209N794m511k655M943
1529B534o3q096L69J2681K704j6597r027J7730J7374j4823k5528P489L1262L127
1543B1136l2626j5066K8802K5875k0257l3288Q666L5766L745l3098j4496K6245
$$ y = [-10717, -10803, 9905, 16816, -5526, -21464, -1927, 22987, 10929, -20356, -19352, 13628, 25025, -4086, -26543, -6203, 23392, 14975, -16429, -20302, 7302, 21325, 1652, -18163, -8402, 12194, 11726, -5299, -11255, -414, 7960, 3596, -3394, -3612, -489, 1118, 2347, 2704, -1298, -5881, -2196, 7022, 7032, -5155, -11419, 401, 13655, 6243, -12532, -12983, 7790, 17869, -225, -19342, -8501, 16682, 16325, -10214, -21289, 1343, 22194, 7952, -18826, -15518, 12120, 19784, -3807, -20061, -4101, 16750, 9701, -11213, -12069, 5322, 11269, -837, -8246, -1037, 4757, 246, -2409, 2534, 2471, -5625, -5256, 7425, 10129, -6468, -15495, 2235, 19609, 4786, -20742, -13253, 18009, 21136, -11490, -26556, 2246, 28121, 7864, -25424, -16758, 19008, 22753, -10345, -24841, 1404]
1555A404K1648j7050k4375P853K3005o90j8919l307J4139L976j0498k399R363
1568D150L16j1022M13J4636J542j8425o702K0470J4309j9151k2593J3642K9453
1581B1038m459l2788o872L1408J8005k5225k6630J5417L0934l996l0353o527K5383
1594E335J4159j7668j7705R350J7195k548j3736j309R086J945n247k2L656l004
1608e13m803N255Q248n191j2713K158J6317L554j7276j0812J4764J7563q551k2049
1622a4049kK2509R338j8943j6934J1591K1278k101k1462o993J7228J3909r996
1635E373j7116J788J6116N571j2001r807N721J0772K6q492l887M369M823j25k825
1650C06k522r49K325M911P02p077n837O445J1121k362j4905m267J5469J2042j2222
$$ y = [1404, 23052, 6002, -18373, -10520, 12485, 11795, -7124, -10431, 3708, 7684, -2814, -5213, 4150, 4466, -6556, -6143, 8493, 10035, -8390, -15092, 5378, 19687, 536, -22057, -8415, 21038, 16579, -16209, -23081, 8327, 26332, 1107, -25523, -10106, 20828, 16832, -13521, -20048, 5335, 19494, 1826, -15879, -6529, 10666, 8118, -5618, -6927, 2159, 4104, -1143, -1165, 2491, -513, -5316, -61, 8187, 2996, -9717, -7559, 8758, 12312, -4964, -15776, -1012, 16551, 8000, -14049, -14051, 8458, 17796, -1147, -18081, -6490, 14788, 12687, -8775, -15768, 1460, 15369, 5373, -11743, -9955, 6161, 11732, -269, -10076, -4355, 6417, 6443, -2049, -5936, -1567, 3256, 3131, 306, -2216, -3165, -840, 4071, 4773, -2304, -8141, -1696, 9425, 7063, -7842, -12109, 3360, 15402, 3180]
1665C180j8778N345K2707L681k2567j2946J8276K0316j0599k4329J380K4120P454
1678A7240k0142j4040J3711J7161o540j6835N76J3872K982r870l676O481K177
1691C097n203L72O340k078r678J584J3893J865j7207q005J7935J5600j5033k2841
1705a9359Q488K7736P75k8805j0981K5624J9899j8616k5891R359K7807K43k5684
1718i405q282K0597J3283j4070j4918P959J3739l739j0964J995Q280k510p025
1731e060M243P932n667j0938N366J5022k465j8691l044K0360J0269j8858j7705
1744a9236J3825K3543n839k6218l596K4909J2498j9662j9159J1775K2163k910
1756A2093k1209m925J6882J0219j0691j2122M458J0823J85p483k240L659J697
$$ y = [3180, -15598, -10253, 12454, 16135, -6432, -19378, -1102, 19214, 8615, -15714, -14334, 9786, 17240, -2902, -16942, -3231, 13930, 7390, -9445, -8869, 5003, 7985, -1885, -5561, 920, 3097, -2106, -1734, 4606, 2528, -7150, -5566, 8327, 10192, -7015, -15020, 2915, 18515, 3482, -19359, -10871, 16865, 17640, -11165, -22146, 3478, 23377, 4761, -21130, -11771, 16036, 16279, -9405, -17687, 2910, 16193, 2123, -12795, -4836, 8903, 5164, -5800, -3805, 4475, 1965, -5060, -817, 7115, 1448, -9490, -4124, 10898, 8433, -10258, -13302, 7058, 17327, -1531, -19236, -5411, 18132, 12293, -13925, -17521, 7388, 19886, 224, -18935, -7160, 15003, 12093, -9116, -14041, 2841, 13060, 2369, -9753, -5295, 5528, 5713, -1770, -4010, -351, 1346]
1769A346r86P42M70l650k318N373N880m846r831J694J2635L478j2860r520J0011
1784b382J4662m300j7361l088J6616J0456j2355j6011N395J8483K619j7166j0013
1797a4445J2562J5066n780j6795j443J5110P370j0790j0847N342J1355l03r308
1810b906k986N867L835k569k428Q02k99j282K825L941l764p901K179J1806J996
1825I116j3973q123J3290J4641r285j9849K505K2261N739k1094j3694J6396J9725
1838A7655r253k2488J152K1718O175j8019j1267J2592J3508p045j2955K651J0668
1851E092m46p871M04N969j833n877L517P765m121j1140K735J4717J158j7144p040
1866a4115J7150J3732j4026j9782Q000K3569j7k4052q368K0997J5415j4998j9767
$$ y = [1346, 360, 1102, 1572, -2078, -4396, 977, 6857, 2011, -7820, -6126, 6509, 9987, -2873, -12393, -2382, 12280, 7980, -9381, -12469, 4147, 14603, 2248, -13763, -8368, 10115, 12734, -4432, -14445, -1883, 13183, 7403, -9392, -10835, 4275, 11645, 855, -9992, -4650, 6705, 6402, -2906, -5892, -25, 3810, 1241, -1187, -385, -684, -1966, 859, 4800, 1036, -6865, -4686, 7120, 9116, -4857, -12980, 310, 14951, 5666, -14183, -11678, 10583, 16322, -4772, -18466, -2070, 17655, 8402, -14086, -12934, 8784, 14959, -3060, -14327, -1735, 11773, 4728, -8227, -5576, 5092, 4646, -3225, -2821, 3148, 1315, -4562, -1045, 6720, 2599, -8541, -5806, 8911, 10069, -7075, -14115, 3035, 16767, 2741, -17041, -9041, 14528, 14511, -9541, -17909, 3088, 18503, 3505, -16262]
1879a6262P415K0779k5j8503n817J4101Q972q945r345M592P627k151m987J897
1893f52K965l524k467N758M084p352p509P164J1693m554j5225l09J6776O552j5517
1908b117j2720J1367J7226m926j9035k410J7608R056j3261j3586O982J5177l75
1921H986j3652n094R764Q278m797q702J08O802K973l504l828J36K529J999J66
1936B164k163k934K81M558K958m114o345J417Q593K913q605p789N999J1725j129
1951G529j3407m980J2226J0793q189j4848K152J6088M585j4364j0356J0013J3968
1964A1210m190j4889j616J3180O120r592q559N450Q694j934p087q6M830K20l012
1979a261J169K563l111l914M444O808m181j0390J738J3454K789j4769q587J3463
$$ y = [-16262, -8847, 11932, 11907, -6596, -12413, 1688, 10660, 1715, -7630, -3038, 4589, 2438, -2549, -652, 2313, -1211, -3678, 2080, 6164, -1188, -8697, -1533, 10160, 5606, -9619, -9928, 6848, 13400, -2117, -14837, -3470, 13756, 8830, -10205, -12615, 4993, 14049, 788, -12798, -5816, 9361, 8986, -4666, -9760, 4, 8282, 3485, -5217, -5109, 1693, 4666, 1162, -2666, -2530, -1, 1998, 2164, 1, -2933, -2652, 1906, 4864, 750, -5595, -4178, 4415, 7328, -1277, -9066, -3067, 8658, 7529, -5878, -10858, 1368, 12161, 3972, -10876, -8724, 7364, 11949, -2415, -12771, -2758, 11210, 7020, -7869, -9485, 3695, 9815, 223, -8336, -2886, 5808, 3874, -3213, -3299, 1531, 1751, -1261, -92, 2471, -640, -4554, -110, 6698, 2517, -7873, -6135, 7319, 10108, -4661, -13248, 215]
1993B15J4453r396j8884L058K0813M242j9605j1134J5500J6230r467j8514K772
2006i717J7965L042j5019p022J0906Q620o890q168M055O517k971m890L569M214
2020D211n017n115O251P705o295j1210M360J4531l48j6505n170J6203J1087j3195
2034A493j6124P895J9085j227j9257n505J6604J0913j1702j4099N848J4536k88
2047H172j2558l816R029N776n185n556K136L841p22j593J130p5k879K44N047J338
2063D329o487m320O351P782m185j0643L10J1747M519j0510r122P013J2257j950
2077G091j3048l567J1300Q195p364j0943K323J1210K633r138o381N481Q121j339
2091D574p647k219N461M322k519m535k45L185J886r61j883j159L27K237K101j640
$$ y = [215, 14668, 5272, -13612, -10554, 10259, 14501, -5104, -16238, -738, 15492, 6025, -12489, -9717, 8248, 11290, -3729, -10751, 155, 8775, 1885, -6283, -2228, 4289, 1318, -3572, -3, 4211, -806, -5921, 330, 8035, 1740, -9470, -5110, 9421, 9073, -7432, -12602, 3601, 14688, 1493, -14631, -6736, 12349, 11122, -8135, -13640, 2964, 13877, 2175, -11924, -6076, 8460, 8172, -4386, -8202, 827, 6603, 1418, -4138, -2002, 1839, 1117, -476, 654, 579, -2300, -2056, 2991, 4329, -2158, -6478, -127, 7655, 3470, -7173, -6863, 4884, 9403, -1107, -10229, -3216, 9041, 7091, -5957, -9524, 1776, 9971, 2607, -8336, -6013, 5197, 7830, -1308, -7689, -2208, 5913, 4574, -3073, -5292, 169, 4491, 1972, -2563, -2808, 377, 2263, 1302, -581, -1740, -1413, 824, 2925, 1285]
2107A285m474o03N705L977n130p521K598J0060J612j0751o518R113J0910n297
2121D966j3710O1J4160N466j2154r997Q201J2632l298j2974j378J1257M812q246
2135b02o440M959O259k409m902J320L237j749k172L181K453m769m289N665P191
2150G333m963j0489K390J3093J783j4013o892J2702J1833r204j5425M020J6958
2163I126J808j5985p196J2898J1005q361j2748L541J2280N84j0253l142P419M014
2177D990m872l468L439K153l331j094M432J046o056k442P337N102p359q474N680
2192b917J1526k220j3350k450J3237P316j0892j1354O781J3586j677j3614l314
2205i342J1519P155p914r114L685R094L7p378k494M753L359k182k692M03J100
$$ y = [1285, -3189, -3792, 1913, 5890, 760, -6761, -4163, 5897, 7509, -3242, -9760, -647, 10263, 4966, -8744, -8683, 5477, 10943, -1211, -11208, -3007, 9625, 6327, -6647, -8025, 3232, 8044, -202, -6642, -1683, 4576, 2167, -2735, -1415, 1822, 73, -2099, 1082, 3535, -1234, -5523, 142, 7333, 2370, -8119, -5729, 7364, 9147, -4866, -11758, 944, 12777, 3573, -11852, -7832, 9126, 10934, -5051, -12247, 651, 11656, 3295, -9453, -5912, 6368, 6952, -3301, -6443, 976, 4990, 118, -3350, 89, 2242, -1089, -2183, 2249, 3295, -2761, -5203, 2134, 7236, -123, -8597, -2917, 8609, 6389, -6961, -9411, 3826, 11142, 250, -11104, -4323, 9263, 7586, -6028, -9342, 2177, 9332, 1418, -7696, -4011, 5083, 5120, -2258, -4752, 1, 3360, 1178, -1514, -1111, -11]
2220a1M8O01Q09j548k527J291M296L23n336k873M975N640l064p654j93Q249L941
2237F967o921p320L850R379L05r448m618P483Q037l919r757l85R421M386p232
2252B28p187L887Q225l01p519k569N517M131l010m214Q74L088K12j446NJ58j334
2269a255J49L127Q67m510l116M822N998l607q665P61J0339L146j0261p372Q250
2284a327J0915m594j2953n8J3037M702j1114q443P723J0581l705j0810o4R471
2298C361K763p205m035M838L922l095k981K503J903l075j411M326K088n543l954
2313e595N986O655n124r406K638J1467J076j2066n314J0800R212p816j1939L672
2327e754J2917Q21j2006m707R524P272o171q205K793P637j87o054j191M142J307
$$ y = [-11, 37, 638, 1447, -101, -2628, -1337, 2959, 3282, -2054, -4927, 48, 5688, 2624, -5030, -5223, 3026, 6967, 46, -7274, -3424, 5955, 6260, -3188, -7806, -323, 7714, 3795, -5962, -6347, 3074, 7460, 228, -6959, -3072, 5153, 4852, -2667, -5236, 281, 4412, 1402, -2812, -1938, 1150, 1362, -84, -79, 79, -1255, -1106, 2021, 2888, -1622, -4738, 84, 6082, 2475, -6190, -5429, 4910, 8056, -2205, -9577, -1327, 9588, 4994, -7959, -8017, 5020, 9722, -1392, -9835, -2112, 8469, 4764, -6046, -6110, 3361, 6124, -1081, -5116, -278, 3644, 549, -2432, 71, 1974, -1101, -2512, 1814, 3902, -1641, -5595, 391, 7046, 1922, -7484, -4846, 6621, 7697, -4369, -9683, 1117, 10329, 2513, -9426, -5754, 7163, 7984, -4022, -8729, 795, 8067, 1896, -6309, -3516, 4121, 3934, -2120, -3311, 831, 2138]
2342B138k618m98K022o05k580J362L936j138n498l46O680K731o714n600N378Q087
2358F737k634r561q85R354M565p539p405M413Q805o71q496k833O665N252l813
2373A954o145O95N555J767l787l093J575L049M11j913j502K63J381J235k43j944
2389g42j409J486K938k9l643k119L172M197j449n540j137N584M041m191o435J594
2405c682P626J708p221n029N366P435k328q440j170P922M261n989o342L224P095
2420D436m67o447j751M906K928l110k923J629K133j036j016J420K81k594m22L941
2436A908J683m850l810M705O323l281q509O20R706K802r439o269P563R139m513
2451C778j0688Q15J0660K780r200n536O753P036l904p237J360O381L60n001j068
$$ y = [2138, -480, -978, 1044, 439, -2141, -779, 3157, 2019, -3479, -3825, 2855, 5586, -1128, -6728, -1350, 6737, 4103, -5458, -6343, 3011, 7576, 37, -7368, -2955, 5850, 5179, -3317, -6150, 515, 5767, 1954, -4191, -3496, 2059, 3826, 39, -3054, -1479, 1570, 1981, 68, -1434, -1171, 210, 1445, 1202, -742, -2151, -665, 2273, 2244, -1399, -3518, -346, 3851, 2402, -3138, -4275, 1309, 5350, 1159, -5276, -3682, 3944, 5652, -1569, -6598, -1232, 6203, 3875, -4565, -5735, 2187, 6448, 459, -5883, -2659, 4436, 3969, -2478, -4229, 677, 3605, 495, -2428, -799, 1334, 298, -718, 702, 983, -1611, -2033, 1908, 3591, -1259, -5069, -364, 5959, 2678, -5831, -5211, 4495, 7297, -2142, -8411, -848, 8291, 3778, -6910, -6095, 4565, 7345, -1855, -7391, -638, 6398, 2494, -4743, -3383, 2998, 3358, -1643, -2711]
2466b711L702Q57k958j99L072l26l935J97N162Q21o141k774O410N254n480p703
2482f752L320R395j94r820l301Q743O401o352q444L104R079K58q216l055O258
2497D24M725l777n107J449M396J72l048p69J643L80p13N66O90j624j455K067K885
2514B904j717m287M00N161J620n112l810L911N622j750o500r52O137L572m541
2529F58n458K068O162P31n533l205L774M758j359n099j103M219K982k490l836
2544b731M78L587J248k493k146R74K123L42j276r70J4O93J095L44j490j863J002
2561a069L213M50l886k496L561M519k072o064k43O561K906n825n339L950O986
2576E152j392p436j358O723L656n024n145K926N520q45m970p00L852J399k607
$$ y = [-2711, 991, 1848, -1110, -1309, 1763, 1437, -2498, -2301, 2861, 3682, -2459, -5233, 1177, 6431, 951, -6752, -3432, 5963, 5769, -4051, -7352, 1391, 7792, 1440, -7004, -3900, 5179, 5437, -2779, -5834, 424, 5149, 1372, -3735, -2286, 2110, 2282, -766, -1535, 108, 488, -225, 341, 1031, -593, -2048, 19, 2904, 1187, -3100, -2700, 2461, 4081, -1031, -4841, -930, 4692, 2942, -3558, -4510, 1627, 5199, 658, -4800, -2732, 3430, 4161, -1372, -4577, -803, 3955, 2596, -2503, -3606, 613, 3595, 1105, -2731, -2253, 1334, 2582, 89, -2057, -1083, 1040, 1382, 106, -864, -850, -157, 938, 1282, -208, -2071, -1069, 2144, 2594, -1292, -3788, -227, 4292, 2220, -3844, -4087, 2474, 5380, -445, -5784, -1834, 5152, 3760, -3676, -5034, 1689, 5345, 321, -4824, -1898, 3622, 2777, -2193, -2893, 959, 2358, -249]
2591b49j315J796O55j592rK200l07l249j42M358J453m959l421M667N559l327p323
2608e205J033Q213J816p921m575O360O788l979p883J142P803J460o649l365M864
2623i8M221k875m221J326L510m89k544M10J827q72j738J551K324j920l436J600
2639a424M722m94n643j359N867L531n088n564L377O920r33p275j723O484M014
2654E412m710n487K330N875M3n150j942L635L015j848l055K61K256P55j091r29
2670f30L9K91N84O41m18j572l61J977J563j590k760M82L416J161l279k801K173
2687a084M071m25m465j640L834L548k333m671K21M824J949l995l699K349M636
2702C120l14m572j634L681L000k208l558N75L313P00k440j348J366J296n16o82
$$ y = [-249, -1564, 232, 887, -705, -714, 1486, 1179, -2070, -2212, 2146, 3599, -1360, -4781, -114, 5445, 2118, -5205, -4172, 4041, 5857, -2064, -6639, -279, 6509, 2530, -5353, -4211, 3592, 5052, -1597, -4962, -98, 4123, 1248, -2973, -1647, 1863, 1374, -1170, -760, 1067, 195, -1543, 8, 2332, 412, -3024, -1424, 3298, 2804, -2839, -4198, 1669, 5200, 112, -5452, -2075, 4845, 3912, -3363, -5086, 1398, 5412, 702, -4785, -2455, 3420, 3463, -1687, -3629, 6, 3021, 1173, -1882, -1621, 635, 1390, 299, -630, -591, -300, 284, 925, 507, -1065, -1426, 551, 2114, 524, -2236, -1754, 1662, 2823, -456, -3257, -1084, 2987, 2562, -1903, -3543, 291, 3839, 1506, -3165, -2944, 1880, 3829, -166, -3865, -1516, 3120, 2806, -1766, -3400, 281, 3281, 1073, -2485, -1910, 1403, 2103, -337, -1685, -319, 977, 461, -221]
2718b21K24j65n79P27J507p18k624q7L513J599l805l372L108N088j536o198p02
2735d241O399L090n512n190L729O476j397o746r48O050K832m608l932K887M197
2750C086j350l726L16K872N1k081J64J709o90j956J149K703j074l796L69M729
2766B475J018n141k895M792M801l514o286J465P014R23o715l227N420M994l458
2781A666n841J225N698P59m735k118L312K677j830k458P53J725l33r19N54M39
2797E74j216m89J918J165k246k331K007L513j030m352n47M524K345l888l886K406
2813a533M908n32m972j499M204L097k724l941Q79L926Q12l082k035J773K493k99
2829A475k223q43J351J406k55j297o62O46J091K84r31j072J96J423P96j089j738
$$ y = [-221, 3, -162, -741, -14, 1493, 775, -1849, -1936, 1577, 3176, -629, -4001, -893, 4195, 2659, -3539, -4241, 2158, 5248, -264, -5454, -1725, 4751, 3354, -3392, -4340, 1710, 4542, -66, -3998, -1111, 3086, 1736, -1990, -1674, 1198, 1249, -832, -668, 1041, 351, -1605, -456, 2247, 1173, -2623, -2254, 2475, 3493, -1648, -4543, 249, 5050, 1536, -4750, -3285, 3729, 4652, -2063, -5290, 130, 5124, 1666, -4175, -2950, 2748, 3507, -1228, -3346, -34, 2643, 813, -1645, -892, 833, 500, -419, 135, 574, -642, -1131, 787, 1952, -294, -2625, -618, 2895, 1865, -2487, -3034, 1490, 3835, -53, -3939, -1533, 3375, 2843, -2129, -3628, 576, 3673, 949, -2992, -2113, 1813, 2625, -457, -2492, -719, 1774, 1475, -748, -1591, -240, 1166, 911, -386, -1048, -402, 689, 973, 42, -1030, -834, 589, 1385, 296, -1442]
2846a442K17K136J091j892k359R01L169O39l277k315K544L714j071m442q29M362
2862A146K584l314l968J708M592O8m334j697L453K713k128l030Q05K781P1k053
2878f03m77J308K88q13L24P90q85j384J179K321r11l374mM090J481m158l218L470
2896e76M784k015n822L2O029K090n304l940L842N101j968n437P6M988J437l924
2912f07k354K670K560j570k221R21J657q21j201J151J167j661j631J987K502j815
2928G34l601R96M563L47m920k033M545L739l427n062J716N638K65n355k140M378
2944C83L474k840m091J116L962L53l212j276K096J564j068j244L50O38k10J9N63
2961E77l73j189J98J845M82k183j477J925K523j091l219j95L327J654k723k859
$$ y = [-1442, -1225, 911, 2002, 110, -2249, -1348, 1821, 2460, -817, -3132, -588, 3126, 2055, -2387, -3216, 1146, 3730, 416, -3552, -1844, 2748, 2816, -1518, -3215, 238, 2951, 823, -2207, -1402, 1379, 1450, -603, -1080, 228, 516, -297, 27, 817, -68, -1452, -273, 2048, 1137, -2237, -2241, 1849, 3330, -828, -4046, -576, 4208, 2193, -3629, -3597, 2432, 4522, -782, -4722, -880, 4221, 2253, -3184, -3108, 1880, 3317, -607, -2961, -291, 2269, 699, -1522, -601, 1056, 235, -966, 185, 1352, -309, -1940, 47, 2549, 734, -2867, -1871, 2692, 3039, -1881, -3914, 631, 4370, 943, -4119, -2403, 3235, 3500, -1855, -3995, 383, 3857, 1017, -3074, -1958, 2004, 2357, -855, -2131, -35, 1529, 461, -783, -433, 205, -5, 14, 577, 204, -985, -787, 1058, 1540, -643, -2120, -195, 2328, 1237, -1982, -2177, 1150, 2804, 81, -2778]
2977b778J439L566J15l503j692K715K837j302l367k52L095J617k152k507Q58K702
2993A391M19k241j364J347J777l30j625m62R96Q27k14o46l99L8O04P62l00j396
3011h16n26J608J610j243k566K34L189J146l123k650K352L826r31m437p85M296
3027A184K398l393l639J979M246m04m065j025L348J923k279k263J245K077n42
3042G90j578L21J015n08p96J022R94j491j661J639K620j242l575K42M243J149
3058C184m268k731L624M105k326n001N98N214J184m662k675L511L668k112l919
3073b606O42L602M65k809j112J987J141j262q33R65L89j128r5J566K49k119q25
3090a783K425J786k297k859J581L752l85m159j129L923K583k976l689J541M161
$$ y = [-2778, -1339, 2227, 2342, -1161, -2853, -138, 2699, 1397, -1970, -2222, 873, 2490, 338, -2169, -1311, 1391, 1810, -431, -1795, -448, 1329, 999, -626, -1088, -92, 735, 521, -125, -524, -486, 118, 880, 580, -816, -1342, 266, 1876, 633, -1933, -1699, 1490, 2636, -487, -3137, -785, 3041, 2110, -2327, -3112, 1184, 3582, 189, -3450, -1471, 2775, 2371, -1694, -2719, 629, 2552, 273, -1990, -745, 1332, 790, -788, -467, 548, 40, -756, 266, 1260, -231, -1892, -253, 2367, 1125, -2450, -2208, 2035, 3184, -1084, -3815, -191, 3914, 1588, -3413, -2815, 2399, 3583, -1079, -3754, -243, 3425, 1313, -2606, -1964, 1638, 2103, -706, -1818, 169, 1310, 48, -785, 180, 569, -559, -654, 912, 1161, -958, -1783, 642, 2428, 131, -2728, -1147, 2605, 2220, -1939, -3068, 855, 3438, 462, -3227, -1686, 2475]
3105B475P8l884j535L008K466j725k825M48K531N72j765j135R05J074j16o54k79
3122c61K3K22N41K47p76r18N09J526J49j775j056J563J899p81k484l09K476J543
3140B238j929k480Q00K969N63k764j909J965K828p01l155o76K795J925j930k657
3156b118P55K778L92k358j244J575J622p33j511J04J024J93m92K5J11n56r7J101
3174E71N80j462j403J438K307q07l142k04L441J587l237k881K361L903j048m377
3190b373m97M179J961l387l028K194L538q88l442k65K926R89k151j257J433J123
3206A055r96p88R53M84j259m21J664Q29k034j583K069K520j543l483O27L979P18
3223B791m005k116L371L376k274m024O87M249P22l708j840K653K683j665k817
$$ y = [2475, 2553, -1331, -2866, 142, 2608, 883, -1942, -1494, 1037, 1609, -156, -1291, -386, 688, 572, -82, -361, -338, -116, 425, 672, -104, -1022, -513, 1013, 1162, -613, -1669, -106, 1793, 1012, -1472, -1781, 695, 2238, 309, -2171, -1371, 1598, 2161, -603, -2512, -547, 2281, 1580, -1575, -2251, 544, 2469, 539, -2118, -1363, 1415, 1807, -551, -1795, -220, 1402, 669, -842, -738, 286, 479, -13, 12, 123, -433, -530, 571, 1151, -311, -1714, -276, 2031, 1224, -1918, -2122, 1319, 2906, -331, -3212, -851, 3052, 2004, -2373, -2870, 1309, 3270, -117, -3145, -951, 2587, 1699, -1743, -2008, 918, 1907, -244, -1501, -68, 1055, 59, -729, 224, 708, -551, -972, 692, 1521, -513, -2096, -27, 2493, 950, -2533, -1906, 2073, 2791, -1214, -3330, 41, 3417, 1143, -2881, -2194, 2055, 2777, -931, -2771, -118, 2565, 900, -1917]
3238a917O75K328J84j689n16J025M07o58n6O24l89q84O66J371l72j962k03K260
3256H94J064k102k199J787K691o35l164n23K934J727k261k501J043K965K08k591
3272f63j313J905J744q38j951k13J695R64j047j250J99J113L83n38p51N4O35N07
3290F35j70q05l49M45R40P5j087q25Q47J437j26j820p61J703J698j101k382J04
3308a542K625J054k339k110J565K785m36k960p58K624J752j874k357R19K437N2
3324A437k150p19J565J013r32r35M99N73l65k44O34P0j078k54J562P92j812j603
3342a947J603K566j003l247n8L524J320l262k536K483L451j293l845q4L704J297
3358B673l076k146K115K539j119k478L28K065J89j551l14J168J03r63J05J137
$$ y = [-1917, -1242, 1086, 1270, -419, -935, 90, 497, -161, -217, 407, 18, -866, -200, 1171, 799, -1163, -1366, 894, 1958, -144, -2343, -556, 2135, 1500, -1664, -2187, 747, 2474, 213, -2288, -1245, 1720, 1928, -663, -1976, -71, 1673, 835, -1116, -1329, 366, 1330, 283, -967, -768, 345, 728, 190, -561, -507, 128, 635, 465, -340, -689, -244, 696, 771, -316, -1141, -294, 1143, 1017, -803, -1564, 139, 1837, 736, -1646, -1542, 1083, 2137, -202, -2312, -747, 2038, 1602, -1358, -2116, 508, 2260, 386, -1971, -1052, 1385, 1437, -713, -1432, 133, 1146, 214, -721, -222, 351, -14, -258, 376, 446, -632, -886, 676, 1468, -344, -1947, -344, 2222, 1219, -2028, -2086, 1438, 2758, -504, -3040, -557, 2894, 1601, -2244, -2328, 1376, 2673, -403, -2549, -434, 2105, 986, -1492, -1164, 901, 1090, -461, -775, 393, 496, -467, -362, 775]
3374G75k84j518J17K070L02k382j093K378K051j972k884J062L472J03l545j322
3390b670L030K399k097l047Q87L163K74k745j182K001J679j095j726L10J380J77
3406G38q45k90L36Q9p6K97J64o61n53Q26J028n91j524L0J821P16j729j478J182
3425e20K092l57k293o22K040J476j324k093M34K178N64j844j369J159J782k33
3441A070j810n76J388J172p47j356L1J183N11p62p31K31O63J40k86k91j21P6M39
3460B24L41m37r23J73J321M83j452j266J184J978n06k435m48K475J456k055k287
3477b174J224K796k00k847q25K491J563j746k015R50K039k09j778k68J333M42
3493G76q73l92O61J23o82Q7J003j25j408j58J771P15j910j474J695K265j078k890
$$ y = [775, 491, -1027, -910, 1160, 1462, -920, -2013, 365, 2416, 444, -2440, -1378, 2094, 2197, -1348, -2670, 360, 2759, 662, -2385, -1498, 1665, 1939, -806, -1988, 13, 1692, 597, -1129, -819, 561, 738, -107, -397, -61, 28, -48, 249, 413, -248, -801, 25, 1053, 462, -1062, -1032, 789, 1505, -224, -1702, -520, 1572, 1215, -1078, -1700, 340, 1816, 492, -1601, -1167, 1011, 1575, -269, -1638, -479, 1303, 1070, -740, -1316, 72, 1244, 497, -859, -828, 355, 866, 104, -627, -396, 267, 407, 121, -170, -291, -215, 224, 565, 128, -795, -622, 699, 1182, -270, -1536, -352, 1626, 1120, -1315, -1763, 712, 2168, 113, -2174, -950, 1846, 1646, -1201, -2026, 465, 2028, 282, -1733, -783, 1256, 1047, -731, -999, 334, 776, -97, -489, 172, 295, -387, -300, 703, 578, -830, -988, 783, 1498, -412, -1886, -191, 2074, 996, -1894]
3511a894J82L088R04k855j914K203K605j238k896J69K777P12k256j333J560J563
3527A377q43j468L34J140r9p55J51N73m21n89O28Q70p19j287M94J815p3k072o63
3546a607K083J442j694k146J008K496n0k539q50K132J598j411k028N58K034K39
3562A265j656q31J055J083m05r83j01O43L33j73l30j44J9K86L49j68o27k11P05
3581A09O93n16j027J3J188O08j019j153N15J506J90j497r60J118J564m64j829
3598i61l57J739J075j221j669N36J883K37j722q72J234J292o58j393O4J195L68
3615G70q39n09M48M18j79j49J49j40l82L07P45j79j147k14J442Q02j430j509J073
3634e23K093l50k416n19K340J419j927k103J174K475k81k469n95K140J205j566
$$ y = [-1894, -1712, 1376, 2280, -575, -2489, -286, 2319, 1081, -1815, -1646, 1131, 1843, -413, -1746, -186, 1377, 534, -934, -600, 540, 441, -314, -163, 410, -11, -600, 28, 898, 179, -1108, -614, 1201, 1128, -944, -1607, 476, 1918, 224, -1922, -914, 1582, 1532, -1007, -1857, 275, 1873, 462, -1566, -1008, 1026, 1265, -391, -1222, -167, 916, 511, -472, -573, 70, 403, 230, -100, -244, -225, 61, 410, 242, -385, -596, 109, 802, 286, -741, -728, 460, 1068, 49, -1104, -589, 917, 1107, -390, -1350, -232, 1332, 868, -961, -1318, 421, 1496, 275, -1394, -858, 1025, 1262, -460, -1332, -98, 1194, 536, -857, -793, 402, 770, -69, -578, -130, 288, 109, -40, 109, -31, -413, -106, 639, 460, -687, -901, 541, 1343, -87, -1596, -523, 1570, 1220, -1196, -1715, 625, 2044, 117, -1986, -812, 1663, 1382, -1087, -1682, 458, 1663, 97]
3650I7j497R16J514m18j260Q0R82k6p40J61O72l36q40M44J177l48j565l6J852
3669H29O26j887j345J628K034j081k491K90K587O44k392j387J790J946j006k144
3685a359K33J970M17j557q25J012R16n02p74K21M86j54k21L25O9n57k12P63N66
3704H17q49r77O51J367j65j629m35J544J093j175j567N47J787J90j669q86J213
3721a43J381n88j499j13J328O79q81j018L25J040J97p65n87L75O81O1n38l33J96
3740b02M46J20l00l65j1M37L42k33o27j57P04O14m81j044K6J222N63j074j182
3759a202O86J575k6j715p14J517J354r98j759L13J871L74j657r04J160J251o65
3776D61j249J65J098J10p70j81M82R0l96J21M79k84p45L03J078o9j428l47J559
$$ y = [97, -1400, -484, 1030, 612, -648, -568, 414, 388, -352, -191, 481, 145, -695, -251, 926, 578, -987, -1023, 829, 1455, -432, -1777, -149, 1885, 804, -1687, -1397, 1190, 1834, -558, -1945, -155, 1791, 785, -1359, -1126, 844, 1261, -296, -1121, -109, 807, 305, -469, -248, 238, 84, -137, 188, 257, -300, -512, 251, 817, -32, -1009, -358, 1009, 844, -785, -1220, 324, 1417, 242, -1325, -778, 1009, 1199, -470, -1356, -143, 1238, 650, -849, -962, 366, 1045, 164, -854, -529, 511, 708, -57, -644, -269, 412, 473, -65, -398, -202, 244, 364, 64, -301, -312, 125, 467, 234, -393, -550, 154, 768, 287, -757, -731, 491, 1054, -20, -1202, -516, 1059, 1033, -682, -1396, 121, 1475, 477, -1282, -969, 902, 1276, -381, -1285, -125, 1126, 461, -788, -623, 475, 585, -185, -366, 116, 206, -190, -69, 410, 126, -619, -316, 762, 693, -735, -1082, 477]
3795D77R63j465j585J062K069l85k295l95K191J164j817j722J153K023m15j989
3811i66k51J688P24j241r48Q04Q82m50o90K79N27l50m10N36M94p07p51P11J168
3830A049o00j509J96J746M43j785j094J491J663r55k002K11K064N33j800j141
3846a490J299J463o07j537lJ331M01q96o56M76O16j30l85l5J18k8J10K22j75m77
3866c83K2P22K70p41o96N76J040j98j190l20J081Q63p53j201J92J327L95j132
3884a26r31O68J270r5j255n14R91R63n44j171KJ115M85q29p64M19Q14j8o77k43
3904d40L95L18j25k01k3n4L1K86J74m21n12L71Q63q0j125l44J166Q85r61j404
3924a201N49J696O8j734p55J527J274j007j633L96J685J99j504o49J125R17o99
$$ y = [477, 1440, -25, -1610, -548, 1521, 1136, -1159, -1554, 637, 1801, -16, -1738, -585, 1438, 1023, -966, -1217, 471, 1195, -46, -994, -190, 692, 242, -448, -169, 358, 8, -402, 134, 628, -79, -830, -119, 1049, 449, -1060, -864, 882, 1325, -460, -1554, -63, 1600, 645, -1357, -1146, 918, 1451, -349, -1490, -191, 1272, 665, -872, -875, 456, 857, -39, -695, -219, 397, 267, -118, -153, -35, -63, 47, 269, 94, -383, -361, 361, 631, -110, -806, -230, 810, 612, -578, -898, 183, 1046, 293, -908, -716, 611, 1006, -126, -1057, -389, 881, 786, -469, -983, 8, 971, 427, -744, -742, 373, 858, 29, -735, -316, 498, 480, -197, -440, -45, 273, 148, -53, -76, -130, -99, 187, 361, -60, -572, -201, 662, 582, -543, -887, 279, 1164, 203, -1201, -652, 1044, 1112, -622, -1377, 150, 1424, 417, -1216, -820, 865, 1064, -440, -1089, 36, 953, 254]
3941B54r45L52P79j45n60J52L74k72m03M73N58n41r04M81J252j86j529l16J621
3960D95R25j451j491J039J908m57k005l21J954R38j555j384R95J563l92j506j26
3977h71J241M38q70n54N49M52l28k85L00J36m58o7O70J84q35m69Q57Q94p18j304
3997a038L40J513K43j517p92J254J267p79j527J42J541M73j264r23P66J133k39
4014E93j056k51P97N91m51o11L1M95K09k26k82m9J63K57L5k53l26J18M88J77n00
4035e1m93K74P77M9q33m82O66Q85l28j089j77J091P04q30j114L72J288K05j231
4054c17p35R23J103m33j262l6J107M83q30p14M70P31j39o10n2L95O2j90R3J24
4074A73k85k52M44N31m92q62K79J219P1j381n84J326J131j018j601N20J856J04
$$ y = [254, -691, -339, 440, 295, -265, -113, 261, -11, -414, 59, 617, 76, -828, -347, 905, 719, -810, -1126, 495, 1420, -31, -1522, -483, 1425, 968, -1037, -1358, 596, 1534, -21, -1405, -410, 1153, 761, -745, -871, 370, 808, -62, -616, -67, 385, 57, -228, 72, 208, -250, -317, 353, 537, -298, -767, 90, 984, 266, -1038, -698, 815, 1058, -459, -1251, 3, 1270, 491, -1036, -894, 647, 1120, -144, -1067, -301, 832, 593, -463, -714, 83, 674, 223, -388, -357, 138, 347, 121, -161, -210, -47, 210, 245, -8, -334, -216, 272, 449, -51, -544, -270, 507, 556, -277, -759, -93, 792, 464, -625, -802, 289, 993, 163, -951, -579, 709, 914, -317, -1052, -129, 974, 541, -721, -757, 350, 833, 3, -711, -241, 490, 351, -259, -311, 84, 146, -44, 49, 173, -112, -364, 80, 611, 119, -743, -464, 755, 826, -555, -1139, 187, 1318, 300, -1301, -781, 1075, 1179]
4092A179j804p55J543J220j043j532N20J513K6j351m07J056N88p07n80M62M37
4109C65l32l31M02K57n47l25O99N77p96q85O34J304l54j575j56J619P89j451j293
4128a399J007J669m23j779k24J596Q10j265j098P29J224k40j115j33Q16L65n12
4145B8l53K64K18j49k6J83r8l85J23N89K7p47l38P65P16o07j048K72J201K12j147
4166c00o89Q68J071m45j235n4J131N56q19r03L93R87P3q51m65N39O81j60o45k12
4186d79M81M00k14m16p7L14K19m4k28j59M3L03J90k24n04K6O39L49n99p72M14
4207c38J035K4j156n39J038J017p25j301K03J425L42j284q60R81J165n16j250
4224g39J9J161L21q61n50N49N85l25m26J83K57k13j30L58J53n40l61P01O33o51
$$ y = [1179, -625, -1380, 163, 1383, 340, -1192, -672, 841, 867, -484, -891, 165, 753, 46, -534, -72, 365, 33, -298, 104, 361, -186, -511, 188, 765, -31, -916, -282, 1022, 668, -907, -1063, 556, 1345, -106, -1399, -392, 1277, 854, -925, -1149, 447, 1257, -8, -1106, -377, 847, 607, -508, -641, 175, 540, 28, -325, -61, 157, 8, -18, 165, 67, -318, -195, 394, 421, -326, -664, 101, 817, 210, -838, -566, 635, 847, -300, -989, -121, 950, 505, -730, -784, 347, 903, 84, -819, -426, 561, 634, -217, -682, -143, 538, 378, -267, -479, 2, 402, 188, -228, -305, 9, 228, 184, -44, -203, -160, 143, 333, 109, -395, -369, 270, 619, 20, -752, -338, 697, 721, -435, -974, 64, 1081, 356, -945, -742, 683, 1025, -259, -1119, -138, 1027, 511, -739, -720, 441, 762, -99, -649, -100, 485, 160, -266, -83, 174, -39, -169, 189, 342, -198, -559, 142, 775, 124]
4244A24j052M55J362Mj557n44J485J092j130j557O37J763j6j745n94J503J019
4261A249j025j280N42J292j20j096j94Q32L09n84k84M49J46m10l9N37N6p72j70
$$ y = [124, -928, -473, 889, 893, -664, -1208, 277, 1369, 239, -1318, -681, 1082, 1066, -679, -1273, 230, 1249, 224, -1056, -514, 778, 658, -438, -632, 200, 509, -75, -359, 90, 236, -174, -213, 324, 380, -392, -562]
$$ [...]
8191G8
##END NTUPLES=NMR FID
##END=
