##TITLE=1H_SR58(52)
 CDCl3, 8 sc, 
 30.04.2021
##JCAMPDX= 6.0         $$ Bruker NMR JCAMP-DX V2.0
##DATA TYPE= NMR FID
##DATA CLASS= NTUPLES
##ORIGIN= UXNMR, Bruker Analytische Messtechnik GmbH
##OWNER= root
$$ XWIN-NMR		Version 3.5
$$ Fri Apr 30 14:39:51 2021 Russian Standard Time (UT+4h)  she@DPX200
##.OBSERVE FREQUENCY= 200.131506
##.OBSERVE NUCLEUS= ^1H
##.DELAY= (6, 6)
##.ACQUISITION MODE= SIMULTANEOUS
##.ACQUISITION SCHEME= undefined
##.AVERAGES= 8
##.DIGITISER RES= 18
##SPECTROMETER/DATA SYSTEM= spect
##.PULSE SEQUENCE= zg30
##.SOLVENT NAME= CDCl3
##.SHIFT REFERENCE= (INTERNAL, CDCl3, 0, 15.7039)
##AUDIT TRAIL= $$ (NUMBER, WHEN, WHO, WHERE, WHAT)
$$ ##TITLE= Audit trail, XWIN-NMR		Version 3.5
$$ ##JCAMPDX= 5.01
$$ ##ORIGIN= Bruker BioSpin GmbH
$$ ##OWNER= she
$$ F:/spectra/data/she/nmr/H-F/1/audita.txt
$$ ##AUDIT TRAIL=  $$ (NUMBER, WHEN, WHO, WHERE, WHAT)
(   1,<2021-04-30 14:39:00.54 +0400>,<she>,<DPX200>,
      <created by zg, POWCHK disabled, PULCHK disabled
       configuration hash MD5:
       00 E9 B6 7A A2 85 ED C7 34 08 36 98 17 FE 4E 26
       data hash MD5: 16K
       F2 1E 74 C2 8C 69 44 9D 2C E6 2A 0F 94 46 3B D2>)
$$ ##END=
$$ 
$$ hash MD5
$$ 03 D2 3D 90 CE FD 97 09 FC 48 8D 89 1F 7A 0E 5B
##$RELAX= 
##$RELAX= 
##$RELAX= 
##$RELAX= 
##$RELAX= 
##$RELAX= 
$$ Bruker specific parameters
$$ --------------------------
##$DU= <F:/spectra>
##$EXPNO= 1
##$NAME= <H-F>
##$PROCNO= 1
##$TYPE= <nmr>
##$USER= <she>
##$AMP= (0..31)
100 100 100 100 100 100 100 100 100 100 100 100 100 100 100 100 100 100 
100 100 100 100 100 100 100 100 100 100 100 100 100 100 
##$AQSEQ= 0
##$AQ_mod= 1
##$AUNM= <au_zg>
##$AUTOPOS= <>
##$BF1= 200.13
##$BF2= 200.13
##$BF3= 200.13
##$BF4= 200.13
##$BF5= 200.13
##$BF6= 200.13
##$BF7= 200.13
##$BF8= 200.13
##$BYTORDA= 1
##$CFDGTYP= 0
##$CFRGTYP= 5
##$CHEMSTR= <none>
##$CNST= (0..31)
1 1 145 1 1 1 1 1 1 1 1 1 1 1 1 1 1 1 1 1 1 1 1 1 1 1 1 1 1 1 1 1 
##$CPDPRG= <>
##$CPDPRG1= <>
##$CPDPRG2= <>
##$CPDPRG3= <>
##$CPDPRG4= <mlev>
##$CPDPRG5= <mlev>
##$CPDPRG6= <mlev>
##$CPDPRG7= <mlev>
##$CPDPRG8= <mlev>
##$CPDPRGB= <>
##$CPDPRGT= <>
##$D= (0..31)
0 1.2 0 0 0 0 0 0 0 0.06 0 0.03 0 0 0 0 0.0002 0 0 0 0 0 0 0 0 0 0 0 0 
0 0 0 
##$DATE= 1619779139
##$DBL= (0..7)
120 120 120 120 120 120 120 120 
##$DBP= (0..7)
150 150 150 150 150 150 150 150 
##$DBP07= 0
##$DBPNAM0= <>
##$DBPNAM1= <>
##$DBPNAM2= <>
##$DBPNAM3= <>
##$DBPNAM4= <>
##$DBPNAM5= <>
##$DBPNAM6= <>
##$DBPNAM7= <>
##$DBPOAL= (0..7)
0.5 0.5 0.5 0.5 0.5 0.5 0.5 0.5 
##$DBPOFFS= (0..7)
0 0 0 0 0 0 0 0 
##$DE= 6
##$DECBNUC= <off>
##$DECIM= 32
##$DECNUC= <off>
##$DECSTAT= 4
##$DIGMOD= 1
##$DIGTYP= 9
##$DL= (0..7)
0 120 120 120 120 120 120 120 
##$DP= (0..7)
150 150 150 150 150 150 150 150 
##$DP07= 0
##$DPNAME0= <>
##$DPNAME1= <>
##$DPNAME2= <>
##$DPNAME3= <>
##$DPNAME4= <>
##$DPNAME5= <>
##$DPNAME6= <>
##$DPNAME7= <>
##$DPOAL= (0..7)
0.5 0.5 0.5 0.5 0.5 0.5 0.5 0.5 
##$DPOFFS= (0..7)
0 0 0 0 0 0 0 0 
##$DQDMODE= 0
##$DR= 18
##$DS= 0
##$DSLIST= <SSSSSSSSSSSSSSS>
$$ [...]
##$SUBNAM2= <"">
##$SUBNAM3= <"">
##$SUBNAM4= <"">
##$SUBNAM5= <"">
##$SUBNAM6= <"">
##$SUBNAM7= <"">
##$SUBNAM8= <"">
##$SUBNAM9= <"">
##$SW= 16.9725357007746
##$SWIBOX= (0..15)
0 0 2 0 0 0 0 0 0 0 0 0 0 0 0 0 
##$SW_h= 3396.73913043478
##$TD= 16384
##$TD0= 1
##$TE= 0
##$TE2= 300
##$TE3= 300
##$TEG= 300
##$TL= (0..7)
0 120 120 120 120 120 120 120 
##$TP= (0..7)
150 150 150 150 150 150 150 150 
##$TP07= 0
##$TPNAME0= <>
##$TPNAME1= <>
##$TPNAME2= <>
##$TPNAME3= <>
##$TPNAME4= <>
##$TPNAME5= <>
##$TPNAME6= <>
##$TPNAME7= <>
##$TPOAL= (0..7)
0.5 0.5 0.5 0.5 0.5 0.5 0.5 0.5 
##$TPOFFS= (0..7)
0 0 0 0 0 0 0 0 
##$TUNHIN= 0
##$TUNHOUT= 0
##$TUNXOUT= 0
##$USERA1= <user>
##$USERA2= <user>
##$USERA3= <user>
##$USERA4= <user>
##$USERA5= <user>
##$V9= 5
##$VALIST= <valist>
##$VCLIST= <CCCCCCCCCCCCCCC>
##$VD= 0
##$VDLIST= <DDDDDDDDDDDDDDD>
##$VPLIST= <PPPPPPPPPPPPPPP>
##$VTLIST= <TTTTTTTTTTTTTTT>
##$WBST= 1024
##$WBSW= 4
##$XGAIN= (0..3)
0 0 0 0 
##$XL= 0
##$YL= 0
##$YMAX_a= 245294
##$YMIN_a= -338603
##$ZGOPTNS= <>
##$ZL1= 120
##$ZL2= 120
##$ZL3= 120
##$ZL4= 120
##$ABSF1= 10
##$ABSF2= 0
##$ABSG= 5
##$ABSL= 3
##$ALPHA= 0
##$AQORDER= 0
##$ASSFAC= 0
##$ASSFACI= 0
##$ASSFACX= 0
##$ASSWID= 0
##$AUNMP= <proc_1d>
##$AZFE= 0.1
##$AZFW= 0.1
##$BCFW= 1
##$BC_mod= 2
##$BYTORDP= 1
##$COROFFS= 0
##$CY= 11.3945322036743
##$DATMOD= 1
##$DC= 2
##$DFILT= <>
##$DTYPP= 0
##$F1P= 15.9154993809931
##$F2P= -4.1035820241983
##$FCOR= 0.5
##$FTSIZE= 0
##$FT_mod= 4
##$GAMMA= 1
##$GB= 0.15
##$INTBC= 1
##$INTSCL= 1
##$ISEN= 128
##$LB= 0.24
##$LEV0= 0
##$LPBIN= 0
##$MAXI= 10000
##$MC2= 0
##$MEAN= 0
##$ME_mod= 0
##$MI= 1.114404
##$NCOEF= 0
##$NC_proc= 0
##$NLEV= 6
##$NOISF1= 3.799351
##$NOISF2= 2.8
##$NSP= 1
##$NTH_PI= 0
##$NZP= 0
##$OFFSET= 15.70392
##$PC= 1
##$PHC0= -11125.67
##$PHC1= 17.00103
##$PH_mod= 1
##$PKNL= yes
##$PPARMOD= 0
##$PSCAL= 0
##$PSIGN= 0
##$REVERSE= no
##$SF= 200.130013532006
##$SI= 16384
##$SIGF1= 3
##$SIGF2= 2
##$SINO= 400
##$SIOLD= 16384
##$SREGLST= <1H.CDCl3>
##$SSB= 0
##$STSI= 0
##$STSR= 0
##$SW_p= 3612.71676300578
##$SYMM= 0
##$S_DEV= 0
##$TDeff= 0
##$TDoff= 0
##$TI= <>
##$TILT= no
##$TM1= 0
##$TM2= 0
##$TOPLEV= 0
##$USERP1= <user>
##$USERP2= <user>
##$USERP3= <user>
##$USERP4= <user>
##$USERP5= <user>
##$WDW= 1
##$XDIM= 8192
##$YMAX_p= 0
##$YMIN_p= 0
$$ End of Bruker specific parameters
$$ ---------------------------------
##NTUPLES= NMR FID
##VAR_NAME=  TIME,          FID/REAL,        FID/IMAG
##SYMBOL=    X,             R,               I
##VAR_TYPE=  INDEPENDENT,   DEPENDENT,       DEPENDENT
##VAR_FORM=  AFFN,          ASDF,            ASDF
##VAR_DIM=   8192,          8192,            8192
##UNITS=     SECONDS,       ARBITRARY UNITS, ARBITRARY UNITS
##FACTOR=    0.0002944,     1,               1
##FIRST=     0,             0,               0
##LAST=      2.4114304,     0,               0
##MIN=       0,             -338603,         0
##MAX=       2.4114304,     245294,          0
$$ Real data points
##PAGE= N=1
##DATA TABLE= (X++(R..R)), XYDATA
0@%%%%%%%%%%qJ6j6J6k4L2m0M8n6P2q5R8j17J36j57J82k10K43k81L24l70M21m77
33b53N38o06O82p67Q61r60J068j187J319j463J617j789J977k179K401k644K910
50A525l204L530l893M294m744N255n837O506p287Q210r318J0682j2404J4649j7706
65i742K2116k9017M1281o8953K25671l7222m82737N83897k40795j98930M36082
76B41651l50688N117L36829l77971J07536J72563k13163Q6302K653k3382O3197
87E0644j10267Q9029j6864n1268J15764j53679O7897J35864k61873J48405R8551
98A12203k39024J77869j2353j38004K01727j34752m3514J90694j66664J4416R7056
109E9654j09062Q6013m4971n0066J41313j19804m342J09044j23437P1406J5111
$$ plain form
0 0 0 0 0 0 0 0 0 0 0 0 -8 8 -8 8 -16 16 -24 24 -32 40 -45 53 -64 72 -85 97 -113 130 -151 173 -197 224 -253
33 -253 285 -321 361 -406 455 -505 563 -624 695 -768 849 -940 1037 -1142 1259 -1385 1525
50 1525 -1679 1851 -2042 2252 -2492 2763 -3074 3432 -3855 4355 -4963 5719 -6685 7964 -9742
65 -9742 12374 -16643 24638 -44315 181356 144134 -338603 245294 4499 -194431 241651
76 241651 -109037 -103920 232909 -145062 -37526 135037 -78126 8176 10829 -12553 50644
87 50644 -59623 29406 12542 -38726 77038 -76641 -8744 127120 -134753 13652 112203
98 112203 -126821 51048 38695 -99309 102418 -32334 -75848 114846 -51818 -37402 59654
109 59654 -49408 36605 -8366 -58432 82881 -36923 -41265 67779 -55658 15748 30859
120C0859j12107J48111n4229j01971J58839o7764n1345R4437p4491L0272L3624
131C4235q3320O4254O140m5822L5527k6046L1055j874o1662Q5338k4265o2355
143d8795R2539n3645j5989Q2159r9280K9199Q3261j20333L8580O9615r6924M0009
155C96L2678o6403M7837P337n4885M5401J4358n2047J9692L4988l9375n890M0523
168B4610l2370l878L9398m8486J1283M7949o7901J7580N2055o8293K0426L6666
180B9039n5611L0976J2545m5771M1725m1l9320L4956L02k3284J7629k728n138
193d721P157n265n01L801M21n132k90J0798q783n719J4222p115m114Q996p575
208c820L287N018j0457O136M546q288L522J765k078J225j958K709L38l294L042
$$ plain form
120 30859 -81248 66863 12634 -89337 69502 1738 -49607 44830 -29661 611 34235
131 34235 -49085 15169 21309 -24513 11014 -15032 16023 14149 -47513 37825 13560 -48795
143 -48795 43744 -9901 -25890 56269 -43011 -13812 69449 -50884 -12304 57311 -39613 396
155 396 33074 -33329 14508 21845 -33040 12361 26719 -25328 -5636 29352 -10023 -15913 24610
168 24610 -7760 -11638 27760 -20726 -9443 38506 -29395 -11815 40240 -28053 -7627 29039
180 29039 -26572 4404 16949 -28822 12903 12862 -26458 8498 8800 -14484 3145 417 -4721
193 -4721 2436 -2829 -3330 471 892 -4240 -4530 6268 -2515 -8234 5988 -1127 -5241 3755 -3820
208 -3820 -533 4485 -5972 164 4710 -3578 -56 1709 -369 856 -1102 1607 1945 -1349 1693
223A693p07l76K281m372K750K733m950J322L027l132K49J737j604n4J142q59j421
240e41L592k204l084N907k702m108P162m234l128P945o355j324P916p256m24P296
256D458p567M46O407o573J43N631n597p29O440n355k315Q081n442l375R732o851
272b466l336J1451q860k509J2164j0740n14J1883j2680K063J0549j2888L998Q287
286F402j1980M947N924j0025M753M212p428K596N070o701J514N385o381O17O742
301E647p826J346P079r392L403N768r964N683K440q096P603k313l858P332o169
316a317J087M059o895O164k330m116R022p992j18Q276j0561N043M005j0430R472
331C369k248o985J0064n478j540N622o515M335p95l834P375o816J959M762j0284
$$ plain form
223 1693 986 610 2891 -1481 1269 4002 -948 374 3401 269 518 2255 651 597 1739 880 -541
240 -541 3051 847 -2237 3670 968 -3140 4022 -212 -3340 4605 -1750 -3074 4842 -2414 -2838 4458
256 4458 -3109 -2663 3744 -2829 -2686 2945 -2652 -3381 3059 -2296 -4611 3470 -1972 -5347 4385 -2466
272 -2466 -5802 5649 -3211 -5720 6444 -4296 -4810 7073 -5607 -3544 7005 -5883 -1885 6402
286 6402 -5578 -631 5293 -4732 21 4233 -3195 -599 4471 -2230 -716 4669 -1712 -1095 5647
301 5647 -2179 -833 6246 -3146 257 6025 -3939 1744 4184 -3912 3691 1378 -2480 4852 -1317
316 -1317 -230 3829 -3066 3098 768 -3348 5674 -2318 -2436 5840 -4721 322 4327 -6103 3369
331 3369 1121 -5864 4200 -1278 -2818 2804 -3711 624 -171 -4005 3370 -3446 -1487 3275 -7009
346g009J0474k237j0212J6431r753n019J6456j6213M439J1534j9800J3869L135
359F095j7639J8989o954r332J8389j4359K143J2120j8773J2528K536j5279J7812
372H276q801n609J7190j7836O103J1232k0771J5030P43j4838J9551j2011m408
385f149J8628j9636O694R940j8809J5676l408j1645K0095j5340r41J6635k0969
398i229J1318N021j8803K0646q317j1008K2992j8712J179J6024k1969J3360M170
411F672j9584K1408q320j0403K1087j7360K549J2938j9762J3665J818j6096J8918
424G530q709o659J6690j5754N135Q975j7364J3847l13j2276J6304r909k351J3282
438H428j5441P642N747j5228J3702k903q700J4838j1099Q3J1447j4714P485M352
$$ plain form
346 -7009 3465 1228 -8984 7447 -2306 -7325 9131 -7082 -2643 8891 -10909 2960 6095
359 6095 -11544 7445 491 -8841 9548 -4811 -2668 9452 -9321 3207 5743 -9536 8276
372 8276 -525 -6134 11056 -6780 -677 10555 -10216 4814 5557 -9281 10270 -1741 -6149
385 -6149 12479 -7157 -463 9477 -9332 6344 2936 -8709 11386 -3954 -4895 11740 -9229
398 -9229 2089 7110 -11693 8953 636 -10372 12620 -6092 -4913 11111 -10858 2502 6672
411 6672 -12912 8496 176 -10227 10860 -6500 -3951 8987 -10775 2890 4708 -11388 7530
424 7530 -1179 -7838 8852 -6902 -1767 7208 -10156 3691 3378 -8898 7406 -2503 -4854 8428
438 8428 -7013 629 6376 -8852 4850 1947 -6753 8085 -3014 -2931 8516 -6198 1287 5639
452E639j2546J2084l696o418J2340r903P88Q528j1558O577K033q581R487m464
466C10l578R251q698K377N161r024O631p54n662Q442n603j479O875p599L607K252
482B509o571O884l206l301P666o682Q65N346p971N252R25p057Q060l137l673P199
498C108n371K5M826n836L089J937m981M207j181k121L411k250P78J355k741K465
514G20p87j010K435k361P72J919l007K009L24k038K463j306n26J577j261P50J90
531H63j160J817j564K89J588k774J747J243l448L179m72l169M078j390k445M084
547B466k521r35L201k561p04K839k533j37K034j517l53J535j411m14J545q23r45
564a234J770o18j740K455n46j778J953n48j228J926r08p68J449q45k60J065n80
$$ plain form
452 5639 -6907 5177 1481 -4937 7403 -2500 -1712 6816 -4742 1835 3868 -4713 4774 310
466 310 -3268 5983 -2715 -338 4823 -4201 2430 1676 -3986 4456 -1147 -2626 4249 -3350 257 2509
482 2509 -4062 2822 -384 -3685 3981 -2701 -1836 3510 -4461 791 1716 -5341 2719 -418 -4091 3108
498 3108 -2263 -2238 2588 -3248 -159 1778 -3203 1004 -177 -2298 1113 -1137 -359 996 -1745 720
514 720 -67 -1077 1358 -1003 -231 1688 -1319 690 1014 -1024 1439 133 -393 1184 -77 673 863
531 863 -297 1520 -44 245 1833 -941 806 2049 -1399 1780 1308 -1861 2217 827 -1618 2466
547 2466 -55 -990 2211 -350 -1054 1785 -748 -885 1149 -368 -721 814 -597 -1011 534 -289 -1234
564 -1234 536 -82 -1822 633 87 -1691 262 -286 -1514 412 -496 -1264 185 -660 -920 145 -435
581d35p37J037J30q05O08L76r78M79O80j127N83Q01j202M20Q62q73L69N08p12
600a6K89K63k95J47K16N9l36N20N7j261J478k6j309R35K36j270J337l08q64J332
620A184k84j527J474k8j679J418M11j413N38N04j491J436j4j738J856j61k334
637a848K285k05j832K469j564n12K252k172j90K065j917O37J016j746J394o64
653e32r24J849q94l54R86r99O85O2p71J217n08j04K30k78Q05p77k39J518j374
672d02j32J651j869J423J24k037K638k12k236K472o24j152J498j124K89J123j958
689e28J152O19j358J005n51K77M42j996J870K32k333K223o60j638L170l216M00
706h90L484m574J294K685l723J465P11k298K743j096r78K160j287q1ll50J230
$$ plain form
581 -435 -1172 -135 -5 -810 -202 174 -804 -325 355 -772 -189 612 -590 -170 692 -181 188 696 -16
600 -16 273 536 241 388 604 663 327 847 904 -357 1121 1095 -214 721 957 -313 1024 716 -148 1184
620 1184 900 -627 847 819 -860 558 969 -444 94 598 -893 543 529 -1209 647 486 -1848
637 -1848 437 232 -1600 869 -695 -1207 1045 -1127 -1317 748 -1169 -532 484 -1262 132 -532
653 -532 -1456 393 -501 -855 131 -868 -183 -121 -892 325 -183 -287 -57 -335 470 -307 -546 972 -402
672 -402 -534 1117 -752 671 795 -1242 1396 1184 -1052 1420 796 -356 1142 18 307 1430 -528
689 -528 624 1243 -115 890 339 616 1058 -938 932 1164 -1169 1054 394 -1244 1926 -1290 -890
706 -890 2594 -1980 -686 1999 -1724 -259 452 -1846 897 -199 -1177 983 -304 -385 -388 -738 492
723D92j595K20J811k133M65J470k398K835j826k264M435j526j672K897j995o3
739h47J564k566K462L83l339K990k95o67R62j376J990j23l381L937m79k401L114
756A928k222N83K114m024J975K284m071K075M58j390J543j464L11J489j891N33
772B31L6J38O92k819K360J321m034K902O51l110L297k121j723N098m015j340N190
789B754l617n68K700k344Q79P58k028J605K88k034P38J040j39j244O68J270j728
806a002N57O39j430K020r39j820L584j563k202L327j528m67K026k108J365P68
822A227k756J611Q14j737J099l6K38K10j266R75R67j568M58J48l60Q35j288L17
840a12J628j225j356J569o59P87K68l34J31m62j90l54J262q17q07J321j31j467
$$ plain form
723 492 -1103 -883 928 -1205 -740 730 -1668 1167 -659 -2923 1512 -14 -1686 1211 -784 -847
739 -847 717 -1849 613 996 -2343 647 352 -315 647 -729 1261 1138 -2243 1694 1215 -1186 1928
756 1928 -294 289 2403 -1621 354 2638 -1433 642 1100 -290 1253 -211 100 1589 -302 231
772 231 267 405 1097 -1722 638 1959 -2075 827 1478 -1632 1665 -456 -2179 2919 -1096 -2436 2754
789 2754 -863 -1431 1269 -1075 -196 562 -1466 139 427 -1607 -869 171 32 -1212 -544 726 -1002
806 -1002 -445 194 -1236 784 -155 -1975 1609 46 -2156 1171 -357 -824 1202 -906 459 1227
822 1227 -1529 82 896 -841 258 222 460 670 -596 379 1346 -222 236 384 24 859 -429 -112
840 -112 1516 291 -1065 504 -155 632 900 566 697 235 45 -309 953 136 -671 650 519 -948
858i48J386j47q00R93p96n65J841j267p56J886j151n92J512j228L63K04j017R30
876a52J01p62P81j02k57ln8N27pm64J31k53Q74k66o20O66k39l25O91k05k15L82
898B25p02L14Q61p33L2O03l36J29m45L09K27l72K8J53nn9j6O6L57p59M19K08j36
921C68j62J19Lk30M20m39R7L88k12j83K34l20m5J81l28J80q6j16J63j09j07J01
943h3j05J24q4k26K86L0r7j69K03J31m27l0J89K6n2o6K4J50j43j21M83M1n01N19
967A02j41k97L20j51l02Q43m96r0O29m73MO18p78N08J84q70Q87k36o56J056q26
988a65J01O71o48M83K17q53O98l22k26O12l17j05l4r9K81j18j17o1L89l04p7j64
1010a58M82j97k59M24j30k30L33n82O17K99j365R22O8q47O81l74k15N56p68J61
$$ plain form
858 -948 438 291 -509 484 -312 -877 964 -303 -1059 827 -324 -916 596 -632 -269 -65 -1082 -152
876 -152 -51 -813 -32 -134 -391 -394 -452 75 68 -396 -265 -518 356 90 -530 136 -103 -428 263 58 -157 225
898 225 -477 -163 698 -35 -3 600 264 393 -52 257 484 112 140 293 288 229 213 279 636 -123 296 504 368
921 368 206 325 328 98 518 79 176 564 352 169 403 83 38 219 -109 71 -15 -131 32 -77 -184 -83
943 -83 -188 -64 -148 -374 -88 -58 -155 -324 -121 10 -417 -447 -258 -232 -284 -350 -326 -176 -319 -440 43 84 -417 102
967 102 -39 -336 -16 -167 -469 374 -122 -212 417 -56 -52 566 -212 296 480 -390 497 261 -395 661 -165
988 -165 -64 607 -41 442 659 -194 504 182 -44 568 251 146 112 13 294 176 59 -2 387 83 6 -158
1010 -158 324 127 -132 292 162 -68 265 -317 300 599 -766 156 224 -623 58 -316 -531 25 -743 -582
1030e82J026j249N56K73p45P25j71j74L70n28L77L67n63L13k36j18N17p31M53
1049a20L68o98Q10l16j45N24p86L18Q15q97L02M24p92O84j41n38J149j062r1R63
1069G71p18L14l9o01Q76m38m98R81o89K9M27o95P63j40o76R97o91m22J018q34
1089b65K68j2n90O13J51o03M83o0l7k6l63N10k32l53P36m92j82M98o16L32L81
1110A41j221J355l07o69R04m94lR59j387L24O70o03J9N82n41J38Oo9O45m91L65
1131C23m33L83L1k74K21l68K53L49o2k14N52p79P8L58k50K30N5p64L03R22j036
1152a22P56k99k46M20q05N48O4n08J21J44l60L01J62q6k68L91j24J15J21j22l47
1173a44k29O11o47N01l26j02L40l40J84K02k95J46o9m56Q11n40r9P06q09j35J291
$$ plain form
1030 -582 444 -805 -249 24 -721 4 -167 -341 29 -499 -122 245 -318 -5 -241 -359 158 -573 -120
1049 -120 248 -450 360 44 -101 423 -363 -45 770 -127 175 599 -193 491 350 -188 961 -101 -192 771
1069 771 53 367 328 -273 603 165 -333 648 -41 -12 415 -280 483 343 -333 664 -27 -449 569 -265
1089 -265 3 -9 -599 14 165 -438 45 -15 -52 -78 -441 69 -163 -516 220 -272 -454 44 -572 -240 141
1110 141 -1080 275 -32 -701 203 -291 -294 665 -722 -398 272 -331 -312 270 -271 -133 -127 -196 449 -42 323
1131 323 -110 273 304 30 251 -117 136 485 423 209 761 -18 60 418 168 398 453 -311 -8 914 -122
1152 -122 634 335 89 509 -296 252 316 -192 -71 73 -287 14 176 90 -178 213 89 204 325 203 -144
1173 -144 -373 238 -409 92 -234 -336 4 -336 -152 50 -245 -99 -168 -624 187 -353 -452 254 -555 -690 601
1194F01r17J75M72q64M15K28m56O32l12j92K87j64K43p1j48L6L18l67L82l06M20
1215D12k42J31j00R3l26M87m65L12J83n48N58l54n88J155r74J61O25o42MP58j065
1236d25N15J89q08J026k00n61O17k34l98P70q27J90K10j87K48o14K89j1m9N41
1256B81q21J24O00j28l83P65n30j75L55j41m4l53L25M17o97k02P62J68j84l28
1276a89l83N45n3P2P5j8k59O52j73j57O0n1j36L03l84M42k70l7M19l20K89l33
1298I4K0J30J73m43K71j62J00K87l78J66j67l26M20j16k18N47r05M08N34n63L59
1319B31k26j09M61k52l45N59n75J42K16l56Q5J80m39O98m65j97N16j60o1j7l28
1340d42K79Jj06K75k98K5K01l53N58m3l06N2J72k15R5K21p6j5p5N0J59j69L3K6
$$ plain form
1194 601 -316 -141 331 -533 -118 110 -346 286 -26 -218 69 -95 148 77 -71 -35 283 -84 298 -8 412
1215 412 170 301 201 294 -32 455 -10 302 485 -63 495 141 -447 708 -266 -105 520 -122 -118 640 -425
1236 -425 90 279 -529 497 297 -264 353 119 -279 491 -336 -146 64 -123 125 -489 -200 -211 -260 281
1256 281 -540 -416 184 56 -327 438 -92 -267 88 -53 -97 -450 -125 292 -405 -607 155 323 139 -189
1276 -189 -572 -27 -80 -8 67 49 -210 442 269 112 172 121 -15 288 -96 346 76 39 458 138 427 94
1298 94 114 244 417 -26 245 83 183 470 92 258 91 -235 185 69 -149 398 -507 -99 435 -128 231
1319 231 5 -104 357 105 -240 319 -256 -114 102 -254 -169 11 -428 270 -195 -392 124 -36 -97 -114 -442
1340 -442 -163 -162 -268 7 -291 -266 -65 -418 140 97 -209 -157 15 -200 -105 116 40 25 -50 0 159 -10 23 49
1364D9j10M86m84K01L22o34L73K35n62O33j66n72O23j84k95L27J54m91M84q7j32
1385A70Q2k17J07j79K14j93P3o2p8j47K21M9r3K18l33K8K7j87M83n59J0L27p14
1408g53L78J78k68J76K40j74j2l8j17J76Q7k2L69n99N8L03j67J26J74j57k1K90
1430B27p35O62l41K82m2l20L48N6K58p56P1O52k61l57L77P9L9l52N38K63q39L96
1452B45N15p29J17M31m41M82l14o67P85oJ57j67l25j23J2J79m2j34M63l79k23
1473a64K2N09L35p95J53k1N1K81j40o76m1Q37q02k26R06p43K95N14J8j79m82O47
1495B99j6k26o3j91m87O94L91n46o09Q02M05r52M61P2r4K40k53j53Q81q63L78
1516A70J63m76M38OK38n46J36m51l98J107J88k45o14O61j06m91l39N65N19n38
$$ plain form
1364 49 -61 425 -59 142 464 -170 203 438 -124 509 343 -229 394 210 -85 242 396 -95 389 302 170
1385 170 252 35 142 -37 177 -16 57 -5 -83 -230 -9 40 -53 165 -168 -140 -113 -300 183 -376 -366 -39 -753
1408 -753 -375 -197 -465 -289 -49 -223 -235 -273 -390 -214 -127 -149 220 -379 -321 -18 -185 -59 115 -42 -63 227
1430 227 -508 154 -187 95 53 -267 81 137 395 -361 -290 362 101 -256 121 200 239 -113 425 688 -151 245
1452 245 760 31 148 579 138 620 306 -361 424 418 575 408 83 -40 -28 151 109 -25 438 59 -164
1473 -164 -142 367 702 -93 60 39 90 371 231 -445 -486 351 -451 -677 229 -514 -219 295 313 134 -348 299
1495 299 283 57 -6 -197 -684 10 401 -145 -754 48 453 -499 -38 34 -60 180 -73 -226 655 -208 170
1516 170 333 -143 295 301 539 -7 129 -322 -720 387 575 330 -284 377 271 -220 -559 6 525 -13
1536a3O78n64j1L74l13M05l32O69j133J28KK46K43N2l8l05L41k39Q9k01l03L22
1558I7o3q62L14K58N15Op77P31m46M89M09j012O29m68j61M20K9p74M7O29K88j86
1580A12L63p12l74R49K07l92L01J8o64k61J082q78R52k41p72P00K89o60P13r64
1600b32L0Q18n61N55m90k82M05k39Q8L04j6k76K99k35n61J017p51K98k96N09n8
1621C26l97k7Kk38J66M2J06J09n04M93j38k42L91j42k70L85r7m77N52m5k91M64
1643A68o78M59M5k31J42l4j56K72j6k20M27l37M1K16l14L25q8k36L38j80J1J4
1665c2l67K30L91l02J56L9j74J74o7j3L44k56K56l09j16J45j23K24K97l10j57
1686C0J54l37o5K98k91K45J91m69L85j76KL47n39N20k83k02L98l02K5L11j71l09
$$ plain form
1536 -13 665 101 90 464 151 556 224 893 -240 -112 -110 136 379 431 393 88 429 190 279 78 -225 97
1558 97 34 -828 -514 -256 259 265 -512 219 -227 262 671 -341 288 -180 -341 79 108 -666 -619 10 298 112
1580 112 475 -237 -611 338 545 153 454 472 -192 -453 629 -249 703 462 -310 390 679 19 732 -232
1600 -232 -202 616 55 610 120 -162 243 4 92 396 380 104 403 168 -393 624 -127 171 -125 384 326
1621 326 -71 -98 -96 -334 -168 -126 -20 89 -415 78 -60 -302 89 -53 -323 62 -35 -512 40 -5 -296 168
1643 168 -510 -51 -6 -237 -95 -129 -285 -13 -29 -249 178 -159 -118 98 -216 109 21 -215 123 -57 -46 -32
1665 -32 -399 -169 222 -80 76 115 -59 115 48 35 379 123 379 70 -46 99 -24 200 497 187 30
1686 30 184 -153 -218 80 -211 34 225 -244 141 -35 -33 314 -225 295 12 -190 208 -94 -69 242 71 -238
1708b38L12k98K33j91j47J84j96K94K1k4l51N91m95L19J26l15J66J11k35M2O7
1729b4j7k0p2K10j38k22j1L65l4j56L9J66L4l70M77o4j32K60j43J32j69p7kJ77
1753B09j15J84q3j05j70L29m20PO64m01m1K96l18KJ69J01p08L41O92l74m19j0
1775a70K55J10k07K30n07K11J57k97K87j4k63q3K16J00k82K82p7k18J01j8Q4K93
1797A90m94l1M34k23o9L77m96M01r9k44J60L54o88N94k9k52L06k72K8M50m06r7
1819a06L08l25J63L85l93M6K81m85M37k62J75l38K13Nk15K70o6j43K41j07j0K22
1841B96m07L08J94n22J44K13k2l48K95j83J87j60l3N1q7J3J15k46r7N82o22J54
1863a75L38k33j75K30k73Q6m5l1O3J07K78j43mj45j8P2P4j92K51j64q2M23k78
$$ plain form
1708 -238 74 -224 9 -182 -329 -145 -341 -47 -26 -50 -401 190 -305 14 140 -175 -9 102 -133 -91 -24
1729 -24 -41 -61 -133 77 -61 -283 -294 71 37 -119 -80 86 120 -250 227 163 31 291 148 280 111 34 32 209
1753 209 94 278 195 90 -80 249 -171 -164 500 99 58 354 36 38 207 308 -400 -59 633 259 -160 -170
1775 -170 85 195 -12 218 -289 -78 79 -218 69 55 -208 -291 -75 25 -257 25 -52 -270 -169 -187 -103 190
1797 190 -304 -335 99 -124 -193 184 -312 89 -10 -254 -94 260 -428 166 137 -115 191 -81 -53 397 -9 -106
1819 -106 202 -123 40 425 32 78 359 -126 311 49 224 -114 99 104 -111 159 93 -50 191 84 74 296
1841 296 -111 197 391 -131 13 226 204 -144 151 -32 155 -5 -38 13 -74 -61 54 -192 -289 293 -329 -175
1863 -175 163 -70 -245 -15 -288 -202 -247 -278 -215 -108 170 27 23 -122 -140 -68 6 -186 65 -99 -181 242 -36
1886c6l4R8k4J8k4Q9l67M90j34J1K7K33m06J98k22L04k09J83J11k63P1l71L07
1909E0Q5mO4k30M1L7r5K67q1pk17L32J9j79j12J0j12K33Q9j17Q1j61q5nr3qK1
1936a77R0k2K31j21j54J84k42J52P9j71K70k58O6j73J64j03r7L27j65K47l40J3
1958b00Q7J4j24O9K75k12J63j64L7K29m2O3j46r1P4Qk1K8K42l19J01K89l19l21
1982b80N12j71L6R7j54J60k91J16J0J61k03m5JM4qJ08M9roj83R3j59j44J27p0
2007b09J1J99j57K26l39J32J69k5j03K6J33j6N4k88K72k95K42k28J48j04j00J43
2029a09k3m7J50J04k13K65Ql14M07k03k81K59O5lJ10n12L07J31k89M22j85k97
2051b48L08J87k38K25j35k52M46k14j3%K4J04j47NN1q0Lj13O0J39K6o1K05m40
$$ plain form
1886 -36 -70 28 4 22 -2 87 -280 210 76 87 114 347 -59 139 -83 221 12 195 306 43 114 -257 50
1909 50 135 131 195 -35 6 43 -52 215 134 127 -90 242 261 82 -30 -20 -132 101 190 73 154 -7 -92 -97 -190 -198 -177
1936 -177 -87 -109 122 1 -153 31 -211 -59 20 -151 119 -139 -73 -246 -82 -185 -282 45 -120 127 -213 -200
1958 -200 -113 -99 -223 -154 121 -91 72 -92 -55 174 132 195 49 -42 32 40 19 47 289 -30 71 360 41 -280
1982 -280 232 61 97 194 40 200 -91 25 35 196 -7 -52 -51 -7 -15 93 142 133 127 -56 37 -122 -266 -139 -209
2007 -209 -198 1 -156 70 -269 -137 32 7 -96 -70 63 47 101 -187 85 -210 32 -196 -48 -152 -252 -109
2029 -109 -132 -179 -29 75 -138 127 135 -179 228 25 -256 3 68 65 175 -337 -30 101 -188 234 49 -248
2051 -248 60 247 9 234 99 -153 293 79 66 66 90 194 47 52 103 23 26 -87 -27 112 138 77 282 -158
2075a58J94K48k26O9k2lQ5m13P9J68j79K31%k80QK43J4n3j94N9Q0M6j67J95j7
2100Gj08j00j27K98Q3k14P7J09n0K3O8k17RM8j3N2J93j23N7P1j08j56K94k35j4
2125g6K33j15p2K09P6l10J22K8J03k32J03k5m2J14J7K26l25n2L23m40K71j20o9
2148e3J39l61K73J76p9l25M49j66o2J70k6j69k10K92o9J72j1j13j39P2k8K31k21
2171e8j77J69j59J49n5J49j18J09k19K5K42O2j59J15j17l7J6K3J19j16J56n4K2
2194H7j05j00L89l58K45j55L02l33P4j18J69j30J05j65M7K18k76jJ15K19k85M9
2216gJ45m1J36j74m5K28p2k15M01l41j04K60R6l02r1J45OJ63k24j3KQ3k69K47
2240A4j96J47q3P4j50J69P6j18o6K96k39j51J59k30J79K67k69q0L62l51K88j7
$$ plain form
2075 -158 36 284 58 127 105 102 187 -226 -147 21 -158 73 73 -207 -199 44 58 5 -189 -130 -50 -4 -171 24 7
2100 7 -101 -201 -328 -30 53 -161 -84 25 -25 -2 66 -151 -142 -94 -107 -55 138 15 72 143 35 -121 173 -62 -76
2125 -76 157 42 -30 179 255 -55 67 95 198 -34 69 44 2 116 133 359 34 -18 305 -135 136 16 -53
2148 -53 86 -275 -2 174 95 -230 219 53 -9 161 135 -34 -244 48 -21 151 140 27 -112 -40 -68 163 -58
2171 -58 -235 -66 -225 -76 -131 18 -100 9 -210 -185 57 119 -40 75 -42 -79 -63 -40 79 -37 119 65 87
2194 87 -18 -118 271 -87 158 3 305 -28 46 -72 97 -33 72 -93 -46 172 -104 -105 10 229 -56 -7
2216 -7 138 97 233 59 14 242 170 -45 356 15 -89 171 267 -35 -126 19 25 188 -36 -49 -47 36 -233 14
2240 14 -182 -35 -118 -44 -194 -25 51 -67 -133 163 -76 -227 -68 -298 -119 148 -121 -201 161 -190 98 81
2262H1k40l3K45N2k47M8Q3j9K16j46o4O9j00J78p4J12j54m7l5K2K07M1j20J18
2286A93k84J61m3P4j28K33m7n6j77r7O2J10o9J22R2j33k5j77R8M8j51L84rj04
2310G7k03K03k31L56j07l43L27j65p6L32k07j46J8J50k84K81m16k72Q84q4j28
2331c4J15n8k37K03k0J99j6k25J17J22p9J18j30j09j25M23k84l9L38m04J97j6
2353E6l65L90m4N0J6P6k18q7K86j68J25p5j29M1J77q7Kn5K46l9j99n7R1k04L17
2378A46o9k12J39Q2O2q1n2J11M5j13k10K50J9P6l24K12ml75O25l50n4J53K19k69
2402B6J55l8j79l3k44J83J99k37L9J42j02o7J02k23L96Q8j09k95K68n7O5p8J3
2425A4O8j44J06j25K96j66P8r1o3J33R8j28k04J84k5J23N5r5j58j21K23j9j29
$$ plain form
2262 81 -159 -192 53 105 -142 -94 -11 -30 186 40 -24 45 -55 123 49 161 7 -40 -75 -53 154 195 75 193
2286 193 -91 70 27 101 -27 206 159 103 -74 -171 -109 1 -68 54 146 13 -12 -189 -91 -43 -194 190 181 77
2310 77 -126 77 -154 202 95 -248 79 -86 -162 170 -37 -183 -165 -15 -299 -18 -434 -706 178 94 -34
2331 -34 81 23 -214 -11 -31 168 152 -73 44 166 87 205 75 -34 -159 264 -20 -59 279 -125 72 56
2353 56 -309 81 37 87 103 179 -39 -126 160 -8 117 42 -87 -46 131 44 46 -9 237 198 -1 -58 33 -171 146
2378 146 77 -135 4 86 148 67 15 126 171 58 -152 98 117 193 -131 81 77 -298 327 -23 -77 76 295 26
2402 26 181 143 -36 -69 -313 -130 69 -168 -129 13 -89 -156 -54 -277 119 207 98 -197 71 14 79 1 14
2425 14 82 -62 44 -81 215 49 127 36 -27 106 204 76 -128 56 31 154 209 114 -44 -165 58 39 -90
2448i0j54J77K21j13p8J35j87n0Q7J3N8O8Q1k31K64r7j8k1J71l69R5J5n4NL5m2
2474g9l1n6K26Q6j82J85k38K3j24L7J95ML8j50j2J17o5M7j53J07J87r3J54l65
2498a42J63j96K00M9L0j34J13l1m2j10J45K33k72J59ml19K34j65n5J56J15k35
2520a08o2J55J62J01k08k24%J90L3j19J51l1R3l00L10O2p4o0J46k34j83M27k54
2543b7k8J86j22q9R4J5P8k00J18J05k36J12O5m2j96m3J82m0K1J10j21j21K04o
2567A9j77J21j03J14j69J13N8K05l57N49l50k43J42j32K20j84J34J2J27j53R2
2588C8m9q9mK13m7q0N2R8J91m79K73J19k03n1L0j02M2K85l09K54j30O8r3K01k60
2613c2mNk9j09L11j12j08J39oj8j95K8P5J68j90J46O0l00N1Q7j85O7j4p9L05r8
$$ plain form
2448 -90 -244 -67 154 41 -37 98 -89 -139 -52 -39 19 87 168 -63 201 104 86 65 236 -133 -38 -23 -77 -72 -37 -79
2474 -79 -110 -166 60 146 -36 149 -89 -66 -190 -153 42 46 84 -66 -78 39 -26 21 -132 -25 162 69 223 -142
2498 -142 21 -175 25 74 104 -30 83 52 10 -100 45 278 6 165 161 -158 76 -89 -144 12 127 -108
2520 -108 -170 -15 147 248 40 -184 -184 6 39 -80 71 40 133 -167 143 205 131 71 217 -17 -200 227 -27
2543 -27 -55 131 9 -80 14 29 107 -93 25 130 -106 6 71 29 -167 -210 -28 -68 -47 63 -58 -179 25 19
2567 19 -158 -37 -140 -26 -195 -82 -24 181 -176 373 23 -220 -78 -210 10 -174 -40 -28 99 -54 38
2588 38 -11 -100 -104 109 62 -18 34 132 323 -156 117 236 33 -18 12 -90 -48 237 -72 182 52 120 27 228 -32
2613 -32 -36 -31 -60 -169 142 30 -78 61 55 37 -158 -130 -55 113 -77 69 129 -171 -120 -33 -218 -151 -165 -244 61 -37
2639c7j43K94%j57n9N9K6K13k2j80j6R5o0K53l21P9k18J15K08j41K80l05j87K75
2663E1J42j74p0J03J5o4l9J1k60M58l09L48j26m4J09M2j43R7Qk35M27l53q3J96
2687A07r9q0J22p4j97R5J08QM0J72l9k06j8J79q6j82K66k28J18k3o2M3%N0J54
2712A68l59K15N2m0rn9J06m12J46L9K20jj81j17K81j58L19j99j39J25R9J45j27
2735A14q2j63L29k64M2L8o6J56J26j22p2m8N9l0p9L1m8J64m1L0j54Q5NK22l75
2760a43M4P4K49l11K79Mj80J13j65r7K16l0K13j60o4l4j5NM7R2j23j27K1O1r5
2785a26K30r9r0j41J76m3K06Q1l76J25m1m6J39J57q9J97k09j77P9J1n7J82JJ6
2809A06J3k44K75k11K46j24k57M36k56M1J3K1K0m7J76k43mk3L8J63r7q7j3J46
$$ plain form
2639 -37 -180 114 114 -43 -102 -43 -17 196 174 -6 -22 73 13 266 -55 24 -194 -79 129 -12 268 -37 -224 51
2663 51 193 19 -51 52 67 3 -36 -25 -285 173 -136 212 86 42 151 193 50 147 155 -80 347 -6 -89 107
2687 107 8 -72 50 -24 -221 -126 -18 -10 30 202 163 -43 -61 118 32 -150 116 -112 6 -17 -79 -36 -36 14 168
2712 168 -191 24 76 36 27 -32 74 -338 -192 -153 67 66 -115 -232 49 -109 210 11 -128 -3 96 241 114
2735 114 32 -131 198 -66 -24 14 -52 104 230 108 36 -12 47 17 -62 -31 -79 85 44 74 -80 5 10 232 -143
2760 -143 -99 -25 224 -87 192 196 16 129 -36 -133 83 53 266 106 42 8 -7 -2 45 137 14 -113 -92 -31 -126
2785 -126 104 5 -85 -226 -50 -93 113 194 -182 -57 -98 -144 -5 152 63 260 51 -126 -47 -36 -93 89 90 106
2809 106 119 -125 150 -61 185 61 -196 240 -16 25 38 59 79 32 208 -35 -39 -62 -24 139 42 -45 -58 88
2833H8m8K04m89J30J74Q3k43k4K47j20K0j86J45j00O9J67j32j19L2j30L08j67
2855i1K95j72j27R7J4j3l3m8J80k34J3N0J03j8j92J0J34R0K6j4N8l08J96j78J43
2880a9J50k04P8J86k32l9K89r1j07K02k21p5J83k88K45n1L35j44q7m2Q7L3r6j3
2904G9k73J10lJ76k8kj60Q4o2K0J08j5k89J79p8j73K45R2o6l0L66k56q3J71K0
2929A32j17r8n3K13l7Q7n3j29M9j8j70K30r%l7l1J06Rj78K14l45K80j53N1K10
2954A53k30l6R9J6jj64K99p8rp4J01l51O30m25j30J41J55j16k59K85j49K61j79
2977f1J96j64Q6m3p8L03j04j69J33j88K86k68J80P9m33L33k11J66j6J0j31K3K07
3000A36j03j89j51K85M3O4K1j95J23p3KJ23lj07N5m3J46J94k02k53L50k45j3m7
$$ plain form
2833 88 40 244 -245 -115 59 142 -101 -125 122 2 22 -164 -19 -119 -50 117 -15 -134 -102 -232 76 -91
2855 -91 204 32 -95 2 16 3 -30 -78 102 -132 -119 -69 34 16 -176 -166 -32 58 84 70 128 -180 16 -162 -19
2880 -19 131 -73 5 191 -41 -80 209 118 11 213 -8 -83 100 -188 57 6 341 197 110 68 155 188 92 79
2904 79 -194 -84 -87 89 61 59 -101 -17 -79 -59 49 34 -255 -76 -154 -327 -82 10 -56 -86 280 24 -59 112 132
2929 132 15 -83 -136 77 40 127 74 -55 -6 -24 -194 36 27 27 -10 -41 65 74 -104 110 -235 45 -108 -57 153
2954 153 -77 -113 -14 2 1 -163 136 58 49 -25 76 -275 355 -70 -200 -59 96 -20 -279 6 -143 118 -61
2977 -61 135 -29 57 14 -64 239 135 -34 99 -89 197 -71 109 188 -245 88 -123 43 27 37 -94 -71 136
3000 136 33 -156 -307 -22 21 85 106 -89 34 -39 -37 86 83 -24 31 -12 134 328 126 -127 223 -22 -35 -82
3024h2J54Q4n5l57J08l3nL84j26j76J00j42M2K81l0k40J07j72l1K48p2K5j07K08
3048A13j06k60M57Mj62q2o7K12L7j95J27K45m34j39M94n52M31p4J12K7j61l05
3070b78K37J22n6r6P5m3J70j34j57L83k69r3jK00j81J20K13j87k6Q3j30P8l7J77
3094A70q2j45j45L37j59r5J63Kk2R9p6j5K7j01l6M7K59m89L90j59q2O5q6Q7R0
3119D4JK5l57K36K20L2o3r1J28n7k51L87k45J46j37O9M8l58K07Q1j2k39J51L1
3143dk3K07k76J34ll2j94o0K07L20j60J60k78k61L48J51m7o5j8l36K11m5J40j07
3167c1q4J8J21l16J07J07j02K70j90R6j30Q7j17K10O4k37J74N1p4j73K37K66k76
3190G8k52Q5K32k19K21l18N2J61j73J30J79K1k33j6J87l6l59L49R1K23m45k0M
$$ plain form
3024 -82 72 156 101 -256 -148 -181 -186 198 72 -104 -4 -146 -104 177 147 -93 14 -158 -189 59 -13 12 -95 113
3048 113 7 -253 204 208 46 -36 -103 109 146 -49 78 323 -111 -250 244 -308 123 49 161 188 27 -278
3070 -278 -41 81 25 -71 4 -39 131 -3 -160 223 -46 -139 -140 60 -121 -1 212 25 -1 82 -48 30 -7 170
3094 170 88 -57 -202 135 -24 -119 44 46 24 123 47 32 59 -42 -78 -31 228 -261 129 -30 -112 -47 -133 -46 44
3119 44 45 70 -287 -51 169 201 138 47 175 118 -133 254 9 155 18 87 135 -223 -16 65 53 -186 -35 -4
3143 -4 -27 180 -96 38 35 3 -191 -251 -44 276 116 276 -2 -263 85 236 189 124 106 -230 -19 -64 76 -31
3167 -31 -115 -97 24 -292 -185 -78 -180 90 -100 -4 -134 -47 -164 46 110 -127 47 98 24 -149 88 354 78
3190 78 -174 -89 143 -76 145 -173 -121 40 -133 -3 176 197 -36 -52 135 99 -260 89 180 403 -42 -62 -58
3213e8kk6O1J00lk08K01m7n6K41l30J00J93k01L08l25M5k8Q4P5j71K12j71J91
3237A85k80M7mJ27j56L0m7n5oJ01K50k85K19j7k15j90J55J74J54qr9j44J4J70
3261A20q2N4p4K49j80K4k48J06J55J06m03M63m14J66J87k82o0J76J10l58J85p5
3283g5K67l25J86k22K36r2M4J75j74O0n5J94j81j91K17P8j26j08K03k9q4J12J2
3306A22j13j0l0J44m9Q3m4k1j22l0K98m03M1Q7J59j68q2J18O7o4J21K5j25k76
3330b72L75J24l17J75k48K29j85K56m1K6k46J3P2L9J35l04J20J09m1J1L4J03j63
3353DJ19j48%r4q5J97J05k6M6P4l02M7J40N7l25J54J28J99r5j51q4p3N0m6j09
3378b18j4P9K16R4m31L86k33j64M42k16m5K4K8Kj74L45J17l38L1N2J77j13N4o9
$$ plain form
3213 -58 -60 -86 -25 75 72 -136 65 18 -38 203 -127 -27 166 -35 273 -52 -7 -35 49 124 -47 165 -6 185
3237 185 -95 -48 -52 75 -81 -51 -98 -153 -159 -58 192 -93 126 109 -106 -296 -141 33 187 179 80 -64 -50 120
3261 120 38 92 18 267 87 111 -137 -31 124 230 -173 290 -124 42 229 -53 -113 63 173 -185 0 -75
3283 -75 192 -133 53 -169 67 -25 19 194 20 80 25 219 38 -153 64 142 16 -92 111 82 -2 110 122
3306 122 9 -1 -31 113 64 147 103 82 -40 -70 228 -175 -134 -47 112 -56 -138 -20 47 -17 104 129 4 -272
3330 -272 103 227 -90 85 -163 66 -119 137 96 122 -124 -111 -39 0 135 -169 -49 60 19 30 64 167 4
3353 4 123 -25 -25 -119 -204 -7 98 72 118 192 -110 -63 77 134 -191 -37 91 290 195 44 -40 -113 -63 -109 -218
3378 -218 -232 -153 63 157 -274 112 -121 -285 157 -59 -104 -80 -52 -50 -224 121 238 -100 -69 -17 160 47 101 32
3402C2l5J6j10k8J33M2j46l5R8P9r7P2r1j88ML05m7K18q2j55l4Q8k18J70j37j35
3428b81M73j97R3l8J4N3m20L87l87K77J8j06P1l2K18m0Q7j31M2k77j27L81J22
3451B00k84P3J29k41J50k41L76L2j60j11j2K1P1j61L73r2J36k11K5N4j27OM8j05
3475e1q6L61k63L3j69J26O0n6n72N14L62j40j65j48k29P06M18m57L20J80j104
3496c60K59J96J38l61O9K59l31K09k18J99J55m4j68j93L04o09P31o72J052r37
3516c22j33N71O28Lj929J181K34j43j00J06m50M74M51r90J355o11l80M0K38m33
3536b10J66J84l24j42N74J39r59N83k7J62o05K63J36k4l77J064j99N4j159K58
3556d43n7P40l3r1k59J69J11j81o18R47k01l65jk79J221m30k1k26m18K27N95o76
$$ plain form
3402 32 -3 13 -97 -125 8 50 -96 -131 -33 46 -51 21 -70 -258 -254 51 4 222 140 -15 -49 39 -179 -9 -146 -281
3428 -281 192 -5 88 50 64 117 -303 84 -303 -26 -8 -114 -43 -75 143 103 190 59 101 -176 -303 78 200
3451 200 -84 -11 118 -123 27 -214 162 194 34 -77 -89 -68 3 -158 215 123 259 48 73 127 0 6 54 -51
3475 -51 -137 224 -39 -6 -175 -49 11 -45 -617 -103 259 119 -46 -194 -423 283 701 244 564 744 -360
3496 -360 -101 95 233 -128 -59 200 -131 78 -140 59 214 170 2 -191 113 -496 235 -437 615 -322
3516 -322 -455 116 744 747 -1182 -1 233 90 -10 96 -354 120 571 -419 936 325 -55 -15 223 -210
3536 -210 -44 140 -184 -326 248 387 -572 11 -16 146 -459 -196 -60 -84 -461 603 404 458 -701 -443
3556 -443 -500 240 207 116 -143 26 137 -44 -662 285 84 -281 -282 -561 660 230 209 -17 -435 -208 387 -289
3578b89K69k13L03q2M8o1k8P0O6j32j72mN2J08J46k7n0o4J73j34L07m9j16Q7j05
3603A03k06R1J08l0j1O4M6j47k63K25Q3k41J13K29j31m6r2j4K9N9o7J39j57L43
3627B27k16J9J14r5P3l2j25K84k15lJ09k33K70m10J28m5J89j7j80o5M05l14M2
3650i0J37K87l76L7l09K02M07l94m9J65J30r0J31m4j60k33j6Q5J35J48k11L54
3672B46j80k66K77Q5r6q0j36L4p0K35j51J62m0m4n0j05O05l58j71n5J55k06K55
3695D6k3J19j38R9k99L89m17M01j37J25m9k61M22k51J78k00J32r4Qk6K24l69O9
3718e2o6K4J62L5q4j2J67r5q4j86K68%j91J37R0k08rR3R8O7j31k0o9J28j06J12
3744F8q0j90ML14j43j64J13K7l9K99k57L3P7j19j8Q6j73K38M3r5J46j66r1k%K26
$$ plain form
3578 -289 -20 -233 70 -12 36 -25 -53 17 83 -49 -221 -225 -173 -65 81 54 4 -60 113 -21 286 237 121 208 103
3603 103 -103 -12 96 66 55 119 165 18 -245 -20 63 -178 -65 164 33 -13 -105 -119 -90 -31 -98 41 -116 227
3627 227 11 30 144 49 122 90 -35 249 34 31 140 -93 177 -233 -105 -150 39 22 -158 -223 182 -132 -90
3650 -90 47 334 -42 -5 -314 -112 295 -99 -148 17 147 57 188 144 -16 -249 -265 -180 -45 103 -108 246
3672 246 66 -200 77 162 66 -14 -150 -116 -186 49 -102 60 20 -24 -74 -179 426 68 -103 -158 -3 -209 46
3695 46 23 142 4 103 -196 193 -224 177 40 165 116 -145 277 26 204 4 136 42 50 24 248 -121 -52
3718 -52 -118 -94 68 103 19 7 174 79 -5 -191 77 77 -114 23 113 -95 -104 -11 87 154 23 3 -66 62 -44 68
3744 68 -12 -202 -198 116 -27 -191 -78 -51 -90 209 -48 -15 62 -57 -75 11 -162 76 119 24 170 4 -87 -89 -89 137
3770A37Mj11J3p6j60P9m9K40l37K5L17m55R4K55k94K29Q2m4K62j52nk11Q6j11
3794a82K38j32j6J18j02L43j23j57R9J54j99j17Q3j34J05K5k74L59J5O2k08L1
3816a2j36K55k28J51r3J90l01L66oj3j60k89M38p7k77l3M72m14J8J49J9k7j69
3839a77j57M37j61q7K25j95K42l02L97j00j20J31J30k33j11K10k83k3L3M55k99
3860A2M2q2N3J03q3j50J37j8m6j61K24k17K37m99L02L52r6J70k37j63Q9J95j17
3883D7k62K74m18J01J53M1j14J66j13L00k00j12K6J64J67j18m8k8J5o1j91K84
3905G3k50J65R6j01J05k37J69J06k30L85k90n7N9J4j0j25R0L73k11j85J37O0p3
3928F3p4J80k27j25K53j4j03n1J94j17L64k28m2j34l16N19o9n2M8k09m4J06N4
$$ plain form
3770 137 141 30 43 -33 -193 -114 -163 77 -260 -235 82 -373 -279 -24 -318 -89 -7 -51 211 59 54 -157 -71 -182
3794 -182 56 -76 -92 26 -76 267 144 -13 86 240 41 -76 7 -127 -22 3 -271 88 103 165 -43 -12
3816 -12 -148 107 -121 30 -63 127 -174 192 186 173 13 -276 162 85 -192 -225 247 -167 -149 0 19 -8 -177
3839 -177 -334 103 -58 -145 80 -115 127 -175 222 122 2 133 263 30 -81 129 -154 -177 -144 311 12
3860 12 54 -28 25 128 45 -105 32 14 -32 -193 31 -186 51 -448 -146 206 110 280 43 -120 -31 164 47
3883 47 -215 59 -359 -258 -105 -64 -178 -12 -125 175 -25 -137 -111 53 220 102 54 26 41 -20 -211 73
3905 73 -177 -12 84 -17 88 -149 20 126 -104 281 -9 -66 -7 7 -3 -128 -38 335 124 -61 76 136 63
3928 63 -11 169 -58 -183 70 56 -47 -98 96 -21 343 115 73 -61 -377 142 73 21 69 -140 -184 -78 -24
3951b4m6J76J47k33j06r9K15J9M8j09K6Q1p2L7k93L80k68J23J7j80K57J22j54
3974F4Lk81K28J01j42j21K69J32k90Q0l0K9k86L17j98K25m4l04K60j45K21n0J19
3997A57l75J83L66l15J96l41K12J1o1j03j64K97Qr0P4k5k01K29R3l78J22J51O2
4020A08l60O7K27j33j47K63J0j6K87k20j16j05R5JK3k97L69p4J01n4m7k9PK80
4044B40l32J63L4K15j39k23J53L8k73K89l27L54j51q8J55m7j30K61j13J0j47M4
4066a4J60N9k31K09l5j16m3j45k7J55P4j5l0M6p1J98j60P1j53J59Q8j97N4k4j28
4091a16K59j19J42j75o9o4K35j22kJ58l48K21K4P9k79M25l81K88ll06J75nk59
4114b42L19j13j19J49p2J04j79j70M54n0j5k44J61k38L06r0J9J27j27m5Pk33K96
$$ plain form
3951 -24 -70 106 253 20 -86 -185 30 49 97 -12 14 95 23 60 -233 147 -121 2 19 -161 96 218 64
3974 64 67 -214 14 115 -27 -148 121 253 -37 43 13 42 -244 73 -125 100 56 -248 12 -133 88 38 157
3997 157 -218 -35 331 16 212 -129 83 94 33 -70 -234 63 71 -19 55 30 -171 58 151 -227 -105 46 108
4020 108 -252 -185 42 -91 -238 25 35 19 306 86 -30 -135 -40 -39 -16 -313 56 -18 83 29 -18 -47 -40 240
4044 240 -92 71 105 320 181 -42 111 149 -124 165 -162 192 41 -47 108 61 -69 192 79 89 -58 -14
4066 -14 146 205 -26 183 148 32 -11 -156 -183 -28 46 31 1 47 -24 174 14 85 -68 91 179 -18 36 12 -116
4091 -116 143 24 166 -9 -78 -142 93 -29 -31 127 -221 0 24 103 -176 249 -132 156 153 -153 22 17 -242
4114 -242 77 -36 -155 -6 -78 26 -153 -323 131 81 66 -178 -17 -255 51 -39 -20 107 -20 -65 -58 -291 5
4137EQ9j07J21k70J00n8K53j60o5J51l28J93q8J7P1n3l5L80j54n3J41L4m04J37
4161h3J80j77K35l36Q9K55k58l6J61L4j69K24J21j95O5j86k5j9r1K42j34K67j10
4184E4n1j58K25j23J9J21k67J23k5j23K84k9j51j1R6J21l3j36J9j51J59k06K37
4207fJL4J16k02k01N23k44j07j28J70j56J17O4J64k53K15J3j89K30N4l00K12j02
4230B5K16m02N3K28k55L62k43R9p4lR5j71J13j46j2K7J78j55P1K01l05Oj06K05
4254GK07m60K01m7J53r3n1J69M2k57J73K30l06rO0J36j4L5m02L10n8J6J06k62
4278a14p6J11P0P9r0Q4l36M4K48j20J7M8j7J45O4q8J43l51J18Q7P2j81r3%j19
4303b55M42l65P6J16%Q7j56J51k73M08l18J79o9J14P4k90j80J29NR1J60j23j03
$$ plain form
4137 5 94 -13 108 -162 -62 -120 133 -27 -92 59 -269 -76 -164 -147 -76 -129 -164 216 62 9 150 184 -220 -83
4161 -83 97 -80 155 -181 -92 163 -95 -131 30 64 -105 119 240 45 110 -76 -101 -120 -211 31 -103 164 54
4184 54 3 -155 70 -53 -34 87 -180 -57 -82 -205 79 50 -101 -112 -16 105 72 -64 -45 -196 -37 -243 -6
4207 -6 -5 29 145 -57 -258 265 21 -86 -214 -44 -200 -83 -19 145 -108 107 120 -69 161 215 -85 127 25
4230 25 241 -161 -108 120 -135 227 -16 83 9 6 101 -70 43 -103 -115 -88 90 -65 6 207 -98 -92 -198 7
4254 7 214 -246 -45 -92 61 -32 -83 86 128 -129 44 274 -32 -41 19 155 141 176 -226 84 26 42 148 -114
4278 -114 -190 -79 -9 70 -20 64 -272 -228 20 -100 -83 -35 -52 93 157 69 212 -139 -21 66 138 -43 -136 -136 -255
4303 -255 187 -178 -102 14 14 101 -55 96 -177 231 -87 92 23 137 211 -79 -259 -130 -125 -34 126 3 -100
4326a00k5J12k31L24k00K94j95J11J90q7k21o7l0J16N0j1L4k08P1p1J77o9K05
4349A69K16l89r8j9K87k27K7j13J31o2J44k42J52K53k99K27k10K73j38n2j32o7
4371a69J70j57k3K02R7k57L75j71k02n1K8J44q0o2J97k12J28N1l1L9k46Q8R0J30
4395G8m6n0N1Lj39j73M02j18j95P0K03k1p1O8l77K13J28O1r8P7j50K5k06m8L93
4420H0k8M7r6M7J1J91l90N66l82J2kN7m01K95J25l67J97N5k5l1J06q2J8j96J18
4445g5j09K11m9L39l13k9j6J29k99L23j25N2k49L77j07k41q8L42o1j59J88j35
4467i4L7q4L3K31j79J60l1M6j26J73N1j83J08q5M3j92K27j66pJ33K16n25K09J62
4491A57q9j22j57K83k3j88J70l6R7k67J12j55K98k08O6K31m37jK31J69j10l6R3
$$ plain form
4326 -100 -125 -13 -244 80 -120 174 -21 90 280 193 -28 -95 -125 -9 41 30 64 -144 -73 -144 33 -36 169
4349 169 385 -4 -102 -121 166 -61 -34 -147 -16 -78 66 -176 -24 229 -70 157 -53 220 82 30 -102 -169
4371 -169 1 -156 -179 23 120 -137 238 67 -135 -186 -158 -14 -94 -156 41 -171 -43 8 -23 16 -230 -142 -52 78
4395 78 32 -18 33 36 -103 -276 126 8 -187 -117 86 65 -6 62 -315 -102 26 87 -11 66 -84 -59 -265 -313 80
4420 80 52 99 3 50 61 252 -138 428 46 58 56 113 -288 7 132 -235 -38 17 -8 -39 67 -15 3 -193 -75
4445 -75 -184 27 -22 317 4 -25 -41 88 -211 112 -13 39 -210 167 60 -181 -269 73 12 -147 41 -94
4467 -94 -57 -141 -108 123 -56 104 73 119 -7 166 217 34 142 57 100 -92 135 -31 -38 95 311 -214 -5 157
4491 157 68 -54 -211 72 49 -139 31 -5 92 -175 -63 -218 80 -128 -62 169 -268 -269 -38 131 21 -15 78
4514G8K6k54Q9J9L9J88l82J58J02j02j50J2J79K7k21J79J18r9K3j89J05j87J76
4537f6Oj17J80j07K12k8J4J9j59%J2K05j89m1P2j00l4O4J9j11J78R0j81R5q3K58
4563B08j90l65L31J02L1j91J80om25M56k70L27j51J00k07J4K04k30J86Q7l55J
4585a63O6J00J63p5q2Q2j33n2M02k35r2L4Kp7K7Mk61L12M7M3j55J16J13j53J95
4610B28k00K4P2j69J03Qm2K3O0k77J43l6R6K0o9l2K54k00J7L31l34m7j61K12m1
4635a7J7k19L26k3j69j58J79m9R5q2K97jj97J08k2j70J77l52J87J66o0J6J06j33
4659B2J66k13q5J78j70k3L59k82J68j65K45m32J14L40k82K24m87K86O3q4r9L21
4681A64j30P0o7rj24P7R6k42K14j92L64k00J12k5j9l7j08q7J60k8r1P8LQ1o7J19
$$ plain form
4514 78 104 -150 -61 -42 -3 185 -197 -39 63 -39 -189 -177 2 29 -192 -13 105 6 29 -160 -55 -242 -66
4537 -66 -60 -177 3 -104 108 80 94 113 -46 -46 -34 171 -18 -59 13 -87 -121 -57 -38 -149 29 119 -62 33 -50 208
4563 208 18 -347 -16 86 117 -74 106 100 -325 131 -139 188 37 137 -70 -56 148 -82 104 191 -164 -163
4585 -163 -97 3 166 91 9 91 -42 -94 308 73 -19 15 17 -60 -33 -29 -290 22 69 112 -43 73 186 33 228
4610 228 28 52 124 -45 58 66 24 47 107 -170 -27 -63 33 53 -16 -48 206 6 23 354 20 -27 -188 24 -17
4635 -17 0 -219 107 84 -85 -243 -64 -113 -18 -100 197 196 -1 107 85 -85 92 -260 -73 93 33 49 155 22
4659 22 188 -25 -110 68 -102 -125 234 -48 120 -45 200 -232 -118 222 -60 164 -323 -37 26 -58 -157 164
4681 164 34 104 37 28 -96 -19 77 -165 49 -143 221 21 133 108 89 52 -56 -143 17 -11 -102 -24 -21 60 -7 112
4707A12p6m4j9k4J96j09j48j27K16pm4L30l22J51J28j28j18j35K01K11k16Q9L6
4730A53l50K22K5R6p5M7j29J8k69M77k32p7K48m0k09J9P8qk07J18r6N0j45L07
4754B1J7m1K7j64K60J97l46O5J15j99K77k33J15k00L34j06K9j55j16l4K13j33
4776e7n6j3K65l7n2Pj30j57K08Q4k24M61j89N4l90N8M0K28j22J40l14J92R0p9
4800Gl61J78O2L43m16K80l3k34J05j3P5l0J52l0K6j18q9P2o0K25l75J70M0N1n9
4825c2K99O6l44j82L02j79J90Nj73R1j82K02J09j22P3j89rJ58j17K98l54M2L7
4848a1N9k33M14j29j84R6l17M3K39Qj27L38j84j32J51m5j73J49q2k12K77R1m4
4871hk8J39j30J71j61J39q6K46k96p4K28l18L83k94J8J67j72J84J1q2Q4m2r3J86
$$ plain form
4707 112 36 -8 -27 -51 145 36 -112 -239 -23 -30 -74 256 -66 85 213 85 -33 -168 33 244 28 117 153
4730 153 -197 25 50 146 71 118 -11 7 -262 215 -17 -94 154 114 -95 -76 2 -6 -213 -95 -191 -141 -286 21
4754 21 38 -3 24 -140 120 317 -29 36 151 -48 229 -4 111 -89 245 139 168 13 -103 -137 76 -57
4776 -57 -113 -126 139 102 50 57 -73 -230 -22 62 -162 299 110 164 -226 -168 -128 100 -22 118 -196 -4 86 7
4800 7 -354 -176 -114 229 -187 93 60 -174 -69 -82 -7 -37 115 85 111 -7 -96 -24 -84 141 -234 -64 -24 27 -32
4825 -32 267 333 -11 -193 109 -70 120 125 -48 43 -139 63 172 50 123 -66 -75 83 -34 264 -90 -48 -11
4848 -11 48 -185 229 100 -84 12 -305 -262 -23 -15 -142 196 12 -120 31 -14 -187 -38 -120 -332 -55 36 -8
4871 -8 -36 103 -27 144 -17 122 36 282 -14 -88 140 -178 205 -89 -71 96 -76 108 119 37 121 79 -14 172
4895A72J6o1k12K90j80l86L03o4J48j18R1K05m05Q0P5J16j38q3Q9N2K23j75Q9
4918A27k32L3J1L7j22P3L08k09J31j7p4n8J30j71j12J38L7j93R2K29m30L79M3
4941A50k03Ql15L30J53j0O1l51J74J74k41J49K4p8k52N14l70K32l12J83O6j62
4963g6J98Lj28O8Nr1Qk09L46k82J3P0K41k84J21J81k20n6L3j90L78N3N5j23k54
4988a40j35L12Q9j78m0K58j63O2L9j31R9j2rL9J9j64J2K57r6M9k92M2L07j96N
5013C3r1P9n5j43J19k9M9j49K37j6N9k02O7r6L36k09j16o8Q9L35l17j96N47j98
5037F5P0l88L33k98J44pK23j29j69K36k53J36K42j45o2n5K75j82j64P5k8k03L46
5060F2m04O07m72N28k08l23Q0j63R21o61K04l26K03j23j22K04K10k75Q4l3l39
$$ plain form
4895 172 188 127 -85 205 25 -361 -58 -122 26 -92 -1 204 -201 -121 -46 70 -68 -151 -62 -10 213 38 127
4918 127 -105 -72 -61 -24 -146 -73 235 26 157 140 66 8 138 -33 -145 -7 30 -163 -71 158 -272 107 150
4941 150 -53 -45 -360 -30 123 113 174 -177 -3 171 -70 79 103 25 -227 287 -83 149 -163 20 86 -76
4963 -76 122 125 -3 65 70 -21 -13 -222 124 -158 -145 -75 166 -118 3 184 -36 -92 -59 -249 129 182 237 114 -140
4988 -140 -275 37 126 -52 -92 166 3 65 104 -27 72 60 51 90 109 -55 -43 214 118 167 -125 -83 224 28 33
5013 33 -58 21 -34 -177 -58 -87 -38 -187 50 34 93 -109 -42 -138 198 -11 -127 -195 -106 229 -88 -284 263 65
5037 65 135 -253 80 -218 -74 -81 142 13 -156 80 -173 -37 205 60 -2 -57 218 36 -128 -53 -81 -284 62
5060 62 -342 265 -207 321 113 -210 -130 -293 628 -33 171 -155 48 -75 -197 7 217 -58 26 -7 -346
5081c46K61L56J86k19L21o94Q98n00o42O33O8m07K47p20O50L58l67k01P64m92
5101A54k21J32P1k58j13j08O55j25j99J44l53NJ97q9J65o2K11k47M0J53l17K81
5123A16m2j86j6O5P8j1o1j41J67J78k97M0qK54K1k20KQJ03l1n9M9J81j97j13J0
5149a10J43P1K1j14j17J18l7PJ07K6k89N1L05l61K75l52K21J32PPO3j47k19L7
5173a55Q1J70q5J71K9j14l8J2j00j26K13O7l17J06j16K52J13k05J60j75M8l1J23
5196H3J57j74k71K28J39k73K29k44L1J50j56k3rj81J89J59k26m1J40N1l03L23
5218b2K03k71J69P5k33j8O6Q5Mj07J6J23j57K45o3M1j73n3K70J4l09jJ71j65k6
5243a16M52n69K40n8K7l0L46j19J40l04K49k83N3j00K84k09J40j86J24j39rN1
$$ plain form
5081 -346 -85 271 457 238 559 -135 763 263 -379 254 322 -85 162 -558 92 450 83 -118 646 154
5101 154 -67 65 136 -122 -235 -343 312 187 -12 132 -221 -216 -19 -108 57 -5 206 -41 -1 152 -165 116
5123 116 74 -112 -128 -63 15 4 -57 -198 -31 147 -150 -110 -118 136 157 -63 -61 -53 50 19 -40 9 190 -7 -120 -110
5149 -110 33 104 125 11 -106 12 -25 -18 89 115 -174 -123 182 -179 96 -256 -35 97 104 111 174 27 -192 -155
5173 -155 -74 96 11 182 211 97 59 71 -29 -155 58 125 -192 -86 -202 50 163 -42 118 -57 -9 -40 83
5196 83 240 66 -205 23 162 -111 118 -126 -95 55 -101 -124 -133 -314 -125 34 -192 -233 -93 -42 -345 -22
5218 -22 181 -90 79 154 -79 -97 -31 54 58 -49 -33 90 -67 178 115 156 -17 -70 200 214 -95 -96 75 -90 -116
5243 -116 336 -233 7 -51 -24 -54 292 173 313 9 258 -25 28 -72 212 3 143 -43 81 -58 -67 -16
5265a6L8j24o6K21K3j73j41L89l45J31P4j12J17L5J93l85mL49j29j63L26l87L7
5288a12K95l41K69j58Q4j67j06K53l3k76M57L5k46J63l0L6n0j91Qj83N36j46j01
5311dJ22M1k38J27j36K89l71K15Kj89K34q2J00j33o7k7J25p8j70J40m5K18j32
5334e9j5k82M46j11j15J83L3j06N4Jj09J21K54l12q3J81J39Q6m89j7K78L5k92
5357a79K36j30n3Q5J87k03K13k69K76k23l7o8L98l99J09K69l18L5J8P4P6K3j64
5380d4kJ90r9J45o4p1nj85J99j93l2J08k59K96R3j61J28o0j59L59l82M19j98j13
5404i0J85M5q4q1j78J80O2j3j53%K37l17J3K60P8k23J91j52J3k02K55k83K16j05
5428a46N3K06l63J05K6K31p7M4l4Q3rN9k00k1J12o4J56m8k32N3NO5n2o5j30K96
$$ plain form
5265 -16 22 -102 -168 53 76 -97 -238 151 -194 -63 11 -101 16 51 244 -141 -145 204 75 -88 238 -149 -112
5288 -112 183 -158 111 -47 37 -130 -236 17 -16 -292 165 200 -46 117 87 123 73 -118 -110 -293 243 97 -4
5311 -4 118 159 -79 48 -88 201 -170 45 47 -142 92 10 110 -23 -90 -117 8 -70 -240 -100 -145 73 -59
5334 -59 -74 -356 90 -21 -136 47 80 -26 28 29 -80 41 295 -17 -100 81 220 306 -183 -200 78 113 -179
5357 -179 57 -73 -126 -41 146 -57 156 -113 163 -60 -97 -165 233 -166 -57 212 -106 -71 -53 21 97 120 -44
5380 -44 -46 144 45 190 126 55 50 -135 64 -129 -161 -53 -312 -16 77 -84 44 -16 -175 184 -198 221 23 -90
5404 -90 95 140 56 -25 -203 -23 39 26 -127 -127 110 -207 -194 66 144 -79 112 -40 -27 -229 26 -257 -41 -146
5428 -146 -93 113 -250 -145 -119 112 35 79 45 128 119 178 -22 -43 69 5 161 113 -119 -66 -61 4 -48 -113 -243 53
5454E3k95L25k59K03q9q3L2J12J08j02m4J53k52J47q0P3J9L39M79r64M8K75K2
5477B20n18L36j5o8p8J38j56K29j00m9K09j06j15j5J06j24r9O01n06n8J98J7Q6
5500A33L2j08J74l32J95K6l46J17J26R5p2l27L04j5M9k14%K8J47k10K78q2J60
5523A58m9m5K4m6m7J2Q0j60R3j0k01K03O7K07l13n4K01j60Q4Q8J0l02K09l75M27
5548A01n3lOo0j88J07K31k1j72J37qk17J6J28k40J05L25l52M11k76R1J8j61O7
5572hj98J14J93J9l29K03k42K36J65L10m02J41l2m47K29J98k16l46L38r6Q6J16
5594C2j34J09J65J13k05k39L20j30p6k4R8J3J18j74j15L43l9j93L2L2M8j42L4
5617a4j70L86J0k78J13J21j64J17j37M3rq6O0J37j32J15rKj85J81Pr4J49k21J93
$$ plain form
5454 53 -242 83 -176 27 -62 -145 -113 -1 107 5 -39 114 -138 9 -71 2 21 360 839 -125 -77 198 220
5477 220 -298 38 23 -45 -123 15 -141 88 -12 -61 148 42 -73 -88 18 -106 -205 396 -110 -168 30 47 133
5500 133 165 57 231 -101 94 120 -226 -109 17 112 40 -287 17 2 51 -163 -163 -135 12 -198 80 -2 158
5523 158 109 64 88 42 -5 7 87 -73 20 10 -191 12 79 286 -27 -81 120 -40 44 132 142 -160 49 -326 101
5548 101 48 45 51 -9 -197 -90 141 120 -52 85 77 -140 -124 4 -236 -131 194 -158 253 -23 68 86 -75 -8
5572 -8 -206 -92 101 120 -209 -6 -248 -12 153 463 61 202 170 -277 -48 150 -66 -412 -74 -170 -84 32
5594 32 -102 7 172 285 80 -159 161 31 -45 -69 29 42 160 -14 -129 214 175 -18 14 46 94 -48 -14
5617 -14 -184 202 212 -66 47 168 4 121 -16 27 18 -68 -8 129 -3 112 103 105 -80 101 108 14 163 -58 135
5642A35k02O6K73j7j78k53rK29j90P7K72j59RJ8j94O9O6l7j12N6J45r5N7j19J53
5667F0J1k25j26j21K48N30l24j87J21L8J64j55J6j3j19K06l14J2K25j17l13N11
5689A28j07k19k8K09P8M7l4K9k80K29j45k9N9K38k85Nq1J69J45p8k2k44J49K10
5713A43l34J71J16r2j20J37K4j48R8J87k65k46L80r0n5L10n10M07j71Q4k71L09
5735F4O7k44M1l1K35j37k76N06j83j30K6N6K7j40q2L20o9k02K29j52j00K36n7
5758Dj2l16O8J99%K64j74M6j13J33n4j4j55J00o9L9rJ93k22L6J17n3J99j73J68
5783B02k54k73K45J95j92K32l4m9K9k77J30OJ39j37R7k3nk30J70j02J36J25l6
5806I4r6N4l23Q7QK30R5k0j67n4pn1k3J64J05lk05j26P2m8K16q1J9J99l45J40
$$ plain form
5642 135 -67 -1 272 255 77 -176 -185 44 -146 -69 203 44 53 71 -123 -54 12 -25 -137 -81 64 -31 26 -93 60
5667 60 71 -154 -280 -401 -153 377 53 -134 -13 25 189 34 50 37 -82 124 -190 -178 47 -70 -383 128
5689 128 21 -198 -226 -17 61 108 74 103 -177 52 -93 -122 -63 175 -110 -105 -186 -17 128 50 28 -216 -67 143
5713 143 -191 -20 96 4 -116 21 45 -103 -5 182 -83 -329 51 -39 -94 216 -294 113 -58 26 -245 64
5735 64 131 -113 -72 -103 132 -5 -281 225 42 -88 -62 -6 21 -119 -201 119 50 -152 77 -75 -175 61 4
5758 4 -8 -324 -256 -57 -57 207 33 79 -34 99 45 31 -124 -24 -93 -54 -63 130 -92 -56 61 8 207 34 202
5783 202 -52 -325 -80 115 -77 155 121 72 101 -176 -46 -40 99 -38 59 36 31 -199 -29 -131 5 130 94
5806 94 -2 52 -271 -184 -176 54 149 129 -38 -92 -99 -150 -173 -9 96 93 -112 -238 -166 -214 2 -79 -60 139 -206 -66
5832f6J25o9Q1J03L6k18J27j29m9m5R7Qj05J71p5m5J85m3m1N1j22j21M2k3R2R2
5858E9k21pO4J59j54j4j51K47n4J80j25P0o7P3p4o5KK67k60L45j42n5p1j14j77
5883b85Q0K33k71K15R0m2l5J79q0m6r7Kj82K93m7J20m9k01P5J04k20J32n1J57
5907G4o5k28J07L13j67r3J49k50L21Rj42k2n9j2j5K16O2k49Kk32L68j39j36L09
5931A21j01j73q0K71K20j50N5n2j36n4J68l45M62k53q1J46o7J32j47J33K8M4k64
5954a23K32k5k27M8M8L9O8j41j3p1J21Q4M2J54k38r1K30r0qM3K7q8m5kM1O1l9
5981C7K16q9j8l03J06j03J77j66L23j96j61n5L78m3j69jl7J28j46L14m55K01J12
6004E0kk46K01R2j07k9J77l8j35R2O9k43J53K05m84L39k37P5m4M9J80o0n4k9q
$$ plain form
5832 -66 59 -10 71 174 210 -8 119 -10 -59 -104 -7 1 -104 67 -8 -53 132 89 48 99 -23 -144 -102 -125 -33 59
5858 59 -162 -169 -105 54 -100 -114 -265 -18 -72 108 -17 53 -14 59 -15 -80 -78 189 -71 274 132 77 6 -108 -285
5883 -285 -205 28 -243 -28 62 20 -15 164 84 38 -59 -57 -239 54 7 127 78 -123 -48 56 -164 -32 -83 74
5907 74 9 -219 -112 201 34 -59 90 -160 161 170 28 6 -53 -65 -80 136 198 -51 -49 -281 87 -52 -188 121
5931 121 20 -153 -233 38 258 108 163 111 -25 -79 89 -256 206 -47 -128 18 -49 83 -64 69 97 141 -123
5954 -123 109 84 -143 -95 -47 -8 60 -81 -94 -165 -44 40 82 236 -2 -93 137 47 39 82 109 21 -24 -26 15 76 37
5981 37 253 164 146 -157 -51 -154 23 -143 180 -16 -177 -232 146 103 -66 -67 -104 24 -122 192 -263 -62 50
6004 50 48 -198 3 95 -12 -41 136 98 -37 55 124 -119 34 239 -245 94 -143 -68 -112 -63 117 57 3 -26 -34
6029c4R9j54q9K21j09K93j78J58j77K9n9J77j85N3MQ3k01L67l54K30lj87N7j58
6053a17P0Q7p5J02M4J0n2j62P9L37l27K77k85K2N7j29p1J48K48m60K17J04l24
6076b00K5M0J61l2k60K96k42P9L13m1j25j28O4j22J8J63q9K0L2o5k1L43j81k16
6100a68K95j06N1k42J09P9j13j04j4K82P9j79K8n6k5M6RK27j25j09J50j61K52
6123B05L5k76n1J2N2J42k25K70k07R7k99K61l2R1j26j24M66m35L84l97K43j81
6145i5J81j50J33O8l15K33j10J99j82oQ8o0K36k27J15j08p1J78j7k9j13k1J68
6168I5%l41L35j26RJ83p0j5l15j57L75J81J72n35J07J81j12M3Kl28M90l22J83
6191C5k06L3j33L69j03M1k9J73j29q1K7n7O0k70J91J90lJ06k28m0l0K42j77k70
$$ plain form
6029 -34 65 -89 -178 43 -66 227 49 207 30 59 0 177 -8 45 49 132 -69 298 -56 174 171 -16 41 -117
6053 -117 -47 40 -35 67 111 121 69 -93 -14 323 -4 273 -12 10 67 -62 -133 15 263 -197 20 124 -200
6076 -200 -175 -135 26 -6 -266 30 -212 -133 180 139 14 -114 -50 -172 -154 9 -80 -60 -28 -93 -114 229 48 -168
6100 -168 127 21 72 -170 -61 18 -95 -199 -213 69 148 -31 -3 -59 -84 -38 -29 198 73 -36 114 -47 205
6123 205 240 -36 -87 -75 -23 119 -106 164 -43 54 -245 16 -16 75 -51 -175 291 -144 240 -157 86 -95
6145 -95 86 -64 69 137 -178 55 -55 144 -38 -44 44 -16 220 -7 108 0 -71 107 90 61 -52 -73 95
6168 95 95 -246 89 -37 -28 155 85 70 -245 -402 -27 154 326 -209 -102 79 -33 10 12 -316 174 -148 35
6191 35 -171 -138 -271 98 -5 36 7 180 51 -30 -3 -60 0 -270 -79 111 108 214 -14 -54 -84 158 -19 -289
6215b89L41J94j72J17r4J57k9j45J35q9j15l4k11K10K01m1j9k44j1J40J4J06j96
6238g4J78Oj53p2j09K58l30K52J95k08R6J60l42J99m4oj27L48l56Q3j62J15J42
6261D9J65j21O4k03K28J48p71M97j58L14k4k54q3M19k57N3l8O5n76O72l02O8l88
6284d33L92L09k63K93l96m81N91L84o40M7L35m33L48o7L19j69j71J34o06O48k32
6305i1K78p4m82L1M59j20M2m03L71L64n35O96n00L05n35J60J37J14k65R8r9K6
6327b3k8J34m9k7m7j01J09j48j23K79k55L02J75o1J95n04j3K85j79L19j32o2l1
6350A5m8K92n12L67n6j47L32k17k7J78k0k59l4L2K50Ml36K97j41K60l78n8K41
6373C5j75mM2n1K26n4K2j86K18o9j02O5j58J50Q5j46n4J1N3j60J30L05j59J69
$$ plain form
6215 -289 52 246 74 191 97 254 225 80 215 126 11 -23 -234 -24 177 136 117 -127 -138 2 16 122 -74
6238 -74 104 110 -43 -115 -224 34 -296 -44 151 -57 39 199 -143 56 12 6 -121 227 -129 -46 -208 -93 49
6261 49 214 93 157 -46 182 330 -441 56 -102 212 188 -66 -149 270 13 66 28 93 -483 189 -113 -45 -433
6284 -433 -41 268 5 298 -98 -579 12 396 -244 -197 138 -295 53 -14 305 136 -35 99 -507 141 -91
6305 -91 187 113 -369 -338 121 1 43 -360 11 375 -160 536 36 341 -194 -34 103 217 -48 50 -49 -23
6327 -23 -51 83 34 7 -40 -141 -32 -180 -303 -24 -279 23 198 137 332 -172 -185 100 -79 240 108 46 15
6350 15 -33 259 -253 114 58 -89 243 26 -1 177 157 -102 -136 -104 146 150 -186 111 -30 230 -148 -206 35
6373 35 -140 -144 -102 -153 73 19 41 -145 73 4 -98 -33 -191 -41 44 -102 -156 -145 -92 -252 -122 183 24 193
6397A93j05m6r8J87j83Q1j41P8K12k5Ok48J10k02Q7k58K84J42M4J20k74k51L25
6420C8r3p0J51j56J8L64l13J19j61J59K2N8q5m0j32J98l8K9j21L85N08n57N92
6443H75j178Q06j81M38p75N08j77L10k81j76l41L69j91k5PJ11L1Q2k7p9Kj64l2
6466h8J37j39M4p5j8J93j28J31qn4L5o2n8J8l6m6O0O9p2K20j46j98J84M4L02m18
6492a09J43L1j45O7K28l13J68k0lj59K39j09r6K9j6K3J31k31K45R8k94K62k14
6515d5J45j68J76r6Qrj64n9K22n7K12k03O3p0O1m4J10q6j67J78J77l02J07J45
6539A34k3r8J9K5q5q8J63j3k5j97L34k47J65k2P5l06K75p3Q6q8K7p9J41p1p9J22
6565G2J01L9m79K44k11K24J39O9k45J30j64m2r9J28M3j7k9K1K7L08l26J3n5OJ44
$$ plain form
6397 193 88 42 -56 131 -52 29 -112 -34 178 153 159 -89 21 -181 -94 -352 -68 74 118 238 -36 -287 38
6420 38 -55 -125 26 -130 -112 252 -61 58 -103 56 78 136 51 11 -121 77 39 68 -53 332 840 283 875
6443 875 -303 503 322 760 -15 493 316 626 345 169 -172 197 6 -19 -12 99 130 212 185 106 108 -56 -88
6466 -88 49 -90 -46 -121 -139 54 -74 57 49 -5 30 -32 -90 -72 -108 -154 -94 -25 -97 123 -23 -221 -37 7 309 -109
6492 -109 34 65 -80 -13 215 -98 70 50 47 -112 127 18 -78 -49 -65 -42 89 -142 103 201 -93 169 -45
6515 -45 100 -68 108 12 20 11 -153 -212 10 -47 165 -38 25 -45 16 -28 82 -4 -171 7 184 -118 -11 134
6539 134 111 13 32 57 -28 -116 47 34 9 -188 146 -101 64 42 117 -189 86 13 99 11 38 -41 100 29 -50 72
6565 72 173 212 -267 -23 -234 -10 129 198 -47 83 -81 -123 -222 -94 -51 -68 -97 -76 -49 259 -67 -54 -109 -103 41
6590D1j0j73K63j65K33k30r1P4k92L16L41k17kl72L59J29k9l68M66n93L20L23
6612C23j18k73j9M0N6Q5J4l83J46K94j40M57m78m04N97J345j633M78L13l57N40
6633H83r16J81k64J19J4K9j26J27kl36L51K45j95k64K46j32J51p9R2r6m1O2k86
6656b37K29P5j45K6J23k19K90K1j97R5L5j20j11J27m1j38n01M27M22k60L42o11
6678c68M30k42O56l83k69j9m86L79L51J01k45jK78m49N97m23R5q6l6j15M3K90
6700I8m6j7JJ15j27l8J35j03j46J18J35p8j32m1M08o35J74K08R9m5k02L09j80
6723A0mR7j14j02m6R1k7m2L33k19n0j5K90K29l63rlK24n52J13K6j1J37m6M53j93
6749B07k18l58N22l40q4K7L20l21J98j27J46P1K73m40K42j47o1J86l38J91M8O2
$$ plain form
6590 41 31 -142 121 -44 189 -41 -132 -58 -350 -34 307 90 88 -284 75 204 175 -193 273 -320 0 323
6612 323 205 -68 -87 -47 9 94 108 -275 -129 165 25 482 4 -400 197 1542 -91 387 700 343 883
6633 883 -33 148 -116 3 17 46 -80 47 45 -291 60 305 110 -154 92 -40 111 32 124 28 -13 49 -237
6656 -237 -8 67 -78 -52 71 -148 142 163 -34 61 96 -24 -135 -8 -49 -187 -688 -261 161 -99 243 -368
6678 -368 62 -180 476 93 -176 -195 -681 -302 49 150 -95 -96 182 -267 330 -93 2 -84 -120 -235 -192 98
6700 98 52 35 36 151 24 -14 121 18 -128 -10 125 47 -85 -126 282 -353 -179 29 128 83 -119 190 10
6723 10 6 103 -11 -113 -159 -68 -95 -137 196 -23 -73 -88 202 431 68 59 56 280 -272 -159 -133 -144 -7 -53 400 207
6749 207 -11 -369 153 -187 -271 -244 76 -245 -47 -174 -28 43 316 -124 118 -29 -90 96 -242 -51 -3 59
6771E9O6j76m3L44k99o4K21j63j36L15l14K35J40j85J5O3J18k77r0K08L9j54j23
6794b01L43p9j2l6m0K23l50J96J07k1l04R3N5j61O8J80J3q7K0J02k18J94K4k5
6818H4k52J42j10J94O0m99M14j10m0M8m0Q0P5k0m2j23L8p2K87k10J55r7P6J28
6842A66j41l13K91J73P6j44J18k32l9n5l6K73o4p1pM7k7p5j07K00l3P6J08j56
6866B8j09Q4J39j98P8Qj22k80L27q3R4k46L00M9J17n1k96M07k94n5ql7M03j74
6890H1j24n1Q6J28o5rK14j56j34j46K39o6K97j67j20r5J25Qj17J31j41J73k4k18
6914a51p2M67n8k82J45J77J5l54j32K26k41M87j84k00K7N0L78l82M9O1Q6j9m0
6937E3j6N6N1k61L5J4K45l8k00qQ1k02J32J95M8j19l9M0n4n7M1J23k36P0o4K97
$$ plain form
6771 59 125 -51 -94 250 -49 -113 108 -55 -191 124 -190 45 185 0 15 78 196 -81 -171 37 76 -78 -201
6794 -201 142 63 51 15 -25 198 -152 44 151 130 -174 -81 -26 -187 -119 61 74 -13 7 109 -109 85 109 84
6818 84 -168 -26 -136 58 118 -381 33 -77 -117 -69 -109 -29 46 26 -16 -139 -101 -173 114 -96 59 -38 38 166
6842 166 25 -288 3 176 252 108 226 -6 -45 -100 -136 137 73 2 -5 42 15 -60 -167 33 0 76 184 28
6866 28 -81 3 142 -56 22 30 -92 -372 -45 -128 -34 -280 20 69 186 135 -161 246 -48 -103 -111 -148 255 81
6890 81 -43 -94 -8 120 55 46 260 104 -30 -176 63 -3 294 127 7 -88 37 45 -72 59 -82 91 67 -151
6914 -151 -223 244 186 -96 49 226 241 -113 -245 -19 -260 227 43 -157 -130 -80 298 -84 -35 26 112 93 53
6937 53 37 93 144 -117 -82 -68 177 139 -61 -69 12 -190 -58 137 185 66 27 67 13 -44 -3 120 -116 -46 -110 187
6963A87l7n7J7p7J10j14L5j6K9k5l06M5K3J72n8j44M75k41j24J74q9j7j35J03
6987g0K1J71k15J44k28J87nJ36l47J9M01l56K64m18O4j89L67j011L06Q51k19L60
7009B33j39l0k00K58K6j40j13O7J1K4K6N1k75J58k58K23J6J4L29k88m2J12k09
7032a46M1L20j33j25K90k18j22P7R4Qj72Q5J3R6l12K36p7j80L96k39Q5j0J10J59
7056B76ok22m3j17L48j15k35lO5n8L33m45K0M15j03o1k64N8K45n3n8p6J21j62
7080a40j26J23J70j26N1k18L62l9N2j53kp4K67j65L6n0m4Q8j23K53o9O9j50k44
7104b52N03j79k09K77O4j73k32J15J73l63M12q6J72j63L4j96L59j21J3Jo9k63
7126a83K57n3p5l7r9K94j27L34m56K56j06J22o8k37J92J33k56J80K37k06k9q6
$$ plain form
6963 187 150 93 110 33 143 29 64 48 77 52 -254 -209 -186 -14 -72 -216 259 18 -106 68 -21 -38 -173 -70
6987 -70 -49 122 -93 51 -177 10 5 141 -206 -187 214 -142 122 -296 -232 -421 -54 -1065 -759 92 -127 233
7009 233 94 64 -136 122 148 8 -105 -38 -27 -3 23 74 -201 -43 -301 -78 -62 -48 281 -7 -49 63 -146
7032 -146 -105 215 82 -43 247 29 -93 -16 78 86 -86 -1 12 108 -204 32 -45 -225 171 -68 17 7 117 276
7056 276 270 48 5 -112 236 121 -114 -117 -52 -110 223 -222 -202 213 110 49 -215 -157 88 35 -23 -99 22 -140
7080 -140 -266 -143 27 -99 -48 -266 96 57 109 -44 -46 -120 147 -18 18 -32 -76 12 -111 142 73 142 -8 -252
7104 -252 251 72 -137 140 204 31 -201 -86 87 -276 136 50 222 59 93 -103 256 135 148 149 80 -183
7126 -183 74 21 -54 -91 -190 104 -23 311 -145 111 5 127 59 -178 14 147 -109 71 308 102 73 -13
7148a3m9J51j06pj13J6O4j28J73P0J12m00K46j35P8J84q5rJ14L7k44K10j15q4
7172c3K7M0q5QQ0jr7MM68m60j76J69J46O04r83L59m93O97n13J48L14L64o23j50
7196a86L14J9j77R8l6j00l9J08p1qo3P0n9K69m96L93j2J63k45k49K03Q4j46K12
7220D6k45K12j9k38L87k56R5j03j0J50k6J31k22%m3L52k72O6k99K15J91j21N9
7243E0J02j73K44j55q3Q6k09J47j66J56k9k7K4R7j65P6J03r4J4J07n3N1q1l5j97
7268b10K63J10j05k0k86N65j87m9j9J10r0k8l08N45n00M40l0l30K94K52m37N86
7290E66o28J95K41l61k09N25l67p5k69N80j10J57n81O61k42J81l61P04q61J17
7310a37L71m66M5K10L90L36j86j460O37M37m18j02P5P15r67R02p32J75n10M97
$$ plain form
7148 -13 -62 89 -17 -24 -137 -121 -57 -185 -12 58 170 -230 16 -119 -41 143 58 49 163 200 -44 166 51 -33
7172 -33 -6 34 -51 -43 37 36 -61 -57 411 -49 -225 -56 90 694 -289 70 -423 274 -239 -91 223 587 -36 -186
7196 -186 128 147 -30 68 32 -68 -107 1 -70 -78 -141 -71 -130 139 -357 36 24 187 -58 -307 -104 -20 -166 46
7220 46 -199 13 -6 -244 143 -113 -18 -121 -131 19 -7 124 -98 -98 -141 211 -61 5 -294 -79 112 -9 50
7243 50 152 -21 223 68 -15 71 -138 9 -157 -1 -30 -57 -33 64 -101 -25 78 -16 -2 105 52 103 22 -13 -210
7268 -210 53 163 58 38 -248 317 130 81 62 172 82 54 -254 291 -209 231 201 -129 165 417 -20 566
7290 566 -62 133 374 13 -196 329 -38 -113 -382 198 88 245 -336 325 83 264 -97 607 -254 -137
7310 -137 234 -232 -187 23 413 749 563 -897 -260 177 -241 -343 -268 447 -520 382 -350 -175 -685 -188
7330a88N27j089O97K43m8j20m9j85O54n24P7n2J31k98J78j59K58Q7r9k04K16r7
7352d4M6J17m0k14O1K19k46P4o6K65j5j17L1j92J45q6k51L97o3j22Lj15L20k01
7376i4J11J43p1j96j45K15L99l73l0j62K51mj09J26m4J14J0J18l40J6n1K32q0
7399C6j56K84J15k16r9N8p7o9K30j36p5j22K33R3m92N29k28j88L29Q6J2j75R1
7422F3p5l7K0J07j80K82n9Pl7k34QJ72j04J62N6k95q7L5K12l1q0J19M4o8m1J44
7448A03l0j78M2J14o4l1k3O6j92KJ52J65k86j7K72j87J80j51Q7L17l35Q0QJ35
7472B29k90p4J39j67K00l41L01J56k86L8J85r9j99K37n7j26J58o1R8J33k53J37
7494E8j41M09k19k23K37lJ93k72m5o1M1j47N2R3k03M23j24r1K81l07L7J27j30
$$ plain form
7330 -188 339 -750 -53 190 142 22 -27 -212 442 -82 -5 -57 74 -224 -46 -205 53 140 41 -163 53 -44
7352 -44 2 119 79 -135 -74 145 -101 -27 -93 172 157 40 71 -121 24 -62 -313 84 21 -101 -98 -213 107 -94
7376 -94 17 160 89 -107 -252 -37 362 -11 -41 -203 48 44 -65 61 17 131 141 259 -81 -65 -116 116 36
7399 36 -120 164 279 63 -36 22 -55 -124 106 -30 -105 -227 6 99 -393 136 -92 -280 49 135 147 -28 63
7422 63 -12 -49 -29 78 -102 180 121 128 91 -143 -135 37 -67 95 151 -144 -231 -196 16 -15 -95 24 68 0 -41 103
7448 103 73 -105 -63 51 -13 -44 -67 -1 -193 -191 -39 126 -160 -177 95 -92 88 -63 24 341 6 86 94 229
7472 229 -61 -135 4 -163 37 -304 -3 153 -133 -95 90 -9 -208 29 -28 -154 4 -57 41 174 -79 58
7494 58 -83 326 107 -116 121 118 311 39 -6 -67 -26 -173 -121 -28 -231 192 68 -23 258 -49 -12 115 -15
7517a5M7K29j83j6R5j46L0PM8k02M6m6j06k9P8K07k64K84J19m9k23L94k46j7O3
7542A05r9j60K00j66K05o1j27pJL71l21KJ05qK36j64r6j47L64k46O5R2l68M18
7566A94l24J77j02N6j31J89P2k82J08L7J09k05J83O9j53N7o1J91k03j69K47j9
7588D0j00K81k89j12K0J0m1L32mk00K6R0p3n9K96q2l25L5L07j52K45l56L3M1j26
7613a63R8N0oq0Jj7K76l89L11Q3k03K16M1k10q1J23j68K5O4j12P5K95k75j08K92
7638A38l51K12J98l96K11k39L5J91K3M3l44M30n3j06J81q5q7J23j15L4j82N1O8
7661b0p2N1n5r6J42R4n8J4M03k43l40L5K04j02P6O1j09l3J50J33l64o1L8J65K2
7686C5k02J98L21l23K19k78k5J0K46pq1O7Ql03p8K65P1k0J68l06p1L5Q3p2K99
$$ plain form
7517 -15 32 261 78 62 157 11 41 48 96 -106 -60 -106 -212 -241 -163 44 -220 64 183 134 -89 305 59 42 105
7542 105 6 -154 46 -120 85 24 -103 -110 -109 262 -59 -57 48 40 276 112 16 -131 233 -13 52 144 -224 194
7566 194 -130 47 -55 1 -130 59 131 -151 -43 -6 103 -102 81 150 -3 54 -7 184 -19 -188 59 40
7588 40 -60 221 -68 -180 -160 -150 -191 141 137 -63 -37 53 -20 -79 217 135 -190 -155 152 0 245 -111 -78 -37 -163
7613 -163 -65 -15 -21 -101 -100 -117 159 -230 81 164 -39 177 218 8 -73 50 -118 -93 -29 -141 -66 229 -46 -154 138
7638 138 -213 -1 197 -199 12 -227 -192 -1 22 65 -279 151 98 -8 173 88 1 124 9 43 -139 -88 -20
7661 -20 -92 -41 -96 -192 -50 44 -14 0 403 160 -180 -145 59 -43 33 94 -15 -48 102 235 -129 -190 -152 13 35
7686 35 -167 31 352 29 248 -30 -55 -45 201 194 113 180 188 -115 -193 72 143 123 291 -15 -86 -51 32 -40 259
7711B59m28K5J70r0J00j43J75k27L8M5L7K9k22J38J01N7k35N39k26k34K60j76
7733hj51K38O3k04J03l3j37m1N0J80K6j33j29J18k27R0K14k13K31K3j08l4j09
7756a91P2n8N1K7J37m25N39j53Q8j46J57K1j57K81k90J3j11l9j00J64K9N2J94
7779A55o07O59k34P5J25Q2m07J15P0J11m18L17O5j63K78m89L55J19j62J02p6J41
7801B13k1p4L7l08J46j73K63m5j06J28o2l2j37M8J29J92l16j17L01j4j22J18J2
7824F0o6J7J9l1k09M77l77o3Q8J46j23Q7L1j92J96q6J92l17J6M65k41O1k28PJ8
7849e3n9Q6j9j13OQJ95j11L09j66J30j08l23J42k60L10l08L01J96r8l15L23j22
7872d9o7J62l6o5j98L00J38j08j03o2K6J03M7j39J54k3j39P5lj2J27j94PN8J15
$$ plain form
7711 259 -169 -144 26 -64 36 -107 68 -159 -121 -76 -39 -10 -232 -94 7 64 -171 368 142 -92 168 -8
7733 -8 -159 79 142 -62 41 8 -129 -170 -120 60 86 -47 -176 -58 -285 -195 19 -194 37 60 -48 -82 -191
7756 -191 -119 -177 -126 -99 38 -387 152 -1 87 -59 98 119 -38 243 -47 -34 -145 -184 -284 -120 -91 -39 155
7779 155 -452 207 -27 48 173 255 -152 -37 33 144 -274 43 108 -55 223 -266 89 208 46 148 72 213
7801 213 192 118 155 -153 -7 -180 83 38 -68 60 -2 -34 -171 -123 6 198 -118 -235 66 52 -70 48 60
7824 60 -6 11 30 -1 -210 267 -110 -173 -85 61 -62 25 56 -136 60 -26 166 -151 -135 330 89 150 -78 -71 -53
7849 -53 -112 -26 -45 -158 -152 -144 51 -60 249 83 213 105 -218 -76 -336 -26 -334 -33 163 65 -250 73 -49
7872 -49 -116 46 10 -55 -253 47 185 77 -26 -88 -62 41 88 -51 103 80 -59 16 13 1 128 -66 -59 -1 114
7897A14j15j23K7N9Q3o4M5K14k14J18j32K27p3j48j7KK3J79j16j70K37N3k35j5
7921d1m0K28j61l8P9k84K63j17O4KK90l86M5j93K52J13k4%j08J53j45K00k03J47
7945I6k45J47p0J67j35K94k04J01L48m95J71k88J60j37K9rK27k38O6J45k8j58
7967e6L58l56mm7J22J34j01k57K41k27K23N8j18r0k6K20m15M87J15k55qJ49j19
7990B8j47J27l70K30r2Q8M9m3K07M1j23k0j06M18n14L46J14l32R2J21k4j4l8j52
8014a14K05p9k6K5J66l69L46k08o2L00j77L8k50L05q1r3n9L52j93k41J47J74j97
8037i1P3R3L5j68K30m9r2o5n4P2J13j26p1j21K92j35l6J61K3j63O7qj6N1j3n4
8063e2RK26j34J66k04J14j43J12j70J44J27l88N8J42N1j55k3J12m5m1J29l2k24
$$ plain form
7897 114 -1 -124 -97 -38 45 -19 26 240 26 144 12 239 166 18 1 3 26 205 89 -81 156 209 -26 -41
7921 -41 -81 147 -14 -52 27 -257 6 -111 -47 -45 245 -141 -96 -289 -37 76 52 52 -56 97 -48 152 -51 96
7945 96 -149 -2 -72 95 -40 254 50 151 499 4 175 -113 47 -90 -61 -70 157 -81 -15 130 102 -56
7967 -56 302 -54 -58 -105 17 151 50 -207 34 -193 30 88 -30 -120 -146 74 -341 146 261 6 -2 147 28
7990 28 -119 8 -362 -132 -224 -136 -87 -130 77 118 -5 -25 -131 287 -227 119 233 -99 -7 114 90 76 38 -114
8014 -114 91 12 -14 11 177 -192 154 -54 -116 184 7 45 -205 100 19 -74 -133 219 26 -215 -68 106 -91
8037 -91 -18 75 110 -58 172 123 31 -34 -88 -16 97 -29 -100 -221 71 -64 -100 61 84 -79 -12 -20 -36 15 2 -52
8063 -52 -43 183 49 215 11 125 -18 94 -76 68 195 -193 -135 7 58 -97 -120 -8 -53 -94 35 3 -221
8086b21J85n4L60k57J82J02k36r2j30L7K76R8j11k8j08m4J01J08j97o8j03L37
8108A37k53j2L37k57J23n0k48K15j3k1pM8k54O9lj8J42j60J79R6R0k25m0J53J2
8133D0j61K04j84L64l23LJ96K9j94R8o4J66P4k24J72l79J56p9O7m9J90Mj23m9
8157f6J09p7p6Q5k05J33j29K35n3R5k12J75J38j9Kq0j7l06K66J5R1l02L70k60
8181h8l3J48N3N%j17l2O2j36J81
$$ plain form
8086 -221 -36 -90 270 13 195 297 61 -31 -161 -124 152 250 139 111 3 -41 60 168 -29 -97 -200 137
8108 137 -116 -128 209 -48 75 25 -223 -8 -21 -42 -49 -1 -255 -186 -189 -207 -65 -225 -46 50 140 -85 -125 28 40
8133 40 -121 83 -101 263 -60 -57 139 168 -26 72 8 174 248 24 196 -183 -27 -106 -39 -88 102 106 -17 -66
8157 -66 43 -34 -110 -25 -230 -97 -226 9 -44 51 -161 14 152 133 135 55 38 -268 -2 13 104 -198 172 -88
8181 -88 -121 27 80 85 85 -32 -64 -2 -138 43
8191D3
$$ Imaginary data points
##PAGE= N=2
##DATA TABLE= (X++(I..I)), XYDATA
0@%%%%%%%%%%qJ6j6J6k0K8l3M1n6O6p5R2j15J37j61J91k22K56k97L44l94M50n14
33b74N83o59P44q39R46j061J185j322J473j638J817k013K227k462K717k994L300
50A730l636M005m411M862n362N918o547P258q072R016j0118J1433j3031J5017
64H062j7565K0966k5762L3097m6148J08694l66863L36050J71469n15819M68292
75A74473j36144k45511M18985k44679j25701L38867k31967l269J10605q7006O5054
86C3707o1816P104P5889j12414R9621n6714n1638J89258j94144m665K26476k44566
98i3902N9892J37885k07306J43763K570j59195K09281q5642r9868J67937r6537
109b1122O364N0313j02412J21758m0519r3655J48521q2863k1740R6393j23934
$$ plain form
0 0 0 0 0 0 0 0 0 0 0 0 -8 8 -8 8 -12 16 -17 24 -32 34 -41 51 -64 73 -88 103 -119 137 -160 184 -210 240 -274
33 -274 309 -350 394 -445 501 -560 625 -697 776 -862 955 -1058 1169 -1293 1424 -1570 1730
50 1730 -1906 2099 -2312 2550 -2812 3106 -3441 3817 -4255 4761 -5357 6076 -6955 8062
64 8062 -9503 11463 -14299 18798 -27350 81344 -285519 50531 222000 -293819 174473
75 174473 38329 -207182 211803 -32876 -158577 180290 -51677 -54946 55659 -31347 33707
86 33707 -28109 -21005 54884 -57530 42091 -14623 -66261 122997 -71147 -75812 150664 -93902
98 -93902 -34010 103875 -103431 40332 42902 -116293 92988 7346 -92522 75415 -21122
109 -21122 -14758 35555 -66857 54901 14382 -79273 69248 -13615 -35355 61038 -62896
120f2896Q1731M1956j55390J32245J3713j24611J08820k6675l7651P4053p6672
131c1377K2589N3118p1877K9667N326j0028K7794o1127M7827K9176r3273P2654
143B0469N778p0928Q7995n0113l7164J11890q8937k5050J11593q4906j1441P5453
155D4639o7734J4041M1616o1377K4672L5915n3626N373M4538l1532k2244M3841
167A8122j3697k7454M2584k4446j9894N7886m4563j9855P0844n1455j6922O2740
179C3890m8122q62M0961m7855J9050K6616m8322K2788K0670l3848J3565Q526j2773
192e716Q206k034l502N297l56l272j208Q097l073j0064J3192n88j0740J0116k546
207A809l707Q300q325P04Q497q802O77N156l996P81o58O45J853l836J555J507
$$ plain form
120 -62896 18835 60791 -94599 37646 51359 -73252 35568 8893 -28758 45295 -31377
131 -31377 -8788 44330 -27547 2120 7446 -2582 25212 -35915 11912 41088 -52185 20469
143 20469 26247 -44681 43314 -6799 -43963 67927 -21010 -46060 65533 -19373 -30814 44639
155 44639 -23095 -9054 32562 -28815 -4143 31772 -21854 -16481 28057 -3475 -25719 18122
167 18122 4425 -23029 19555 -4891 -24785 33101 -11462 -31317 39527 -11928 -28850 33890
179 33890 -14232 -15094 25867 -21988 -2938 23678 -24644 -1856 18814 -15034 -1469 7057 -5716
192 -5716 2490 456 -3046 2251 1895 -1377 -2585 5512 2439 -7625 5567 4979 -5761 4355 1809
207 1809 -1898 6402 -1923 -1219 7278 -1524 -847 4309 313 1094 436 1081 2934 -902 653 2160
223B160k487K259k209m58M410m529q96M312k811j162K658j463r62J210k18j514
239a700K141k09m006M490L66o016N656K39o525P361j710n804Q677l386n284Q950
255C240m509l915P793l915l238P299l314l672O710k059m917P127j441o320Q669
270C538j798p768J0940l200q205J2860n070p336J3663p313n830J3718r316l205
284d322J2719j0085j044J0095q734j76P624p095n51O862n492j734O440l996l306
299b795P593m489l785Q935o522k244R226q465M4P769r051L434L393p771O691j649
315C14m034O644n635J435L604p396P106j750o443J0959p002k612R544r638L681
330a223N004j0726Q389M67p452Q049l861p80M447o512O350j848l873Q289q172
$$ plain form
223 2160 -327 1932 -277 -735 3675 -854 -1750 2562 -249 -1411 1247 -216 -1178 32 -186 -1700
239 -1700 441 232 -3774 716 1082 -4934 722 961 -5564 1797 87 -5717 2960 -426 -5710 3240
255 3240 -1269 -5184 2609 -1306 -4544 2755 -559 -4231 2479 420 -4497 2630 1189 -5131 3538
270 3538 1740 -6028 4912 1712 -6493 6367 1297 -6039 7624 311 -5519 8199 -1117 -4322
284 -4322 8397 -1688 -2732 7363 -1371 -1547 6077 -1018 -1569 5293 -199 -1933 4507 511 -2795
299 -2795 4798 309 -3476 5459 -1063 -3307 5919 -2546 -2502 5267 -3784 -350 3043 -4728 1963 314
315 314 -3720 2924 -2711 -1276 2328 -5068 2038 288 -6155 4804 -2198 -4810 4734 -4904 -1223
330 -1223 3781 -6945 1444 1911 -5541 2508 -1353 -2133 2314 -4198 2152 304 -3569 4720 -3452
345c452K551O451j3195J1530P95j3802J6895o988q317J8345j5345R10J5067j9993
359h548J0108P422j8686J5713k816j0776J8037j4015K66J3875j8373R835M548
372F590j5767J7604p998p911J9558j7643K460J3860k0119J2749K056j5964J9554
385I029r861p616J9075j7109M360J0443j9001J5562j683j4621K1275j3214l767
398g128J7744k0646J0511P225k1032K0455n018j4172K2990j5734j774J7974k2276
411a0881J1418P422k0771J9749n186j1772K0345j5071L19J4701j9828J1579M576
424F600j6685J7473o672p453J6837j5008L177J0696j7135J1764J220j2372J5310
437G752q615l923J4289j4804N132P830j5123J2196j404j0093J4829r750k194J2394
$$ plain form
345 -3452 -901 5550 -7645 3885 4680 -9122 7773 785 -7532 10813 -4532 -3622 11445 -8548
359 -8548 1560 8982 -9704 6009 3193 -7583 10454 -3561 -3295 10580 -7793 2042 6590
372 6590 -9177 8427 429 -7482 12076 -5567 -3107 10753 -9366 3383 5439 -10525 9029
385 9029 -832 -8448 10627 -6482 -2122 8321 -10680 4882 3199 -11422 9853 -3361 -7128
398 -7128 10616 -10030 481 7706 -13326 7129 2111 -12061 10929 -4805 -6579 11395 -10881
411 -10881 537 7959 -12812 6937 1751 -10021 10324 -4747 -4428 10273 -9555 2024 6600
424 6600 -10085 7388 716 -6737 10100 -4908 -1731 8965 -8170 3594 4814 -7558 7752
437 7752 -863 -4786 9503 -5301 -169 7661 -7462 4734 3330 -6763 8066 -1684 -3878 8516
451H516j3801N422N886j2554J0569k240p819J2365q557j093R015j0674N640K529
465C204q995R446l750m696R452p767J384N499q666O078J62o634Q626m480k052
480c189O700o951L294K557p410P177k026m297P785n925M5N904p651M533K312p181
496d323O489j094m270O545m105j154N373n259J721K526m240K920j29j803K989
511B186k588Q73J217k391K190o47j505K745k180j20K207k602J543L68k238K045
527A103p21o45J528j769R87P8j560K457j859l96K552l187J369J745m098K691R59
544A234m084L547m3l496L809j110k213L028j197j217K358r56j393J769k15j119
560a298J208J31j522J243N54j729J361Q55k379J844M62k105J694L35j519J460
$$ plain form
451 8516 -5285 137 6023 -6531 4038 1798 -6021 6344 -2213 -3306 5709 -4965 675 3204
465 3204 -5791 3655 -95 -4791 4661 -3106 -1722 3777 -4889 1189 1351 -5283 3343 -1137 -3189
480 -3189 3511 -3440 -146 2411 -4999 2178 152 -4145 3640 -2285 -2240 3664 -3987 546 2858 -4323
496 -4323 2166 1072 -3198 3347 -758 -1912 3461 -1798 -77 2449 -1791 1129 1000 -803 2186
511 2186 -402 471 1688 -703 1487 840 -665 2080 -100 -220 1987 -615 928 1296 -942 1103
527 1103 382 -263 1265 -504 483 561 -999 1458 -401 -797 1755 -1432 -63 1682 -2416 275 1234
544 1234 -2850 697 654 -2842 967 -143 -2356 672 -525 -1742 616 -340 -1733 36 -179 -1298
560 -1298 -90 41 -1481 -238 316 -1413 -52 803 -1576 268 730 -1375 319 654 -865 595
576E95q6j287J304K04j179O46M73n38j2R24o60j96R03j025L00Q17r60K22P29q33
596C41l8J018j060K08K06m48J98Mj31k11K88L68j104M20Q66j611J36J333j668
615h85N63J057j527P33M47j882J119P03j356N24R09j821R19Q62j626N17J230k078
633a592J179J383k628J096J111k060J489M54k127K382o77j635K842j382o30J900
649A105j873O67Q84j512J183M50j627J673o85m10J091j329J050K47q67L90j48
666B89J52K99o93J075m46j110K159j699j94J482k070J250Q51k537J827N93k216
683i88J599l92j035J999j529j85J573j803M52L88k82O52j694M93J915k595J019
700d13N44j735K562j182j775L852k681r70L592k426o07K235k609K012L57k902
$$ plain form
576 595 509 -778 526 730 -449 197 670 132 120 1044 384 188 1091 66 366 1183 223 445 1174 341
596 341 303 1321 261 469 675 227 425 429 298 87 375 743 -361 59 925 -686 -550 783 -885
615 -885 -322 735 -792 -59 388 -1494 -375 328 -1028 -504 405 -1416 -497 365 -1261 -744 486 -1592
633 -1592 -413 970 -1658 -562 549 -1511 -22 432 -1695 687 10 -1625 1217 -165 -795 1105
649 1105 -768 -101 783 -729 454 904 -723 950 265 -145 946 -383 667 914 47 437 289
666 289 441 740 47 1122 676 -434 1725 26 -168 1314 -756 494 1345 -1192 635 1228 -988
683 -988 611 219 -816 1183 -346 -531 1042 -761 -309 79 -203 449 -1245 -752 1163 -1432 -413
700 -413 131 -1604 958 -224 -1999 1853 -828 -1798 1794 -632 -1239 996 -1613 399 756 -2146
716b146K684p05r15J033j30Q82j179j019K579j475p9J881k139J378J43k799L300
733A294o5l464L504n84j758K780k238L69K142l576K309N22j809J533j244O07J425
750A747l564K372J835m159K823m34j729L162k899n58M106l700k62K942k336M19
766b35L27r47J932j651n96J571q76Q60j495R9K807l514N74L150l884J857Q00l473
784b694L931o75m203N851j870l289M143j829m38K193k420P39J771k591O06J358
800E83l14o84j75J637j179p55J674j117M48Q86k504K956l9l323K999J37k262K237
818A205j009l77K034k584O11K009k039L35M93m97O20q52k87J736j656J42Q46p52
836b2L80Q9j198J968p58k120J974k25l49K54P52q69n9l38K19K77J44j461J246
$$ plain form
716 -2146 538 -167 -1082 -49 -179 703 -476 -1495 1084 -391 -470 1411 -728 650 793 -2006 1294
733 1294 1229 -2235 1269 685 -1073 1707 -531 -162 1980 -1596 713 1235 -574 959 -285 322 1747
750 1747 -1817 555 2390 -1769 1054 620 -1109 2053 -846 -1404 2702 -998 -1260 1682 -654 -235
766 -235 92 -855 1077 -574 -1170 401 -475 385 -1110 -1011 1796 -1718 -1144 2006 -1878 -21 779 -2694
784 -2694 1237 562 -3641 2210 340 -2949 1194 -635 -1073 1120 -1300 -561 1210 -1381 -775 583
800 583 269 -415 -590 1047 -132 -887 787 -330 118 1004 -1500 1456 1417 -1906 1093 1230 -1032 1205
818 1205 196 -181 1853 -731 -120 1889 -150 185 678 181 801 -51 -338 1398 -258 -116 730 -22
836 -22 358 447 -751 1217 459 -1661 313 88 -261 -7 745 -124 -183 -521 -302 -25 119 -1342 -96
855i6P23j726P30R33j483P23Kq83J418k57j716K129m59j180J564n50o13J374j176
874e43N61P68j350K17R45q34J01K09J43J56l25J78M8j20J89k32J30M65n81K72
894C97K18q17P33j88l49O99o76Q0O18n48P6L5k53K71o1j86K73l69L7J64k25M91
916D20l19l10R9L4j04K82k66r2L09m83N7L79l01p9L02j03m73L13m0j15L33m32
938e89L62O1m31M50j08r8K47l28K73p4j42N7M16m3p9p5J9O3n7J85M5k83K91r7
962F5J13M65q28N06K31n75K21M77p86P94l25o95P92k49n79R49n80K00L08m38R8
983A64M91r41N93K84r69P14k16l43O03n35N2P01r96L85K39n71L98k50j44M93p94
1004f42N38L18m21J49l39L16p1m69O38O1n01L07j45l13O19o25K05P70j220Q46
$$ plain form
855 -96 627 -1099 -369 564 -919 -196 -194 -1077 341 84 -1632 497 38 -1142 422 -128 -741 633 -543
874 -543 18 786 -564 -347 598 -236 -135 74 217 373 48 226 274 154 343 111 241 706 125 397
894 397 615 -202 531 343 -6 693 17 97 715 167 243 278 25 296 235 49 322 -47 -10 154 -71 420
916 420 101 -209 -110 -76 -180 102 -164 -256 53 -430 -373 6 -295 -374 -72 -175 -648 -335 -375 -490 -157 -589
938 -589 -227 -166 -597 -147 -255 -353 -106 -434 -161 -235 -377 -320 96 53 -26 -101 -82 -19 -76 109 154 -129 162 65
962 65 178 643 -185 321 552 -23 198 675 -111 683 358 -337 455 206 -373 576 -4 196 504 66 164
983 164 655 -286 307 591 -378 336 120 -223 380 -155 -103 598 -398 -13 226 -345 53 -197 -341 152 -642
1004 -642 -104 214 -207 -58 -397 -81 -152 -621 17 78 -423 -116 -261 -574 45 -580 -375 395 -825 21
1024B1kp68J270m64p13J203o05k14Q41n45j86P67p08N34j89n28O71m45J04M23
1044D67n37M91k65j58N93m97J85L24n50P61m18p91J584j342p1Q90q30L91K57q97
1064d13J051m64m66Q13l43m50N95p14P11j03j082Q53p9n44R04o18J54N53r43L34
1084b51K69p74P80m1m72L72j44J97O7k60J32R4l39K87l50L48K6k71L94K90q11
1105d57N76j26K3O88r09J94P39j302Q98K27q33Q35m41l32J066q34l1N39m93K46
1125B73K18q04M05J2N37P4r01P22k10r7q5k36J90K79j70j4K82q37P51l10l31P36
1147D84l31k85M64k42j07Lp71J432p90o19J434n63m49J83m25N85j06j47N64l78
1167f4L4l68L11j73K7l21L29q9K94O1j64K18m28j30P30m78k9P89q62L59L25q54
$$ plain form
1024 21 19 -749 521 57 -656 547 -58 -272 569 24 -162 605 -103 431 242 -286 385 -60 44 467
1044 467 -70 421 156 -2 591 94 279 603 53 814 396 -395 1189 -153 -224 666 -164 227 484 -413
1064 -413 638 174 -292 521 178 -272 323 -391 320 217 -865 -12 -91 -635 269 -349 -195 358 -585 -251
1084 -251 18 -756 24 -17 -489 -117 -261 -64 3 -257 -125 -31 -370 -83 -433 -85 -59 -330 64 354 -457
1105 -457 119 -7 16 704 -205 -11 728 -574 324 551 -282 553 112 -220 846 12 -19 520 27 273
1125 273 491 -313 92 104 641 715 -186 536 326 229 144 -92 98 377 207 193 475 -362 389 79 -252 484
1147 484 153 -132 332 90 -17 -14 -785 647 -143 -762 672 109 -340 -157 -582 3 -103 -250 314 -64
1167 -64 -30 -398 -87 -260 -233 -554 -225 -314 -20 41 -123 95 -333 -463 267 -211 -240 549 -313 46 371 -483
1189d83Q88l31n06R07m62j03O32m67O5M62q54N11L38o30L00J21m84K24j27L64
1209C65j20n78P90m80K5K98l45N18m25l36O69k38j67K66n70L96Rl85N14k36m44
1230d74Q90l99m19R19r17J64J73n30K99K18l23L52l46n4N01n07K64MM7L26j64
1251B4o35J47K08K52k20j40N87j33N8q8o10J72P98j27n76O09j99L29l43j01M9
1272F1O9k92M38j28J67J64m47J52K21n43K19J84L8l4j53k1K73l48J89J97l94J03
1294A15j33r2J37k1l29M93m35L57J66n53N26k87O9r1l05N04j66l88L09j4l69O13
1316A06o42L87J67q30N68K69l55M41j62k62M33j15k93N80p03J62K75m67O49k02
1336Fl93N67m14N29k58j78L55p7PM8l9PLJ18j26o4m2K73m44K11M13m12j3K96l87
$$ plain form
1189 -483 405 74 -432 475 13 -90 542 75 140 602 -252 259 597 -33 267 388 -96 128 1 365
1209 365 245 -333 457 -23 2 300 -45 473 48 -288 381 143 -24 242 -328 68 77 -308 206 -30 -474
1230 -474 416 17 -402 517 -400 -236 -63 -593 -294 -76 -399 -47 -393 -447 54 -453 -189 -185 -138 188 24
1251 24 -611 -464 -256 -4 -224 -364 223 90 148 60 -550 -378 420 293 -283 326 127 456 113 12 61
1272 61 130 -162 276 148 315 479 32 184 405 -138 81 265 303 269 116 95 368 20 209 406 12 115
1294 115 -18 -110 27 6 -323 170 -265 92 258 -295 231 -56 13 -78 -383 121 -45 -433 -124 -138 -507 106
1316 106 -536 -149 18 -812 -244 25 -330 111 -51 -313 120 5 -288 292 -411 -249 26 -441 208 6
1336 6 -387 180 -234 295 37 -141 214 137 144 192 153 160 163 281 155 91 49 322 -122 89 502 90 77 373 -14
1361a4L75l55j2L17r5m53N57k46M3M64m42k67K95k50J43J19o32N01l4o3J87j45
1383gk0M0j84O4J61J48k72k03K91j73R8J38K0j57K03j21n6p6m11N15j25j36J27
1406a36J17k76L63m18L34K85k15K76k69q30J269m32j22K69j6n21L20J53J87p4
1426B64m2j12j05L19l8o94M12K91k75K32j25N0p0J64p5k08K45L85k65m24L56n45
1448b60M76k54J81m6L37K61q19jk0Kp0l57R92j95M1p97K90L37K01k71o62O23j37
1471a48l03R23l93n19j6O05J50q38Q64m70n42O62o1L56j9K17J50m83k81L75l51
1492a22L09r28J276n89n61J694q51J61j22n87J406r62j45M9M61n43N3K79j81K4
1512A21L48K05r23K24K57O4lJ14q17Q31j03o83P62o53j24N57r11L77J450j831
$$ plain form
1361 -14 361 6 -6 311 216 -237 320 74 117 581 139 -128 167 -83 60 179 -453 48 14 -49 138 -7
1383 -7 -27 13 -171 -107 54 202 -70 -273 18 -155 -57 81 101 -56 147 26 -30 -106 -517 -2 -127 -263 -136
1406 -136 -19 -295 68 -350 -16 269 54 330 61 -769 500 68 -54 215 199 -322 -2 151 338 264
1426 264 222 110 5 324 286 -408 4 295 20 252 127 177 107 271 196 -12 233 618 353 -71 285 -260
1448 -260 216 -38 143 97 434 695 -124 -125 -145 -143 -213 -570 422 227 268 -529 -239 98 299 28 -634 -11 -148
1471 -148 -451 472 79 -440 -456 149 299 -539 325 -145 -687 -25 -86 270 251 468 618 135 -146 229 -122
1492 -122 187 -741 535 -54 -615 1079 228 389 267 -320 1086 124 -21 28 489 -54 -1 278 97 121
1512 121 469 674 -249 -25 232 296 293 407 -410 421 318 -365 397 -256 -380 177 -734 -357 1093 -738
1532g38O80M51j370M15J495r00o18P65j39R6n3r4l11K80n40K15L91j96j91O11
1552B49J03j01m38L92l01O44j389Q29P27r02P69p74M22o05j73O77o0q9O02m70
1572A12j81J13Q0l07Q56K2n51Q3J42o72M84J25l77K52k27Q6j2m87J108m62j27
1593F0J78k9J18k24l30M8p7J211j590J049l0q19P20M49q31K04K00j045J378q19
1613a79k35Q06l84l85N78o02J47M82m69J98q7J79l50J79j64j14K66K59k75k31
1633c81P31l99R0R6l43N6J17l46N90m08P2K32m50J93L39l44L92n5k32K78p1M0
1655A97O7j97o5L32j10j29L3rL75l96k6k1M8N6J24k15L7J1k33J60R3j50j67J72
1679a3J22Pj87J9k90lK77m03J14M50n25J85L99j93L11k88l48L94k40k2L45l27
$$ plain form
1532 -738 -58 393 -977 -562 933 33 -585 180 41 137 84 -10 -321 -41 -581 -366 25 -171 -362 249
1552 249 352 251 -187 205 -96 548 -841 -12 715 -187 582 -192 230 -375 -548 129 69 -20 582 112
1572 112 -69 44 124 -183 673 695 144 227 369 -303 181 306 -71 181 -46 40 28 -459 649 187 60
1593 60 238 209 327 103 -227 -179 -256 955 -635 414 384 -435 285 734 -97 107 307 -738 640 -179
1613 -179 -414 392 8 -377 201 -401 -254 228 -241 -43 -130 49 -301 -122 -286 -400 -134 125 -150 -381
1633 -381 350 -49 41 137 -206 -150 -33 -379 211 -197 -125 107 -343 -150 189 -155 237 182 -50 228 157 197
1655 197 264 67 2 334 224 95 128 119 494 98 72 51 99 155 279 64 101 112 -121 39 132 -18 -185 -13
1679 -13 109 116 -71 -52 -342 -345 -68 -471 -357 93 -432 -247 152 -41 270 -18 -366 28 -212 -234 111 -216
1701b16j91L84o4J83Ql24M76m81L5J40M3kK92n07K50P9k98L07k05j17L74k92L15
1724A89J96m40K15rl83L72j41k23L30O2L4j15m9Q1j87L22m7k16O6J43r8j82L39
1747B59l80L46nl74L67O7n35L95M1l83J23L67q17J38J31l01K55J46k9Lm75P77
1769A16q89P43Q08r86j70J15Q7k8J62k3p2J62l67L20j3Qj51K35j20r7O1J12L3
1792D6j57K8L7M55m24K5J31j45J1o1K60k02K33p6k30L84m63K98k66K08q1K26j14
1815A23J03k12J32R7j89K59q3n0j98P3p7K07K5j89MK67r8k43n8K68lj63j37J72
1839C0Q5j11j30K15l5m80N39k55k3Q5q2Q4J37m25J60J72j14K68l51j23N94k88
1861d8q2L23k69K20l08q0R6J49k49J41K43j21o2K1J07o7K25j26n0J12J53k78K96
$$ plain form
1701 -216 -407 -23 -87 96 104 -220 256 -225 -190 -50 -7 -9 283 -224 26 105 -193 114 -91 -208 166 -126 189
1724 189 385 -55 160 151 -232 140 -1 -224 106 168 202 87 38 119 -68 254 207 -9 57 200 102 -80 259
1747 259 -121 225 220 -154 213 280 -255 140 181 -202 -79 288 -529 -391 -260 -561 -306 -160 -189 -186 -661 116
1769 116 -773 -30 778 -208 -378 -263 -176 -204 -42 -65 -137 25 -342 -22 -35 -27 -178 57 -63 -160 -99 13 46
1792 46 -111 -83 -46 409 -15 10 141 -4 7 -54 206 4 237 161 -69 315 -148 150 -116 92 11 237 123
1815 123 226 14 146 243 54 313 230 180 -18 55 -22 185 210 21 25 292 194 -49 -107 161 158 -5 -142 30
1839 30 115 4 -126 89 54 -426 113 -142 -165 -80 -162 -78 59 -366 -206 -34 -148 120 -231 -354 240 -48
1861 -48 -130 193 -76 144 -164 -244 -148 1 -248 -107 136 15 -47 -26 81 14 239 113 63 175 328 50 346
1884C46k17j37J76Q1k00j6K2J03j82J47k60K42k54K76r0J79Jj9n4j04J08m7k63
1907a62P9J63q0N0J15j73J03j08q8K77k51m2O2l2j92J40K62j37L2L5l03M09k24
1930f5j16j10L69j77J57Kl01K87j66J20j23j01Q0K12j36K53k00p0K19j52O4p2
1952b6J9m3J05j8L02r1l58J64M5m20J80J73r2R5J12L6rk31K61j57j65L2J4LJ23
1977E4j35J18O3j46J77k36L9J68j59m3J33pj68L25k42r6L15l16Q5J05j28r8J43
2000d9j12K24j27L2j20lj13M4K39j63pj79K97q6J79p2j02J23n0m6J06m1K20j99
2024eo2K19j12K05k09l0J73j7k15k9J59j60m3L96m07K79P6k56L16J07m99L29R8
2047C13l89K84j10j25J53j60P4K0k32K55k02R0K43k98L4q9L08K7l62j96K71K2
$$ plain form
1884 346 129 -8 168 249 49 33 55 158 -24 123 -137 105 -149 127 37 216 217 198 144 40 148 101 -162
1907 -162 -83 80 0 50 165 -8 95 -13 -101 176 -75 -117 -55 -87 -279 -139 123 -14 18 53 -250 159 -65
1930 -65 -181 -291 78 -99 58 60 -241 46 -120 0 -123 -224 -144 68 -68 185 -15 -85 134 -18 46 -26
1952 -26 -7 -50 55 37 339 248 -110 54 99 -321 -141 32 -60 35 147 183 174 -57 204 47 -118 -86 -72 -69 54
1977 54 -81 37 100 -46 131 -105 -66 102 -57 -100 33 26 -142 183 -59 -155 160 -156 -71 34 -94 -192 -49
2000 -49 -161 63 -64 -32 -152 -155 -268 -224 15 -148 -155 -334 -37 -123 56 -16 -118 5 -45 -91 15 -26 194 -5
2024 -5 -67 152 40 245 36 6 179 162 -53 -82 77 -83 -126 270 -137 142 218 -38 278 385 -114 215 313
2047 313 -76 208 98 -27 126 -34 40 60 -172 83 -119 -29 214 -84 -50 -139 169 196 -166 -362 -91 -69
2069f9k7j41J07O7P4q9J29q3r0L6j13P5J25k05j1O20o93K23k93K77R3o8K32k00
2093b4j93K20r4J36J3j13J97Qj30q0L03l79K3j0J96k5j36Q6p3R4J56k5j28L8j8
2118D2K31r0p9n1J95l08JJ13p4P2J01n2Ko1k60K29%j36K71l16K95k13J34k96J50
2143a00j6q5M39l6r4j78K6q7N2K75j07n7l5K15k00k24J5J20q9L60l37Q2J1M8k60
2168b62K37l8J13r5P6j32J45j35J33N6l33K21p0O3M7k6j1N9j06J6j05L84q0L2
2192A89l18J9J91L3j77K64J01l28QK11j70j7J7J0J11m9k23O9k6K60k46K0l9J17
2216B7r5o7n6M8K78j09l5R9m42L99k11J5J33j01p1N4L21l2l37M0K06l37Q6J31
2240e6L8J52p0k15J64mq2j6Q5j11L46p3p7j80R4K14l45K09j28K74j91n1J59r4
$$ plain form
2069 -69 -96 -237 -130 -63 11 -78 51 -32 -122 -86 -199 -124 1 -204 -215 405 -288 -65 -358 -81 12 -56 176 -24
2093 -24 -217 3 -91 45 58 -55 142 150 20 -60 243 -136 -113 -123 73 48 -88 -2 -75 19 175 150 22 60 42
2118 42 273 183 104 53 248 -60 -59 54 -20 52 153 101 103 42 -218 11 11 -125 146 -170 125 -88 46 -250 -100
2143 -100 -116 -201 238 202 108 -70 -44 -131 -79 196 89 32 -3 212 12 -212 -197 -77 -166 194 -143 -61 -50 -2 -262
2168 -262 -25 -63 50 -45 31 -101 44 -91 42 98 -235 -14 -84 -21 26 0 -11 48 -58 -42 -147 237 157 189
2192 189 -129 -110 81 114 -63 201 302 -26 -18 193 23 6 23 33 144 95 -128 -59 -85 175 -71 -51 -90 27
2216 27 -68 -135 -191 -143 135 26 -9 90 -352 47 -164 -149 -16 -117 -188 -134 187 155 -182 -142 64 -273 -187 -56
2240 -56 -18 134 64 -151 13 9 -73 -89 -4 -115 231 158 81 -99 -5 209 -136 73 -55 219 28 -23 136 42
2264D2J13l70M15j41k0O2j64Q8J99n23J84J73n43M77Q2k03J62j56J05K79l21J69
2286A09k72K76j22J61m29K36K13j39k27J27J51k00K98l42J48p7J84l43K70J05
2306A27n5m6j47j71M19l30M83m86J66N4j25j88L68k12J54k28J76k66M73l75m81
2327f90R23j53K4k80M08j33O6m6K3k29J95J25J9n38K54m3L61k09j65J24J65j85
2349A6M7n3J02k28K26l9K2p2j9K21r3Rj67J98k72K41r5k09K53k32K30p7k20K50
2373C9k7M1l94J74j68Q9K72j32J24o9j43L22j1l80K69K42k47o9J57j05m1M0J07
2396I0o6k54J2N52m12o8j67j33M12L4r5N7P0k14K08O0j65N1K60l83K91k36J85
2419H9m4J45l08M6R8Q0j5K48k19j23k22L66m25L05j54K9J48jk6k82L5L97k96n6
$$ plain form
2264 42 155 -215 200 59 39 101 -63 25 224 -299 -115 58 -485 -8 74 -129 33 -123 -18 261 -60 109
2286 109 -163 113 -9 152 -277 -41 172 33 -194 -67 84 -116 182 -160 -12 -89 95 -248 22 127
2306 127 72 26 -121 -292 127 -203 280 -206 -40 14 -111 -299 69 -143 11 -217 -41 -307 166 -209 -690
2327 -690 233 80 104 -176 232 99 165 119 142 -87 108 233 252 -286 -32 -75 286 77 -88 36 201 16
2349 16 63 10 112 -116 110 71 93 21 2 223 130 139 -28 170 -102 139 44 -165 88 -144 86 9 -211 39
2373 39 12 53 -341 -167 -335 -246 26 -106 18 -51 -194 128 117 -263 6 248 1 -68 89 -16 -57 -17 90
2396 90 24 -230 -218 334 -78 -146 -313 -446 -34 0 -95 -38 32 -182 26 86 -79 -28 232 -151 140 -96 89
2419 89 45 190 -118 -72 26 106 91 339 120 -3 -225 141 -284 21 -133 -104 44 43 17 -265 -230 167 -129 -185
2443a85J39J26j16j85LL96j83k29kJ76M8n9p4K45j05o9K01j90p4j57K80K6N7l89
2467c20L37J59l52K82p9m15J44J50NJ18J65o5k46M19l02J58k07J97k88J83l30
2488b87L96rj29J18o9N7J19j88o6J04Pl5J03m84O80k58l8O9k56K87J82n31K33
2511EJ22o4j72J95M8k53J15J33j18p2j54K91j81NJ78k29P5R1q3j0J25J09j31M5
2535G0o7j95R5o8K45R2l88J83P0J32r1j65p6j3K08n6l2%j4L09j48j90O6r8j84
2560c15M83J02l97M17k58k14M67l04k9P7J43r7m50M21%J89j22Mq5q0K43j17P7
2583A55j40J29j21j14K6M4j3K31j83p5K04k08J62l02N05p3l19K63j92j07K27j33
2605c4l51J04J63j14R9Q0K5J91l22J70j43K10j31J27J9j6j51J62j05o0J19j0l79
$$ plain form
2443 -185 -46 80 -36 -221 -218 178 -5 -234 -236 -60 -12 -71 -145 100 -5 -74 127 -63 -137 -294 -14 12 69 -320
2467 -320 17 176 -176 106 27 -388 -244 -94 -89 29 194 129 -117 302 0 158 -49 148 -140 43 -287
2488 -287 109 100 -29 89 20 77 196 8 -58 46 53 18 121 -363 317 59 21 90 -166 121 303 -228 5
2511 5 127 63 -109 86 134 -119 -4 129 11 -61 -215 76 -105 -100 78 -151 -76 15 -68 -78 47 156 25 70
2535 70 3 -192 -97 -165 80 172 -216 -33 37 169 78 -87 -163 -176 32 -24 -56 -56 -70 239 91 -99 -33 -131 -315
2560 -315 168 270 -127 290 32 -182 285 -19 -48 29 172 75 -375 46 46 235 113 117 32 -48 195 78 155
2583 155 15 144 23 -91 -65 -21 -34 197 14 -61 143 -65 97 -205 300 227 -92 171 -21 -128 99 -34
2605 -34 -385 -281 -118 -232 -133 -53 -28 163 -159 11 -132 78 -53 74 93 77 -74 88 -17 -77 42 32 -347
2628c47M26p7k03L39q1j81J76k0L2J37l3j25r3J42l09M04K3k71K49k50p8K45J54
2651B59l29J2K32j73k61K50M9p5K69j60P7r2k04K92L3m88L72k7J22k97R7J7j26
2674a51J37n6J01j11M2m7M0R8j58O8r1L17k99J08J97l12J19L7K30l33K0r2J8J39
2698B1p6j02J4K82k44K04L5k85J36J41Q0k67q7k6J89M6K4pRq7L4m5J88j50Q8k47
2724a32L48j18k94L93k01J07j2J15k7q6j69J69q8j31M3P0L49k68j06l8M1k17J42
2747a10K47k32J71k43l5J68K12j46r0J21J64k46J62q0l9m8Q5Q8m6k4k92J83k05
2770b35P9O8P1j25j06J42J04J13k21Q6j46K05K5M3k89J68p7J87Q7n01K79J20L5
2793A12p7qM1j95K31p9N6n6k58L48lJ01k44Q5n7Q7L2j68L3J40k22L45l54J44K1
$$ plain form
2628 -347 79 2 -201 138 57 -124 52 32 64 201 168 43 -50 92 -217 187 210 -61 188 -62 -140 105 259
2651 259 -70 -58 174 1 -260 -10 39 -36 233 73 150 58 -146 146 179 -309 63 36 158 -139 -42 -25 -151
2674 -151 -14 -70 31 -80 -38 -85 -45 53 -105 -37 -128 189 -110 -2 195 -117 2 39 269 -64 -44 -136 -118 21
2698 21 -55 -157 -143 139 -105 99 134 -151 -15 126 206 -61 -148 -174 15 61 85 78 87 0 34 -11 177 27 115 -132
2724 -132 216 98 -196 197 -4 103 91 206 179 93 -76 93 5 -126 -83 -13 336 68 -38 -76 -35 -252 -110
2747 -110 137 -95 76 -167 -202 -34 178 32 -58 63 227 -19 143 63 24 -24 61 149 103 79 -213 -30 -235
2770 -235 -156 -88 -17 -142 -248 -106 -2 111 -110 -24 -170 35 60 103 -186 -18 -95 92 179 -322 -43 77 112
2793 112 35 27 68 -127 104 25 81 25 -233 115 112 213 -31 54 -3 84 116 -52 -19 121 -101 244 -110 34 55
2818E5k91J40K82l60J52k3l19L99m1n8k03K72j01P2J6n8on0J64p9K9K16om45L11
2843F8Q3O2k39O4M3l94L56k2r2M7O8j5l0j30K58r6j30K16M4n5M0r2j78J66J15
2868A57k30m6K90r6j78K01K65r1k61n2Q0k38K71j49O0K68k10J43n0j58OJ08k24
2891a34R0m0M6J1J09r4N5j08J0J71j14K49k48J1J93k63L0J58j28j95K18O4J0J43
2915B44j96j26K36m61M43l94L31j1P8k20K59l51k9L20m36K01L35j16m6K8j3k0
2937E6l0k09J44M8r7L29k52K14j24n5j03J44K08l14J85rk92J64k62K87kj47K48
2960A31k99j8Q4L4k0j37L62l65K10L36m95J66L7j74J97L7m1Q4j22l7km5O2J48
2984A33j37J17J9o7n2L5N0r2J86j7j52qRj83P8l5P1j4O4k8o9J7J96K3r0k08K5
$$ plain form
2818 55 -236 -96 186 -174 -22 -45 -364 35 -6 -64 -267 5 -96 -24 -8 -66 -72 -122 42 -37 -8 208 202 -243 68
2843 68 151 213 -26 38 81 -313 43 21 -71 -24 44 29 -1 -131 127 31 -99 117 161 106 146 54 -124 42 157
2868 157 -73 -119 171 75 -103 98 363 272 11 -41 39 -199 72 -77 -17 251 41 184 134 -24 -18 90 -134
2891 -134 -44 -84 -38 -27 82 -12 43 -65 -55 116 2 251 3 14 207 -56 -26 132 4 -191 27 91 101 244
2915 244 48 -78 158 -303 140 -254 77 66 144 -76 183 -168 -197 123 -313 -112 223 107 61 89 76 56
2937 56 26 -183 -39 9 -88 241 -11 203 79 24 -79 65 273 -41 144 135 -157 7 -255 32 30 -117 131
2960 131 -168 -186 -102 -68 -88 -225 137 -228 -18 318 -177 -11 26 -148 49 86 45 129 7 -30 -32 -77 -15 133
2984 133 -4 113 132 65 13 48 98 6 192 175 23 15 24 -159 -81 -116 -45 -59 5 -23 -92 -75 121 144 54 -154 -129
3011a29J63j03M2j11j41K45J00p4K34m6j31q2P8J24n12N93j84oK22l76J85n6K5
3034F0j84l4q1L10n9J21k39J17J56k14J3r1l8n9J82l0J51j0P1J8k54L70k37q8
3058d9j41K44j59J16P1q1j08J73k6q2J59r0q4K88n30J71K06l8j01M2j31K15p7
3081a2j22r5J15N9M4j11Qj4J89m1j10L76o93M84q8J21L4j69K08j58r4L1L97m10
3105e1mj92K12L0P3N2j25m0P5n2J8j79L44l27J06J25j1j27J49jj21J77q4J78j48
3130G7j39J53j2KKj23Q5RJ9j38J33O4k53K31Q7m07J69K5k01J71N5k1o6k04K20
3155f2K38k39O4J33Q7k38P0j58R7R6j64J94j20J6Q2p9O9J24j60k6K00k20R0n1
3179D3j13J90J94m11m6K22J61k77J52j36Q5j96K35j76J92k2p9J9J35r2j50J86
$$ plain form
3011 -129 34 -69 -27 -138 -279 -34 66 -8 226 180 49 -33 45 169 -343 250 66 60 282 -94 91 35 60
3034 60 -124 -158 -239 71 12 133 -106 11 167 -47 -34 -125 -163 -222 -40 -70 81 71 142 160 -94 276 39 -49
3058 -49 -190 54 -105 11 82 1 -107 66 40 -42 117 27 -57 231 -299 -128 78 40 -61 -19 -150 65 -12
3081 -12 -134 -229 -114 -55 -11 -122 -114 -128 61 20 -90 286 -407 77 -11 110 144 -25 183 25 -69 -38 359 -51
3105 -51 -55 -247 -35 -5 68 120 -5 -45 30 -22 -4 -183 161 -166 -60 65 54 -73 76 75 -46 131 47 225 77
3130 77 -62 91 79 81 83 -40 45 54 73 -65 68 132 -121 110 197 -210 -41 -16 -217 -46 9 -12 -78 -282 -62
3155 -62 176 -63 1 134 221 -17 53 -105 -8 88 -76 118 -2 14 96 17 86 210 50 24 224 4 94 43
3179 43 -70 120 314 -97 -143 79 240 -37 115 -21 64 -132 103 -73 119 97 18 37 172 80 -70 116
3201A16Q9l07K2J61k60J92J28k04M02m47J31l9J11m1L1j41k33M04l21L21r6k73
3223b54nN04m64K30M4j19J65j40o2p7J89m8j98L22j9o5J55k25j91K45J3l3L73
3246C40m07K31l2k84J52r2K08k34K15O7k30J18j3j80J67J20j18J91r8k49J22M7
3268D1j87J17J39j7j80J75k5Q9l15k4M46k02j65K61j98K00N2k86J21k04m2M3J33
3291b8k24N79l25q8p1M4J35K0R4j90J57p0R6k35J14J90k08nj03J80k46J82n4O2
3315FJ05o8R8r3j21J5J64p5q2k25L10M0K36m16p6M6L8K5J26mj24J22j00K3qj21
3341a59J58q8J21J50q2j19J54j03m3j5M4J94k20K02m3Rk84J72j03K5J57j91J19
3364E5J4j49J92k98L72jP5k98K05m44K67J97l36L8K11Q3k97j20M21k26q8j23R5
$$ plain form
3201 116 205 -102 -80 81 -179 13 141 -63 339 -108 23 -16 95 54 85 -56 -289 115 -206 115 19 -254
3223 -254 -259 245 -219 11 55 -64 101 -39 -101 -178 11 -37 -235 87 68 3 158 -67 -258 -13 0 -33 340
3246 340 -67 164 132 -152 0 -92 116 -118 97 164 -66 52 39 -141 26 146 28 219 121 -128 -6 41
3268 41 -146 -29 110 93 -87 88 63 152 -163 -187 259 57 -108 153 -45 155 207 -79 42 -162 -204 -161 -28
3291 -28 -252 327 2 -86 -157 -113 22 42 136 -54 103 33 129 -106 8 198 -10 -15 -118 62 -184 -2 -56 6
3315 6 111 43 141 48 -73 -58 106 31 -51 -276 34 74 310 -106 -182 -136 -98 -73 53 49 -75 47 -53 -30 -38 -159
3341 -159 -1 -89 32 182 100 -19 135 32 -11 -26 18 212 -8 194 151 160 -124 48 -55 -30 127 -64 55
3364 55 69 -80 112 -186 186 185 260 -38 167 -277 -10 187 -149 -111 100 183 -114 -234 187 -39 -127 -250 -155
3387a55K4L7P1L4K6j11L3N7j67J72J08L4j77k44L26p9l2k48P8K05R9l97J35J63
3411hJ83l0k39Q6j35k1J60k72K94NJ57k02r4K93O0J7l46O6J15q4m2J02Ql63K93
3436Cnp7K64k73oM3J25j32R5j07J32Q5J21k07n0o2k4P9nj23P1P5J20k14N5J00
3462H3p5j3j57K73j59jk9j7Q7j42M79n20J64J1l48M03q1k4n10R56o30K63J25L04
3486D42n69L23k08M76n68K11p08O61J85l92Q7J60k53M99l29m84O48k80j38J71
3506f6L43n83lm04J195o38j52O22J23r27L91j66O20k91N03k03J20J71p97N44K41
3527F43m56o99K05K01L05k6K99K5L54r59k32n7P34j184O47O15L12o04l00J42l9
3548g4M09l76K10j27j53M41Q2p52N74m43Q43O2nq43m75O04l78L71L84j96m65L41
$$ plain form
3387 -155 -131 -94 -23 11 37 -74 -41 16 -151 21 129 163 -14 -258 68 -11 -43 -291 -213 -8 91 -306 -171 -8
3411 -8 175 145 -94 -8 -143 -164 -4 -276 18 23 180 -22 -116 177 237 254 -92 -26 89 5 -37 65 73 -290 3
3436 3 -2 -79 185 -88 -94 -51 74 -58 37 -70 62 147 268 61 11 -51 -75 4 -1 -124 -53 22 142 -72 -17 83
3462 83 8 -5 -162 111 -48 -49 -78 -95 -8 -150 329 -191 -27 -16 -364 39 -42 -66 -576 380 -250 13 138 442
3486 442 -127 196 -12 464 -104 107 -601 60 245 -147 -60 100 -153 346 17 -467 181 -99 -237 -66
3506 -66 277 -306 -309 -713 482 -156 -308 314 437 -490 -99 -265 355 64 567 364 484 655 -142 402 643
3527 643 187 -512 -307 -106 199 173 472 497 851 -108 -340 -397 337 -847 -200 415 727 123 -177 -35 -74
3548 -74 335 -41 169 42 -111 330 412 -340 234 -209 634 696 691 -152 -627 -23 -401 -30 354 158 -307 34
3570C4j53K01l44j52M27q9M89k87k94K39J62k39J92k45k69L28J8q6N2N1J70O9
3592B74j11p2J7l9l09l4K20l5R1j7l2l7J43J72k95J04mj45J65j15R9J52M6j48
3616I0k52K20k58J96o8K22l33J93n8J22m0J98j45l45L42N6L0m0r0nq5J23j3N8
3640A18j28M5l88K32k3N0R8j31K91Pq9k7k3q3J13k67L10j65J57j78J10k0J45j56
3664bN0j08M7N3m9k96L51R7k81R4K2J59r1K3L9M9K5k74K01k21j52J42mj04K58
3689B8j58J32J95l98J43o9J75L8n9k8L9Q1k87O3L12O1k28J39l54M07k48m5J30
3712F9k93J59j03J59j1K00k77K72j00k11K6J05j01J30o8l2O7N3l6n4r0Q4J09m2
3736A5p9j09K34q7J7k35K14j5j28K30m19L88K6Q0j78k7J21j32K23j65J60j36k1
$$ plain form
3570 34 -119 82 -262 -414 13 -76 413 126 -168 71 233 -6 186 -59 -328 0 18 -68 -16 35 205 274
3592 274 163 91 108 69 -240 -274 -54 -89 2 -15 -47 -84 59 231 -64 40 36 -109 56 -59 40 192 238 90
3616 90 -162 58 -200 -4 -72 150 -183 10 -48 74 34 232 87 -258 84 140 170 130 40 35 -50 73 60 118
3640 118 -10 35 -353 -121 -144 -94 4 -127 164 171 82 55 32 -51 62 -205 105 -60 97 -81 29 9 154 -2
3664 -2 48 -60 -13 40 -9 -305 46 143 -138 -44 -22 137 46 69 108 157 182 -92 109 -112 -264 -122 -126 -230 28
3689 28 -130 2 197 -201 -58 -127 48 86 27 -1 38 119 -168 -105 207 268 40 179 -175 232 -16 -61 69
3712 69 -224 -65 -168 -9 -20 180 -97 175 75 -136 -110 -5 -106 24 -44 -76 -9 44 8 -46 -136 -52 57 15
3736 15 -64 -173 61 -26 -9 -244 -30 -45 -173 57 -362 26 52 132 -46 -73 48 -84 139 -26 134 -2 -23
3759b3J93j53J29j80K02J73l60j36J90l0J24n0p3L06j79l93K52J37j81M3P8n2
3781A7L8q2k18K69l04J38L25j48K8r0K6J90j32m2j35j5J1n8J76k84L65K08m53
3804a70K29l4j1j3J43L9j54p6J45m9K28k38j61M4J28j40o7L02j07R8j00k79J26
3827a17K41r5m8q8j10K20N5R0K6k54J44O4j25k39J38m8O6P8k3J54Nj58Q3K81k78
3852F2Q3j73n6J6J03k3n6K0oJ31j30j41K52k6k05L13k16J6NM5K04k47N2J07lJ18
3878B45r7l90J53oq1K47O3j46J13l07K37q0J5J33m80M08l0j20K49O9%l12R0MQ2
3903E9r1L8N6k09mOJ95J89k82M6L8J13k01P7o8J81j44j13J23n6K13l1N0N1q4j17
3929C5j58J4N0m7J15j29P4q1%Q5R8o3k43K83j57K09k53K10M8j01j4n9J66j93J94
$$ plain form
3759 -23 170 17 146 -34 168 341 -19 -155 35 5 129 79 6 312 133 -260 -8 129 -52 -9 69 17
3781 17 55 -27 -245 24 -280 -142 183 35 63 -27 -1 189 57 15 -120 -135 -124 -182 -6 -290 75 283 -170
3804 -170 59 25 14 1 144 183 29 -47 98 49 277 39 -122 -78 50 -90 -157 145 38 136 36 -243 -117
3827 -117 124 29 -19 -107 -217 3 58 148 174 -80 64 128 3 -236 -98 -146 -80 -2 -25 129 134 -24 59 340 62
3852 62 145 -28 -84 -68 35 12 -44 -24 -30 101 -29 -170 82 56 -149 164 -52 -36 -31 14 218 -29 23 130 127 245
3878 245 148 -242 -89 -95 -176 71 134 -12 101 -206 31 -49 -34 99 -381 27 -3 -123 126 195 195 -117 -27 -23 59
3903 59 -32 6 62 -147 -151 -145 50 239 -43 3 41 154 -47 30 -38 143 -1 -114 9 -47 166 135 185 236 152 35
3929 35 -123 -109 -59 -106 9 -120 -46 -127 -127 -42 56 -7 -250 33 -124 85 -168 42 90 -11 -25 -84 82 -111 83
3954H3n1L0j78M0p4P6M4M8j30P3J46R1k37Q4N5j17o6J93k42K43o7Q4m21N28j18
3979A17j21q5r0J25K59k63l6P7j38R8K81k49J15m7p5P6QK6j22J57p8l0N0j0k9
$$ plain form
3954 83 32 62 -116 -76 -150 -74 -30 18 -112 -39 107 198 -39 45 100 -17 -83 110 -132 111 44 128 -293 235 117
3979 117 -4 -89 -179 -54 205 -58 -94 -17 -155 -57 224 -25 90 43 -32 44 52 78 -44 113 35 5 55 45 16
$$ [...]
8191A4
##END NTUPLES=NMR FID
##END=
