##TITLE=1H_SR57r+TFA
 CDCl3, 8 sc, 
 26.10.2020
##JCAMPDX= 6.0         $$ Bruker NMR JCAMP-DX V2.0
##DATA TYPE= NMR FID
##DATA CLASS= NTUPLES
##ORIGIN= UXNMR, Bruker Analytische Messtechnik GmbH
##OWNER= root
$$ XWIN-NMR		Version 3.5
$$ Mon Oct 26 13:25:32 2020 Russian Standard Time (UT+4h)  she@DPX200
##.OBSERVE FREQUENCY= 200.1315066352
##.OBSERVE NUCLEUS= ^1H
##.DELAY= (6, 6)
##.ACQUISITION MODE= SIMULTANEOUS
##.ACQUISITION SCHEME= undefined
##.AVERAGES= 8
##.DIGITISER RES= 18
##SPECTROMETER/DATA SYSTEM= spect
##.PULSE SEQUENCE= zg30
##.SOLVENT NAME= CDCl3
##.SHIFT REFERENCE= (INTERNAL, CDCl3, 0, 15.7039)
##AUDIT TRAIL= $$ (NUMBER, WHEN, WHO, WHERE, WHAT)
$$ ##TITLE= Audit trail, XWIN-NMR		Version 3.5
$$ ##JCAMPDX= 5.01
$$ ##ORIGIN= Bruker BioSpin GmbH
$$ ##OWNER= she
$$ F:/spectra/data/she/nmr/H-F/1/audita.txt
$$ ##AUDIT TRAIL=  $$ (NUMBER, WHEN, WHO, WHERE, WHAT)
(   1,<2020-10-26 13:24:07.12 +0400>,<she>,<DPX200>,
      <created by zg, POWCHK disabled, PULCHK disabled
       configuration hash MD5:
       00 E9 B6 7A A2 85 ED C7 34 08 36 98 17 FE 4E 26
       data hash MD5: 16K
       A8 E1 C5 BA 26 38 F5 84 65 78 E6 D7 00 CD 2C 44>)
$$ ##END=
$$ 
$$ hash MD5
$$ AB A6 9F 8C B3 A4 17 64 25 CC FA 90 C5 8A 42 88
##$RELAX= 
##$RELAX= 
##$RELAX= 
##$RELAX= 
##$RELAX= 
##$RELAX= 
$$ Bruker specific parameters
$$ --------------------------
##$DU= <F:/spectra>
##$EXPNO= 1
##$NAME= <H-F>
##$PROCNO= 1
##$TYPE= <nmr>
##$USER= <she>
##$AMP= (0..31)
100 100 100 100 100 100 100 100 100 100 100 100 100 100 100 100 100 100 
100 100 100 100 100 100 100 100 100 100 100 100 100 100 
##$AQSEQ= 0
##$AQ_mod= 1
##$AUNM= <au_zg>
##$AUTOPOS= <>
##$BF1= 200.13
##$BF2= 200.13
##$BF3= 200.13
##$BF4= 200.13
##$BF5= 200.13
##$BF6= 200.13
##$BF7= 200.13
##$BF8= 200.13
##$BYTORDA= 1
##$CFDGTYP= 0
##$CFRGTYP= 5
##$CHEMSTR= <none>
##$CNST= (0..31)
1 1 145 1 1 1 1 1 1 1 1 1 1 1 1 1 1 1 1 1 1 1 1 1 1 1 1 1 1 1 1 1 
##$CPDPRG= <>
##$CPDPRG1= <>
##$CPDPRG2= <>
##$CPDPRG3= <>
##$CPDPRG4= <mlev>
##$CPDPRG5= <mlev>
##$CPDPRG6= <mlev>
##$CPDPRG7= <mlev>
##$CPDPRG8= <mlev>
##$CPDPRGB= <>
##$CPDPRGT= <>
##$D= (0..31)
0 1.2 0 0 0 0 0 0 0 0.06 0 0.03 0 0 0 0 0.0002 0 0 0 0 0 0 0 0 0 0 0 0 
0 0 0 
##$DATE= 1603704246
##$DBL= (0..7)
120 120 120 120 120 120 120 120 
##$DBP= (0..7)
150 150 150 150 150 150 150 150 
##$DBP07= 0
##$DBPNAM0= <>
##$DBPNAM1= <>
##$DBPNAM2= <>
##$DBPNAM3= <>
##$DBPNAM4= <>
##$DBPNAM5= <>
##$DBPNAM6= <>
##$DBPNAM7= <>
##$DBPOAL= (0..7)
0.5 0.5 0.5 0.5 0.5 0.5 0.5 0.5 
##$DBPOFFS= (0..7)
0 0 0 0 0 0 0 0 
##$DE= 6
##$DECBNUC= <off>
##$DECIM= 32
##$DECNUC= <off>
##$DECSTAT= 4
##$DIGMOD= 1
##$DIGTYP= 9
##$DL= (0..7)
0 120 120 120 120 120 120 120 
##$DP= (0..7)
150 150 150 150 150 150 150 150 
##$DP07= 0
##$DPNAME0= <>
##$DPNAME1= <>
##$DPNAME2= <>
##$DPNAME3= <>
##$DPNAME4= <>
##$DPNAME5= <>
##$DPNAME6= <>
##$DPNAME7= <>
##$DPOAL= (0..7)
0.5 0.5 0.5 0.5 0.5 0.5 0.5 0.5 
##$DPOFFS= (0..7)
0 0 0 0 0 0 0 0 
##$DQDMODE= 0
##$DR= 18
##$DS= 0
##$DSLIST= <SSSSSSSSSSSSSSS>
$$ [...]
##$SUBNAM2= <"">
##$SUBNAM3= <"">
##$SUBNAM4= <"">
##$SUBNAM5= <"">
##$SUBNAM6= <"">
##$SUBNAM7= <"">
##$SUBNAM8= <"">
##$SUBNAM9= <"">
##$SW= 16.880792210976
##$SWIBOX= (0..15)
0 0 2 0 0 0 0 0 0 0 0 0 0 0 0 0 
##$SW_h= 3378.37837837838
##$TD= 16384
##$TD0= 1
##$TE= 0
##$TE2= 300
##$TE3= 300
##$TEG= 300
##$TL= (0..7)
0 120 120 120 120 120 120 120 
##$TP= (0..7)
150 150 150 150 150 150 150 150 
##$TP07= 0
##$TPNAME0= <>
##$TPNAME1= <>
##$TPNAME2= <>
##$TPNAME3= <>
##$TPNAME4= <>
##$TPNAME5= <>
##$TPNAME6= <>
##$TPNAME7= <>
##$TPOAL= (0..7)
0.5 0.5 0.5 0.5 0.5 0.5 0.5 0.5 
##$TPOFFS= (0..7)
0 0 0 0 0 0 0 0 
##$TUNHIN= 0
##$TUNHOUT= 0
##$TUNXOUT= 0
##$USERA1= <user>
##$USERA2= <user>
##$USERA3= <user>
##$USERA4= <user>
##$USERA5= <user>
##$V9= 5
##$VALIST= <valist>
##$VCLIST= <CCCCCCCCCCCCCCC>
##$VD= 0
##$VDLIST= <DDDDDDDDDDDDDDD>
##$VPLIST= <PPPPPPPPPPPPPPP>
##$VTLIST= <TTTTTTTTTTTTTTT>
##$WBST= 1024
##$WBSW= 4
##$XGAIN= (0..3)
0 0 0 0 
##$XL= 0
##$YL= 0
##$YMAX_a= 109577
##$YMIN_a= -91999
##$ZGOPTNS= <>
##$ZL1= 120
##$ZL2= 120
##$ZL3= 120
##$ZL4= 120
##$ABSF1= 10
##$ABSF2= 0
##$ABSG= 5
##$ABSL= 3
##$ALPHA= 0
##$AQORDER= 0
##$ASSFAC= 0
##$ASSFACI= 0
##$ASSFACX= 0
##$ASSWID= 0
##$AUNMP= <proc_1d>
##$AZFE= 0.1
##$AZFW= 0.1
##$BCFW= 1
##$BC_mod= 2
##$BYTORDP= 1
##$COROFFS= 0
##$CY= 11.3945322036743
##$DATMOD= 1
##$DC= 2
##$DFILT= <>
##$DTYPP= 0
##$F1P= 16.9975609425685
##$F2P= -3.02152046262296
##$FCOR= 0.5
##$FTSIZE= 0
##$FT_mod= 4
##$GAMMA= 1
##$GB= 0.15
##$INTBC= 1
##$INTSCL= 1
##$ISEN= 128
##$LB= 0.24
##$LEV0= 0
##$LPBIN= 0
##$MAXI= 10000
##$MC2= 0
##$MEAN= 0
##$ME_mod= 0
##$MI= 1.114404
##$NCOEF= 0
##$NC_proc= 0
##$NLEV= 6
##$NOISF1= 3.799351
##$NOISF2= 2.8
##$NSP= 1
##$NTH_PI= 0
##$NZP= 0
##$OFFSET= 15.70392
##$PC= 1
##$PHC0= -10688.58
##$PHC1= 8.80088
##$PH_mod= 1
##$PKNL= yes
##$PPARMOD= 0
##$PSCAL= 0
##$PSIGN= 0
##$REVERSE= no
##$SF= 200.130013532006
##$SI= 16384
##$SIGF1= 3
##$SIGF2= 2
##$SINO= 400
##$SIOLD= 16384
##$SREGLST= <1H.CDCl3>
##$SSB= 0
##$STSI= 0
##$STSR= 0
##$SW_p= 3612.71676300578
##$SYMM= 0
##$S_DEV= 0
##$TDeff= 0
##$TDoff= 0
##$TI= <>
##$TILT= no
##$TM1= 0
##$TM2= 0
##$TOPLEV= 0
##$USERP1= <user>
##$USERP2= <user>
##$USERP3= <user>
##$USERP4= <user>
##$USERP5= <user>
##$WDW= 1
##$XDIM= 8192
##$YMAX_p= 0
##$YMIN_p= 0
$$ End of Bruker specific parameters
$$ ---------------------------------
##NTUPLES= NMR FID
##VAR_NAME=  TIME,          FID/REAL,        FID/IMAG
##SYMBOL=    X,             R,               I
##VAR_TYPE=  INDEPENDENT,   DEPENDENT,       DEPENDENT
##VAR_FORM=  AFFN,          ASDF,            ASDF
##VAR_DIM=   8192,          8192,            8192
##UNITS=     SECONDS,       ARBITRARY UNITS, ARBITRARY UNITS
##FACTOR=    0.000296,      1,               1
##FIRST=     0,             0,               0
##LAST=      2.424536,      0,               0
##MIN=       0,             -91999,          0
##MAX=       2.424536,      109577,          0
$$ Real data points
##PAGE= N=1
##DATA TABLE= (X++(R..R)), XYDATA
0@%%%%%%%%%%%%%%%%Pj5J6j6J6j8K6l2L4m2M9n7O8p6Q8j03J17j32J50j69J89k13
38a13K39k67K98l31L67m08M53n01N54o11O74p43Q16r00R93j092J205j332J475
57G76j638J822k037K293k597K972l449M071m930O213q379J3123m7713j3478k3886
72g6837P6149R7186n1397j8640r1415j9883N0114M0781R1765k2996q8049l2510
84d5732m6267P1580Q3501O144l946p5256o1776K0242N5450O2974M712j4475o2166
97e015o8490L6282N0840M8168K8069n0374n5793m6985K3835P7089K5060J1537
109G4223m4278p0386K527J5179N6059M7402l6136k7509m1368k7288M8787L9794
121C7006K5087r680n8793k7724l081K8104N9240O992l1297l5368l3581J4092M1671
$$ y = [0, 0, 0, 0, 0, 0, 0, 0, 0, 0, 0, 0, 0, 0, 0, 0, 0, 7, -8, 8, -8, 8, -10, 16, -16, 18, -24, 25, -32, 36, -40, 48, -55, 62, -70, 80, -89, 100, -113, 126, -141, 157, -174, 193, -215, 238, -263, 291, -320, 354, -389, 427, -473, 520, -572, 633, -699, 776, -862, 960, -1077, 1216, -1381, 1591, -1858, 2213, -2717, 3496, -4883, 8240, -39473, -52951, -76837, -688, 96498, 45101, 26461, -64954, -84837, -34723, 6058, 97823, 74827, -13222, -45732, -91999, -20419, 63082, 69226, 65280, -9976, -71752, -51510, 3940, 66914, 71626, 57151, -5015, -73505, -37223, 13617, 61785, 89854, 39480, -16313, -63298, -39463, 37626, 62686, 74223, 29945, -40441, -37914, -22735, 33324, 80726, 44590, 17081, -24287, -51575, -2788, 37006, 62093, 52413, -6380, -34104, -37185, -9081, 50159, 57151, 25854, -9514, -43095, -29003, 12668]
134A2668K7049Q755l2514m2212p005J2095L3778L1745j0301k9335l5347j1574
146d2198L0671L0209K1164q518m4135k4195K095K6165L7381N755j7565l3950k3961
159d1082J4160K4990K8225O184k8594k8066j6712J3255L4032K0806J079l1698
171c421l0916l418J2639L6703J8764j5096k2491k9260j363K4918K2763J8353j8154
184A0021k9111j3334n917K9541K7767n75r918l1964j6411J3088K0207K8254j544
197B0104k3544j7852j7652J5589K9128J0357K304k3067k4132l33J0847K7635J3337
210B2721j1256j5842k3785M63K2361J6534J3504j1730k4729j0735J072K1799J8942
223A9319K155q435k4799r743J1249J4187J9459O20j6844j6165r255J2981J7905
$$ y = [12668, 39717, 48472, 15958, -26254, -33259, -21164, 12614, 44359, 34058, 4723, -30624, -42198, -11527, 18682, 39846, 31328, -12807, -37002, -34907, -8742, 28639, 34394, 16829, -17121, -41082, -26922, -1932, 26293, 32477, 3883, -24183, -40895, -27640, 6392, 27198, 28277, -3421, -34337, -37755, -25116, 11587, 30351, 15255, -7236, -36496, -37859, -12941, 9822, 28175, 10021, -19090, -32424, -38341, -8800, 18967, 18392, 8474, -23490, -39901, -26813, -6606, 21648, 20104, -3440, -21292, -38944, -23355, 5773, 16130, 18434, -4633, -28765, -29098, -18251, 9384, 22721, 11465, -4377, -28162, -27699, -5338, 11196, 24700, 12970, -11759, -22494, -21422, 377, 19319, 21474, 13039, -11760, -21503, -10254, 3933, 23392, 24012, 7168, -8997, -18252, -5271, 12634]
236A2634J0278J015j9196j5341J24Q217J9613Q089p417j3970j4947L153J2583
249D835J2442Q270j1887j4904o771Q32J5702J1606m21r674j5164l829N802J2344
263I183J1850n553j2496r821m356J0132J3188N687n845j4677q462K05J0120J5114
277A4269J347r576j1663r937M721J2661J1005J250j1938j2329n689M944J5411
290D476Q569k715j0405j3701l997R637J3305P838m083j2027j1514k916J0537J3123
304F127N439l863j2272j1300J227R940J0719N105n748j2452q072K464J0477Q879
318F670K786o307j1955n396M259Q175Q329J554p882q856l836M318P977O121l22
333E635q497o608l94M306P475M108m177p252m392J547N286O064K474n831o393
$$ y = [12634, 22912, 23927, 4731, -10610, -10486, -2269, 17344, 25433, 18016, 4046, -10901, -7748, 4835, 17277, 25547, 13660, -1244, -8015, -7183, 8519, 20125, 19704, 10030, -5134, -8963, -3161, 9183, 21033, 15480, 2984, -6837, -11193, -1061, 12127, 17814, 11969, -2708, -11170, -10965, -845, 14269, 15616, 6040, -5623, -15560, -10839, 1822, 12827, 14077, 2139, -10190, -15879, -10935, 4476, 13045, 10330, -75, -13776, -17773, -8136, 5169, 13007, 8924, -3103, -14617, -17533, -6996, 6127, 11566, 7703, -4569, -15869, -14642, -4702, 6017, 11122, 5374, -7078, -15150, -12686, -2209, 6670, 9456, 3149, -8806, -14202, -9943, -1768, 6561, 8115, 233, -8623, -12459, -8141, -164, 5957, 5635, -2862, -9470, -9864, -5558, 1917, 6025, 1848, -5404, -9796, -8249, -2963, 3101, 5575, -256, -6649]
348f649k321J869O816N408n39o214o205o97M096P045M710m138o188m295J2O120
364a170O926K422m523p237l371J026P030P883k31m522o431n049L455Q060N821
379A0089L52o926n879k843K958R363L797j766m389p840j653N113O394M954k533
394I191n913n252l005O708O660J096k24o972o208J685L612N942J358l625m437
409F16n548K672N313J830K684l496p515o14J094M064M696r20l600n533n64K789
425b032K127L958j282n774j728Q9K064L652J690k063m953j301Q70K058N159k06
441B328l760k131k824K064L627K278P18n111j895J99o12P210N47l504L70n057
457e553M10M284J135M203m098m011J286l937O267M498l699J205m975k431M382
$$ y = [-6649, -8970, -7101, -285, 5123, 4584, -1630, -7835, -8532, -4436, 2609, 7319, 3181, -3007, -7302, -7290, -1170, 5756, 8178, 3655, -3582, -6953, -5927, 1103, 8986, 8755, 4233, -2198, -7247, -3792, 4268, 10089, 10441, 3515, -2364, -5207, -2249, 7114, 10911, 9145, 4756, -3084, -4737, 376, 6770, 11724, 9191, 3278, -1974, -4979, 1729, 8389, 9485, 9261, 2289, -3919, -2234, 1378, 7320, 8678, 5053, 616, -4932, -2260, 3053, 4883, 7567, 4071, -3444, -4058, -2964, 1100, 5796, 4876, 1276, -4257, -4821, -2032, 95, 4053, 2771, -3003, -4731, -4642, -2578, 1074, 2764, 701, -4252, -5553, -4683, -2625, 2534, 2328, -1432, -3563, -6387, -4323, -696, 1582, 2300, -2811, -4706, -4507, -5119, 2091, 2638, -866, -496, -5553, -5143, -859, 276, 4479, 381, -3630, -2344, -6281, -14, 4484, 785, 1990, -2985, -5416, -1034]
472a034k63N597r14n646J343m226L066N266j781K783m885m085K602m47N119J292
488C787k679j368n645K640L965q8L874l473k988j812o82O212r90J385J321p997
504d538J379R50J065N768l434l10k361n128O770J73J243L712p299R18o77j571
520c340P226j512k69L06n565K874j71J650M862n395R2k75k903M194J483O3q31
537B489k727J214r25O47L770k126r78j43j243R80N54J911q68j994J72j148J492
554A077J820r42j63j893j124J345J003J240q37j987m10j063J204K561o65n97n89
571b0k396m10J864J544J070j540j793j179q76K917K067j200M00k945j892K005
587b384Q34K487J19j867m85k804J520K335q0K629k381k878O76p16K975J839j145
$$ y = [-1034, -1297, 4300, 3386, -2260, -917, -5143, -2077, 3189, 1408, 4191, -694, -4779, -2177, -2624, 2495, 3787, 1108, -260, -5905, -3265, 700, 612, 4486, 1013, -1975, -3787, -4469, 1743, 753, 2138, 3459, -4538, -3159, -2209, -1144, 4624, 1190, 880, -1481, -6609, 161, 334, 1577, 5289, -2010, -1092, -1769, -3340, 3886, 2374, 2105, 2411, -3154, -280, -451, 1199, 6061, 666, 758, 483, -2420, 1774, 3257, 3320, 2489, -238, 976, 51, 698, 4468, 2342, 1364, 1221, -22, 958, 1512, 3423, 2555, 561, 733, -415, 1077, 2897, 1955, 1792, -101, -1225, 120, 1123, 2363, 1526, -461, -871, -1934, -730, 1831, 1166, 569, -20, -2416, -2826, -962, 582, 1652, 112, -1681, -2860, -3736, -819, 1248, 48, 448, -2497, -4389, -2384, -1550, 937, 1056, -811, -1296, -4100, -2580, -245, -325, 2304, -77, -2955, -2279, -2995, -20, 1819, 674]
604F74N72l505P2J992q90L600n38k559N84j747J122J684P8J648k865n04N61j026
622a047K608L80j294L11j761N21N17J75J756k303L89L87j736K301k13n72J7j495
640a059J235l89K0K076k744M90p6j605K687k15m43o0j401O11J21M30J895k481
658i08J7O79k320J944J124j65L32j684l68m53R58K414j029J35p10k024J259J114
676C15K27Q26p61n88r44KJ865J70N28k58k059J24P49j1J544k2n86j279l96J160
696F06j51J245N51j881l98P4j77R02N66j85r20o38N51l67L13J249j175l00ko84
716h21N14M87J75k63p89J54n91K71J192r80M2j51m12J81M60M07l71n13L91q38
736a455M56J003o14L1K6p00L09N22M77n25k00O74n91j41J230l41k52J87j90l64
$$ y = [674, 1246, -2259, -2187, -195, -1085, 2515, 1977, -582, 2, -1745, -623, 1061, 1139, 2787, -78, -582, -21, -1047, 1561, 1941, 647, 958, -803, -282, 235, 410, 2166, -137, 252, 639, -1097, 1204, 991, 419, 436, -1059, 176, -213, -193, 1883, -861, -371, -447, -2052, 635, 420, -23, -83, -1484, -873, -752, -322, 1573, -908, -891, -212, -2532, -588, 536, 371, 703, -981, -1349, -1802, -844, 1570, 541, 676, -34, -2058, -799, 315, 542, 1368, 607, 19, -925, -923, 942, 1112, 1640, 1382, -677, -553, 196, 185, 1729, 1707, 1121, -158, -554, 606, 455, 1700, 2251, 370, -28, 46, -131, 771, 1337, 1152, 232, -406, 145, -222, 91, 1340, 165, -135, -137, -821, -307, 180, 355, 92, -697, -543, -1134, -863, 329, -651, -609, -760, -1172, -991, -531, -124, -495, -1008, -617, -1455, -999, 4, -610, -579, -553, -1253, -944, -422, 55, -470, -670, 4, -587, -728, 502, 161, -91, 96, -94, -458]
756d58N52P43k3k57J15p02q9J059L83l91N2l72o43M29N25K64k14M5o13o70P20
777D55M20j60M18k67j261q1R94J10K10K32q67j027O48k0K52O59k17j048n47K90
797h07L95J01P24o05p06N9j79R1L82O53n11n14K35m50J07P94K11p73K20l06l88
818a267O61O50k51k08K20n40j57N71L15j50K99j04o48M96L96k44J61K74l00l08
838a34L89J48L3N1L73m50k18N63M5n92O87n98j98O56p1j08j32m5o3n09J141k5
860I43r65O46p40j31J088n51K50k28k65j58n66L58M76k28K30m26m82J87L14L32
880H4k30K70m52o20O82j25j8R08m81k62m40j07N18m6N59O4j094O16m03J37J068
901F28l59K37l46k56R3m03P59N12o62M55n20m92P73m5L90J00k90k16m55N96J51
$$ y = [-458, 94, 837, 814, 557, 672, -30, -119, 940, 1323, 932, 984, 612, -31, 398, 923, 1187, 973, 1018, 405, -265, 455, 875, 715, 1133, 866, -395, -476, 518, 628, 838, 1070, 203, -824, -176, -196, 56, 715, 498, -550, -1097, -807, -412, -311, 413, -192, -898, -839, -1018, -927, -545, 108, -403, -917, -682, -1132, -1025, -231, -20, -793, -573, -879, -1267, -606, 44, -207, -415, -195, -735, -892, -321, -6, -156, 143, 39, -609, -113, 283, 39, 200, 474, 174, -134, 255, 403, 436, 487, 860, 410, 192, 755, 800, 208, 895, 297, 99, 755, 684, 576, 444, 399, 336, -173, 968, 943, -22, 624, -116, -247, 841, 290, 540, 312, 47, -111, -677, -319, 157, -71, 159, -267, -749, -562, -248, 84, -146, 124, -328, -948, -266, -391, -409, 499, 18, -244, -684, -791, -273, -319, 240, 304, -790, -174, -577, -440, 628, 269, 506, 160, -96, -3, -406, 353, 865, 203, 658, 138, -354, 419, 374, 764, 864, 574, 358, -97, 499, 650]
922F50l60M09K60r58O57j65m34K11K76k2m38O6J21m51J67K42p42N34M03m47j28
943a49r5l65J36J75K73n74j71K83m64N50m8l90O69k60j30k42o4P83p22M49M16
964F0j576P01M45J11K26n66K86ln65J309o85j99J259j186K54R4n71J067J3J63
984F37l40n98P88l23Q3O28q37L46O07p72N69n60Q32j49l69N13j095L49N90k29
1004F70mp4n65P5K60L70m10n39R62o90M5L26p67N88j15o9j10n51O59R7m47M49
1026A60o86l17J105p19J08J77k06R3j9J92l70k1K44j8l49L44R2n65R01k52k09
1047c15L1J93P4r7N36n27k83M94R7k11L70j99o8L7K78j68l64P54k03o21P52k56
1069C04N1M31l73p5r6j72N22n00L80j88m52Q21l62k75N70o51L15Kk57J8m50L55
$$ y = [650, 290, 699, 959, 1, 658, 493, 59, 270, 546, 524, 86, 152, 273, -178, -11, 231, -511, 23, 426, -21, -149, -244, -609, -473, -298, -25, -599, -770, -487, -951, -401, -449, -839, -170, -430, -560, -802, -866, -83, -805, -356, 60, -1516, -815, -370, -259, -33, -599, -313, -316, -881, 428, -257, -456, 803, -383, -129, -35, -606, 461, 474, 637, 297, -301, 487, 164, 247, 875, 38, 384, 991, 219, 788, 228, 1060, 911, 542, 1055, -40, 309, 899, 670, 666, 592, 27, 102, 362, 732, 322, -217, 745, 55, 100, 426, -341, 247, 132, 63, -47, -598, 61, 158, -289, 160, -526, -843, 262, -457, -349, -172, -378, -285, -304, -112, -482, -503, -259, -277, -626, -282, -190, -755, 146, -106, -315, -284, -91, -17, -114, 422, -105, -388, 106, 203, -8, 362, 163, 95, 132, 410, 242, -122, 632, 429, -192, 560, 304, 355, 786, 413, 338, 242, 70, 592, 92, 472, 284, -168, 653, 291, 16, 586, -65, 250, 252, -5, 13, -437, -82]
1091h2K27o38L58r0j33L68m9l06N8j17k4k50K08J91j41n6K16o70L09K29r9J26
1113c65kj09l62P61j60j85J44l4k10K29P6MJ16J69K90n75K51O9o14Q63p1j44J15
1136B56Lo6K24j32J02l90L03O16j030O47J80o70M65R8k51K53k86M66o84J95N21
1157H20l94k40L99l20j03J14k14J15Jj04o6k22N22m30j45N30p05K82o3R2j89J75
1179a45J97n71J60J35l28J81K13l2p2J3j16k27k00P68l51m4L69k95p2L47j83L07
1201E4M0l74J41j05N25l48L7M69l85j2J87k01r1L49m3k34K71K83m57J35J98j89
1223B50k76K80o2j63J41J2k50K04K81k97j97L83l83N7K14J34l86L2N3j30l82N99
1245A14j76j86P8j29j28R6K78m49K68K66n90O3L62j48k66L58K4l81O14k28j08
$$ y = [-82, 145, -493, -135, -225, -358, 10, -39, -345, -287, -404, -428, -678, -470, -279, -420, -476, -260, -930, -621, -392, -491, -365, -367, -476, -838, -77, -237, -422, -278, -312, -522, -293, -217, -213, -97, 72, 362, -213, 38, 107, -507, 356, 285, 141, 256, 259, 193, 417, 285, 387, -3, 300, 916, -114, 533, 713, 43, 508, 606, 355, 608, 322, 788, 104, 299, 820, 426, 186, 585, 265, 162, 276, 62, 177, 178, 74, 8, -214, 308, -122, -267, 263, -442, -160, -223, -131, -320, -145, 52, -519, -359, -224, -552, -371, -158, -190, -262, -249, -365, -592, -792, -24, -375, -419, -50, -345, -417, -70, -253, 54, 94, -280, -139, -244, 281, -67, -30, 439, 54, 42, 229, 28, -63, 286, 243, 9, 280, 563, 106, 241, 439, 250, -26, 254, 192, 29, 170, 182, -68, 136, 417, 120, -77, 306, -77, -20, 194, 328, -58, -26, 27, -103, -485, 114, -62, -248, -170, -299, -427, -331, -53, -502, -234, 32, -558, -495, -133, -281, -547, -189, -165, -546, 68, -160, -268]
1266b68O7j96J1l1L95k9j22M83q7m97L07J29m64K17L51j12j03M32k5m46L52R4
1288D58j20L65M3n07J82Nl04L58n4L2k3K88k55k68K02J41k58j45K33j17l18K55
1310A93L9k93L58j74r1L6J6k03O1J57l91n2N81m97k9K54j32l61L70K63o26J18
1332d03L90j66l51L44l51n4P2J57q5J08K41k00k06K73J74m18L89J45m53M01n0
1353d3K26m26J73L60l18M77j14m79L70J49o69P00j8l22K56P4o4n0k34N96m92J23
1375B75Q9m25M39M8j1l38J23J97l52j23O06p28N24p7j81K4l89p4R1K40J02n33
1397d73K32M62o03L48k98M4J39j85J48l09L2M58l13Q5r7j81O13l36J04k07R1K56
1419A0l32J14P3m62N42M75q53O32j79J9K58l52L65l08J51L44o30M34N1l03K43
$$ y = [-268, -201, -397, -386, -417, -22, -51, -173, 310, 223, -274, 33, 162, -302, -85, 266, 154, 51, 483, 458, 12, 364, 458, 338, 703, 746, 239, 421, 426, 122, 480, 426, 458, 435, 723, 468, 200, 402, 543, 285, 140, 373, 256, -62, 193, 232, -61, 297, 123, 32, 68, 84, -119, -58, 99, -292, -344, 237, -260, -289, -35, -167, -528, -158, 105, -521, -403, -13, -179, -530, -186, -537, -591, -519, -362, -447, -339, -98, -298, -504, -231, -57, -475, -86, 59, -394, 7, -43, 183, -243, -70, 290, -28, 449, 335, -144, 226, 375, -294, 406, 388, 66, 322, 396, 332, 282, 48, 644, 152, 275, 364, -61, 378, 426, 415, 77, 200, 397, 45, -78, 528, -200, 324, 247, 66, 90, -299, -373, -282, -42, 60, -473, -241, 221, -382, -34, -332, -288, -149, -334, -186, -495, -463, -5, -318, -233, -330, -511, 102, -234, -130, -337, -246, 10, -322, -208, -135, -597, -55, 420, -433, 199, 20, 39, 297, -55, 310, 2, 153, 497, -133, 301, 352, 49, 292]
1440B92k20L08j86J03J74m94O48l98k53K30l4K09q6j40Q0p6M1N0l76M86ql26K93
1463C17R7k80j06Om8n7j74M37p6o3K80o61J84L3q1p8O7q3j09j0p1K52k41M40J73
1488A48o31L50J07o57O80j60j31J83j05QJ2J71O0k51L36nl13L49J4k24K80J4j92
1511D3k19K61j84J37L04n9o0J30k68j02j73O37k8m92M03k96RM69K5m93K78k63
1533E9j1k9OJ17j46L42j7q60N09n4l92P95l12k81K91j38K34l02K42j13m78K43
1555b95J17k32J96N1l83N24J18k52p4J40j55L9o0K37m36L77R6p7j16M55k04p0
1577dK71l6l58M14j18j29K1J72p0k35L59j0j72K00J54n66L56J89j78J17K11k05
1599C83l34l1L03j84K42M4m3j71Q1j47j14K75k98N0q7J97n26K77L28l37L12j35
$$ y = [292, 72, 380, 194, 297, 471, -23, 625, 227, -26, 204, 170, 379, 293, 153, 233, 157, 198, 248, -128, 358, 350, 24, 317, 414, 134, 28, 34, -14, -71, -245, 192, 116, 53, 333, -328, -144, -111, -192, -270, -203, -286, -395, -405, -476, -224, -465, -25, 148, -483, -133, -26, -683, -3, -163, -294, -111, -216, -208, -196, -25, 35, -216, 120, 115, -198, 151, 165, -59, 221, 235, 43, -176, 85, -99, 38, 342, 283, 223, 353, 85, -17, -190, 447, 419, -73, 330, 34, 43, 512, 537, 44, 322, 59, 48, 19, 25, 142, -4, 338, 321, -539, -30, -84, -476, 319, 7, -274, 17, -121, 113, -189, 53, -60, -538, -295, -178, -410, -214, -163, -546, -22, 96, -156, -230, -90, -245, -206, -266, -29, -465, -88, 8, -69, -185, 270, 66, -4, 267, 231, -127, 287, 169, 40, 61, 233, 163, -72, 287, 277, 105, 305, 459, -107, 249, 438, 260, 377, 588, 383, 49, 18, 321, 137, 379, 423, 380, 209, 290, 143, 29, 304, 6, 56, -31, 166, -360, -83, 245, -92, 220, 85]
1621H5k15m7J31r1O4K1N6l97k0J26o9K07P8M42q58K82K35m92K94J39j95P1Q7j09
1645a75p2M5K46j88j3O0QK16j54K9j07M80o11K63P0J67j99J30J15pk53J28l6K7
1669A69J48k22J8L93m87N1n4RJj63N16m75L8K31j36o2J91j74J39m9O3k65J83J4
1693G7k13J11J95n88J48L97l24j18k3K69k10J11q4R6l76J27O8p1R9L90l55R9J41
1716c4rj81K25k39Q1M01m11j17K77L48l27NJ81j02J25j24j6r3J76J18k89K42M5
1739B82n5K8k34L01o8L4j68J99K57k73j01KJ11j19p4K0K05m41L24P6k58K62l83
1762g3P2P6J82k68j93l7J77J45n1R2m50N44j78k75J52K29l16q9L04m61O9J94j
1785a56j90K54o1l10J9M79j00K4Q6r8l70L76j4j00P0N2k30J87N2l53K04N05k23
$$ y = [85, -130, -177, -46, -137, -73, -52, 4, -393, -413, -287, -356, -149, -71, 371, -487, -205, 30, -462, -168, -29, -224, -153, -66, -175, -247, -202, 44, -144, -157, -97, -89, 127, -27, 2, -105, 375, -236, 27, 97, 264, 65, 195, 310, 303, 50, 178, 142, 169, 317, 95, 113, 506, 19, 70, 16, 25, 26, -137, 379, -96, -58, 173, 37, -25, 166, -8, 131, 82, 145, -120, 63, 77, -136, -25, 170, -418, -270, 127, -197, -315, -338, -69, -279, -168, -252, -156, -532, -405, -337, -408, -309, 81, -274, -175, -34, -43, -224, 1, -238, -157, 244, -167, -284, -7, 341, 14, 19, 200, 98, 223, 99, 83, -10, 166, 284, -5, 237, 282, 227, 255, 21, 322, 254, 288, 120, 319, 576, 303, 202, 204, 315, 196, 122, 142, 347, -94, 230, 306, 48, 310, -73, -1, 75, 257, -11, -204, -241, -64, 81, 30, 122, -328, 216, 38, -237, -85, 144, -172, -261, 43, -418, -349, -155, -156, -346, -92, -153, -463, -444, 35, -65, -41, 45, -53, -423, -47, -61, -161, -91, -39, -269, -82, -30, -383, -179, 326, 103]
1808A03j19KqL19j37J44k56k4L34j76l11K91P4LJ28R9k57m1k5j10K35j00jj14
1832E3j13K40l03K48L55n21J91P7k34J1J17j8j39PK3k95L18q7j81K86j78j9j39
1855c01p6l9O4K13L6K1j31r3J80J49o9j52o5K83k15r1K01k38J50K6OK80k98K34
1879G5r8K8o2L67j12l99M46j42j89L88k78K39R2m20L82j79K67J8j55K00k35j87
1901D6L40j95n7k8K6k7L50l46n2j01J30kR8j3j27O4r3m5p5K93j06j62j96L27J12
1926A61m81J0J24k2j46K94L0l94K61K8k53J71P4J39lj17o4L2k3K60l24L08j06
1949d1k57K29j10jJQ1K33Q4k87L8J25j70J08J51o0l11mL14n5j76K4M82k58Q1P9
1974C00k44J45m9k3N5l13J13O0j91K70k57r8L33O6j47Q6k71J30K5K55l94Q3l7
$$ y = [103, -16, -14, -22, 297, 160, 304, 48, 24, 358, 182, -129, 162, 236, 239, 367, 466, 209, 168, 143, 33, 268, 168, 167, 53, -60, 180, -123, 125, 480, -41, 150, 227, -7, 4, 121, 103, -36, -29, -6, -301, 17, -70, -251, 35, -143, -162, -301, -377, -416, -352, -139, -103, -82, -213, -306, -126, 23, -46, -198, -263, 20, -195, -286, -85, -323, -173, -147, -141, 139, -159, 75, -23, 5, -57, 310, 198, -201, 245, 103, -86, 302, 24, 263, 355, -65, 317, 138, 405, 423, 268, 468, 233, 46, 386, 191, 134, 106, 132, 105, 455, 109, 57, -44, 86, 84, 182, 169, 42, 106, 13, -32, -107, 186, 80, -82, -278, 49, 161, -320, -310, -186, -208, -354, -60, -30, -424, -163, -135, -388, -217, -143, -4, -7, -124, -188, -156, -179, 81, -243, 65, -41, -298, -69, -179, -180, -179, -98, 135, 219, -68, -30, 95, -75, 33, 184, 124, -187, -191, 123, 68, -108, -84, 398, 140, 221, 300, 56, 201, 152, 129, 184, -129, -16, 44, -147, 123, -134, -232, 101, 167, 20, 106, -165, -35, -10, 245, -149, -66, -103]
1997a03J61k96L6l09L82J44j83m6K32k70K60l65K43K65n59L39r7K6p7P9K57l32
2019b13L59l53Q1L42j96j03j3K70j44J32O%k68M59j02k91J28K47k64K17l10R5
2041G9NJ03j81L1J85j23J19J79j18j25L18j79j85J4p9k65K43p5J19J21r2R4m9
2064A39Jl11J43O2j24o2J36J03k84j86K28J55j42J42M7l68J02K2R9J05j0j59k8
2087a90j15K06j16K87k30J71n7m8J00k41q3N22l50L0N20m41k08M80l36L7L28k61
2109Ek13L23Q7j62Q8J45j66L3rk6r8O6K66k42k7p1N9J9o7R9pL9k75m4L72k67L36
2136B63j90J56q1p0j24J74r1j18J45j78K30rk77J7K48j17M1q9j24L7M4J84k70
2159a99k1J27J7O2p5k31K9L35k81J07J46l7k01M10k84J47l32K80J8j35N90l88
$$ y = [-103, 58, -238, -202, -511, -129, 15, -168, -214, 18, -252, 8, -357, -114, 151, -408, -69, -166, -140, -217, -138, 119, -213, 146, -207, -126, 216, 20, -83, -96, 174, 30, 162, 168, 168, -100, 359, 257, -34, 94, 341, 77, 294, -16, 79, 84, 187, 6, 37, 222, 99, 218, 397, 279, 154, 472, 293, 108, 122, 43, -222, 21, -54, 65, 186, 94, 188, 139, 140, -171, -28, 34, -90, -152, -16, 87, -197, -383, -155, 0, -142, 0, 47, -321, -219, -197, -98, 7, -3, -162, -190, -305, -99, -215, 72, -158, 13, -44, -92, 8, -233, -316, 206, -144, -114, 406, -35, -243, 237, -99, -62, 266, 5, -208, 115, 202, 40, 128, 273, 107, 140, 131, 105, 7, 73, 339, 97, 70, -1, 58, 77, 10, 109, 102, 141, -134, -178, 194, -73, 263, 73, 229, 148, 78, -46, 128, 37, -81, 64, -114, 116, 107, -170, -153, 95, -22, 19, -70, -194, -157, -113, 71, -199, -220, -93, -76, -14, -89, -320, -291, 44, -237, -130, 16, -21, -222, 188, -96, 51, -281, -1, 17, -118, 472, 84]
2181H4nJ90r5j83J62j70M9J85Lr9k5K12k25KL34J0k72q7J51k80J55K01r7j62K63
2206C01o4j65R8M7k88J43k55L07j13K16k33J65K6j24l08J38K47J05m15J70J4j90
2228a78L0J55K6n0m7j19L4nJ11j16K97p6j11p3J34N7m0k68jJ31J5j22J48J15p2
2253b5n8K11L04l97R7p0j26L14Q7k64J2J04j29N8K82j59k9pl37J41P3O4l81K00
2277c5L7J50K17l35r3L7p8M44l32J12m2qj7q8J11j17j82J70J10j16P8k65k1K73
2301A0l87K08J81q6M6q7K53j41j50J59M4m96M97k5n26L53K1O1R1j52J7J8P2J52
2325A33k4Nj18j96J90R3M0q2K12o9q4r9j35J35K85L7l0q0P4j56J63k09j30m1L42
2350B56k01j2l4K75l90K47J80m92J66R0k78L54p4o6j90J42j33J48Q1k52K47j60
$$ y = [84, 79, 269, 174, -9, 153, -17, 32, 217, 220, 121, 96, 308, 83, 85, 419, 429, 157, 70, 221, -59, 96, 297, 200, 38, 301, 237, 72, 170, 217, -71, 72, -183, 124, 11, 227, -6, 159, 185, 61, -247, -109, 138, 243, -172, -2, 12, -178, -148, 7, 33, -17, -64, -183, -149, -154, -43, -159, 138, 62, -49, -122, 12, 69, 29, -239, -240, -109, -94, -216, -68, 47, -25, -83, 128, 432, 35, 132, 62, -64, 250, 337, 73, 85, 189, 60, 118, 400, 241, 212, 205, -132, 9, 82, 146, -235, -35, 2, 152, 369, 34, -59, -22, -100, 344, 12, 124, 82, 74, 57, -31, 80, -37, -219, -49, 61, -55, 23, -242, -263, 10, -377, -169, 12, -74, -28, -115, 138, -3, -153, 6, 50, -446, 51, 26, -500, -147, -126, -65, 26, -126, -109, -91, -19, 133, 109, 114, -4, -200, -10, 83, 123, 41, 253, 184, 100, 1, -134, 1, 286, 323, 293, 213, 287, 131, 294, 85, -45, -86, 256, 55, 43, 9, 284, -106, 141, 321, -171, -5, 85, -193, 161, 87, 21, -169, -27, -160, -12, 69, -183, 64, -96]
2372i6j47L90j00l30P0L6J94K25l85J43j17j65K12j72L26k0j74l7l8j33M21l26
2394b23J43J95k62K25j11k8J45j45Q4q8K2M1j49J28l0k18L59J74j4j80q8J50j04
2417B6j09J22j24K91K21m68j8L92k21l9Q7K49j47k61Q7j54L43R1j31l65j3M2L65
2440B66l11rR3m4k6j58j2J62M2k60L2M8J97k37M8J16L9r8j69K90j95jJ95j71K51
2465H8k00K7O7P6L8J7o4l44L76j93l7J18j95K35L2K07j7n2N9j77j08J24Pj41K54
2490A97r9k00K36j13O4j16J31j18J75J40q5p0k4K72m60J96j18OLL83j60l88L37
2513A89j66k10P6Q4k03K67j40P9j36K21j43n0l1p8J14n6K43l30R4L2J47m9J30
2536H4j39J27k48J85k24M2K65m13L60j08j63M35j41k38j38J83l8Q8K03m8n1nr6
$$ y = [-96, -243, 147, 47, -283, -213, -177, 17, 242, -143, 0, -117, -282, -70, -242, 84, 64, -110, -147, -185, -318, 103, -223, -80, 115, -147, 78, -33, -61, 84, -61, 23, -65, -43, -2, -151, -23, -53, -271, 88, 262, 248, 68, -20, 130, 26, -83, 39, -85, 206, 427, -41, -59, 333, 112, 73, 160, 409, 262, 1, 88, -66, 277, 368, 237, -128, -141, -99, 266, -45, -54, 39, -5, -31, -189, -201, -39, 3, -257, -225, -177, 20, -217, -169, -53, -14, -112, -281, 9, -186, -187, 8, -163, 88, -112, -85, -18, 58, 96, 113, 49, -295, 81, -112, -149, -31, -226, 9, 41, 248, 231, 179, 238, 61, -47, 77, 84, -57, 197, 98, -102, 134, 21, 85, -31, 100, -18, 157, 297, 212, 142, 118, 390, -70, 126, 8, 14, 17, 400, 240, -148, 189, 23, -187, -111, -27, -230, 37, -103, -24, -160, 61, -82, -132, -163, -241, -127, -183, 60, -270, -176, -144, 3, -46, 84, -55, 72, -176, 9, -215, -173, 92, -321, 39, -69, -232, 203, 62, -176, -314, -131, -169, -81, 122, 74, 23, 18, -78]
2559g8K86k92K79j04p4Pn1n5M2O4QKP4m9O6n0Rj53L7N3j78M08j90k20J79R9j68
2586d9R2J43Q4j64l00O1M1l1j79L23rj65K80l12L05J69n78J19J41j57j11L75j57
2609g9Rr6J53kl22K13J07j09m3R6j02K90j91%J86l7j84J79n7l6r4L99k41j03J39
2634G5J19k00R3J5j33l4J65k51K41L25k51K0n6j8p1j3K59l09L24o9k18R7j18j28
2658a36J19K71m52K32n4r7L1N6K25l8o5j75j94L6L02j27n0L7J15j87j2J00nj27
2682a95qL0N4J0R7k07j8R5L69m75K42K23n25K24J28j73M0n5P0P2O4j45m3M81k76
2707G9j70q3Q5O2J32l1j65L49m1j88j33P7R5p8r6J40kN6L9n3k01M6K8L59l43Q5
2733D8K53l53J33M9j76k01J62J09j28K43q0r8K86r3m24N04j12j23R4k33J04rJ50
$$ y = [-78, 208, -84, 195, 91, 17, 24, -27, -82, -40, 24, 32, 34, 108, 59, 125, 75, 84, -69, -32, 21, -157, 251, 61, -159, 20, 119, -49, 43, 186, 270, 106, -194, -133, -92, -123, -302, 21, 12, -153, 127, -185, 120, 289, -289, -170, -29, -186, -297, 78, -79, -70, -166, -13, -15, -337, -124, -17, -126, -169, -73, -175, 115, -76, -76, 110, 73, -111, 68, 11, -25, -119, 280, 39, -64, 75, 194, -6, 87, 102, -31, -65, 100, -151, 90, 415, 164, 184, 128, 110, 39, 26, 285, -24, 300, 231, 13, 110, -8, -136, -17, 254, -198, 34, -20, -117, -86, -30, 195, 157, 92, -83, -277, -241, 61, -66, -116, -79, 36, -151, -163, -63, -68, -195, -203, -173, -119, -109, -12, -219, -237, -142, 227, -248, -6, 217, -308, -84, 44, -129, -89, -144, -74, -2, 62, -83, -126, 355, 79, -91, -174, -89, -27, 105, 74, -91, 258, 217, 29, -104, -27, 68, -10, -106, 34, 32, 88, 127, 74, -127, -81, -53, 306, -37, 48, 301, -52, 81, 130, -46, -247, -85, 24, -104, 139, 59, -39, 247, 154, -270, 234, 122, -1, 93, -140, -36, -45, 105]
2756A05k87O4j0Q7Rk6j49J33k24L10n3P9o4j12J46r1P9J36l5pJ24m00J94R7k78
2781a73J81J41j02L8l4j26m5N4L05k79k4M0k3m9N4M15l48j16K51J76m04L21k29
2804B4p6J27o8j9k39K35J36l33K20j7l03J22L62N1l05J69j06k5J62j86o2J64Q8
2827A21J10l59k7p0K71k01R3O9Qk50J98K19J40l47L1K0r3K31j43K03k40K0K46
2850B50k51L9n7kl8J68r6R3l5J63k53J15j07R8m81M27J20k48J37P6j74J25K37
2873C06k96O2k3l3P3j05J33r8L9o5K0k27L67j14j9k03p4K61p4j6r7J53J89k63
2897a04L4L0J02j83J65M7k69M61k26q2k61J90k40O1L40k85K46j63J84l0K1L0K2
2920I0p6j01J09q7R5P9j74MR0r2P6m2J56l1Q1k57K40m02K03n3K71k39o5K31j57
$$ y = [105, -182, -118, -128, -41, -32, -58, -207, -74, -298, 12, -41, 38, -26, -138, 8, -83, -4, 132, 97, 90, 214, -186, 8, 105, -173, 8, 149, 47, 85, 51, -75, -120, -66, 239, -40, -64, -24, -47, -96, -42, 373, 25, -91, 160, 336, -68, 253, 24, -52, 75, 7, -12, -251, -16, 120, -213, 7, -10, -313, -191, 171, 222, -83, 86, -20, -45, 117, -69, -131, 33, 121, 231, -128, -155, -225, 46, -155, -62, 7, 15, -235, -37, 182, 322, -25, 6, 26, -67, 164, 21, 224, -16, 4, 250, -1, 38, -19, -21, -59, 109, 13, 106, 71, 234, -19, 96, -11, 87, -394, 33, 153, -95, 42, 118, -56, 69, 306, 10, 72, 49, 16, 89, -16, 117, 19, 58, -7, 13, -214, 153, 39, 20, -183, -257, 4, -70, -86, -183, -30, 159, -104, -70, -40, 62, -121, 44, 91, -178, 283, 57, -25, -286, -96, -336, -275, 65, -220, 26, -137, 47, 17, 38, 68, 90, 14, -87, 22, -65, 30, 109, -65, -61, 29, -63, 13, -29, 127, 96, 177, -80, 160, -242, -39, -92, 179, -60, -125, 106, -51]
2945e1L06k38K82j99J2J63k32q4M4J17k89N3L4qkJ74k86R3J44J32l18R1j52K56
2969D2J10l40K01k20J69O8k89K47R5j59q2J59J23j89L4k1j77K64k12K03l1J20
2991A15J13l10L74n25J28J97k48K3j82K82jK94J24m50JJ83j14q5N0J0KJ02k11
3014a28J5K95k64M6J27J6l14J96J17kj07J81o2l53M57k45Q1j36J36M4k76J90J07
3037A21k43P8J90k09N9r7q5kM42j69k50L0j89K17L5N8l4J27j17q3O7j1O8k49K63
3062A7J9q0Q8k37n1p1J73L60j81J6r4J14O5m0k4K81k94l97M48j52J78k26J22j
3086C3k3J39J21l09J42O3p1p0L51j15n43N79q3pj96QP1P8k38P8N1n3l1L3J84l95
3112b03J55J51p5M4k03pK60p0l68J15J22M1j55L29j30j48P4J81j51j6L0j48M7
$$ y = [-51, 255, 17, 299, 100, 112, 275, 43, -41, 3, 120, -169, -116, -82, -90, -92, 82, -204, -111, 33, 165, -153, -62, -214, 42, 152, -188, 13, -207, -38, 30, -259, -12, 83, -76, -158, 1, 124, -65, -31, -52, -229, 35, -177, 26, -5, 115, 228, -82, 292, -233, -105, 92, -156, -133, -315, -33, -34, 260, 384, -66, -65, 118, 4, -81, -31, -21, -19, 83, -128, -113, 182, -82, -36, 91, 107, -207, -11, 106, 104, -3, 178, 116, -237, 220, -25, 56, -80, 56, 100, -176, 14, 121, -122, -44, 146, -63, -4, -101, -186, -188, 254, 85, -165, -135, -324, -107, -72, -14, -48, 79, -38, -121, -54, -65, 3, -246, 17, 36, -44, 44, -193, -244, -315, -142, 218, 37, 53, -41, 73, 138, 98, 74, 355, 61, -336, 112, -40, 138, -88, 34, 33, 10, 149, 270, -39, 103, 166, 95, 25, 376, 261, -282, 297, 214, 207, 11, 19, 90, 168, -70, 8, 59, 6, -25, 8, 192, -203, -48, 103, 28, 72, -131, -138, 122, 52, -316, -201, -79, -38, -193, 136, 6, -142, -68, 113, -38, -54, -24, -172, -125]
3135a25k78N15j82L02k50j95L16k72J90k04L59j05j30Q7m8M8l04K67k01M67j59
3156I8j70%QK8J9Q6J20n0K26l21j07J34q8O6J68j92o4K96j79j92J93K17k32P6
3180A40j60N0j33J49o6q9L2o4K33p7o3R4n4j52J68p9j2j43K70k83R1J59k9J9k37
3205b36J89L9J2k3q0m0J11J9q7J0l8J27k12M6K77k52m2L66l85JL78r5J06j88j3
3230a0q5J79j15jR5J83l65Lq6K27J02j4J49m53L49M9j83PK09K8k94N6J23l62K70
3255F1J48m0l51K95J21k86q6K95k74K69j38J60o6r3R4j91J31m5J32k40j0J0J37
3278C3j00k31M46m08K4P2j11L21nL7l92K03K28o6j25Q7P1j86L1K43k38K64j76
3301B2k66J66O8O5Qk4l9J55l85K71j26%J57N7l37J67N8j43K13j51L16l61J93K01
$$ y = [-125, -403, 112, -70, 232, -18, -213, 103, -169, 21, -183, 176, 71, -59, 28, -20, 28, -276, -9, -210, 257, 98, -72, -72, -64, -36, -17, 69, 189, 139, 365, 44, -63, 71, -17, 49, 217, 25, -39, 257, 78, -114, 79, 296, 64, 140, -20, 30, -103, 46, -20, -109, -77, -141, 92, 15, -48, 46, -8, -160, 8, -71, -83, -226, 44, -239, -148, 11, -18, 1, -236, -47, -8, 4, -19, -99, -139, -28, -9, -96, -86, -124, 3, -209, -163, 114, -138, -180, 186, -199, -198, 180, 85, 191, 3, -10, -95, 84, -31, -32, 63, 246, -119, -116, -202, 25, 127, 113, 262, -191, 158, 207, 24, 31, 240, 268, -26, 30, 153, -209, 61, 209, 169, -182, 113, 234, -52, -138, 157, -117, 152, 14, 174, 108, 15, 109, -82, 49, 4, 136, -104, -114, -104, 33, -67, -298, 148, -260, -236, -164, -275, 46, 41, 78, -314, -111, 117, 51, -74, 13, 84, -102, -71, 172, -66, 198, 22, -244, -78, -10, 55, 63, 39, 0, 155, -230, 41, -85, -85, 72, 129, -208, -41, 17, -126, 87, -64, 252, -109, 84, 285]
3325B85l88K99M8n15L46j49J99j34R7p9N9j4J09j71k68K61k04mL36j27qL4M7l5
3349B4K39m50J57Rj02Q5n7J11p3O3n9J27J27N2k83MM3J10k20J38O6j17m7j13J54
3374a2j35RL55j23n2k37J30j25K69j28p1J29o6l6K49m2k47K63o2J07k96J94j26
3397e3n9K11J11j07n0L0j51J60k17K65Q9j45O5k78J01K41j98j26k5J75Q7q4k11
3420a69N4J32KPJ31k53R9k86O2L41j80K0J0r0L61k93K18j62L13k28k30L30l1m32
3444b74L19p4k47K55j49K23M0J8j09m17M50J48j88m2L2j39K47o4q5K79k53m3J62
3467H9k40K56k30J40J34j8R2j32N6j05k20pJ77N9L2Rp2k25K20j08J86nL2P2j02
3492I0Q8j41j34m9J53M4m8J10j55l18L00K13j87q3N1J98l81K36J13k34Q3k8k07
$$ y = [285, -103, 196, 244, -271, 75, -74, 125, -9, 88, 9, 68, 54, 163, -8, -276, -15, -219, -223, 113, -14, -22, 12, 59, 24, 263, -187, -30, -21, -123, -38, -95, 16, -57, 6, -53, 74, 201, 253, -30, -26, 17, 127, -93, 45, 111, -6, -53, -166, -12, -147, -138, 217, 94, 42, -195, -65, -190, 79, -49, -120, 9, -57, -93, 156, 114, -133, 130, 68, 175, -121, 73, -53, -112, 99, 210, 103, 53, 83, -68, 92, -125, 140, 229, 84, 149, -129, -28, 213, 15, -111, -136, 39, 126, 42, -169, -115, 17, 19, 26, 157, -96, 3, -283, -221, 120, -60, -40, -30, -120, 241, -52, 166, 4, 317, 89, -141, 189, 158, -274, 45, -29, -276, -21, -170, 53, 93, 111, 2, -415, 35, 183, -5, -47, -15, -154, 93, 29, -56, 223, -30, -73, 89, -151, 105, -125, 15, 149, 131, 223, 91, 147, 42, -178, -185, -8, 51, 83, 92, 20, -205, 15, -93, 93, 88, 120, 192, 90, 178, 37, -97, -146, 7, 51, 3, 113, -42, -360, -60, 153, -34, -117, -66, 132, -249, -13, 100, -134, -51, -79, -286]
3515b86J69J02j41J39J67k1j44j0l8J83j41O2p3J49j21M0K03l54k4O7J64O2j91
3538c7J28Q1j88n8k6L7j95M7L73o3j93J06L95l72j20R8r2L3M6J94m53L43l6N4
3562A02k48Q1J29J7J38l21M4k35J84R1j35J35m3Mo9q5p4M32j69k27K27l7K29k71
3586a01J20J07q6L5j06J3j55J86L9k14K3K26k86K24Q2j68K34j37J01j82j83J08
3608a20J89k64L6K74K05m05J82n2q5j58M55n2j39J33m61M22J17l33J24j71O8Q9
3630E4o5J46K5Q0o5m32L12J1j87m3J74k05Q7j03M3J40j37J96l7J25kj13j05J66
3654F5p3j14K79j85K7j72J18J48n0J63m6k98k13L93m0p6J31q2j1L10m64J99P6
3677H5j30J53j95J49k5k44L08P8j9j10k45p1L69j09K70l93J61j85L28q4j28L5
$$ y = [-286, -117, -15, -156, -17, 150, 129, -15, -25, -63, 120, -21, 41, -32, 117, -4, 36, 239, -115, -139, -72, 92, 154, -37, 91, 172, -16, -74, -100, -63, -258, -211, 162, 99, -94, 12, 407, 35, -85, 13, -79, -46, 0, 194, -259, 84, 48, 102, -146, -65, 64, 81, 219, -102, -58, -293, -109, -18, -153, -18, -61, -57, -126, -211, -285, 147, -22, -249, -22, -59, 170, -101, 19, 126, 40, 75, -31, -18, -173, 13, 52, -162, -139, 87, -199, 25, 107, -61, 173, 36, 137, -45, -228, -120, 69, -195, -159, 115, 320, -85, 97, 45, -40, -198, 257, 205, 66, 199, -262, 160, 277, -56, 68, -103, -35, 54, -11, 135, 160, 240, 175, -257, 55, 66, -121, -164, 10, -195, -108, -211, -168, -28, -165, 31, -6, 119, 117, 4, -101, 65, -8, -122, 157, -28, -1, -173, -55, 93, 43, 206, 160, -138, -351, 42, 2, -74, 57, -25, -36, 274, -190, 9, 85, -45, 108, -87, 62, 37, -207, 101, 179, 160, 50, -195, -266, 103, -6, 264, -129, 32, -153, 175, 91, -37, -2]
3699bm4K79j67j90J82r2j22J58j21R7n8j14L0K83p2O2k49L21q0l2j13MJ63j71
3723d8M2J42j33j48J49K3j21K2j19L46j50j45L3J70j17K20k56l7L05j57K9k14
3745a64M03m78K17j48L54k16q1L42j40J89l61K09J4J32n68M45k77j13J37J81J09
3766A86%O9J56l37j85J30J4k04K62R8n4k3K26k97K50k50M5J16k93j6j7K78j18
3789C6j00L16j07r0K0m21K48L03M4k28n4lj02j79L94n7j06k55L83j99L14k47j20
3812b10M01m61K71j8pM1p6J99k43R9N4Om0j00P2J45k64J81J22j22rl7N5n4k15
3837b10K18K86j28J7l2o0P2l17J54q8J10j31J27K8j75K48q3k57J10k5L08k55j22
3860b05k1N3K67j91K48j2k86J00J00lj78rn4J69N1l29K45R0r7r8J07l0K58k90
$$ y = [-2, -46, 233, 66, -124, 58, -34, -156, 2, -119, -22, -80, -194, -164, 119, 47, 109, -140, 181, 101, 69, -44, -40, 123, -48, -6, 136, 3, -145, 4, 27, -94, -72, -191, 155, 5, -140, -107, 63, -54, 166, -90, -127, 178, 21, 50, -164, 239, -239, -22, -170, 184, -32, -113, 229, 89, 278, -83, 126, 140, 272, -296, 149, -128, -241, -104, 77, 186, 186, 255, 411, 74, -111, 19, 33, -171, 91, 189, 135, 112, 338, 41, 291, 41, 86, 202, -91, -107, -124, 154, 36, -64, 252, 145, 55, 75, -346, -98, 205, 249, 21, -33, -36, -138, -317, 77, 20, -86, -341, 42, -157, 157, -90, -210, 191, -270, 1, -17, -24, 17, -59, 140, -103, -4, 50, 56, 16, -84, -12, 133, -131, 50, 172, 50, 41, 4, 59, 5, -210, 8, 294, 166, 183, 151, 91, 163, -154, 0, -88, 22, -109, 18, 46, -129, 119, 36, -221, -111, -136, 172, -83, -205, -226, -173, 94, -97, 151, 139, -147, -47, 53, 50, -128, -137, -191, -22, 29, -300, -55, 35, -62, -160, -53, -83, 175, -115]
3884a15J1k8R8j54Q1K4o4K09j11K7j74L50j55j8J13m04K02N1J37j44P0J22j22
3907FJ68l1l02o3K85r1j67J9N01l68J8O0J36k47K37j66N8k40J22K85l24L26l57
3930a35J2N8J22j12j05O8J4O4l1J41Q0l77K85j30J77k08N6l1L4K25p9k12Q8O6
3954G0p6p0m7R5N8o3J72k16kO3Qm3J50j82J43j02K83k72p9J21o4j02L25j78p9
3979h7K67l32J03L4J50mk33M8J34J60m09o8M11k45j4j80L33p1J81j79J6n7J75
4002A33k08K84k82J08K19m95J03K33k44J79J96jj89Nj05J04J79k92J49q9J18k9
4024G6l8K08m8l48J54j48K48k87J70k95K64o6R3Qj75R9K55k06p4J04p4m1J74N8
4048A11k53R0pJ91j76rJ20k3Q3n6M6k04J15j06J05n2K04k8k12J47k28j31K65J60
$$ y = [-115, -104, -132, -34, -188, -107, -83, -147, 62, -49, -22, -196, 154, -1, -19, 94, -310, -108, -57, 80, -64, 6, 128, 6, 174, 143, -159, -222, 63, -28, -195, -176, 325, -43, -25, 35, 171, -76, 161, -5, 53, -187, -65, 220, -104, 222, -135, -123, -65, 57, -55, -160, -92, -78, -14, -45, 96, 176, -201, 84, -46, 131, -77, -21, -52, -18, 207, 128, -84, 4, 70, -6, -76, -123, -28, 30, -33, 139, -77, -79, -16, -8, -51, 99, -83, 60, -42, 241, -31, -110, 11, -53, -155, 170, -8, -87, 180, -152, -49, -15, 135, 131, -102, -54, 80, 240, -169, -237, 174, -71, -85, -265, 68, -3, 178, -1, 15, -42, 133, -75, 209, -73, 35, 254, -241, -138, 95, -149, 30, 226, 225, 36, 41, -64, 40, 219, -73, 76, -13, 105, 76, 38, 246, 198, -150, 4, -144, 104, -183, -13, -308, -44, -110, -17, -9, -184, -85, 170, -36, -110, -6, -80, -121, 53, 111, -142, -52, -59, 132, -44, -53, 67, 44, 127, 71, 117, -87, 28, -78, 27, -25, 179, 151, -61, 86, -142, -273, -8, 152]
4072A52k81k6J53P8l6K2j04Kj44J73o2r8jm0K66q3mJ76j21j87l6K48mK8J12n4
4098A29j41J93j49n0l66K56QJ3o3K30R4j15r3R4k45J42J0R0Q4k61n4P6J81k70
4122b07J74mK02k79J18L3j14R3o4M7J38l23K07q1j9K45l6ok00R7R8n6K4l0j9k39
4148b01K38J49k91L58j38j37J40J6oJ4Oj17n7K85n17K73K34k24J9J5q0k16J23
4171a14N1M7j5J43l33L20l6j79M01l03k80K79k9L1j22J50j62R9m2J54o1n4J81
4194A26M2P2k97R2J98j9k36J35j82J97m01L55j00L0N0j65J33j71Q8O9PL3QK56
4218C20l03J24m30M25k8j93m9j62M69l12K07kN2j07J70n0j09q6J74j79K20M2k24
4241c1J75k79J10k45N23k88J69j65K40j85o6O8o8p9Q8p3P0K8j37P0J03o3r4K70
$$ y = [152, -129, -155, -2, 76, 40, 62, -42, -40, -184, -11, -73, -171, -172, -212, 54, -29, -33, 143, 22, -165, -201, 47, 43, 71, 183, 129, -12, 181, 32, -18, -384, -128, -120, -107, -170, 60, 154, 39, -54, 40, -205, -63, -53, 37, 121, -140, -194, -118, 63, -207, -33, -37, 165, -114, 4, 37, -77, 16, -48, -1, 137, -186, 21, -60, -79, 166, 130, 124, -76, 21, 119, 63, 87, 57, 38, -201, 37, 186, -105, 253, 115, -22, 118, 134, 128, 142, 148, 31, -26, 259, -258, 15, 249, 25, 44, 59, -21, -237, -114, -63, -16, -31, 112, -221, 99, 63, -116, 285, -18, -298, -19, -48, -17, -139, 11, -151, -52, -94, 60, -1, -55, 126, 168, 240, -57, 35, 233, 214, -22, 113, -69, 128, -273, 82, -18, 12, 62, -103, 30, -141, -53, 16, 23, 56, 64, 320, 17, 141, -289, 136, 108, -85, -134, -296, 173, -139, 68, 66, 118, 11, 181, 131, 22, -64, 110, -69, 151, 193, -31, 144, -135, -25, -270, 253, -35, 134, -31, 209, 24, -42, 26, -42, -121, -33, -106, -36, -8, -145, -75, 28, -35, -129, 141]
4265A41k97J78n2Q8k0j15OK6K03k91J98j14K98l49RK03j15L79k95j96J83l7L1
4288F2j5k5k9K20j96r0J63m54K59J70rJ6J8M2j48l2R8j71k8K68L0k56K07j44J42
4313I8j11P4k95k1K85Pk63K04N9m9j23K30l2J5j91L8K57k43k7k6P5q5k8K19O3
4338A30M5j16j27K37j24j02M4J83j32j22K02p4l09M3L90m55J67R9p9K34r0j2m3
4361a1j24J17J35P8k37J51j25k9J58j20k7N2q2N2J8J58k64R8L53m19j07K60j2
4384G3K1j20J33M5k88K65j18m8O2J7K7j65J27j57p0K08J33j64O4q0Q3j5j29J25
4408B9j79J90j08J2K31m16K74N6n7R2m25J87N0J36O5M3k56R3j82R6L1rO7j07j64
4433b51j0J43O6O0q3L9j01J05M2J36k47J09Q0j34J30J08j21P4J7k74J74qj88J20
$$ y = [141, -156, 22, -30, 58, 38, -77, -71, -45, 158, -133, 65, -49, 249, -100, -91, 112, -3, 376, 81, -115, 68, 31, 62, 47, 22, -7, 213, 17, -73, 90, -364, -105, 65, 56, 72, 90, 132, -16, -48, 50, -121, -149, 119, 149, -107, 100, -44, 98, -13, 61, -234, -255, 30, 37, -226, -22, 37, -12, -135, 95, 63, 78, -113, -75, 182, -61, -88, -114, -39, -124, -152, 67, 130, 175, 59, -68, 169, 45, -57, -13, 170, 38, -84, 118, 44, -265, -222, 168, -287, -120, -21, -100, 134, 44, 32, -11, -135, -18, 117, 195, -42, 109, -16, -45, 113, -7, -34, 18, -64, -12, 6, 164, -100, -2, 351, -68, -175, 85, 73, 94, -26, 107, 152, -136, 129, 11, -37, 25, 42, 69, -96, 31, -126, -196, 12, 145, -19, 45, -35, 48, 33, -96, 29, -150, 40, -68, -56, 175, -241, 33, 89, 32, 124, -301, -114, -64, 72, 137, 180, -76, 17, -165, -69, -38, -47, 20, -87, -251, -261, -118, -52, 8, -75, -36, -137, -32, 10, 146, -101, 8, 88, -46, 84, 192, 71, 145, 162, -112, 62, 54, -134, -14]
4457a4J04Qk28o5L98q6J75l87Q2j93K48o4m9K90m00L46k99K65j58L3j49j15L28
4480G0k61N0K91k48l4n7L59m2r8j05P0j02j6j7O7L7K74k50M1j30K13m8J77k64
4504b3K09j91J23q8k93K60k17l6J45J36J04k68qp5J15J52p0mlO1J00j08J27p1
4528G7k24K10N7k07M4J00L7j21J23k76J98K43j96j1r8j98M65k02k58K01l1J56
4550H9r1j70K12Jk60P8m1L44j88Q3j88P3K7M6j31J67K24m04L78k22r5j87K37l4
4574e2R0J56k28J40j02j05J77L7l1P9k61J08j00J31j87K26R7M9j39k40J06J8J52
4597A21j35M3q5J13m0l0k35L46k4L5j53J87j21j39L96k56j7Q8n9K8K7j12L18l06
4621a0J34k46K39j93l2q8K0j94L67ok10M01l49M25k91P1j78K89j2k71L8L6k6K76
$$ y = [-14, 90, 98, -130, -195, 203, 117, 292, -95, -13, -206, 42, -22, -71, 219, -181, 165, -134, 131, -27, 6, -143, -258, 70, -191, -141, 150, -98, -132, -189, 170, 128, 30, -75, -5, -107, -123, -140, -73, -36, 238, -12, 29, -101, 112, 64, 241, -23, 186, -5, 118, 30, -263, -3, -220, -256, -111, 25, 129, -139, -147, -222, -107, 45, -25, -29, -32, 29, 129, 21, 148, 77, -147, 63, 120, -87, -43, 57, 94, -27, 96, -180, 18, 261, 65, 54, -44, -242, 223, 21, -237, -36, -67, 89, -2, -172, 40, 41, -219, -141, -182, 162, -26, 57, -131, -58, -31, 15, -116, 51, 275, -129, 249, 27, -68, -255, -18, -52, 38, 194, -34, 106, 4, -101, 76, 113, 82, 161, -100, 8, -92, 39, -148, 78, 175, 224, 85, -155, -49, -31, 121, -14, 29, -56, 57, 17, -13, -248, 98, 74, 109, -44, 143, 22, -117, 279, 23, 6, 94, 35, 63, 90, -22, 296, -10, 124, -122, 117, -76, -108, -196, -176, -370, -3, -9, -219, 182, -167, 258, -33, 38, -140, 149, 137, -134, -96, -60, -86, 190]
4645A90k01j0J50k4j63P9M6J95n45M72j20j96P5k3M4J5J18j03j04K55j40j11K4
4668g7J24j67J70L6j77K62j08K3R9k98L24j97J89j05j38qk44L16J44j48j49K35
4690A06k26K95k36K59l34L6n5L88j29l26J69L9k33Q7M73j73k99L30j77J3k50J52
4712i1R3p5M5j5J38jL4k6j61MM07l59p9lK23j05j91k3L20n04N11M4l30R1J2J55
4738A14l3k32L23j04j98L98k79o9PJ11J24k24K0J49J56l45q6K17k25L74j52J95
4760B41j65r3j63L57l70J57J35N1j03r0j3Q4j2l1M7q3j01M10k64m3K54j07rk00
4784a11J95j12l9P6j59K19L1k46K1J79J18p0k44J5K40l0m4j90O2J58O4p1J89l42
4808i1Q0M4j27r0J21J66k38K80l13K00j09K56j10J88j01n9j35p8k3J25j22K51
$$ y = [190, -11, -21, 129, 105, -58, 21, 67, 262, -283, 189, 69, -127, -52, -75, -31, -16, 102, -1, -105, 150, 10, -101, -77, 47, -120, 50, 86, -91, 171, 63, 86, 185, -113, 211, 14, 203, 98, -40, -48, -292, 24, 168, 20, -129, 106, -120, 175, -61, 198, -136, -100, -155, 233, 104, -222, -53, -14, -247, -160, 313, 140, -159, 171, -6, 7, -243, -91, 2, -73, -28, -43, 95, 94, 128, 102, -59, -55, 352, -7, -86, -89, 134, 29, -162, -185, 135, -369, 142, 186, -144, -53, -41, 114, 81, -151, 172, 68, -130, 268, -11, -80, -73, 38, 162, -62, -42, 107, 263, -82, -168, 49, -176, 198, 46, 241, 76, -17, -180, 177, -193, -36, 99, 150, 47, -43, -56, 28, 16, -15, 32, -51, -152, 258, -6, -49, 205, 98, 89, -111, 84, -28, -67, 9, -150, 69, 100, -146, -125, 54, 172, 102, -142, -127, 113, 83, 39, -151, -89, 69, 133, 62, 251, -91, -11, 33, -94, -184, -63, 103, -135, 145, -168, 32, -77, 179, 69, 257, 156, 97, -38, -116, -139, -14, -136, 115]
4830A15J79j32o9j52J32j35j5k06K31K0MP6rO6j93J70l03M45l77J62J09k35NQ4
4854b8J42l86L30j32K18r6n0j00M7N3l4N5J24Q5k03k93M26j35M5j38K59j12rj6
4878E2L9m5R8l08J98J5q1K8J04n7J29j14m8P4j83J95j67J51q7L5j49K15l4o1q5
4903h6o0J25r9M5J91j52MJ05j03J27k57J47J96j6m18O5L18k78nl7K51k19J86k70
4927b40K09k13K52p6j7J86j48M7k43L98k53J62q4j64Q1K61k6J8j33j27J05J88
4949A83j86J04k23k5n7L81k92K40j33K9m4j2M7l8K19j90J95j34P2j73m1j01NJ79
4973El3L17j16l66M0L25j49K20n6j05k34L13k27n3J36j05J28q6J17j52J11J01
4995A31l41K32p0m7j08j8K97R3l0L9l24NO4L8j53J16J20K7k14N8K3J86J08L3l47
$$ y = [115, 294, 162, 93, -59, 73, -62, -77, -283, -52, -32, -28, 48, 39, 105, -88, 82, -221, 224, -153, 9, 118, -117, -112, -28, 114, -272, 58, -74, 144, 48, -2, -102, -55, -2, -36, 19, 143, 228, 25, -268, 158, 23, 68, -70, 189, 77, 68, 52, 91, 46, 144, -164, 34, 49, -32, -4, 100, 43, 172, 58, 10, 84, -99, 96, -71, 80, -7, 28, -121, 94, 60, -1, -86, -146, -21, -120, -75, 116, -36, -32, 73, -30, 97, -160, -13, 183, 167, -251, -186, 132, -146, -151, -188, 63, -156, 30, -240, -31, -244, 8, -68, -85, 101, -47, 0, -243, 155, -98, 64, -20, -184, -103, 158, 132, 150, 17, -110, -5, 183, -3, 101, -122, -147, -204, 177, -115, 125, -8, 21, -23, -35, 12, -26, 193, 3, 198, 64, 136, -37, -78, -179, -174, 5, -28, 289, 173, -193, -153, 172, 23, 243, 187, 82, -152, 161, -66, -119, 17, -88, 40, -46, 71, -81, 30, 131, -210, 22, -48, -95, -203, -221, 76, 169, 139, 178, -146, -141, -77, -39, -192, -76, 44, 71, -143, -85, -62, 124, 232, 265, -82]
5020h2j3N5J45J54j26k01O1j08M9Q3r3j45J71Q4J75j90m8KJ39j86k8rJ58J14k15
5045e4K26k12J09l06J19K17k19L9O6J1q5J23j22j8M0R6m3k9OJ54j77K4J03k98
5069b30J76K00r9J41k23q6j34K62m0P5j36j04n8L59l24K33J09O2l97O9J17j08
5091a36J06J07j13k8k4l9rN0o1o6M40j08j13n4J31J52m2r6l1p1j67K52lQ5j76
5116a4K17j65k18J37p3J98j71J95j21M6j6J17k17K1J99q0Q9l9j68J60k43L71j48
5139G7Ok75J96o6K13j87L26k5k50j65L3j40N11k69J56k66O3Q2k96P4K44k53K36
5162B5k18J98K0j63Q0j48M1j53N58m95Q6L41j54J17l4j38Q3n2J52k7l00L17o7
5185F9R9k74l7J31m0J0j51R4J31k3o1K0O6L6o4l68L21p7L74o3m43M95L4k11L8
$$ y = [-82, -95, -40, 105, 259, 133, -68, -7, -115, -66, 17, -76, -221, -50, 34, 209, 19, -29, -27, 112, -74, -102, -111, 47, 161, -54, 172, -40, 69, -237, -118, 99, -120, -81, -15, -4, -89, 34, -88, -106, -66, 30, -13, -42, -36, 118, -59, -35, 68, -230, -54, 146, 47, 188, -35, -121, -255, 7, -33, 42, -94, -198, -256, 103, -221, 12, 121, 183, -214, -145, -28, -136, -30, 77, -36, -64, -88, -127, -136, -86, -147, -213, 227, 119, 6, -48, 83, 235, 193, 97, 66, -5, -172, 80, 77, 162, -14, 203, 38, -180, -43, -116, 82, -89, 106, -15, 31, 15, 132, -85, -64, 135, 55, 144, 105, -63, 97, -146, 225, 77, 83, -192, 4, -62, 151, -36, 290, 265, 15, -150, -117, -257, 254, -15, 141, -125, -62, 20, -276, -202, 42, -211, 25, -193, 5, 25, -138, -58, -206, -165, -318, 240, -255, -169, 172, 18, 135, 101, -37, 46, -6, 146, 119, -181, 136, 69, 168, -106, -143, -12, -52, -42, -193, -99, 32, 9, -52, -32, 34, 70, 6, -362, -41, -118, 256, 193, -250, 245, 279, 68, 106]
5210A06o22O09j66L8J3k42K86j12J50j25J94j64N6J9K74m26K85n9l90K67q2J29
5232C8L7M2l66J76L6j55K40j05j11J74N0j31j65K97n8o7N5m6J57k5q9J3R8N8j46
5257Gn4L21j30r9j88J86L7r5K62m8j41l0k89j1L13J51k54n5J16j8l9K16k51j4
5281a07K88r4q1Lp1j91K30K3K10k88M2l8J78jJ44l6j21k11K45o9j1o8q9L4R3J84
5307A98k74j4O2O6M0l20K50M75n05p9J64j67j65J56j98J62K36q3k03M68l10m6
5329h7n9K09O9j90P4N4J6p1j09L32l62J54m3Q2N2k38K09n8m0r7N9j4J96o0l8J08
5355A48j41j8K5j18J8J27r4K2k10m8J40J22K90l70p2J40J00l1N9o1l5J62r6l37
5379b78L30Q7k40O9j68Q0J73q9K84l23k5J78k43K46j15L91m31p6J92Qp0j86M84
$$ y = [106, -516, 93, -73, -35, -22, -264, 22, -90, 60, -65, 129, -35, 21, 40, 314, -112, 173, 114, -276, -9, -91, 38, 75, 117, -249, -73, -37, -192, 48, -57, -168, 6, 56, -75, -240, 57, -1, -68, -13, -59, 98, 73, -16, -3, 95, 153, 7, -47, 274, 144, 45, -143, 43, 80, -15, 247, 199, 58, 28, -261, -272, 41, 192, -62, -117, -1, -19, -58, 158, -93, -107, 181, 87, 6, 9, -62, -253, -23, 0, 210, -78, -36, -74, 104, 103, 247, 211, 90, -121, 124, 55, 44, -24, -113, -79, 14, 198, -76, -90, -28, 38, 78, -242, 8, 483, -22, -101, 63, -104, -269, -113, -311, -149, 87, 4, -199, 269, -41, -87, -146, 63, 132, -58, 16, 70, 86, 15, -94, 238, -124, 30, -13, 69, 121, -117, 92, 34, -6, -103, -44, -58, 138, 78, 40, 148, 7, -11, 14, -104, -86, 41, -53, -31, -241, -289, -149, -27, 263, -107, -179, -39, 61, 30, 89, 28, -7, 155, 59, -278, 52, 139, -101, -32, -200, -120, 53, -36, 248, -75, -100, 78, -165, 81, -34, 357, -74, -150, 42, 50, -20, -206, 278]
5402B78m8k04j97K75j33J35n8o3l6p4J70J40k07K48q6j53O5j93J54Q6l28N5J5
5425a59L1j26K94J10j52nl4p6K93Jk85Q9J3q7J44l07M19k2l74L87k15J92k03j93
5449b65K57J50q8Rk7k28J71J60o7p6L2j49K8M6J18N1Ll08K58q5Q9o4p3J9J55j42
5475b6R0K6L6j10j03Q9r9R8J8j56L06j57p9j59J57j02K16l11N17k66P4M6k54M09
5499B60l72mn2O2Qo0J42K1l2L16j65k57L00l29o4K37J91Ml08P2J21J09l68M00
5523B32j28l38L52J23k73n5m5j03K42j00K63j95J56o3mj65m5j7L47k91lPq8L01
5547A10J01k16m3K25j95O2m7O5k1j04l1J28M4l83K41l4J99k30N9J84j27J94j55
5570B6k5L4L5K7j9o5Rj8k9p0j25L00J33k48J65k39J15r5J74mm6r9N5p6O9l5r8
$$ y = [278, 230, 26, -171, 104, -29, 106, 48, -15, -51, -125, 45, 185, -22, 226, 140, -13, 52, -141, 13, 99, -229, -174, -159, -128, -254, 40, 150, -2, -7, -41, -117, 176, 177, -108, -19, -6, -93, 51, -256, 163, 141, -233, 154, -61, 131, -72, -265, -8, 142, 54, 63, 36, -192, -21, 139, 72, -4, 28, -121, -93, -47, 71, 122, 125, -183, 75, -10, 79, 15, -58, -39, 116, -26, 64, 90, 126, 16, -87, 2, -97, 1, 19, -137, 169, 12, -67, -226, -69, -171, 45, -266, 251, -15, 59, 105, -149, 260, -112, -116, -168, -106, -98, -158, -16, 5, -27, 289, 124, -133, 167, -162, -226, 11, 202, 206, -102, -30, 91, 200, -168, 232, 104, -234, 118, 241, -32, -87, -132, -235, 7, -93, 170, -25, 131, 68, 64, -101, -146, -163, 184, -107, -110, -103, -191, 110, 211, -5, -48, 177, -18, 44, -3, 62, 41, -63, -94, 34, 78, -305, -64, -98, 101, -129, -70, 114, -13, 181, 26, 1, 35, 70, 97, 78, 13, 22, 4, -25, -95, -220, 80, 213, -35, 130, -109, 6, -89, 85, 81, 35, -64, -9, -85, -16, -51, -149]
5597a49K62j07l9J31J8j65J51K8k69j66K62J8n2Q8m1M7j8m6K8k9m0j47K10j52
5621a77P6J47L2J46k85QJ0l5r5L11j73N6m2J62j0n5J7k4qj00N5j27J47j28mK33
5647A37k9k06q2m8J52l2M3L16k38m3J90m6k1Mk70K22l6j01P4q7K19k58O8M04n45
5672b13K33j70JL68m22J91lJ8j36N4J48L2K77l86j27K41j89j18L13M5l94R0J91
5695D4j64K69k28p7J62Ql77L70PO6l78L54M5m67L72P5n1J49k62K49pJ17k22K0
5719G4k7l5K03j95j65R9J02N6l6j75j14L34j31L0J50k97K58J42m26J91k7j76K41
5742G6j76J73k18nOj65K95j00K52k05q5K48k17R3r5J51M0J1j36J62k35k6L03J02
5766B49l60JP9q1m7K60j93o7L32o9Rj56J05j09m6R3j67L3L47k35K9k7j78J39J94
$$ y = [-149, 113, 6, -33, 98, 116, -49, 102, 130, -139, -305, -43, -25, -77, 11, -30, 17, -1, -47, -19, -48, -88, -235, -25, -177, -101, 46, 78, 224, -61, -53, -43, -78, -173, 138, -35, 21, -21, 141, 131, 76, 93, 69, 61, -39, 16, -111, 36, -92, -96, 137, 108, -98, -180, -228, -76, -108, -65, 251, 13, -30, 160, 114, 93, 97, -173, 49, 13, -88, -14, -101, 118, -140, -72, 332, -213, 20, -150, -149, 219, -203, -12, -15, 3, -133, -79, 69, 101, 378, -8, -135, 106, -83, -201, 112, 157, -237, -147, 44, -120, 149, -79, -156, 6, 14, -363, 7, 14, 80, -298, 56, 101, -366, 6, 81, 30, 179, -83, 166, 159, 276, 54, 74, 47, 12, 215, 20, -145, -46, 56, 112, 76, -99, -213, 121, -10, 20, 170, -127, 131, 273, -153, 38, 11, -165, 76, -100, 73, -145, -150, -144, -309, -14, -114, 138, -67, -152, 96, -121, -28, -123, 28, 68, 79, -57, 105, -130, -156, 147, 249, -111, -110, -31, -112, -159, 101, -92, -159, 173, 104, 113, -43, 62, -47, -93, 0, -167, -134, 213, -22, 7, -20, -198, -59, 135]
5791A35j82k79L07l41K39J99k24J99k02q7L31P2l1j08R4j55J7J14j42p4mJ73j95
5814a44K21k47J98r6J35k65K46k9k66M24k5k00K58m8j38J40k44j87M39l7r6J72
5836B11L2m03P6K11j47j51J06K02r1j70J75o6R8k0j13qJ36k18MQ5R9j81J76m5
5860bj00o3J14J61q1k30J44J39j52R0m0R5l6L57m66P1l2R9j86m2L63n3k05P8J53
5885A76o6k59L10k88J74R3j55K26m88K23J10k4J46j75k18L18l60N04k53p2n7j08
5907b43q3J95K14J48j79L7l04N9K43K34o28M19j42J51l1n5j35Q9K9J44q5k67J92
5930BP9k9l1J26j65q7K82n4j2q6r8O0J57k25J94k15J99J04k2k35n5J41M9o4n2
5955c7Qo1K01q5l0K9P4k33L6N38m13j77jK28l86M20j74L36k46l53K38K02k3j31
$$ y = [135, -47, -326, -19, -360, -121, 78, -146, 53, -149, -236, 95, 167, 136, 28, 122, -33, -16, 98, -44, -118, -122, 51, -144, 77, -170, 28, -68, 67, -198, 48, 19, -247, 177, 152, -48, 210, 162, 24, 164, -80, -267, 172, 135, 39, 211, 243, -160, -84, 127, -20, -171, -65, 137, 46, -124, 51, -15, 83, 63, -50, -58, 78, -140, -136, -51, 48, -133, 43, -2, -102, -165, -51, 110, 29, -201, -57, 82, -70, 20, -20, 75, 39, 396, -70, 1, -31, 68, -118, -160, 203, 150, -55, 23, 176, 110, -149, 161, -127, 47, 140, -15, 211, -277, -54, 56, 32, 178, 3, -215, 103, -257, 247, -6, -78, -135, -243, -326, -131, 83, 231, 52, 89, -215, -156, 87, 321, -307, 112, -30, 121, 90, 35, -100, -11, 18, 162, 77, -190, 2, 81, 52, 21, 147, -18, -105, 177, 123, 111, 25, -73, -13, 144, -81, 113, -102, 97, 201, 179, -56, -111, 30, 79, 15, -37, -29, -90, 111, 26, -4, 25, 99, -134, -98, 440, 27, -150, -151, 77, -309, 111, -63, 273, 27, -326, -88, 114, 91, -40]
5979d0K02j90m3k1P6l7R6o5N1l0J5j09j12K42k72K95q0j90L68j91J10l5j3k05
6003a78L76j54j49q7K77q3q7J41j58J17k32L30l14K82j79J95o9k02J16m7j13l6
6025b54M02N5n0j96j01O8J10N9J32j21j12J6J65j28k33M47k96k34L25n3J33k17
6047h3k3J29o3j20J49J47l52N7J35K8K3n5J22l53J51K40k86M82k22r4P5M9q9L6
6071H3J1J34l85J22o2K44k02M4J78k27Q0j92L21l64K19qJ89j24r2j68R4J9K01
6094A15J2L01l56j35J22p0Mm6P9r1J56j18J17j24j93M0R5j2J89k7j91J31j8K99
6118B79k30j25m0j1J71l4l3j28K98l04o4Q7O3q4m1K43j79J49k8R9L8j56m5L4K0
6143b1J9Q4K10j59q9k4K33k30m6o0K07j02j12O8J32j91o0K53k90K85o9m3j33J44
$$ y = [-40, 162, -28, -71, -92, -16, -53, 43, -22, 29, -1, 14, -95, -207, 35, -237, 58, -22, -212, 156, -35, 75, 40, 27, -178, 198, 44, -105, -192, 85, 2, -85, 56, -102, 15, -217, 113, -201, 81, -98, 97, 28, -174, -58, -105, -218, -254, 148, 203, 153, -43, -144, -76, 34, 93, 225, 104, -8, 8, 173, 45, -188, 259, -37, -271, 54, 1, 134, -83, -106, 23, -40, -160, -11, 136, -216, -159, -24, 4, 27, -28, 94, -259, -108, 132, -154, 328, 106, 12, 87, 136, 47, 83, 94, 228, -157, -35, -97, 147, -55, -11, 167, -60, 20, -172, 149, -215, 4, -4, 185, 61, -31, -199, -105, -86, 115, 127, 428, 72, -63, 59, -11, -7, -53, 26, -65, 91, -27, 90, -34, -227, -187, -92, -104, 85, 58, -133, -2, -20, 279, 49, -76, -116, -127, 44, 10, -23, -151, 147, -157, -221, -134, -71, -155, -196, 47, -132, 17, -11, 88, 126, -30, -75, -41, -21, -2, 82, 292, 133, 44, 20, 253, 23, -23, -83, 124, 22, -90, -22, 110, -81, -141, 112, -178, 107, 38, -5, -138, 6]
6167FL61n10K64k02K20j70J47k01J93j92J1J17L8k47r3M89j83j55J21M0l7n1K27
6190A93k37p3J84q0J85j48j13o3K44j04j27K18k1j25j13K58m03J35L34kj61r9
6212a18N3M2J01k39j83L61J50k02O6j63L3M6m3Q4K43l10P6n5m0M0J78K3L4j68
6236Il8j65J95l0l1J63j93K00K70m37n2m1L02l59K50k75J81n2J77N7j31J78o2
6259A16K4j73o4J57%j55J39l48J71J51q3P7rJ75j67J26q1K63l98J61o4k78J80
6282h0Q0j13J97j49O4J75j21n8K28m2k98J39Qpj56K5L5K28k45N0J07mj00j17Q6
6307f8K16k48K09K8k44L2j88N14k82ok5j20K71q5j01J56r0p2j7R1Oq7K19j19J31
6332A21j49n2J71N4j43o3k84L11J71j81n2J41l9j68L14j15J70k46J59JK5k53N7
$$ y = [6, 367, -143, 121, -81, 139, -31, 116, -85, 108, -84, -73, 44, 82, -165, -258, 231, 48, -107, 14, 54, 17, -34, 193, -44, -117, 67, -13, 172, 24, -89, -152, 92, -12, -139, 79, 58, -67, -180, 78, -325, -190, 144, 142, -19, -118, -65, -23, 78, -161, -344, 17, 167, -35, 31, -132, -99, -53, -96, -12, 231, -79, -3, -58, -98, -58, 120, 143, 177, 9, -29, -194, 1, -29, -60, 103, -90, 110, 380, -57, -109, -150, 152, -207, 43, -232, -51, -103, 74, 131, 0, 178, 116, 140, -33, -97, 60, 60, -95, 44, -304, -133, 18, -65, 12, 3, 178, 11, 137, 56, 319, -79, 82, 18, -260, -80, 0, -113, 84, -65, -1, 174, 53, -5, 223, 181, -117, 22, 30, 23, -133, -108, -73, 155, -90, -40, 67, 63, -37, -154, -68, 148, -100, 109, 137, -107, -75, -263, 251, -31, -37, -62, -182, 89, 4, -97, 59, -31, -103, -120, -29, -23, -110, 109, -10, 121, -28, -80, 91, 145, 2, -61, -345, -34, 137, -44, -96, 45, 6, -162, 152, 37, 207, -39, 120, 121, 146, -107, -50]
6355e0J20r7j0j40J85r1Q2O5l66K30K79J47l75j0lJ00l3j56K87l67K52J59n10
6378c02K82J01j13k50K06K43j78J20j34k50Q4k19J76L85l6l59M99r1k17L57k98
6399FJ35k61K37k69j5J98j5J39J26j99j73M7o2L32k87M27m56k53K43K96k64J2
6421e6P5qN9m02M18k44J37J36k9Jj15m9K53k37J46l9l0j34JJ74j14Q9p8j29K68
6446I3k41Q4o0J80J54p1l08Q9K12j87O3J16j02J94l44K7K63%k91J05m4j58K14
6469a2j33O8j28K61N7k84J14o7J56M8o6Or1Q7K01j28j8j08J56k18J89J69k37J46
6493A68j65r6Q6kj4r0J13k22J90j78J58J58N0k34J55j13M35k54k35j81oL41j74
6516a10q0J78K98n64K03R0K61q3l47J42p1L01l28K60k45K20k2k59N05n17O7J90
$$ y = [-50, 70, -27, -37, -177, 8, -83, -1, 64, -302, -72, 207, 354, -21, -31, -34, 66, 33, -123, 164, -203, 49, 208, -302, -20, 81, -32, -282, -76, 167, -11, 109, -25, -275, -191, -410, -234, 151, 115, -244, 255, 164, -53, 304, 6, 141, -120, 117, -152, -167, 31, 16, 155, 281, 82, -91, -44, -106, 226, -61, 366, -90, -343, -100, 196, -68, -56, 19, 11, 70, -332, 86, -158, -21, 115, 86, 87, -28, -77, 176, -61, 85, 46, 16, -118, -117, 57, -57, 32, -46, -175, 93, -148, -64, -124, 56, 210, 139, -169, -80, 132, -55, 8, 124, 22, 216, -128, -101, 162, 162, -129, -24, -68, -226, -12, -145, -77, -205, 56, 113, -171, -57, -124, 32, 80, 14, 20, -71, 16, 217, 89, 71, -37, 119, -99, 90, 259, 22, 168, 3, -93, -7, -9, -23, -113, 0, -222, -32, -210, -52, 106, 156, -78, 77, -36, 399, 145, -90, -271, -277, 64, -110, -190, -12, 286, -278, -75, 15, 276, 193, -154, -12, -83, 218, -110, 150, -95, 125, 103, -156, 349, -168, -101, 89]
6538H9j60m9K91k73o1nJ85Q8K3k03K98l48M09l57N5M1m0L2J63k65K99j80k73M5
6562a96K13o7M3j57O6J19k29J31J47J24k96J21k13P2L80j61q3M5R9j90k53J20
6584a65R8k9P9r7J28R7j76j9J58j01m7j5K07j24n2J93j08k25K70k05K01L6j18
6607a4k07L9J83J56j20r2J33j41j26K50k1K5m1R9j09j60J35n1J24K38n57N12l03
6630d8J92J42m63J56o4J92k43J37J71J07l65K80j47j20Q3J46q8o5j43L30k09L4
6652A5j24R7nJ10j30l1r3k0M22k95J68J50m20N6R8j61L43k93j26K53Q5k30n2J69
6676a4R1j12j20J04J21p3K8J20j80K11k92k0j6K12o3j56J86j15M1P1L5J26l51
6699a66J43R7J08m09K55r6J05Rk40J33j35K18K3l1j45L32j07j25J49n9N4j46j38
$$ y = [89, -71, -120, 171, -102, -163, -168, 17, 105, 128, -75, 223, -125, 284, -73, -18, 23, -17, 15, 178, -87, 212, 32, -241, -196, 17, -50, -7, -164, -98, 21, -208, -77, 70, 194, -102, 19, -194, -122, 258, 97, 14, 59, 158, -32, -285, -165, -67, -96, -17, -114, 14, 111, -65, -84, 74, -27, -74, -89, 118, -6, -58, 135, 27, -198, 72, -133, 68, 104, -14, -221, -182, 1, 157, 37, -55, 78, -63, -189, 61, 40, 65, 24, 123, 14, -146, -11, -62, 62, 300, -257, 255, -48, 144, 286, -177, -21, -85, 107, -136, 1, 172, 279, -86, 194, 47, -73, 10, 156, 68, 3, -140, 190, -19, 15, -109, -12, -17, 93, -37, -68, -161, -181, 241, -54, 114, 264, -156, -100, -2, -163, 180, -113, -239, 14, 99, -131, -183, -14, 77, -35, -155, -51, 70, -3, 25, 145, -35, 176, -116, -136, -152, 60, -3, -159, 27, -88, -47, 24, 59, 185, -166, -23, 74, 182, -227, 28, -68, 37, 46, -194, -61, -196, 22, 45, 14, -131, 201, 94, -31, 118, 59, 113, -33, -171]
6722a71J74l31K37j84L67o8j83K45j19Q5oK3P7k59k0O3n2O6J05n3kK04k39j36
6746a77L81k83j24L70k05j42L57j20k10K79l10K73k5k52K19l3j32j29p7M55k09
6767i4Q3l27M73j15J25k09J45O1l87K83k5m6o8J01j2J02j40OM3J5o8P9j75J75
6791B5o5j2J86P7j88j15K32J2j42R8l9o8N1k2j36O7k27J40K16j24k6L05k66Q3
6815F2O5k62rK06j36K15j37J6j39N11m10R8p4r6p6K64J3k10J12N9j41R3j54m0
6839a70J52m5m7K66j35J7j2k05K98R4m07K26k3O6m0k07J39L9N5l3K64l93L7j21
6863a85J94l04M41m16j5L06J81j90j4J19j11K9joM5j13J40j32J48j26k3Q4k86
6886b35J60p9L69o4q6L4k03O6nP3J5KL52l25K29j42p8m9P8j5j54Q3j72L30l97
$$ y = [-171, 3, -328, -91, -275, 92, 24, -159, 86, -33, 52, 46, 69, 146, -113, -133, -70, -122, -56, 49, -4, -6, 198, -41, -177, 204, -79, -203, 167, -38, -180, 177, 57, -153, 126, -184, 89, 64, -188, 31, -2, -134, -263, -340, 115, -94, -11, -338, 135, 20, 145, -64, 81, 142, -245, 38, 13, -33, -101, 0, -12, 90, -50, -44, -1, 14, -54, 25, -150, 25, -40, -52, 134, 211, 23, -92, 140, 152, 10, 108, 69, 1, 52, 30, -106, -39, -266, -126, 90, -34, -60, 245, -21, 62, 127, -135, -144, 62, -74, 141, 4, 20, -119, 392, -18, 80, 6, -90, -166, 98, 111, -99, 13, 72, -69, 24, -130, -170, -18, -63, -110, 156, 21, 38, 26, -179, 119, 213, -194, 32, 9, 75, 35, -172, -33, 6, 61, 28, 292, -101, -64, -185, 9, -295, 146, -270, -285, 21, 202, 12, -2, 117, 6, 35, 34, 28, 73, -40, 100, -32, 116, -10, -33, 51, -235, -75, -154, 215, 151, 65, 99, -104, -38, -43, 30, 45, 47, 399, 74, 303, 161, 83, 34, 112, 97, -57, 26, -146, 184, -213]
6911b13R6R5K21o9j68O9j79K02l43M76k76R4J42j54J17J00k05J04j0N2k19J18
6933E0j67O6q3R5j08Q1N4k25L74k88J85K77k53k10Q2O5N1J50j10j09J73l13K50
6956H7j07k02J49J48k04J44J60j94P1j33O7n7KJ4J47q0N8j24j35Q9p1K59K12j04
6980A96l53J43J35k32K02k65K07R7k34J48J49J36j91K4j69m4LJ14k6q0K41n4k02
7003e5k20M64j94K26l66K29Kr0J46k01M3P7j41j4K1J95j16J3M6j17J92j17M0K48
7027C11k98j0P5p7n4j10J62P8j6o1m7K80l92R2j68J87L5j86%J61k25R6J31L4J7
7052A5o6nJ75r3J95M5j07j41k8j74J16r1J80j9l51L95K1k2m0o2K37k71P6K0j54
7077a49j04J81O3k02J76l7L8j6j12J29P1j0j0j13J11o6P6m6K54l54O8O2P8N7l72
$$ y = [-213, -117, -22, 199, 130, -38, 31, -148, 54, -289, 187, -89, 5, 147, -7, 110, 210, 5, 109, 99, 151, -68, 50, -117, -51, -134, -39, -147, -66, -12, -237, 137, -151, 34, 311, 58, -152, -70, -5, 46, 196, 86, -23, 150, -163, 87, -20, -222, -73, 75, -129, 15, 175, -19, 52, -81, -14, -71, -69, -55, 92, 12, 70, -54, -189, -100, -171, 88, 300, 196, -157, -14, 121, -111, 91, -174, 33, 130, -104, 44, 193, 329, 138, 162, -7, -51, -48, 66, 40, -40, 201, 147, -55, -275, 189, -5, 221, -145, 84, 86, -4, 142, -59, -16, 61, -80, -94, -73, 122, 6, 19, 65, -52, 140, 23, 63, 311, 13, 3, 78, 1, -53, -163, -1, 77, 61, 0, -47, 233, -159, -67, -235, -48, -13, -199, -199, -38, -263, -167, -36, -2, 15, -51, -56, 119, 26, 221, 266, 159, 18, -10, -184, -68, -159, 21, 2, -349, 46, 67, 45, 5, -57, 180, -91, -15, 5, -149, -253, -72, -9, -211, -35, -72, -34, -50, -162, -33, 38, 28, 18, -95, 16, -50, 26, -20, 234, -120, -52, 10, 88, 145, -227]
7102b27L34j55j31j95M78j83M0J51j43J47J14l56K26j85K3P4q1j64K31Q0k2j17
7124f1O6j63L94j56J6L3j47J65j76L16j62J2J38k37R3k27J78P3j46Q7o1k16K10
7147B9k4j77L83k41K04l36J86p1o8N4Lr3L10j23J27l44K25J3j45K61j33j57K34
7170A17n7Lr8r3K70k29Q4N8n0J22j92N2q7nK79j71k2J75k83J04L8l7j01j53R0
7195a86J07J05l7k2j55L01L6j62K1O4l18K39J13p1k11K68k01J46l1j45L8j21J57
7218f5N6k4l3O4m5J42Qj05n9j99M59o3j12rP0n1n9M8rl4k10L36K4j49M0k7j29
7245a35J22j12J37j13J47j39l5k4K37Q9p6j55m5j0J21l2M29o09K55j89p7L93j43
7268C6Oj01J98k27K11j16J86l30J54L5n0k60K15q1J34K44l26K29kk44J39R5k27
$$ y = [-227, 107, -48, -179, -374, 104, -79, -39, 112, -31, 116, 230, -126, 100, -85, -62, 12, -69, -233, -2, 78, 56, -61, 5, -158, 236, 80, 96, 129, -18, 147, -29, 287, 125, 137, 275, 38, 131, -96, 82, 155, 9, 96, 35, -181, 29, 5, -172, 211, -30, 174, -162, 24, -47, -115, -61, -58, -151, 159, 36, 163, -181, 44, 57, -88, 173, 40, -117, 117, 60, 63, -35, -128, 142, -87, -3, 55, 5, 127, -65, -13, -100, -105, 174, 3, -19, 156, -127, -23, 15, -22, -123, -276, -186, -79, 26, -11, -33, -188, 113, 149, -13, 8, 72, -246, -7, 106, 35, -176, 92, -109, 37, 6, -139, -101, -222, -65, -9, -33, -66, -2, -47, 95, 103, -2, -61, -260, 199, 136, 24, 15, 85, 34, -25, 23, 14, -20, -230, 106, 130, -19, 21, -6, -135, -13, -125, 12, -101, 46, -93, -128, -152, 85, 174, 98, -57, -102, -112, 9, -23, 406, -203, 52, -137, -214, 179, 36, 42, -59, 139, -88, 123, 7, 193, -137, 17, 52, 2, -258, -43, -124, 10, 254, -72, 157, 155, -89, 50, 145, -82]
7291h2J30j3j64M61m12J37k8j9J16k91K95Q9j54L7rj83n1Q1O0J41r2n8j67J15
7315f1J23r3J39l20K30n1j88J47L7J45l53L64P6n9L0k64M4j22J21JK38j22k29
7338a67J87P1M8J11j2k54Q9j07M6j01l00K01L72l97L30j69L63Kk62l7q8N3o2J86
7362A03j90J70L7j63J10j98j8J05J32k20M25k29k24J00N0J11k31L60m82K73j07
7383h6K12j17j22J79j05j34K90r2k68K52K7M0o5L1j39M73l40j67k51K14J8j17
7405b67J75J18j37K4J20l0O2k32K26r2l8L4L40l15j19q5OM31k43n7J36K20j44
7428A33j42Q8L6j40j30K46k80M10l05o6K78j63K40p6j22M6j99OO2N9l6k9p1J49
7452fj0q1J31k13J95J87k12Q9J48l70R1J00l6J10l17J28J57j67j14K34j21R6j80
$$ y = [-82, 48, 35, -129, 332, -80, 57, 29, 10, 126, -165, 130, 219, 65, 102, 93, -90, -141, -60, 0, 141, 49, -9, -176, -61, 62, -31, 108, -212, 18, -33, -221, -74, -37, 108, -245, 119, 195, 136, 166, -98, -54, -176, -55, -54, 184, 62, -167, 20, 91, 139, 250, 238, -16, 73, -34, 12, -89, -389, -188, 184, -213, 117, -52, 311, 313, 51, 14, -74, -21, -83, 103, -87, 83, 120, -43, 67, -131, -149, -44, 88, -132, 293, 64, -160, -60, -10, 101, -130, 230, -252, 21, -86, 126, 9, -113, 66, -39, -173, 117, 25, -243, 9, 36, 76, 11, 42, -97, 376, 36, -131, -382, -168, -150, -267, -92, 26, -111, -87, 33, 3, 65, -167, 59, -33, -71, -37, 303, -12, -131, -216, -210, 221, -22, -79, 57, 277, 133, -9, 79, 115, -25, -155, 91, -189, 221, -84, -150, 128, -35, 205, 129, 7, 53, -146, -140, -78, -19, -55, -84, -155, -6, -16, -97, 34, -179, 16, 203, -9, 80, 228, -142, -51, 49, 13, 123, -194, -66, 91, -76, -190, 44, -77, 19, -161]
7475a61p5M7J64J23j82r9N4J27j88K05j71q2M03m51K93N8J69j0q8j61j46P7K0
7498g4K9j03K46o0K22j70R2j43j08J08j5J7j00o1J41J05j49P4M7k21L3Q8Rk20
7522b13J98lJ37j09k31K95j49j28Q1J75J9k65J71L8j44K9K57k13K59l5k34rK9
7545d5rK7J29j30m8J80j91r8L21J5j50K81m49K40m9M5R3j63J6J60l54K07J16p0
7569G4n9KL2K54l17o1r5J56J50k38Q8R2J22j77J13l31K69n3J99k33J72k89J39
7592Ij39K55k71J96p5Ql22M24l5k48M29k42M7l9k4K55j79L8r8J40l55L34J7j66
7616d1R6j34j05J30J15j35L07m03J55q0l5K77r0j05P0n7L2j72J36J61k79K15j2
7639D6k06P2L5KK71m70L47j53M1o9Q6J97p7p1R0k94L39j13K8k42jM43m09L29j87
$$ y = [-161, -236, -189, -25, 98, -84, -183, -129, -2, -190, 15, -156, -238, 165, -286, 7, 65, 234, 224, 136, -25, -171, -94, -74, -45, -148, 98, 38, 260, 90, 182, 39, -69, 39, 24, 41, -59, -120, 21, 126, -23, 51, 98, -123, -90, -2, 7, -213, -15, -18, 119, 10, -221, 74, -75, -203, -122, 53, 72, -193, -22, 16, -128, -99, 158, -55, 204, 169, -65, -74, -45, -54, -27, 102, -28, -76, 104, -87, -185, 136, 151, 1, 282, -167, 73, 24, 69, 162, -1, 15, 175, -179, 28, 144, 74, 15, 17, 49, 303, -14, -75, -170, -14, 136, -102, -14, 78, 200, 23, 136, -195, 74, 21, 220, -13, 159, -130, 9, -130, 125, -146, 50, -25, -17, -339, 85, 50, -198, 231, -11, 36, -3, -27, 228, 49, 87, -11, 129, -226, 108, 125, -41, 55, -79, -184, -54, 61, -74, 233, -170, -15, -95, -130, 147, 57, -48, 22, -35, -3, -175, -39, 122, -157, 58, 46, -160, -88, -53, -51, 220, -250, 97, -56, -15, -84, 2, 199, 122, 51, 141, -153, 186, 73, 101, -141, -142, 301, -108, 221, 34]
7664C4Mo1r7J24o7J14N5M5p6mn5j05p7K08m9J87k39J24rj43K99j28k53K42j93
7689a20j04r9K87J20l59J65J04j01j09Q5K30j41R7k08J17K24j83p9O9Q6Jn2j04
7712g4K18j77J46k57L61k46M3j03j41K00L7J47j29j28L0j3R2J54m13L08Q8k08
7734f5o1J60N1j39J96q2J85l47J14q6J28j04J20j89K55p1r8Pq6J17k11K26j3j31
7758a24KJ81l8N1j80K03O8j32j21J04K10j47p3l8j57J06o3J45k48M17j87J11r8
7781hp7M5R9j20o8J55k29L05o3L75l92qj2j70M82l42K55l95K2K27k07n4P3oK17
7806A04j27J43j94K01j25lK06k12J14q0K07r4j96J30l50J87K99j54J43j79j7j2
7828iK90k96J01j09J88M8k60j61L15k33K41mk98M07m46L31l40K73P5Q1j33J0j85
$$ y = [34, 38, -23, -120, 4, -63, 51, 106, 151, 75, 71, 16, -89, -166, 42, -7, 180, -59, 65, 56, -87, 212, 84, -169, 73, -120, -224, -323, -36, 84, -275, -110, -6, -107, -216, -131, 99, -42, 55, -153, -36, 188, 5, -74, -5, 81, 82, 30, -74, 144, -33, 113, -144, 217, -29, 14, -89, -230, -30, 7, 154, 25, -103, -73, -86, 6, 160, -253, 55, 143, -65, -126, 34, 85, -54, 142, 60, 245, -102, 12, -74, 54, -50, 70, -119, 136, 65, -33, -26, -112, 5, -206, 20, 7, -124, -122, 59, 21, 72, -108, 95, 163, 31, -90, 14, 224, 77, 4, -34, -191, -85, -148, -3, -251, 166, -21, 90, -8, -85, -40, 59, -61, -129, 26, -203, 102, 39, 414, 22, 14, 2, -168, 314, -28, 227, -168, -146, 81, -126, -180, -107, -113, 104, -23, 120, -74, 127, 2, -1, 205, -7, 107, 27, 234, 140, -56, 74, -276, -89, 210, 56, 199, 20, 3, -9, 281, -15, 86, -23, 165, 213, -47, -208, 107, -126, 115, 111, -187, 220, -226, 105, -235, 38, 113, 194, 61, 71, -114]
7851a14K27m8J58l69j83O7L43K7j92Rl3J80j51Q2K20k15j28J63j24p9K97J8j24
7874C1j25Q4k8P5k58K49n1j1r4K43j6L4j01k7p1O6K33m84J08J52J28M2l01J98
7898G6j4l1k0k6J2P9j97J77p9k75L28k62Q9J28R1j81Q9j15J62J54j39j17j21M3
7922a49P8J46j1J18k58M19j83k20Q3j63J07k77K81R6j87j3R1o3J35j43J00P2j96
7945a37J12k0l6k19K91j18M06k22J80l65k8M14q4k32K43j36P9j51n6p1j46L50
7967E4n9rJ10j73q6NK86k74j13J95J81k11J55j06r3J69p4M1Npk55K88O2J15l06
7992a00J74p3L3j36r8K7J87r7J53oko9K6oj31R7J67Mo4j28p6M0R7j56j70L89p9
8019CK0n1O4K6J59k89k4K39k8j34K19J0nP3l72q8O5j2m1K71j18J78k39j44K42
$$ y = [-114, 113, 65, 223, -146, -329, -262, 81, 108, -84, -75, -108, 72, -79, 3, 223, 8, -120, 43, -81, -160, 137, 155, 31, -94, -10, -38, 37, -221, 28, -23, -34, -128, 115, 99, 133, 32, 5, -66, 0, 233, -251, -143, 9, 137, 179, -122, 76, 62, 31, 11, -15, -3, 76, -121, 56, -23, -298, 30, -232, -143, -15, 76, -105, -16, -131, 31, 185, 46, -71, -192, -149, -71, 75, 64, 182, -76, 343, 160, -60, 23, -140, -33, -310, -29, 67, -120, -133, -42, -105, 30, -113, -13, 59, -137, -25, -45, -81, -300, -9, -127, 279, 57, 237, -128, -156, 258, 174, -58, 185, 49, 128, -23, -79, -150, -296, 54, -5, -14, 96, -77, -163, -158, 128, -146, -259, -64, 117, -94, 61, -45, -138, 31, -43, -2, 3, -4, -259, 29, 91, 206, -100, 74, 1, 34, -102, -200, -173, 14, -83, 70, 64, 62, -7, 19, 13, -118, -21, 146, 150, 86, -42, -118, -78, 19, -137, -307, 82, 3, 23, -28, 36, 62, 221, -68, -92, 147, 119, -15, 204, 214, 209, 282, -90, -178, -113, -125, -166, 105, -13, 165, -74, -218, 24]
8044B4o2K92j89r7M6m9J09j41j32L35K0n8q2j16j0J72j37J96j88M46l85N8Q8j90
8068e0m7K23k95K61M5k8P2k70K54p4q0R6r0n8N8o2J57K5j97K31o4k44J6K33k95
8093a83K8K02r1k0J34r4J28N6l07K2K22Jj96K47k83K44j82q0J06L0J91j77R0k58
8117a70M6L30p0j6r7j26K48j54j02K68j57J78l47K25j7k56L2J67jJ06K06k00l5
8140E8M5j27j5L8l2j8on7R2K93m87K64RM1Mj13m8Q3q6J41k7j73K07L5P3l39M3
8167a02J43j15O9J56O4j35j88l6j7J86K6J73j95J0K20j43r1P4j8j27J12k64j89
8190c87L16
$$ y = [24, -38, 254, 65, -32, 14, -35, 74, -67, -199, 136, 156, 98, 16, -100, -110, 62, -75, 121, -67, 379, -6, 52, 140, -50, -97, 126, -169, 92, 137, 109, 181, -89, 165, 91, 11, 107, 17, -41, 17, -45, 112, 137, -60, 171, 107, -137, -121, 112, -183, -155, 47, -44, -64, 70, -24, 104, 160, -147, -125, 97, 98, -98, 149, -134, 110, -72, -152, -46, -16, 175, -2, 88, -170, -124, 206, 136, 120, 23, -103, 145, -9, -111, 157, 0, 178, -169, 56, 39, -217, -185, -18, -19, 87, 293, 93, 58, 103, -24, -39, -1, -33, -51, -57, -114, -22, 271, -216, 48, 57, 98, 102, -11, -59, 24, -62, 79, 52, -121, 86, 121, 194, -145, -102, 41, -74, -5, 151, 215, 80, -108, -144, -161, 25, 51, 224, 29, 39, 259, 116, 25, 99, 81, -46, 66, -198, -387, -71]
8191g1
$$ Imaginary data points
##PAGE= N=2
##DATA TABLE= (X++(I..I)), XYDATA
0@%%%%%%%%%%%%%Qj6J6j6J6k4L2l2M0m8N6p2Q0q8J04j21J43j66J90k15K40k70
35a43L08l47L88m36M85n39O00o65P38q18R01r95J098j210J333j468J617j782J966
54A031k170K400k661K960l307L715m200M789n523O465p729R523j2276J7077k7807
69a7713R4776j6135j44360N0590j8220J00056O0583l5349m3899r0879K212P0133
81A1795K1997P0398m0574p1535k1758l2500O2365P4750j041j5474o5307m5570
93e2454L328O4251O5593k3198l1592m6146m5997M4873M9369L3292r991n5483k5653
106b9808k5464K9271O9128N700m419m9315n6446K0440K1883N1748L5444n4541
118A3621m0755k7918J354N8880L1247O002k8881n9851q911K1240L2591M5000n323
$$ y = [0, 0, 0, 0, 0, 0, 0, 0, 0, 0, 0, 0, 0, 0, 8, -8, 8, -8, 8, -16, 16, -16, 24, -24, 32, -40, 40, -48, 56, -65, 78, -88, 102, -113, 127, -143, 165, -182, 206, -230, 255, -284, 316, -349, 389, -429, 472, -523, 575, -635, 698, -770, 847, -935, 1031, -1139, 1261, -1400, 1560, -1747, 1968, -2232, 2557, -2966, 3499, -4230, 5293, -6983, 10094, -17713, 77063, 60928, -83432, -32842, -51062, 48994, 109577, 74228, 30329, -60550, -58338, 11795, 33792, 104190, 63616, -7919, -29677, -62177, 188, 74938, 73897, 58423, -6884, -52454, -49126, 15125, 80718, 57520, 25928, -20218, -66215, -21342, 28027, 61319, 51328, -4155, -29808, -55272, -26001, 43127, 48827, 44408, -4907, -61353, -40913, -19030, 32718, 68162, 13621, -27134, -55052, -53698, 5182, 36429, 42431, 13550, -46301, -55212, -33972, -1381, 43619, 38296]
131C8296m2038l6542k1132K8248M8928K1612l894m2769m6441K374K9430M2033
143A8105K3036k3922l5009l2039l57M1245K9591J1596j6087m3091j9998O846L3134
156f950L6227j26k2280l7062k0619K1617L0781K7288j062l2325k6734j0893K1277
169b0861L1891J4338k412l2135k5061L536J5136L2914J2685j7781k2632k5250
181c5632P079K6845K0167J3882k3355k8381o143J723K9583K2774o264j3580k7414
194a8716o837J6666J7831K3159q181k5142j2619r430J9098K7021N455m846k5020
207a561j7269O549J3536K5471N132j7465j4949j6544O877K3379J2226M361j6452
220A3291k1091n618O755K3834J2586o973j2461k1776l812J6745J5929J1463r041
$$ y = [38296, -3742, -40284, -61416, -33168, 15760, 37372, 33478, -9291, -55732, -53358, -23928, 18105, 41141, 17219, -17790, -49829, -50186, -8941, 20650, 32246, 16159, -26932, -46930, -40084, -6950, 29277, 29151, 6871, -30191, -50810, -29193, 1588, 28876, 27814, -4511, -31245, -42138, -20861, 11030, 25368, 22956, -9179, -34240, -30704, -15568, 17346, 30031, 12250, -10382, -35632, -28553, -1708, 18459, 32341, 8986, -19395, -25538, -23815, 5768, 28542, 22278, 8698, -18716, -25553, -8887, 8944, 32103, 23922, -1220, -13839, -23269, -4171, 22850, 28305, 23459, -1561, -18830, -12281, 1255, 26726, 31858, 14393, -556, -17100, -10223, 13156, 25382, 29743, 13291, -7800, -13418, -6663, 17171, 29757, 22784, 10323, -11453, -15265, 1480, 17409, 28872, 19831]
233A9831j8632j3263l710J9217J6926K806o163k2221j2334O019J4009J8054R47
246B1486j3701j6581j2402R889J6590J1349K358j7476j7022m406P080J8508J0235
259A5907l419j4849j7497l73J0407J4052J1800p986j6028j1219j646J2859J3406
272E414O615o199j7230p684K055J0018J5041K190r624j1770q078N334J1566J0215
286G863R85j0983r825m011M436J3051P235l359q322q881j846P612R929M690n491
301C083q622n746N93R582R051m53o375q238m746M595R761O620j813p580q200k685
317a1173O202J0560M240l300q433q668L4R455R121K701m987j0422o797K208J0614
332A355Q466J467n565j0846o243M496R201Q286J499p389j0750m446N839R244P155
$$ y = [19831, 1199, -12064, -15774, 3443, 20369, 23175, 17012, -5209, -17543, -11524, 2485, 20539, 21486, 7785, -8796, -21198, -11309, 5281, 16630, 18988, 1512, -15510, -19916, -12836, 5672, 15907, 12488, -2361, -19858, -20231, -9824, 4228, 16028, 8042, -7986, -19205, -20851, -7992, 5414, 12029, 5830, -11400, -19084, -17029, -7011, 8030, 10220, 596, -11174, -19252, -13918, -2352, 7863, 8848, -2135, -11960, -15971, -11535, 1516, 8751, 5392, -2930, -11811, -13657, -6045, 3884, 8574, 3083, -5539, -11285, -10692, -1110, 7941, 7488, 1113, -7125, -11871, -7276, 2485, 9105, 7292, -288, -8488, -11173, -4971, 5589, 9829, 6529, -1904, -10572, -10538, -1083, 8038, 10739, 5752, -4670, -11467, -9259, 1355, 9821, 11288, 5723, -5123, -11366, -6870, 2331, 10617, 12116, 4727, -6023, -10469, -4630, 4614, 11769]
347A1769M47q918r308j848N202R261N787j144q534p979n78M993Q292N711l476
362I677p527o071n20N960O971L497l810p797l247M30M845O963L23m244n257l870
378c677K568M664M795r3o129l960j697J415O805K511k867l859m649kM062L839
394C726K043m640m341j399j043O236M256k664k588n242k702L724M256M207j703
409B126n417l004l170M294O963m58m13m626n581J893L806M735J321k965m061m955
425i512J685O533K314K331k566o802k186K469M991L372Q90l285o117p20L633K858
441a12M408r72m299k998k072L935M269J887Q00o536k138J114m96P586J309l887
457A798j115m853J511L722J218M828n718m196K528l873N387M070k798Q83o127
$$ y = [11769, 12216, 3298, -6010, -7858, -2656, 6605, 12392, 11248, 2714, -5265, -5843, -850, 7442, 13153, 9677, 2150, -3921, -4441, 1519, 8490, 11987, 8177, 380, -2867, -2437, 2408, 9371, 9694, 5450, 193, -3677, -1109, 3555, 8350, 8257, 2128, -1832, -3529, -2114, 4691, 7202, 4335, 476, -4173, -4175, -113, 3726, 5769, 1129, -3212, -4611, -5654, 582, 4838, 2174, -414, -5656, -8358, -4634, -378, 3829, 2126, -3291, -6295, -9465, -5171, 1792, 1334, 921, -3705, -9286, -7393, -3587, 1148, 2469, -496, -4557, -9512, -7827, -1294, 1020, 3351, 785, -6017, -8203, -5734, -743, 2629, 3519, 234, -5883, -6603, -2970, -112, 4296, 3324, -975, -3973, -6045, -2110, 2159, 4046, 4846, -1690, -3828, -2714, -3210, 4376, 5685, 1798, 683, -4170, -2659, 1063, 2281, 7109, 1391, -2805, -277, -4150, 1237, 5307, 2509, 3392, -2735]
472b735q10L991r33N816r28n413R06m148L472M421j867K194m186l164K115r2M468
489C107m02j787N12n287K065L542k21K450l496o34j842j245P572k018o50J099
505B765n816K704Q11J199M030n763J075o68l702O953r84LJ673o829K439P71o11
522E0O122l359j650j192l342N372M3m5L292o081j327J255j16L682j08L02k761
539A37l962K184J047J544K833k596k666k071L30K630J343J926k014l236o38p21
555c930K390K831o74m90k541j900P23J659K968n2k136j050j861M22L254P72n64
572a79l55j947l69N71J506J740j174l93l31k132K041J659o55J316k117n50R01
589d68N1K065q17j046J164k318J637J729j899J822j457j212J551n18J925j40j578
$$ y = [-2735, -3545, 446, -487, 5329, 4401, -1012, -106, -4254, -782, 3639, 1772, 3966, -220, -3384, -1269, -1361, 3107, 2705, 918, 1430, -3857, -1792, 1750, 1529, 3979, 483, -151, -1993, -3238, 4334, 2316, 1666, 2765, -3051, -347, 464, 1663, 5693, -70, 1005, 337, -3365, 3588, 2604, 2607, 4280, -2549, -110, 661, 50, 6172, 2813, 1163, -29, -3371, 2001, 2044, 1999, 5291, -790, -2117, -862, -978, 2704, 2596, 2898, 137, -3825, -1641, -594, 950, 3783, 1187, -1479, -3550, -3220, -590, 753, 2679, 665, -2571, -3209, -3930, -1540, 1291, 617, 127, -2414, -4314, -3591, -1932, 1036, 984, -1152, -2202, -4063, -3641, -387, 385, -179, -534, -2481, -2850, -2279, -773, 967, -207, -600, -931, -3063, -1022, 637, -18, 1298, -819, -1369, -468, -417, 1648, 831, -215, 949, -1369, 268, 1997, 98, 1920, 463, -749, 802, 284, 2209, 2069, 491]
606D91J092k769R62K502j384J766j507k291R80l17K482K05j533M52l097P96J730
623E60l82K155r52j836o75j325K726M83K50J299l874o00O74l39K975Jp71p67k657
642c055J875L55P59K708l087n71P7j851K671P07L54K4k199L03n94P93K981j932
660C18l9J98j607R15P77O01R2j223N36r48l40K545q74J54k95r27L36J74M35L60
680A188p28M32j073J3J592j091L12L81j480K33L29M35M25r11o3q21j45J421n00
699e1m0M60j204m60P74K87M56l57k1j144m23J219K62m3O55j007j063L6Q03O02
719b59K36K82r33r73N82M04N83Q37m60p32m88J94L18P63P30p60j209P68k58K72
739a03J171r5l28o51l08M77J67J019L28j155L1m15k16J235K24n73Q2p43k60J34
$$ y = [491, 1583, -1186, -224, 2278, 894, 2660, 1153, -1138, -158, -475, 2007, 2212, 679, 1131, -1966, -1170, 560, 178, 2333, 1381, -455, -1130, -2455, 271, 754, 1004, 2303, -1571, -2171, -1497, -1836, 1139, 1140, 369, -398, -3055, -1180, -825, -66, 2642, -445, -1016, -939, -2790, -119, 588, 942, 966, -1233, -930, -1524, -731, 2250, 318, 279, 477, -1130, -215, 562, 1163, 1255, 32, 568, -380, -720, 1825, 951, 1105, 810, -117, 219, 393, 828, 1188, 460, 892, -181, -168, 1424, 333, 645, 1026, -454, -221, 108, 543, 968, 57, -6, -827, -972, 449, -51, -91, 369, -835, -1295, -521, -234, 222, -135, -156, -1300, -1723, -504, -242, -285, 370, -637, -1700, -1664, -861, -259, -23, 259, -674, -1647, -1065, -661, -78, 759, 299, -433, -921, -727, -409, 354, 1084, 324, -885, -117, -375, -103, 1068, 973, 645, -6, -314, 163, 330, 1349, 1677, 522, 553, 138, -78, 1157, 1381, 808, 890, 147, -113, 21]
759B1R54P1n20J10m14o82O38N69N1l47j57o13m44Q17J97j01k26j1j032O5P96j70
781d28O5K71o43l64N25N3m08O47l52o26J36M17j46L59K90m08m45M45M91n43L35
802c29L7m27L52K06J52j6K63k86l60L26L86j24K51K61q71K91N4L25K08R2j57o51
824a7J18K99K55J46P16j049k51K08k91M33R93l20o20n85j65K32L99O40l6j010
844I5K6m43k79J243L52q51K3o58j96M9Q71L35o91Mk32q22Q26M94o36M23j08o06
866g81O8K62K94n5Nop97O07M66q81M81L22k46l53L52K56m08L67K22r60J207j23
888B99n50L17l2J58l63L91P24j141N09M10q40N89q7j14M19n57K42k91k74J188
908I97p35J67L65j347M36N00l51O46l66l71j34J6K07m24O65J31o59l13K93m71
$$ y = [21, 975, 1046, 526, 636, 222, -460, 178, 747, 798, 451, 294, -319, -763, 54, 251, 150, -76, -87, -1119, -1054, -258, -428, -363, -92, -735, -1099, -574, -521, -929, -282, -634, -1260, -1124, -707, -853, -494, -204, -612, -1057, -612, -121, -664, -329, -292, -719, -367, -161, -9, -25, 238, -48, -408, -82, 304, 180, 431, 692, -179, 112, 166, 491, 699, 791, 634, -17, 101, 400, 655, 801, 1517, 468, 217, 425, 134, 567, 1560, 1240, 620, 35, -130, 102, 501, 1141, 1105, 95, 121, -322, -601, 642, 994, 143, 166, -492, -688, -639, 232, 567, -124, -120, -352, -1174, -348, 146, -490, -67, -175, -781, -713, -451, -157, -212, -207, -213, -1010, -403, 63, -818, -337, -15, -261, -614, -262, -6, -414, -47, 175, -785, 422, 299, -251, 66, 34, 192, -171, 220, 944, -197, 312, 722, -118, 471, 384, 270, 689, 132, 374, 83, -191, 997, 262, 429, 794, -553, -117, 383, 32, 678, 312, -59, -193, -177, 30, -394, 271, 402, -257, -570, -277, -748]
928g48M52M65m00l82l57M31O1j78O91n03j95J96k62m33P16j16K36j73N6m27j81
949a051J204m00J86L52j064N70J70l4M02l48N01l60n29J177j134N49R41j062M09
968D79J14m23N88l41K89j95o18J365l31o86R88j340P42K61l83L87p32N78j73m17
988A52R32p84n9O06p46j40J04R5M14m92L26p98l05J119n82j11N02p13J68R7P1
1009a44j39k68Q49o84n01O89n86K22M88k80j67k55L13M19n44M01j74m85Q55l53
1029c44l19P52j74MM0k61J60k35O01K25n23L2K36l66N45K07n56R4J51L26l30M3
1051C08N6k1j56L24p87M66J27k9Nj65O2k39L11L83o06J89K0p18O93l27j68L10
1073C8r8K07m42j48N53n95M38J19o78M38r8j95K71j22J98n41K32M42r23R0R49
$$ y = [-748, -296, 169, -231, -613, -970, -539, -478, -656, 35, -468, -663, -467, -729, -1162, -446, -562, -326, -499, -443, -870, -1051, 153, -247, -61, 291, -773, -203, -33, -67, 335, -13, 488, 128, -401, 776, -358, 191, 1132, 70, 479, 593, 170, 758, 417, 706, 511, -107, 1258, 927, 241, 1229, -111, 631, 892, 509, 896, 164, 742, 569, 152, 1084, 300, 241, 847, 101, -39, 65, 160, 574, 82, 408, -390, -695, 424, -158, -269, 233, -480, -312, -215, -144, -283, -551, 298, -386, -887, -198, -784, -562, -74, -354, -521, -776, -463, -44, -588, -187, -361, -846, 9, -344, -663, 89, -85, -81, -41, -302, -142, -377, 224, 449, -74, -42, 194, -172, 373, 580, 24, 118, 269, 595, 265, 308, 364, 343, 187, 511, -276, 190, 317, 288, 293, 128, 190, -49, 262, 645, 39, 228, 248, -470, 223, -104, -272, 38, -60, 147, -295, -443, 110, -485, -47, 72, -606, -168, -266, -461, -190, -312, -114, -655, -423, 19, -904, -814, 135]
1094A35r63O61J39m39K78M9J01k79K0K79k79J47M72o05R3M87Mj49L06k83Q5j67
1116I2M97m89K27k0p2N2J62P0k42L13L41p07Q9J92k97K44K58k25J38N6n55L37
1138D61q1L57l35m63O25o63k39O06k52Q4k7k33n0k18K47j37J7K97k54k08N33q98
1160h31L23M40k31j58j00J88j84N1L49k98j14N59l26k5J37j32K51J24J1m75J23
1181c18L75l38o7O21m80K66k05O6J25n9N36n64O0K17j30j26M68l99M62k80N8m1
1203B47r8M06j20l56K93j75nJ78M7l39M3K27j48j61Q0j01j33K65J5l41K83m09
1225c02J0K91J7o2k15J90j65q2J73r2k1J70L7l84M4P7J59j52K68k05J87l36L05
1248h8k12K21Q1n30N70n1n4j99N10j46j72J87l8k53K76K63k97J66J41l9q3o0n3
$$ y = [135, -828, -167, -28, -467, -189, -140, -39, -318, -298, -19, -298, -151, 321, -284, -191, 296, 300, 151, 457, 174, 259, 92, 589, 100, 327, 307, 235, 287, 449, 519, 277, 590, 931, 224, 313, 505, 208, 452, 710, 485, 623, 679, 124, 461, 380, 737, 402, -61, 564, -99, -338, 268, 16, 100, 73, -160, -210, -428, -181, -318, -301, -4, -258, -466, 67, -831, -508, -68, -299, -457, -557, -369, -553, -502, -153, -451, -565, -6, -332, -357, -220, -352, -101, 23, 34, -441, -318, 57, -281, -348, 273, -207, 59, -146, -80, 45, -14, 522, -42, 18, 235, 105, -21, 447, 48, 510, 230, 288, 247, 149, 555, 435, 79, 372, 197, 192, 370, 417, 78, 121, 348, 200, 39, 119, 18, -115, 150, 165, -176, 107, -302, -292, -1, 16, -46, -261, -71, -236, -318, -145, -237, -258, -88, -51, -435, -391, -314, -155, -307, -39, -244, -57, -393, -88, -300, -79, 2, -528, 42, -9, -63, -262, 248, 102, -70, 117, 79, -174, 102, 365, 68, 234, 375, 336, 253, 193, 140]
1271A40k4M0L60j23q7R6l10K33R9k80Q5L04k41k86K19L17l83K38M6m40J81Q5p4
1294A95j93n9Rj25K24K0k07l68M24pl50K02K7l89L91j5k08K61J35o21J74L98p1
1317a53k65j13M02m69N19j72l70L82m3n6P2K66l01P8J38K24m37L91J83l97M0K82
1339B01k47OM5L44l26J38K68m83L57K22l66l0K01j20K1j54L66j27O9J78m71J02
1361A94M01j53j76j80L18l59J19j01r2J66N0j63k92N54l25P2K00l73J80j51J39
1382B8j87pK5k58J35J47k19j2P1J9K6r5K43k30K06J91l42k44L51j49K01%K14j92
1406g8j75N62n12j43Q79p80O59k74j2J31k8J07O6j09K22k87k98Q83r16K01N00
1427E98k80N6j33K38j75j41K04l49J25K39k23J98k69RLJ46N8n01K20L8Qk6l0r5
$$ y = [140, 116, 156, 516, 393, 306, 402, 92, 325, 424, 144, 229, 533, 292, 6, 225, 542, 159, 397, 443, 3, 184, 269, 195, 2, -57, -48, -173, 51, 71, -136, -504, -80, -87, -437, -235, -208, -597, -206, -221, -429, -168, -33, -654, -480, -82, -153, -418, -531, -129, -598, -79, -251, -621, -239, -282, -338, -266, 0, -301, -223, -85, 139, -298, 93, 276, -121, -81, 201, -46, -40, 5, 349, 23, 161, 429, -54, 303, 525, 159, 129, 330, 210, 231, 77, 443, 316, 385, 563, 92, 194, 595, 442, 266, 86, 404, 45, 164, 63, -29, 137, 187, 24, -268, 286, -39, 33, 233, -140, 40, -111, 28, -159, -166, -141, -399, -264, -117, -336, -348, -277, -258, -232, -327, -84, -314, -108, 83, -259, -503, -152, -301, -100, -100, 114, -78, -253, 309, -203, -346, 533, -247, 412, 138, 126, 257, 229, 336, 402, 293, 515, 228, -70, 813, -103, 98, 598, 318, 374, 241, 479, 304, 163, 367, 18, 143, 382, 159, 357, 88, 97, 100, 246, 304, -197, 23, 61, 69, 43, 13, -82]
1451h2n0k83K62j2j13J14k61m9N97k90n0p4J00m3j75K48m6K2J33j97l23K21n6
1474d07L1K79j39J4K49r5j67J36P8l27J99k3K60m04L83K74n22K95J56l33K17%
1496A54Q5j40J84J39n94K92N47n34K47M2m72N82k91m75M78l2Q7j85P9o4o8P4K7
1519A62j90p3L19k16j89J80P3l53K85p9k41k9Q6k44L17j35K41q1j0K78n93K92
1541b00J73m51K76K64n81L03j04m0K65J3L69n75k7L56m55J38M13l65K95pj1q5
1563c6n3K37j75J99J91k12K75m13J3K47K20m7m87M23j27j59M20j98P7k23p8K39
1585C33k13K02j33k44K84J04m35K23P8l49K53j28j66J55J5m8R0j0L5k79j22K66
1607h9l97M04p1n0j99J5Q0J3nJ04q5l35N69o0k53K31q1k96N31p3k05k0oK6N1K63
$$ y = [-82, -132, -415, -153, -165, -278, -164, -425, -474, 123, -167, -217, -291, -191, -234, -409, -161, -207, -185, -52, -249, -572, -351, -407, -376, -97, -236, -222, 27, -68, -235, -99, -21, -348, -149, -172, 88, -316, 67, 341, -181, 114, 270, -63, 154, 154, 239, 99, 283, 422, -172, 120, 667, 133, 380, 422, -50, 532, 241, -234, 244, 212, 299, 114, 193, 129, 61, 135, 162, -28, -101, 218, 2, -187, -7, 66, -287, -2, -81, -322, -351, -265, -509, -192, -327, -86, -167, -177, 101, -492, -200, -27, -478, -202, 62, -519, -216, -320, -360, -95, -82, 287, -288, -315, 41, -414, -276, 137, -228, 67, 60, 49, -36, -89, 148, -27, 172, 363, 151, 426, 13, 26, 273, 493, 446, -41, 382, 255, 96, 516, 318, 395, 172, 94, 333, 120, 322, 189, -55, 229, 333, -102, 121, 199, -150, 103, -25, -191, -36, -21, -69, 21, 11, 46, -233, -355, -89, -486, -82, -153, -203, -402, -387, -307, -294, -299, -195, -280, -615, -46, -106, -359, -128, -209, -505, 26, -47, -252, -272, -278, -252, -201, 62]
1633F2j04M7j02J23k49K34N9q3L1P4l5L4J62j95l3L23j18j71P4m7Q4L2K02k85
1657A19K7N5J75j79n2J95l97J24J31k11JP3N4R0k51K18k3l00J88L7l62K70n4j61
1681b33J58%j52J98k23j17J70P2K3o5O5kq2K14M4j60j91J24R9J79l3k97K24k31
1705b16R6J85m9n8J46J72j38j90L07Mmk75J97P5k10K79K18m27J81m8m9nK3L7k7
1730B24L65l10k04J83P1j63J45q4J16q4J19k21J0K8J12m30J1L56k08J0J04l33
1752a83J8M69l67l5r3N1K4K10r5m03K79j20j79rK03R0l34qM99l04k11L38k03J59
1776b04j26J51q6J41J56j85J93j90R9j19K16o7K34k7ok99L24k08l43M15m9J18
1798A38pr7O8k84L11M9J07j20J53k76J47l4j21J45j28J75j62J71j69j33j44L02
$$ y = [62, -42, 5, -97, 26, -223, 11, 70, -13, 18, 92, 57, 91, 253, 58, 25, 348, 230, 59, 133, 86, 170, 202, 404, 119, 146, 201, 376, 197, 145, 340, -57, 67, 198, -13, -12, 61, 115, 205, -46, 172, 149, -151, 37, 74, -288, -18, -72, -233, -75, -75, -227, -29, -252, -369, -199, -127, -104, -169, -104, -106, -188, 26, 70, -90, -281, -157, -58, 121, 88, -209, 15, -216, -120, 65, 16, -42, 104, 276, 138, -52, 255, 259, 255, -20, 177, 252, 42, 321, 539, 112, 293, 245, 196, 191, 214, 251, 224, 589, 279, 75, 258, 329, 166, 311, 227, 343, 259, 378, 157, 167, 195, 307, -123, -112, 244, 36, 46, 150, -183, -165, 304, -63, -98, -191, -140, -116, 94, -1, -404, -125, -245, -424, -433, -230, -140, -474, -482, 17, -287, -498, -160, -363, -204, -330, -179, -265, -124, 32, -153, 40, -150, -51, -170, 46, -21, 213, 186, 180, -119, 205, -3, -346, 69, 20, 138, 131, 34, 102, -182, 129, 178, 285, 165, 318, 42, 189, 155, 34, 179, 51, 226, 64, 235, 66, -67, -211, 91]
1820I1k65M84j81k55K33L6k55j6m6L00l77J55J6j79L8O2J02j08J82j81j30N2J57
1843h5k00M97m98J21J97O7k64J3R7J11l76K22k3k6K25J69k48j11K18R9j00R2K51
1866D48o20N36m68J25K44J35j79j59rm2O2J97j30R2L5rl96p4N44j62J06O8j71
1889A73l30K07M13m27J07j36N6L8j99K10j43J20j36J13j29l14K08LK79l78R2J06
1911f7j68R5j81L24n09L63l7j67j57K35j5j56M58P0l20k14K86k4J32l0j03QJ63
1934a4j55l9L67k19k08L74j7k26J30K38j16Q7j33j5Qj67J44NJ29j94o4J45K1j93
1958a12L35k53L94k73j64Q8m9j26K13k85J82K01K21p00M11N3l40L09k77J23k2
1979g1J88J29p35O30j36j33M7Q3n56L46K06l49L43j87J20m7R1J18k64L60l86O5
$$ y = [91, -174, 310, 129, -126, 107, 143, -112, -128, -174, 126, -251, -96, -80, -259, -221, -159, -57, -165, 17, -164, -294, -242, -85, -285, 212, -286, -165, 32, 99, -165, -152, -55, 56, -320, -98, -121, -147, 78, 247, -1, -112, 106, 205, 105, 197, 448, -172, 364, -104, 21, 265, 400, 221, 62, 53, 11, 73, 270, 140, 232, 267, 258, -138, -212, 332, 170, 276, 344, 173, -157, 50, 463, 36, 143, 7, 63, 101, -98, 112, -31, 89, -47, 66, -63, -377, -169, -166, 113, -265, -173, -67, -235, -140, -321, 3, -506, -143, -180, -347, -504, -269, -284, -440, 18, 88, -232, -446, -160, -184, -52, -82, -185, -177, -14, -169, -208, 159, -60, -268, 106, 89, -137, -7, 231, 115, 202, 69, 54, 62, -105, 39, 44, 173, -21, -85, 60, 81, -112, 223, -30, 364, 91, -73, 15, -34, -160, 53, -232, -50, 151, 372, -328, 83, 136, -204, 105, -172, -49, -71, 117, 246, -489, 141, 5, -128, -81, 2, -554, -208, -2, -351, -8, -195, -75, -122, -31, 87, -177, 183, -203, -138]
2001a38K34J2l89L50J17l47J99J39j22k45J13R3m7K21J08k50r4K99j89j73L64
2022B55l1l3r8q5K8O9J15J20q1M4j51np6R3k11L10k79R5k1j90K90m32K80K98k57
2047D7j54J68l59K15l21M52j96K7K82m43k2J17j62K99N1l13O3J37j24l1K02k75
2069c40N2j1K77m67O66l20j21K44p0k1r9J92j28J87J90q6j73P5k18L12j08N9o3
2092B9K2J99J2k61N2J87m40K99J5Q2j42K17j67j18L70k54q3K53q8r8o1K49l46
2115g2K69k20oL2r8J09M6K5J68j90p6J60k17k02K55J13Q0j33M6k62J53j92J69
2138d3N1o1p2r1M01j48p7K63m94K16Q1K83k76R5k44j80J95L96k43m18L96j18J3
2161g5J30K2R7j71j06J40n8K44j62J71o8k14J77R6n9j16Q5j75o3K81L00m45M4
$$ y = [-138, 96, 108, -281, 69, 186, -161, 38, 177, 55, -190, -77, 16, -31, 190, 298, 48, -46, 253, 64, -109, 255, 224, 191, 93, 8, 36, 105, 220, 340, 259, 303, 152, 147, 71, 164, -47, 263, -16, 79, 58, -132, 158, -274, 6, 304, 47, -107, 61, -298, -83, -404, 48, -148, -121, 161, -282, -304, -187, -349, -50, 1, -312, -249, -112, -236, -267, -65, -340, -288, -299, -22, -489, 177, -143, -264, -20, -90, -111, -210, -18, -146, 41, 231, 145, -28, 47, -171, 141, 33, 92, 29, 51, 250, 262, 1, 53, 240, -200, 99, 114, 196, 54, 271, 104, -14, 356, 102, 19, 272, 184, 86, 25, 274, -72, 197, -23, -29, 3, -95, 14, 60, 85, 253, 63, -13, 147, -70, -272, -17, 96, 176, 43, 89, -173, -20, -212, -43, 8, -53, -125, -216, 185, 37, -40, 223, -271, -55, 26, 309, 33, 128, -116, -296, -101, 295, 52, -366, 30, -88, -75, 55, 77, 174, 3, -103, 37, -21, 223, 61, 232, 164, -50, 127, 223, 164, 48, 133, -42, -105, 176, 476, 31, 75]
2184G5J6j56L28j76j85M7l8M22o2l62J42j27k9M8Rn6K72j50k66R8J10Q2j16j04
2208a78M5k45L98r6N4l04J2J46J25r7O1o8j95N37r9k58j54O3P7J22j52k37K96
2231a47K80j16j59K63Qj61J93K7j95o3p1P1L09j38p7J49J1m09M72J60m93K30r3
2254E1K61k84K47Rl23J65K03j35j28O9k11K92j92P1r3J26N8q4j37J09j79P5p2
2277a02J82k47J23O8k00o8M5J74k9q1N8J24j68J32j7j57L7K78k72Q1l67K85L38
2300B17k03j89K84M4m3m84N59p4k54M39j84l7K58m51K77J08j96K7J61j11L1p0
2322A09j1Q4k79K19J3k52L2K37P6l04L12j36oM9m3k82K43K40k19j81K58Mj60K85
2346B88k52q5O3o4J01j09k74P7K43j10j33K00j51Q1Q4q2M9j48K67k31j6M9J48
$$ y = [75, 91, -65, 263, 87, -98, -51, -89, 333, 271, -91, 51, -76, -105, -57, -48, -104, 168, 18, -248, -150, -40, 42, -74, -178, -133, -378, 20, -76, -22, -326, -314, -168, -43, -140, -79, -147, -342, 195, 96, -162, -316, -253, -176, -54, -206, -443, -147, 133, 17, -142, 121, 129, -32, 161, 188, -7, -70, -141, -70, 239, 101, 24, 173, 184, -225, 247, 407, -86, 144, 51, 312, 28, 275, 284, -39, 126, 329, 194, 66, 135, -76, 216, 24, 95, 2, 128, 186, 102, -35, 74, -105, -30, -102, 80, -167, -44, 24, -176, -244, -199, -25, -54, -135, -77, 47, -121, 11, -6, -163, -126, 152, -120, -39, -406, -121, 217, 14, -175, 109, 153, 110, -374, 185, 111, -143, 296, 112, 75, 333, -118, 159, 267, 71, 98, 259, 148, 179, 109, 98, 182, -97, 122, 135, -117, -85, 152, 228, -76, 236, 100, 94, 143, 100, -182, 61, 301, 82, -99, 159, 163, 3, 288, 36, -49, 14, -50, 51, -58, -332, -255, -12, -122, -255, -55, -206, -125, -41, -123, -74, -222, 45, -186, -202, -153, -5]
2369ek54K7K37k27k0L11k31k47L08k7No1L31l06J06J30j20J07r0J02J65j61L1
2392A11oJ02r2O0q7J44J01k73k5J23j18J13O8j46J38r4j94J68J43j42l2J98k0
2415B40l35oK42r8J55j27q2O4J65j54j39J3K74o5n3P8m39K34K45k1m16J18l0Q9
2439d8L08l85N0k08K85j61J31l4J21p7j49K16l24K62J12j16l24PK61l38L91j05
2461a25K55j66K80l77J21N0N1o0J46j70R8J5J08J17k63J18k61J27M8J00K54j54
2483C12m82R7J42j75J24J25k1j5Ll48J3L75k86K21j38Q9l6k41m0K26j98J64K03
2506A14j69k61J97J41l6o1N9r0K4K60l36q9J96j47J1R2k0K6j30O2j58L03Q7l30
2530b55K98J26r2j73M4K6J13l7j25J44j74J83P2k03K04j5j04M2J49m33K00K19
$$ y = [-5, -259, -232, 5, -222, -242, 69, -162, -409, -101, -128, -123, -184, 147, -159, -53, 77, -43, 64, -26, 76, 241, 80, 111, 105, 207, 115, 175, 88, 232, 333, 60, 35, 158, 40, 153, 221, 75, 213, 119, -75, 93, 236, 94, 62, 260, 240, -95, -101, 141, 43, 198, 71, -11, 53, 218, 64, -75, -62, 212, 147, 94, 172, -267, -33, 212, 191, -225, -107, -137, -48, 260, -125, -75, -283, 2, -159, -28, -62, 59, -18, -167, 49, -275, -13, 99, -17, -341, -334, -73, -411, -20, -125, 130, -36, 244, -133, -12, 38, 89, 29, 175, 5, 103, 118, 226, 343, 80, 198, -63, 64, 112, 212, 466, 312, -170, -73, 69, -106, 18, 143, 122, 107, 110, -238, -225, 150, -136, 85, -53, 36, 0, -241, -281, -55, -253, -89, 114, -55, -316, -119, 22, -14, -75, -16, -106, -82, 178, -158, -247, -51, -198, -187, -95, -115, -89, -219, -157, -315, -12, 75, -255, 43, 169, 77, -96, -52, -26, 87, 50, -75, 69, -105, 78, 150, -53, 151, 136, 32, 74, 223, -210, -10, 209]
2552B09j50J05k54M08j56k58J36J15Lj20k14J39K37q9k3k1j21J23l00L44j30j72
2574a89K78j4k41O9J99m12L24k39K55q6j43K84j29J29l00j01L08po2j72L24j87
2596a12o5n1J20j10J55Q5Mj40J54j25N5J08N6j55j9J81m3J63j39j04j20j19K14
2619gN3O5m0j31q6J49O1O0K8k50R2J90q7k73L35k31K89nK9n54M61j47L6kL60n17
2645a22K40k35J10j80K48Ml15L50k5Jk04J63j27J35l5k8l65M99k77Q7n5O9j7j25
2669b04K53j21j98L01j7Mkj41J44J20N3j72PL7j08p8R7J6K6k6J8J15n4j34N2L
2695iq9N0j18K72N1j27P2J36K8l31J62k47L46o1n0l2o5J58n2L43l97o1o7K46J4
2720A72j17J44k82K07o6j34J62j13jJ24j63N2J18m10N52l65j19K1J19r1r7L28
$$ y = [209, 59, 164, -90, 318, 162, -96, 40, 155, 158, 38, -176, -37, 200, 111, 88, 67, -54, 69, -231, 113, -17, -189, 89, 75, -166, -97, 102, -310, 14, -225, 30, -56, -199, 85, -44, 85, -215, -316, -8, -15, -77, -249, 75, -112, -177, -228, -108, -218, -63, 22, 26, -114, 40, -85, -30, 78, 134, -21, -40, 141, 98, 261, 122, 18, -102, -221, -7, 46, 111, 71, -60, -146, 3, 64, 124, 152, -98, -6, 184, 97, -176, 159, -72, 217, 212, 241, -313, 148, 1, 37, 35, 395, -122, 118, -117, -7, -187, 61, 65, -250, 100, 75, 76, -128, 35, -92, 43, 8, -20, -385, 114, -163, -76, -131, -62, -79, -204, 49, -72, -270, 31, 14, 18, 16, -125, 19, 139, 192, 20, 27, 64, -44, -122, -25, -9, 17, -9, 9, 124, 70, -64, -12, -9, -98, -48, -166, 106, 157, 30, 102, 238, 266, -65, 97, -150, 196, 135, 85, 53, -12, 146, 94, 437, 40, -21, -88, 158, 172, 55, 199, -83, 124, 58, -76, 86, -27, -28, 96, -67, -15, 103, -307, 245, -120, -239, -218, -99, -190, -287, 41]
2742D1k12J63On9l0J13J43l84K97K3l18K66J39k30N9j50j44L48m7r6Q8j67J67
2765A6M5l4J67j21lO0J70j57L5k42J13J36P0k02R0j80N5L68l80J85q2L56k94j7
2789A54j14L7m4R0K74n10J87R2k7R1j99j03N9j48J45j80L6J31k03J22K11Kj33
2812c0J06P5k77n4J55J06m45L9J83L08m17L63P6l77J76j02m4P0Q4n1R1K19j01
2835A53j98J2K6N5N7j60P9K27Pm84J03O6L6J52j10j78J21J70j96J03lJ6M7j63
2859f2L71k60j71K47l96L17K23k66m1J65j51K6J74j33k30J27R2j98M6J81k63L78
2881A76j32k11J21j3k7j24J77p7n2L53n1l2j00j63K48l03K90k02K39j93N7m9J71
2904A03p7J48k07k9k2k7j7J15K25k36k3J44j38K52p9m6Ok7l8J48j44J17j90Q9
$$ y = [41, -171, -8, -2, -61, -91, 22, 165, -219, 78, 101, -217, 49, 188, -42, 17, -133, -277, 71, 24, -72, 16, -151, 16, 61, 27, 194, 73, 70, 130, 300, 143, 178, -64, 49, 185, 255, 53, 143, -37, 18, 386, 6, 191, 109, 465, 171, 154, 40, 77, 33, 123, 397, -113, 74, 166, 139, 230, 31, -72, -13, -161, -16, -196, -160, -29, -232, -110, 101, 103, -30, 76, 151, -126, -180, -25, 81, -364, -325, -142, 166, -251, 112, 188, -189, -13, -115, -159, -89, -5, -56, 35, 254, 153, -45, -33, -7, 48, 105, -55, 24, 251, 258, -226, -123, -57, -21, 131, 21, -157, -36, 134, -62, 41, 38, 54, 101, -62, 309, 49, -122, 125, -271, 46, 269, 3, -38, 127, -24, 2, 176, 43, -187, -60, 32, -166, -120, 61, -202, 176, 44, -167, -46, -59, -86, -210, -33, -110, -162, 191, 140, 108, 8, -155, 93, -210, 80, -122, 117, -76, -19, -68, 103, 26, 174, -33, -62, -84, -111, -128, -13, 212, -24, -47, 97, -41, 211, 132, 86, 92, 65, 27, 175, 31, 148, -42, 47]
2928D7J27P1k89N9k5J24J69m01K97j96J81j17m02K80K99k98L48j98p3k90J24K78
2950A15m37L95J2q5o7j44M38m69O8K94P3l11k18K39J55n3q0RJ42j07pl87M79j07
2974e3P1o1r0q8J63K03r8o5N6RJ8k64M05k04K44k78n3L62j91M5r4n2K12J11j57
2999A51M70p05J73k3K40l95K43j68J07q4J26j15N7k20R2n4M80l76J7L0j46J75
3021G5j38J39j79J9J75j87L5Q4m8K09k98J63j54K93k17n0J62m8j81lJ0Q7L5L6
3045A9j74q7K42l4j63J84J12r5J03j2j31n9K47N5k32r6J46j2o2K80k43j01K05
3068I2j31J3R6j05K75j76j39J99J0r1L8O9j77L11m47j4L15%k55J44o3o9m6K06
3092E5o3r0l4MJ55K51n01J51k4J7K10k40K19j46j56M8nK46j49k59L25j75k7p8
$$ y = [47, 174, 245, -44, 15, -10, 114, 283, -118, 179, -17, 164, 47, -355, -75, 224, -74, 274, 76, 3, -287, -163, 115, -322, 73, 85, 0, -67, -211, 227, -242, -174, 120, 193, -118, -336, -97, 58, 5, -75, -66, 76, -31, -38, -425, 54, -53, 18, -43, -133, -221, -58, 145, 47, -18, 38, 47, 65, -199, 206, 2, 246, -32, -85, 277, 86, 131, 37, -15, 197, 308, 151, 621, -84, 89, 66, 306, -89, 154, -14, 93, 9, 135, 20, 77, -143, -51, -105, 375, -1, 16, 46, -100, 75, -63, 76, -103, -84, 91, -96, -61, 23, -25, 184, -114, 49, -105, 188, -29, -79, 83, 35, -146, -149, -139, -52, -17, 19, -155, -242, 0, -34, -197, -13, 99, 4, 107, 95, -36, -95, 152, 207, -25, -121, 25, 13, -49, 231, -12, -113, 92, -39, -26, 70, -35, 240, 64, -75, 124, 134, 43, 81, 150, -27, 284, -163, -177, 138, 138, -117, 27, -36, -105, -151, 55, -8, -98, -132, -128, 27, 278, -223, -72, -96, -79, 131, -109, 110, -36, -192, -144, -149, 97, -52, -311, 14, -161, -188, -266]
3116b66K34j44O8J44P2m0j85K31p1mO8j78M1L14k14l9O8j44k30K94Kj94K20p6
3140b9nK2J13j79R6Q8o8J20k90J93j97l1L44j61k10K26J34m91O37m34L37j04j15
3163dJ17n2L9L1j90N9o3K00k07K72m15PL92k03l7j75L95j72j40J54K05l51K61
3186A23N7o9k09J44j47O6L1m8MK25k34M1M7p4j50J60j73J01J04N4K41l18K12l17
3210a29J03J71K2m9p9J29j08j31J60o2j70L70j86j02J1m1J51Pr8l1L34k24l21
3233b73L63n0p6J89N4k87j50J36R1prMJ06k39K30P3J9m61K75Qj08j3K04j1j58
3258i0J34l68K40K25j23l3q3pQ1j6r5J9k4j0O5J58o0k01J8K07k02K05k83K49p
3283ak30K03J63l54M5K90k48K83m9J23j28k01K55j62K1K25k65M5nJ17M2j20j0
$$ y = [-266, -32, -176, -108, 36, 108, 68, -117, 114, 43, 39, 107, -71, -30, 284, 70, 31, 99, -45, -275, 19, 21, -173, 47, -29, -34, -12, 101, -78, 18, 106, 38, 158, -132, 61, -136, -167, 177, 16, -194, 32, 166, -325, 312, -122, 215, 111, -4, 113, 61, 100, 131, -59, 0, -63, 137, -70, 202, -213, -206, 186, -17, -54, -229, 166, -6, -146, 8, 213, -138, 123, 180, 111, -98, 46, -101, -35, -4, -52, -48, 177, -57, -16, 31, -43, -193, -33, -206, -105, -1, 53, 294, -24, 188, -129, -26, 145, 167, 118, 39, 168, 60, -71, 89, 27, -143, 227, 41, -61, -50, -91, 60, 67, -31, -62, 272, 48, -273, 90, 40, -36, 153, 207, -80, -230, -94, -3, -10, -19, -15, 91, -148, 82, 155, 174, -287, -12, -4, -112, -125, 79, 68, -90, 44, -324, -84, 141, 18, -15, -98, -105, -24, -40, -135, -116, -140, -150, -85, 73, 13, -188, -170, 37, -165, 40, -243, 6, -1, -231, -28, 135, -219, -174, 116, -132, 151, 102, 225, 97, -104, 151, -11, 10, 235, -30, 15, 10, 127, 169, 49, 39]
3306C9L09j20l19L36l69Q8K3J84j03l76P62l68k10J84j8o6N5K2j94J84k45J65
3328c7j28j1p7L11l8j78J14j19lj4L12k24q5M8J19j0J8Rj93O2J79j14n9K3O5j2
3354d2J9N5j59J03K26m20K75j3j02j9L23j06j56m2J28J33l68K56k10K48J55j29
3376A55j03l8O2j47L91o6l54K86k37J65k44j79J00M0K99M8l25J75M8j54J67j88
3398i9j9M11j65mq2j4l5j95J16L14l92PJ13J79l21L94j69l33K81L6k29j10J74
3421a42O4K37l01M75m57Q4q5j34P6J50Q8r1K15m85K23K5n1r4K86j13n5r0L60j60
3445B5J57j85R3J72j38q4j77J85Q0j1k74J9J07K06j09k09o4K09j2nJ33j29L39
3468C28j34j03k01K55j48J64j27P5j76J80k03n9L2R7J05o2P1R6j48n5j37J74j46
$$ y = [39, 348, 228, -91, 245, -124, -36, -13, 171, 68, -308, 454, 86, -124, 60, 42, -24, 31, 53, -141, 43, -202, -37, -165, -176, -253, 58, 20, -158, -44, -163, -166, -180, 132, -92, -177, -129, -10, -20, -2, 7, -186, -124, 55, -59, -118, -95, -30, -42, -23, 32, -127, -24, 202, -218, 57, 44, -58, -77, 246, 140, -16, -58, 70, 203, -165, 91, -119, 129, 284, 155, 52, 14, 76, -71, 320, 254, -100, 186, -51, 114, -130, -309, -209, -169, 130, 178, -147, 28, 76, -78, 89, -99, -118, 293, 128, 124, 42, 28, -7, -202, -86, 228, -164, -157, -44, 135, -186, 208, 39, -294, -13, 23, -206, -316, -142, -78, 159, -142, 333, -124, -40, -125, -259, -183, -33, 55, -36, 179, -306, -83, -58, -109, -203, 83, -30, -85, -175, 185, 25, 182, -3, 90, 262, 124, 40, -137, 48, 128, 117, -157, -138, -31, 175, 66, -143, -207, 2, -10, -15, 118, -11, 328, 194, 91, -110, 145, -3, 161, 34, 109, -67, 113, -90, -149, -117, -20, 85, 23, 94, 190, 42, -13, -150, 24, -122]
3491a22j7M75j51l97J25Q5k5O8l45L71MJ25l94L64k06N2J38k34k18L10J29l32
3513a95L97l45J76M4j15K19J21r9j23j63L60l25j7O7K07k19J46O3lj67J5M1n6
3536B9J13j60k5K00m25K43j19N5P4j44KK28q9k85J60J65k86K05K07m35J64J89
3558F6j17K7k6J22r1K32j73k76J69j03j1J71k95J34R0M4j28L01j28J56j12j56
3580a04M03j13j33k12K0Q7j4J34j83R7MK04n9j85j03M6n1O6N4K68L4k01M5N4L
3605A61m0o1l9R2J5r5O5j26k9K9J33j67K8o7J43j42J91j35N6J38p5k22J39J56
3629A48o0l16L10m5p4K64l02q2QK60k43N9j69J86m5J37J23j30j88J39j58J00q1
3652a59J53P7j28q5M9l4P7K99k58k22O0L14J22j00n1k96M07n5k3k82L38J6k24
$$ y = [-122, -139, 336, 185, -212, -87, -2, -27, 41, -304, 67, 71, 196, -198, 166, -40, 12, 150, -84, -302, 8, 137, -195, 202, -143, 33, 77, -38, 181, 302, 203, 80, -83, 277, -48, -65, 2, 209, -10, 136, 199, 196, 29, 44, 85, 29, 142, -18, -43, 157, -268, -25, -144, -89, -15, -159, -157, 71, -18, -303, -143, 22, -264, -59, 148, -287, -123, 66, -51, -24, -50, 72, -19, 213, 40, -236, -67, -170, -181, -10, -305, -171, -81, -37, -165, 136, 8, 164, 52, -104, 299, 186, 53, -159, -139, -52, -66, 68, -115, -18, -14, 190, 131, -54, -157, -111, -162, -96, -42, 226, 260, 59, 104, 158, 161, 121, 60, 21, 113, 128, 33, 98, -28, -57, -28, 105, -62, -34, -101, 42, -100, 91, -44, 12, 150, 75, -147, -8, 148, 88, -228, 82, 37, -37, 227, -75, -157, -149, 111, -132, -73, -242, -56, -101, 36, 159, 29, -159, -20, -178, -78, -159, -6, 71, -57, -142, -93, -127, -50, 249, -9, -231, -171, 143, 265, 165, 114, -182, 225, 170, 147, -135, 203, 219, -5]
3675em6J26P2p7mN1K2j49j73Q5K03j46Q5J4J7L5J45N4j64r5Mj76O5NK28l03J86
3702E9m4P0Km94N49j15N4j27R8j41M9%P0R4l6M9j18p4k13J29R0J16l78K84R6l0
3728C9j97R2j80K66q4Q7J16k6j17NL05j73k68L23J1k40R9K9k22J1K78K6l85L81
3752A76j75J16L3j31P3k86O3J49j33J56J28k9L6o6Or7Rj72L01j92J31k03R1k9
3776d5K4o4L6J81j77oj62J04J05jJ29j26m4j88K75qo5l3k9J20j69N7K16m56M75
3801A49l5l00J78J68k46j20K19K7K47j84j28J6L0Q3o8lj77K99r1j30K97j78J21
3824A74k35m5N3K77l95K03O7l37M60k6l31L15o8j33p5K22q0R0j40M1M2j99J48
3847B8k02J17R5k31N4K79n7k30K83r4l4K00k52K26k37j13L30k82q7J35p0J91j02
$$ y = [-5, -51, 75, 147, 70, 66, 117, 139, -10, -183, -98, 105, -41, 44, 58, 75, 110, 255, 309, 145, 50, 54, -122, -57, -52, 176, -127, 59, 15, 85, 87, -407, 142, 27, 81, -46, 52, -89, -40, -40, 30, 124, 88, 137, 19, -55, -268, -139, -49, 67, -311, -27, 69, 39, -158, -66, -246, 20, -64, 23, 139, 113, -4, 1, 306, 133, -135, 188, 199, -41, 58, 87, -135, -124, 154, 180, -205, 176, 1, 117, 150, 19, 92, -194, -131, 18, -115, 41, 169, 140, 176, 110, 116, 19, 28, -144, 157, -35, 96, -107, -16, -45, -21, -85, -49, 132, -45, -51, -213, -109, -4, -5, 124, -2, -46, -234, 41, 33, -32, -65, -94, 26, -143, -86, 130, -326, 149, 114, -186, -8, 160, -86, -206, 13, 40, 287, 103, -25, -9, 21, 104, 36, 33, -144, 155, 64, -66, 231, 53, 174, -61, -106, -53, 224, -171, 32, 99, -238, 222, 196, -135, 180, 112, -21, -96, 126, 46, 136, -4, 37, 79, -120, 28, -174, -57, 38, -193, -139, 140, 83, -147, 136, 42, 8, 208, -44, 182, -55, -168, 162, -120, -207, -72, -142, 49, -53]
3870e3j81J43k64N44j69k22J64j19K60r4K5N1j56P0m4J10j62O3N1NJ1J11l39L10
3894A15k63K10n1J16k27R7o7L0N7lq4K04p2k37L03k88Q3q2O7J14j28%L5j24J37
3919e8J06j76J53k10L14r9M8k32Q5J12q1J06l3k08K39K05j45l96L14M8k00K82
3941A74l54K27k1k85K79m8L6r7j75M20k20RP4j24k3J07l42K39M0K47m13L34o7
3964A7K20l08J93j3l05Q6N7Q2lJ5L8K15p6j87j83K56j42j31J8K14L5j33j28K21
3988E8l7k40L23j95L1Jl1j21L28j41J9J90k25j90Q8l9L36k59J4L45m05K30k33
4011a53J54j7M8j86L00Rj01l68M12j69r3J99n5j74K62k0K2j45n8J40j68K80o3
4034E6J33k40q5Q9j9J09M2o8M3Q0o9j55J34J34o8j79K13m89K62K23j80N1j14j1
$$ y = [-53, -234, -91, -355, 189, 20, -202, -38, -157, 103, 9, 34, 85, -71, -1, -45, 65, -97, -34, 17, 22, 33, 144, -195, 115, -148, 62, 11, 127, -100, -3, -70, -40, 17, 14, -70, 134, 62, -175, 128, -160, -77, -159, -92, 22, -106, -106, -71, -195, -58, 48, -128, 25, -185, 129, 30, 78, -154, -69, 43, -38, 68, 35, -173, 66, 271, 126, -270, 44, 92, -108, 174, -180, 47, 26, -259, 20, -28, 8, -89, -264, 156, -64, -55, 19, -105, -128, -21, -363, -124, -84, 163, -250, 84, 17, 237, -71, 122, 109, -196, -110, -53, 29, 26, 41, 79, 294, 218, 31, -152, 104, -38, -169, -151, 63, 98, -35, -163, 58, 21, -219, 104, -91, -60, -59, -90, -211, 117, -24, -5, 185, -40, -230, -142, -181, 155, -104, -90, 255, -150, 80, -153, 1, -16, 32, -154, 146, 155, 54, -314, 98, -71, -164, 35, -20, -194, 68, 48, 70, -75, -133, 7, -161, 119, 56, 189, -51, -136, -47, -66, 43, 85, 17, 60, 140, 71, -84, 50, 184, 116, -63, 150, -339, -77, 146, -34, 17, -97, -108]
4058a08K38L8k88J8J79kK17l78N7R1K78j64k04jO2rj10O1j01K71J44j81O8j23
$$ y = [-108, 130, 168, -120, -102, 77, 75, 292, -86, -29, 62, 340, 176, -28, -29, 33, 24, -86, -25, -126, 145, 289, 108, 176, 53]
$$ [...]
8191B35
##END NTUPLES=NMR FID
##END=
