##TITLE=1H_SR57(28)
 CDCl3, 8 sc, 
 30.04.2021
##JCAMPDX= 6.0         $$ Bruker NMR JCAMP-DX V2.0
##DATA TYPE= NMR FID
##DATA CLASS= NTUPLES
##ORIGIN= UXNMR, Bruker Analytische Messtechnik GmbH
##OWNER= root
$$ XWIN-NMR		Version 3.5
$$ Fri Apr 30 14:47:04 2021 Russian Standard Time (UT+4h)  she@DPX200
##.OBSERVE FREQUENCY= 200.131506
##.OBSERVE NUCLEUS= ^1H
##.DELAY= (6, 6)
##.ACQUISITION MODE= SIMULTANEOUS
##.ACQUISITION SCHEME= undefined
##.AVERAGES= 8
##.DIGITISER RES= 18
##SPECTROMETER/DATA SYSTEM= spect
##.PULSE SEQUENCE= zg30
##.SOLVENT NAME= CDCl3
##.SHIFT REFERENCE= (INTERNAL, CDCl3, 0, 15.7039)
##AUDIT TRAIL= $$ (NUMBER, WHEN, WHO, WHERE, WHAT)
$$ ##TITLE= Audit trail, XWIN-NMR		Version 3.5
$$ ##JCAMPDX= 5.01
$$ ##ORIGIN= Bruker BioSpin GmbH
$$ ##OWNER= she
$$ F:/spectra/data/she/nmr/H-F/1/audita.txt
$$ ##AUDIT TRAIL=  $$ (NUMBER, WHEN, WHO, WHERE, WHAT)
(   1,<2021-04-30 14:46:19.59 +0400>,<she>,<DPX200>,
      <created by zg, POWCHK disabled, PULCHK disabled
       configuration hash MD5:
       00 E9 B6 7A A2 85 ED C7 34 08 36 98 17 FE 4E 26
       data hash MD5: 16K
       AD CE D0 29 20 64 25 90 22 58 40 09 2E 82 3A A9>)
$$ ##END=
$$ 
$$ hash MD5
$$ 47 F7 A2 D3 BD A6 C3 87 28 B4 67 64 88 0F D1 42
##$RELAX= 
##$RELAX= 
##$RELAX= 
##$RELAX= 
##$RELAX= 
##$RELAX= 
$$ Bruker specific parameters
$$ --------------------------
##$DU= <F:/spectra>
##$EXPNO= 1
##$NAME= <H-F>
##$PROCNO= 1
##$TYPE= <nmr>
##$USER= <she>
##$AMP= (0..31)
100 100 100 100 100 100 100 100 100 100 100 100 100 100 100 100 100 100 
100 100 100 100 100 100 100 100 100 100 100 100 100 100 
##$AQSEQ= 0
##$AQ_mod= 1
##$AUNM= <au_zg>
##$AUTOPOS= <>
##$BF1= 200.13
##$BF2= 200.13
##$BF3= 200.13
##$BF4= 200.13
##$BF5= 200.13
##$BF6= 200.13
##$BF7= 200.13
##$BF8= 200.13
##$BYTORDA= 1
##$CFDGTYP= 0
##$CFRGTYP= 5
##$CHEMSTR= <none>
##$CNST= (0..31)
1 1 145 1 1 1 1 1 1 1 1 1 1 1 1 1 1 1 1 1 1 1 1 1 1 1 1 1 1 1 1 1 
##$CPDPRG= <>
##$CPDPRG1= <>
##$CPDPRG2= <>
##$CPDPRG3= <>
##$CPDPRG4= <mlev>
##$CPDPRG5= <mlev>
##$CPDPRG6= <mlev>
##$CPDPRG7= <mlev>
##$CPDPRG8= <mlev>
##$CPDPRGB= <>
##$CPDPRGT= <>
##$D= (0..31)
0 1.2 0 0 0 0 0 0 0 0.06 0 0.03 0 0 0 0 0.0002 0 0 0 0 0 0 0 0 0 0 0 0 
0 0 0 
##$DATE= 1619779579
##$DBL= (0..7)
120 120 120 120 120 120 120 120 
##$DBP= (0..7)
150 150 150 150 150 150 150 150 
##$DBP07= 0
##$DBPNAM0= <>
##$DBPNAM1= <>
##$DBPNAM2= <>
##$DBPNAM3= <>
##$DBPNAM4= <>
##$DBPNAM5= <>
##$DBPNAM6= <>
##$DBPNAM7= <>
##$DBPOAL= (0..7)
0.5 0.5 0.5 0.5 0.5 0.5 0.5 0.5 
##$DBPOFFS= (0..7)
0 0 0 0 0 0 0 0 
##$DE= 6
##$DECBNUC= <off>
##$DECIM= 32
##$DECNUC= <off>
##$DECSTAT= 4
##$DIGMOD= 1
##$DIGTYP= 9
##$DL= (0..7)
0 120 120 120 120 120 120 120 
##$DP= (0..7)
150 150 150 150 150 150 150 150 
##$DP07= 0
##$DPNAME0= <>
##$DPNAME1= <>
##$DPNAME2= <>
##$DPNAME3= <>
##$DPNAME4= <>
##$DPNAME5= <>
##$DPNAME6= <>
##$DPNAME7= <>
##$DPOAL= (0..7)
0.5 0.5 0.5 0.5 0.5 0.5 0.5 0.5 
##$DPOFFS= (0..7)
0 0 0 0 0 0 0 0 
##$DQDMODE= 0
##$DR= 18
##$DS= 0
##$DSLIST= <SSSSSSSSSSSSSSS>
$$ [...]
##$SUBNAM2= <"">
##$SUBNAM3= <"">
##$SUBNAM4= <"">
##$SUBNAM5= <"">
##$SUBNAM6= <"">
##$SUBNAM7= <"">
##$SUBNAM8= <"">
##$SUBNAM9= <"">
##$SW= 16.9725357007746
##$SWIBOX= (0..15)
0 0 2 0 0 0 0 0 0 0 0 0 0 0 0 0 
##$SW_h= 3396.73913043478
##$TD= 16384
##$TD0= 1
##$TE= 0
##$TE2= 300
##$TE3= 300
##$TEG= 300
##$TL= (0..7)
0 120 120 120 120 120 120 120 
##$TP= (0..7)
150 150 150 150 150 150 150 150 
##$TP07= 0
##$TPNAME0= <>
##$TPNAME1= <>
##$TPNAME2= <>
##$TPNAME3= <>
##$TPNAME4= <>
##$TPNAME5= <>
##$TPNAME6= <>
##$TPNAME7= <>
##$TPOAL= (0..7)
0.5 0.5 0.5 0.5 0.5 0.5 0.5 0.5 
##$TPOFFS= (0..7)
0 0 0 0 0 0 0 0 
##$TUNHIN= 0
##$TUNHOUT= 0
##$TUNXOUT= 0
##$USERA1= <user>
##$USERA2= <user>
##$USERA3= <user>
##$USERA4= <user>
##$USERA5= <user>
##$V9= 5
##$VALIST= <valist>
##$VCLIST= <CCCCCCCCCCCCCCC>
##$VD= 0
##$VDLIST= <DDDDDDDDDDDDDDD>
##$VPLIST= <PPPPPPPPPPPPPPP>
##$VTLIST= <TTTTTTTTTTTTTTT>
##$WBST= 1024
##$WBSW= 4
##$XGAIN= (0..3)
0 0 0 0 
##$XL= 0
##$YL= 0
##$YMAX_a= 169733
##$YMIN_a= -250209
##$ZGOPTNS= <>
##$ZL1= 120
##$ZL2= 120
##$ZL3= 120
##$ZL4= 120
##$ABSF1= 10
##$ABSF2= 0
##$ABSG= 5
##$ABSL= 3
##$ALPHA= 0
##$AQORDER= 0
##$ASSFAC= 0
##$ASSFACI= 0
##$ASSFACX= 0
##$ASSWID= 0
##$AUNMP= <proc_1d>
##$AZFE= 0.1
##$AZFW= 0.1
##$BCFW= 1
##$BC_mod= 2
##$BYTORDP= 1
##$COROFFS= 0
##$CY= 11.3945322036743
##$DATMOD= 1
##$DC= 2
##$DFILT= <>
##$DTYPP= 0
##$F1P= 15.9154993809931
##$F2P= -4.1035820241983
##$FCOR= 0.5
##$FTSIZE= 0
##$FT_mod= 4
##$GAMMA= 1
##$GB= 0.15
##$INTBC= 1
##$INTSCL= 1
##$ISEN= 128
##$LB= 0.24
##$LEV0= 0
##$LPBIN= 0
##$MAXI= 10000
##$MC2= 0
##$MEAN= 0
##$ME_mod= 0
##$MI= 1.114404
##$NCOEF= 0
##$NC_proc= 0
##$NLEV= 6
##$NOISF1= 3.799351
##$NOISF2= 2.8
##$NSP= 1
##$NTH_PI= 0
##$NZP= 0
##$OFFSET= 15.70392
##$PC= 1
##$PHC0= -11117.47
##$PHC1= 7.601031
##$PH_mod= 1
##$PKNL= yes
##$PPARMOD= 0
##$PSCAL= 0
##$PSIGN= 0
##$REVERSE= no
##$SF= 200.130013532006
##$SI= 16384
##$SIGF1= 3
##$SIGF2= 2
##$SINO= 400
##$SIOLD= 16384
##$SREGLST= <1H.CDCl3>
##$SSB= 0
##$STSI= 0
##$STSR= 0
##$SW_p= 3612.71676300578
##$SYMM= 0
##$S_DEV= 0
##$TDeff= 0
##$TDoff= 0
##$TI= <>
##$TILT= no
##$TM1= 0
##$TM2= 0
##$TOPLEV= 0
##$USERP1= <user>
##$USERP2= <user>
##$USERP3= <user>
##$USERP4= <user>
##$USERP5= <user>
##$WDW= 1
##$XDIM= 8192
##$YMAX_p= 0
##$YMIN_p= 0
$$ End of Bruker specific parameters
$$ ---------------------------------
##NTUPLES= NMR FID
##VAR_NAME=  TIME,          FID/REAL,        FID/IMAG
##SYMBOL=    X,             R,               I
##VAR_TYPE=  INDEPENDENT,   DEPENDENT,       DEPENDENT
##VAR_FORM=  AFFN,          ASDF,            ASDF
##VAR_DIM=   8192,          8192,            8192
##UNITS=     SECONDS,       ARBITRARY UNITS, ARBITRARY UNITS
##FACTOR=    0.0002944,     1,               1
##FIRST=     0,             0,               0
##LAST=      2.4114304,     0,               0
##MIN=       0,             -250209,         0
##MAX=       2.4114304,     169733,          0
$$ Real data points
##PAGE= N=1
##DATA TABLE= (X++(R..R)), XYDATA
0@%%%%%%%%%%%Qj6J6j6K4l2M0m8N6p2Q5r8J17j36J54j78K08k40K74l13L56m04
$$ 0 0 0 0 0 0 0 0 0 0 0 0 8 -8 8 -8 16 -16 24 -24 32 -40 45 -53 64 -72 82 -96 112 -128 146 -167 189 -215
33b15M57n16N80o50P28q13R06j005J116j239J369j514J673j843K030k238K465
$$ -215 242 -274 306 -344 384 -429 477 -528 588 -651 718 -796 877 -966 1064 -1174 1291
50A291k715K991l295L635m016M448m940N507o165O941p876R023j0471J2355j4912
$$ 1291 -1424 1567 -1728 1907 -2109 2339 -2601 2906 -3259 3682 -4194 4829 -5642 6713 -8199
65h199J8588k4317L4438n7092J85334l9998l58963M19942k20175m9341K46834
$$ -8199 10389 -13928 20510 -36582 148752 108754 -250209 169733 -50442 -99783 147051
76A47051k33254R3963P9075j53244Q7857l0039K6186k0880j6865Q1849r8665M7416
$$ 147051 -86203 7760 86835 -66409 21448 -8591 17595 -3285 -20150 61699 -36966 10450
88A0450K5523j09525J19539l9673m3826P7847n6509K8612M135m3102L2708n849
$$ 10450 35973 -73552 45987 6314 -37512 40335 -16174 12438 16573 -26529 6179 330
100C30J2433l6561K5764K9709o9205N7367k7794j5286P1514j06249O7988L2366
$$ 330 12763 -23798 1966 31675 -37530 19837 -7957 -23243 48271 -57978 10010 42376
112D2376j03429J03896n9826j2285Q9541j22384P1611J9871q1480R4936o5624
$$ 42376 -61053 42843 -16983 -29268 60273 -62111 9500 29371 -52109 42827 -22797
123b2797L763N8014p7236N1546j6391p219L5615o5170O5334k2759l3221P3937
$$ -22797 -19034 38980 -38256 13290 -3101 -10320 25295 -39875 25459 2700 -30521 43416
135D3416q5182M9088L3147r9278R0005k0575m1256O4911n4925K3161J4679l3646
$$ 43416 -41766 7322 40469 -58809 31196 10621 -30635 34276 -20649 2512 17191 -16455
147a6455L0314k4913K5377r902k8413N9074m9606P899L6352n9995M9747p354l6997
$$ -16455 13859 -11054 14323 4421 -23992 35082 -14524 -6625 29727 -30268 19479 12125 -24872
160b4872M7488k6543N475N146j5976K5786k7740J7762j08k6025M6562l9735K518
$$ -24872 22616 -3927 1548 6694 -9282 16504 -11236 6526 6418 -19607 26955 -12780 -10262
173a0262L8377n3172L4553r62l0851M4887l3511L541K1510l0153K6137j5393l896
$$ -10262 28115 -25057 9496 8534 -22317 22570 -10941 -7400 14110 -16043 10094 -5299 -9195
186i195K2888k8982J9801l632j3286K4767k3221Q935P979j8499J9224j3187K435
$$ -9195 13693 -15289 4512 880 -12406 12361 -10860 -1925 6054 -12445 6779 -6408 -3973
199c973J0672j9068J7270o437n144J4451j7028J1064J363j0949J3796j0186M537
$$ -3973 6699 -12369 4901 -1536 -6680 7771 -9257 1807 3170 -7779 6017 -4169 368
212C68K678q901J2327r915L413N240j2680J5507q569k624J3430j7283J1624N56
$$ 368 3046 -5855 6472 -3443 -30 5210 -7470 8037 -532 -3156 10274 -7009 4615 5171
226E171j2420J8288j3685J440J1460j7386J1623M89r884J3218q719J37N808o781
$$ 5171 -7249 11039 -2646 -1206 10254 -7132 4491 4980 -4904 8314 -405 -268 5540 -1241
240a241L853j379j97K47j993M445o400K357M700q789N779J050o653N546L13n579
$$ -1241 2612 1233 1036 1283 -710 3735 -2665 -308 4392 -4397 1382 2432 -4221 1325 1638 -3941
256c941M633J411n800K277L925o842L495K818p912N886R79o532N815r64j883K955
$$ -3941 692 2103 -3697 -1420 2505 -4337 -842 1976 -5936 -50 929 -5603 212 -752 -2635 320
272C20k153M26m82O09o07n00L415l982K32M681m850K788J609m220L607k09k390
$$ 320 -1833 -1407 -1889 -1280 -1887 -2387 1028 -2954 -2722 1959 -2891 -103 1506 -2714 893 684 -1706
289a706K012N94j061L04R75j004M40J103j796J345Q9k45P55j833L437k210k429
$$ -1706 306 900 -161 143 1118 114 554 1657 -139 1206 1295 1050 1805 -28 3409 1199 -1230
306a230O034n366O00N236q367N533K653r015P454l78n139N506l247n00K593k671
$$ -1230 4804 -562 38 5274 -3093 2440 5093 -3922 3532 3154 -1985 3521 274 -226 2367 -304
322c04J296j563J952K46n516O277q28o364Q458l483m678R936q011j841J0083r691
$$ -304 992 -571 1381 1627 -3889 2388 1560 -4804 3654 171 -4507 5429 -2582 -4423 5660 -4031
338d031K71Q657j0396M863L429r958R677k334o079R357n773n33N725r074O461
$$ -4031 -3760 4897 -5499 -636 2793 -7165 2512 178 -5901 3456 -2317 -2850 2875 -6199 262
353B62J402p602Q157m193j278P270r364N092L732q816Q145k451m022R309p762
$$ 262 1664 -5938 2219 -1974 -3252 4018 -5346 -254 3478 -5338 2807 356 -3666 5643 -2119
368b119K64P906j0013N914P83o873R645n711k179Q947r339L710L815r414R674
$$ -2119 -1855 6051 -3962 1952 2735 -4138 5507 -204 -2383 6564 -2775 935 4750 -4664 5010
383E010k822o387J1034p981N58O774j0436P430Q97p999Q346m104j534N088o553
$$ 5010 2188 -4199 6835 -1146 -588 6186 -4250 3180 4077 -3922 4424 320 -1214 3874 -2679
398b679M202M38m248M390l053Q28J846m150L422q69j801K043j693P52J88r09L47
$$ -2679 1523 1961 -2287 2103 -950 -122 1724 -2426 996 127 -1674 369 -1324 -572 -384 -1293 -946
415i46Q7M19j876J576m3j662L166l425J639K276n070M434j721k107N883o346K717
$$ -946 -859 -440 -2316 -740 -783 -2445 721 -2704 -1065 1211 -3859 575 -1146 -3253 2630 -3716 -999
432i99K961o523P059l595j844O590p552M842Q65n492P341n549J603M115p741O722
$$ -999 1962 -4561 2498 -1097 -2941 3649 -3903 939 1804 -3688 3653 -1896 -293 3822 -3919 2803
448B803k439j953O559p865M404J476n491O817m561N7M186n946M890k090j755M383
$$ 2803 364 -1589 4970 -2895 1509 2985 -2506 4311 -250 -193 3993 -1953 2937 847 -908 3475
464C475m931M192j440k643M962n548L942Lm779O782n480J495L197p333O854l079
$$ 3475 -1456 2736 1296 -1347 3615 -1933 2009 2012 -2767 4015 -1465 30 3227 -4106 2748 -331
480c31j943O270q216N303K13n566Q123p089J980L920p624P393m351j636P337r154
$$ -331 -2274 3996 -4220 1083 1296 -4270 3853 -3236 -1256 2664 -4960 2433 -1918 -3554 3783 -5371
496e371O215n39n851R339p221J307N065q751Q010k739k906O527o941M298P00l866
$$ -5371 844 305 -5546 3793 -3428 -2121 2944 -5807 2203 -536 -3442 3085 -3856 442 1142 -2724
512b724N698o116L140J677n414O955m840N63M779o783N432k349j927O431p036
$$ -2724 2974 -3142 -2 1675 -3739 3216 -1624 -1061 3718 -3065 2367 18 -1909 4522 -2514
527b514M239j1m628P967n771J674K805o285O453l785j194N546p069N135j48n492
$$ -2514 1725 1714 -2914 5053 -718 956 3761 -2524 3929 144 -1050 4496 -2573 2562 2414 -3078
543c078Q942p433J892L668p161O271k504l360P201p178L719O82m659O166m911
$$ -3078 5864 -1569 323 3991 -3170 3101 597 -2763 4438 -2740 979 1661 -2998 3168 -1743
558a743J176K397n102N377l573m15L861n833M999j343l015N369n204K715J425
$$ -1743 -567 1830 -3272 2105 -1468 -1883 1978 -3855 1144 -199 -3214 2155 -3049 -334 1091
573A091m723M942l289O85K569m681M335k401k78L947n690M229o38l397O467n907
$$ 1091 -3632 1310 -1979 -1294 1275 -3406 929 -1472 -1750 2197 -3493 736 98 -3299 3168 -2739
589b739J933L019n933O193k687k021N353n147L389P4l430M664l400O93K314l742
$$ -2739 -806 2213 -3720 2473 -214 -2235 3118 -2029 1360 1434 -1996 2668 -732 -39 2275 -1467
605a467L752j925m89L032l915K893n16j889L661l506J389R91l206L277j561p81
$$ -1467 2285 360 -129 2903 -1012 1881 1365 -524 3137 -369 1020 2011 -1195 2082 521 -260
621b60K090k273J428o71p51J691k060J953j305o49K243k858J930J98l070L604
$$ -260 1830 -443 985 314 -437 1254 -806 1147 -158 -807 1436 -1422 508 706 -2364 1240
637A240k321j55K512l721K362n8j605K409k433R84Q91j933K130j871M17J204j935
$$ 1240 -1081 -1236 1276 -2445 -83 -141 -1746 663 -1770 -786 105 -1828 302 -1569 -1152 52 -1883
654a883K202j091r83K567k365R64J064k254K128p49m31J559j519M98O42q12Q55
$$ -1883 319 -772 -1755 812 -1553 -589 475 -1779 349 -400 -831 728 -791 -293 349 -463 392
671C92p16P03L69r89J002m30Q8M09m94N48r6j45q8K98K73n28M19n31L89O37j442
$$ 392 -324 379 748 -241 761 331 419 828 334 882 786 641 553 851 1124 596 1015 484 873 1510 68
692F8N93M27q41N61l44O6O04q46L7K43j3j91n74K57L91m70P3l74K27m3m41L10
$$ 68 661 1088 247 808 464 530 1134 288 325 568 555 364 -210 47 438 -32 41 -333 -106 -149 -590 -280
714b80k77O28q61n8P60o79K58j82l48Q99r07J15O40q27Q50q37L63J221j611N82
$$ -280 -557 71 -790 -848 -88 -767 -509 -691 -1039 -140 -1047 -932 -292 -1119 -269 -1106 -743 478 -1133 -551
734e51j7l95J448j560L02J404j414Q99n47qR54j108O49N24n24O55j128O93R48
$$ -551 -568 -963 485 -1075 -773 631 -783 116 -431 -439 515 -593 56 580 56 711 -417 276 1224
753A224j496R80n09L66N79j115P84J53m74N54r51R75j82p68J254j389R16k70p17
$$ 1224 -272 708 199 565 1144 29 813 966 492 1046 95 1070 888 120 1374 -15 901 631 -86
772h6J301o75r4J29j407J767r26n38J740k070J677m15j406J871j773j44J565j028
$$ -86 1215 540 446 575 -832 935 9 -529 1211 -859 818 403 -1003 868 -905 -1049 516 -512
790e12M98n24q96K018j220J69J71p95J800j578k73J400j307R41l01N2n4n88J12
$$ -512 -14 -538 -1434 584 -636 -467 -296 -1091 709 -869 -1142 258 -1049 -108 -409 -357 -411 -999 -887
809h87O78j38N48r04N22K20o08O87q15N82N60j001Q31l30j70Q38j171R33O36j102
$$ -887 -209 -347 201 -703 -181 39 -569 118 -697 -115 445 -556 275 -55 -225 613 -558 375 1011 -91
829i1O42m05L79K83p65P29l72n1O95j027Q20Q8j044J157o05J15N27j227Q35k95
$$ -91 551 146 525 808 43 772 400 349 1044 17 837 925 -119 1038 433 548 1075 -152 683 388
849C88k29P40p28j1M72q62O14J02n34R3k40K43l5K3n37M66l46p97Q58n3o0j25
$$ 388 159 899 171 160 632 -230 384 486 -48 45 -195 48 13 36 -501 -35 -381 -1178 -320 -373 -433 -558
871e58L10k08m19N35o81L77K06m33K98K58n62N11l52K67k23J67K35k94N77j64
$$ -558 -248 -456 -875 -340 -1021 -644 -438 -871 -573 -315 -877 -366 -718 -451 -674 -507 -272 -566 11 -153
891a53l64N32l52k90R28o91K60O87o84M27K75o02M17j30J7J3J14K42n50O53j69
$$ -153 -517 15 -337 -627 301 -390 -130 557 -127 300 575 -27 390 260 277 290 404 646 96 749 580
912E80r4Q6j03j15L83o20M62l20J94M62q91M79J10o17P99o60L26R1m20M44n76
$$ 580 486 572 469 354 737 117 579 259 453 915 24 503 613 -4 795 135 461 552 132 576 0
933@j95R47j397J115m81n42P52o24J62M78j121Q45j32n83Q92r28N05k49j60L05
$$ 0 -195 752 -645 470 -11 -553 199 -425 -263 215 -906 -61 -193 -776 116 -812 -307 -556 -716 -411
953d11l18N2J23j4K16p97P05P0k29N70o24K77P04j278J110q9q04J393j178Q35
$$ -411 -729 -677 -554 -568 -352 -1149 -444 -374 -603 -33 -657 -380 324 -954 156 67 -737 656 -522 313
973C13J98j300J523p91L86O03j533J250j2q51J115j275J032L78j232J487j129
$$ 313 511 -789 734 -57 329 932 -601 649 637 -214 901 -374 658 1036 -196 1291 162
990A62K27O35j144P62j10o69J296j048L52J19r69J011l40l25J89l64R24p27j58
$$ 162 389 1024 -120 642 532 -137 1159 111 463 582 -387 624 284 -41 148 -216 708 -19 -177
1009a77M44l28L69l69k67N20p10M61K3m38N82q65L43L61p74P16p11L21N08q34
$$ -177 267 -61 308 -61 -328 192 -518 -57 -34 -472 110 -755 -412 -51 -825 -109 -820 -499 9 -825
1029h25Q14o79p7R25j285Q16J79r62J280o76P9M59q95N73K19j78M23n68O62P4
$$ -825 -11 -690 -767 158 -1127 -311 -132 -1094 186 -490 -411 48 -847 -274 -55 -233 190 -378 284 358
1049C58p71O98l92L75K21o92O77k29j70L88k44L65k40k15M00j72M85o19J89M38
$$ 358 -413 285 -107 268 489 -203 474 245 75 463 219 584 344 129 529 357 842 223 412 850
1069H50o59M45n92L75L88j013O90J9m10O45o26k72Q75j000J26L59l90N96n65K74
$$ 850 191 636 44 419 807 -206 484 503 93 738 112 -160 715 -285 -159 200 -190 406 -159 115
1089A15M9n72K60k68L4M63o62L53m3P9J35k63j42p0J62j76JK77j99J69J49n66
$$ 115 164 -408 -148 -416 -382 81 -581 -228 -271 -192 -57 -320 -462 -532 -370 -546 -545 -268 -467 -298 -149 -715
1111g15Q60n36k65Q73j004N63J54n41J035o36J13L14p50P38k60j37Q85q23L14
$$ -715 145 -391 -656 217 -787 -224 -70 -611 424 -212 -99 215 -535 203 -57 -194 691 -132 182
1130A82N27q88P97o62K11N86o37L89j04j36M00p22O17j76j82L11o02M09K69l73
$$ 182 709 -179 618 -44 167 753 116 505 401 265 665 -57 560 384 202 513 -89 320 589 216
1150B16N15n97K45J79o81N27l34q2L68j009J078m13o50J005p36M24L5r82J391
$$ 216 731 134 379 558 -123 404 70 -12 356 -653 425 12 -638 367 -369 55 90 -892 499
1169D99j014J9Q10j021O00j94n28Q67j061J167j32j161J038m08l6O96j062P74
$$ 499 -515 -496 314 -707 -107 -301 -829 38 -1023 144 12 -1149 -111 -519 -555 141 -921 -147
1187a47n1m05O16p09O65J73n17Q37q64J06O16p14R09o60J39P31j050P63k32l53
$$ -147 -198 -603 13 -696 -31 142 -375 462 -402 -296 320 -394 515 -145 -6 725 -325 438 206 -147
1207a47R67q25L59K53p52J164q22j9O26j164Q98k86j25R48j333N49M05p08J017
$$ -147 820 -5 354 607 -145 1019 197 178 804 -360 538 252 127 1075 -258 291 696 -12 1005
1226A005r74O3O42j014O87m06n2L80n20J93Q4n07N34l97K52J93m66N05o77K74
$$ 1005 31 94 736 -278 409 3 -49 331 -189 4 88 -419 115 -282 -30 163 -303 202 -475 -201
1246b01K88o57P37m27l53O48o03P13k85m67N57o62M58L51n44M60n19o4R88j035
$$ -201 87 -570 167 -260 -613 35 -568 145 -140 -607 -50 -712 -254 97 -447 13 -506 -570 418 -617
1266f17P70l83m70J180r86N37J88m53O65m36lN56o88M63k02j86O55o05M93P1n42
$$ -617 153 -230 -700 480 -506 31 219 -234 431 -5 -8 548 -140 323 121 -65 590 -15 478 549 7
1287GN54k23j17J00l38N61j47k95L82l84K1L14l33O12l24k88J69j91N32l31q0
$$ 7 561 338 221 321 -17 544 397 102 484 100 121 435 102 714 390 102 271 80 612 281 201
1308B01j40j36M25j84p3K53o01M21l82j61K96M5k31K71n66N32j47n40P90o75J86
$$ 201 61 -75 350 166 93 346 -255 166 -216 -377 -81 -36 -267 4 -562 -30 -177 -717 73 -602 -416
1329d16K25j99J31k00P1K14k95L89k25Q0J20m7N3q0k22L59k72J57J29q3K16k11
$$ -416 -191 -390 -259 -459 -388 -174 -469 -80 -305 -225 -105 -152 -99 -179 -401 -42 -314 -157 -28 -111 105 -106
1351a06j6K56j19pK53l66P22p08L93j83J84J77l28L06j57n8Q9k04K04j66j28M47
$$ -106 -122 134 15 8 261 -105 617 -91 302 119 303 480 152 458 301 243 332 128 332 166 38 485
1373D85m1l02L64j95k3J48k22J44j09k09K54k62j37L07k78J48j6j52N5m2j79R0
$$ 485 444 142 506 311 288 436 214 358 249 40 294 32 -105 202 -76 72 56 -96 -41 -83 -262 -172
1395a72J21p4J2k71M30p8k92L24K8k49J42j37j13l4J6r6R4j26K94j61O7K71j56
$$ -172 -51 -125 -113 -384 46 -32 -324 0 28 -221 -79 -216 -329 -363 -347 -443 -349 -475 -181 -342 -275 -4 -160
1418a60q8J81J40q0J19o4K0l06K60Q8k40LK54R6l2J85l08J66j20j28J65k8J91
$$ -160 -248 -67 73 -7 112 48 68 -238 22 110 -130 -127 127 223 191 376 68 234 114 -14 151 123 314
1441C14K92m19L3J55j54K32k37M37o17J01M65j42m01K88m01J0K61Q3j95k41N8
$$ 314 606 187 220 375 221 453 216 653 36 137 602 460 59 347 -54 -44 217 300 105 -136 -78
1462g8K50k17K0k0r4K92p4k54mJ1k07M49l8l78L61m10j30J63P3L74m55j53L53
$$ -78 172 -45 -25 -45 -139 153 79 -175 -179 -168 -375 74 36 -342 19 -391 -521 -358 -285 89 -366 -519 -166
1485a66r9r1L83m96J44J72J0N9k08n0M95m82L76L12m54K22j62J45L25m39K11k00
$$ -166 -265 -356 27 -469 -325 -153 -143 -84 -292 -342 153 -329 47 359 -95 127 -35 110 435 -4 207 7
1507Gk2M77l69j50K46M0L8o6K77l77K37k8q2j3L6K00r4j07oK3k35L63m58J24M8
$$ 7 -15 462 93 -57 189 229 267 201 478 101 338 310 228 215 251 451 357 250 244 267 32 395 -63 61 109
1532A09r8K92N6j62J64l78J25J69k01r3j82J35J53k64j94K77Ln0j06k03P9J51
$$ 109 11 303 359 197 361 -17 108 277 76 -17 -199 -64 89 -175 -369 -92 -89 -139 -245 -448 -369 -218
1554b18r0J87k02O8j5O8l02M24j99K23J8mj38k6M4O3P9p8Jj75K75J95l36J68J58
$$ -218 -308 -121 -323 -255 -270 -202 -504 -80 -279 -56 -38 -42 -180 -206 -162 -99 -20 -98 -97 -272 3 198 -138 30 188
1579A88j47K70k46N6j76j09N02j40KJ52k74L22k09q9J60J44j75r5K7L65j61j36
$$ 188 41 311 65 121 -55 -164 338 198 200 352 78 400 191 102 262 406 231 136 163 528 367 231
1601B31q9o4K34j36J9K53m12J18p5k42N52n57J26p9K40k86KR8mm25N13j17j05
$$ 231 142 78 312 176 195 448 36 154 79 -163 389 -168 -42 -121 119 -167 -165 -67 -71 -496 17 -100 -205
1624b05O5j13J39q5l33L03p8L07k52n8J73j27KK49k58K29o0k43M30n69M78r7j13
$$ -205 -140 -253 -114 -199 -532 -229 -307 0 -252 -310 -137 -264 -262 -13 -271 -42 -102 -345 85 -484 -6 -103 -216
1647b16M62m23O1K61l92L81K02l08K55k81L63l11k7k4J36kJ09j47K71j85j4J36
$$ -216 246 -177 -116 145 -247 134 336 28 283 2 365 54 27 3 139 137 246 99 370 185 171 307
1669C07k12M85m40K16rj73K7J7j15L41p42L78J58l46L72m21J28J60k84M39j66
$$ 307 95 580 140 356 347 174 201 218 103 444 -298 80 238 -108 264 -157 -29 131 -153 286 120
1690A20l84L96n00L41K0k75J55m03M31K74o04L72j98k2K08l92L41m76J68K62j16
$$ 120 -264 132 -368 -27 -7 -282 -127 -530 -99 175 -429 -57 -255 -277 -69 -461 -120 -596 -428 -166 -282
1711b82j27J66Jj1J39j42J06m14N19Q4k63K36l58L18j03K06j1k04Q0K07l77M26
$$ -282 -409 -243 -242 -253 -114 -256 -150 -564 -45 39 -224 12 -346 -28 -131 75 64 -140 -60 147 -230 196
1733A96j86P3J44j3p3K00j37J93n2j75K27k76J20L3j43J5j2K38l26Q8Jk13M35
$$ 196 10 83 227 214 141 341 204 397 345 170 397 121 241 274 131 146 134 372 46 134 135 -78 357
1756C57N8k21J6j76%J90k65L1L40m18K10l15K52M7j15R4j41j59K10m07N09l65
$$ 357 415 194 210 34 34 224 -41 -10 330 -88 122 -193 59 106 -9 85 -56 -215 -5 -412 97 -268
1778b68Q4o1k18K05J2L5J53k71K41K32k83O3k50K34j77J72J02r0k34N52m28j32
$$ -268 -184 -245 -463 -258 -246 -211 -58 -329 -88 144 -139 -76 -326 -92 -269 -97 5 -85 -319 233 -195 -327
1800c27M79Jk25J01n2j3n7L32J1k07j15K79j86J59k84K14j74K59J00k06L55j99
$$ -327 152 153 -72 29 -23 -36 -93 239 250 43 -72 207 21 180 -104 110 -64 195 295 89 444 245
1822B45j8j75j57L50j14l53M82j96L06k58k09L44j49r6O9o5J12j49K34k18j47
$$ 245 227 52 -105 245 131 -222 260 64 370 112 -97 247 98 2 71 6 118 -31 203 -15 -162
1843a62K5n1J62O7j65j21K6O8M18n45K1K72k60Q1k52J95R9j56J20L17m39J70J8
$$ -162 -137 -188 -26 41 -124 -245 -219 -151 267 -278 -257 15 -245 -164 -416 -221 -122 -278 -158 159 -280 -110 -92
1866i2j27J89l07M18k63Q0L13k71O7Q4k05J62Kl11l6J29L08l83L65K43j23Q4n69
$$ -92 -219 -30 -337 81 -182 -102 211 -60 7 91 -114 48 50 -261 -297 -168 140 -243 122 365 242 326 -243
1889b43L41N86m94M61q8o31L40q8L4q5q3J58J60j08J70m70J25K48k70ok31K04
$$ -243 98 684 190 651 563 -68 272 184 218 133 50 208 368 260 430 -40 85 333 63 57 -174 30
1911C0J33k9j04NO9j15j73K12l9p1N5k03j4Q5J14J19k48k6j04J89K75m23q6L13
$$ 30 163 134 30 35 104 -11 -184 28 -11 -82 -27 -230 -244 -159 -45 74 -174 -200 -304 -115 160 -263 -349 -36
1935c6j83J66n7Jk3n1r9K15MK37l29J25K2mO4k7k37J27R2J08p4j27K81r3j57J36
$$ -36 -219 -53 -110 -109 -132 -183 -282 -67 -63 174 -155 -30 -8 -12 52 25 -212 -85 7 115 41 -86 195 102 -55 81
1961H1pj5L88n3n3k11q1l9K48j14j10j15K84l9q5j7j18J82k63K06O4J0M1J16n4
$$ 81 74 59 447 394 341 130 49 10 258 144 34 -81 203 164 79 62 -56 126 -137 69 133 143 184 300 246
1986B46j78p2k1M0L1n2O2j13j47M33k88Kj59J56l3M7k65q5K35Mj46K16p0K46o3
$$ 246 68 -4 -25 15 46 -6 56 -57 -204 229 -59 -57 -216 -60 -93 -46 -311 -396 -161 -157 -303 -87 -157 89 26
2011B6j05q2or3P5J56j60O5K60k06k7R4L7j05j17J68k5j69J48K82l92L08k01K23
$$ 26 -79 -161 -167 -260 -185 -29 -189 -124 136 -70 -97 -3 34 -71 -188 -20 -45 -214 -66 216 -176 132 -69 154
2035A54j13J6O6P8l23L12j03j7M9k18K16R7m4J45m7k5j17J72n7k62J51J9P2j64
$$ 154 41 57 123 201 -122 190 87 70 119 -99 117 214 170 315 268 243 126 298 241 -21 130 149 221 57
2059E7J10k71J86j54K42j64j7kM7m4J21j50l6k02M13j15k15K86l64p6K11l3J16
$$ 57 167 -104 82 -72 170 6 -11 -13 34 -10 111 -39 -75 -277 136 21 -194 92 -272 -348 -137 -170 -54
2082e4j81q3J63m8K4K03k02M14l27K1q1J08n5N2k01P9J45o6J76j01K23j29oj49
$$ -54 -235 -318 -155 -203 -179 24 -178 236 -91 -70 -151 -43 -98 -46 -247 -168 -23 -89 87 -14 209 80 74 -75
2106g5P4K65j12lj83J68L9q9J09L7rK5j13K0J69k56q5K22k65Q6k6o3N6J82L8j34
$$ -75 -1 264 152 149 -34 134 173 84 193 230 221 246 133 153 322 66 -19 203 -62 24 -2 -65 -9 173 211 77
2132G7R9q2L48n93K41l25L69k01kK29l20J15J41m25J23J97o8l6Q9o6J2j15jr6
$$ 77 176 94 442 -151 90 -235 134 -67 -69 160 -160 -45 96 -329 -206 -9 -77 -113 -24 -90 -78 -193 -194 -290
2156b90K44p0p9K58l69K42k93Q6M11j55k95J38P6o8N4j36J85P5j19K2K89j94l07
$$ -290 -46 -116 -195 63 -306 -64 -357 -271 140 -15 -310 -172 -96 -164 -110 -246 -61 14 -105 -83 206 12 -295
2179b95L24k06M1L67l69J79k10M29k87N4k5J61P3l25K88k99K33O1j67J92j80j80
$$ -295 29 -177 -136 231 -138 41 -169 260 -27 27 2 163 236 -89 199 -100 133 194 27 219 39 -141
2201a41K78p8J31p4Nk32L94m66K32Lp7J25p8Q7j45K23N4j16p1j65k2P8j31J21
$$ -141 137 59 190 116 121 -111 283 -183 49 52 -25 100 22 109 -36 187 241 125 54 -111 -133 -55 -186 -65
2225f5q7r4j01K76o0J32r3k5j94N13l13PK8J47j87M2K2k9P0j54m4K15J59p5k97
$$ -65 -152 -246 -347 -71 -131 1 -92 -117 -311 202 -111 -104 -76 71 -116 -74 -52 -81 -11 -165 -209 6 165 90 -207
2250b07m9J22R3Jj64L70q1K4l12K90N3j49k15M16K30m53L88j91Q6n1m7j39r0J26
$$ -207 -256 -134 -41 -40 -204 166 85 109 -203 87 140 -9 -224 192 422 -31 357 166 252 201 154 15 -75 51
2274E1K1O5k39L57j50j70L38j23j04L9j28K5j75K67r3J33l5M8pj62l6J3R5n4J99
$$ 51 72 137 -102 255 105 -65 273 150 46 85 -43 -18 -193 74 -19 114 79 127 120 -42 -78 -65 30 -24 175
2299A75q1j04k01K5RJ31p7J90J6j75Q7j88K7r1J25jj21J45J13J9L1Nk00Q3J37
$$ 175 94 -10 -211 -186 -177 -46 -123 67 83 -92 -5 -193 -166 -257 -132 -133 -254 -109 4 23 54 59 -141 -58 79
2324G9l03m9P9Q2k11M89j86j51J42KK57j59j17K57q2P5q8O5R4j74J13J77k02l97
$$ 79 -224 -273 -194 -112 -323 166 -20 -171 -29 -27 230 71 -46 211 129 204 116 181 275 101 214 391 189 -208
2348b08K93j66J05M78m39J17mj20K2n2M3M80p29L51j20n7l2j78L09Kj69p6L71
$$ -208 85 -81 24 502 63 180 176 56 78 26 69 549 -180 171 51 -6 -38 -216 93 95 -74 -150 221
2371B21k48L9J29j28j93j80K60J26k60K27j97K34rL3kl69J49K07j89M1p9n7L06
$$ 221 -27 12 141 13 -180 -360 -100 26 -234 -7 -204 30 21 54 52 -317 -168 39 -150 -109 -188 -245 61
2394F1O4l56M75m40M43o92N41k05J91k86K29qq5J50K79j66n05K27J16P4j60K38
$$ 61 125 -231 244 -196 247 -445 96 -109 82 -204 25 17 -68 82 361 195 -310 -83 33 107 -53 185
2416A85q1o8P3J14k14J62R9j94J72j5j22K53n13J62L37l98K81n5k76K2KK7J66
$$ 185 104 36 109 223 9 171 270 76 248 233 111 364 -149 13 350 -48 233 178 -98 -76 -74 -47 119
2439A19j93K21N4m5j12k73L65m6j26N9j35J54k47kKL10j44j68m1K00j04J62mk05
$$ 119 -74 147 201 156 44 -229 136 90 -36 23 -112 42 -205 -207 -205 105 -39 -207 -248 -48 -152 10 6 -199
2463a99k9o1K73k24Q2J44j10L9j86K74j62K10j43j41N8q8K36K5q9J72lq7pQ8j90
$$ -199 -228 -289 -16 -240 -158 -14 -124 -85 -271 3 -159 51 -92 -233 -175 -263 -27 -2 -91 81 78 -9 -16 72 -118
2488a18Q7J63J87k15K70k61j9j14K34q1L2%m9M3j27K1J5J95j30q6Q7K1j73J8L66
$$ -118 -31 132 319 104 374 113 94 -20 214 133 165 165 116 159 32 53 68 263 133 47 134 155 -18 0 366
2513C66m5l62j4qJ15K7o9J83j21j56j25N5K63k39M4Q8Q6k15Q1k7J40k45J85k26
$$ 366 321 -41 -55 -63 52 79 10 193 72 -84 -209 -154 109 -130 -86 2 88 -127 -46 -73 67 -178 7 -219
2537b19K08N3k26Q1R9j21N5P0j78J85J12j90k3k6K18j73M8N4j16q6L63l62J75
$$ -219 -11 42 -184 -103 -4 -125 -70 0 -178 7 119 -71 -94 -120 98 -75 -27 27 -89 -175 188 -174 1
2560AO7n9J01J90j51K64k01k65J11J11n6O2j0n49M22J69j24j28o7J91K43k08r7
$$ 1 68 9 110 300 149 413 212 -53 58 169 113 175 165 -384 38 207 83 -45 -112 79 322 114 17
2583A7K1K53l39J61J46j69J60l09j20N2P3J17j22O9m1j46Pk4J14j5j67k1J45J89
$$ 17 38 291 -48 113 259 90 250 -59 -179 -127 -54 63 -59 10 -31 -177 -170 -194 -80 -95 -262 -283 -138 51
2607E1k70L19q6j90l0n4mK33k10k4J76K70n24L95r1j21J56k79J35J44R7l7l1o0
$$ 51 -219 100 14 -176 -206 -260 -264 -31 -241 -265 -89 181 -343 52 -39 -160 -4 -283 -148 -4 93 56 25 -35
2631c5J20QRl24K08J12l0P4r9J3j21K15J55l81J30J51j3jj16j99N23j92j26k9
$$ -35 85 93 102 -222 -14 98 68 142 43 56 -65 150 305 -76 54 205 192 191 75 -124 399 207 81 52
2655E2j5j29J19K39k83J11p1P8M0q4k59K5J16L1j52L01l17q8O1K45m0L2m0l44
$$ 52 37 -92 27 266 -17 94 23 101 141 57 -202 -177 -61 -30 -182 119 -198 -286 -225 20 -20 12 -28 -372
2679c72L42j18K81k71j9Q8k19J27np7K18Nj4N7j96o1K39K4Pm8P9Ll78L82j25J83
$$ -372 -30 -148 133 -138 -157 -69 -288 -161 -166 -243 -25 -20 -34 23 -173 -234 5 29 36 -12 67 70 -308 74 -51 132
2705A32j51L7pp2n4M6K01M6m1k08RJ2o0K35Pj15L8M7R0m9k88R4K16l32L58n4N6
$$ 132 -19 18 11 -61 -115 -69 132 178 137 -71 -62 -50 -110 125 132 17 55 102 192 143 -145 -51 165 -167 191 137 193
2732A93N2j12j3j8M9m8K3m29J73K51j79M5J76j75K3j2k07J59Q5p6j74J50L1J16
$$ 193 245 133 120 102 151 103 126 -303 -130 121 -58 -13 163 -12 11 -1 -208 -49 36 -40 -214 -64 -33 83
2756H3j11j0k1j04J06j97J97J79j64j40j23K58O6l11K51K04j03M3r1L6J05qm01
$$ 83 -28 -38 -59 -163 -57 -254 -57 122 -42 -182 -305 -47 19 -292 -41 163 60 103 12 48 153 145 -256
2779b56L94j96l7oK62K5k6k37O6K04q5m3j08J31M3l37M7J68L37m97R4P5M8J78
$$ -256 138 -58 -95 -101 161 186 160 -77 -11 193 108 65 -43 88 131 -206 -159 9 346 -151 -57 18 66 244
2803B44k84K43M9J28l08m0L70l76J82k31O9r3k0M8J26L1k67J03J26j88K02j95
$$ 244 -40 203 252 380 72 32 402 26 208 -23 46 -47 -67 -19 107 138 -129 -26 100 -88 114 -81
2825h1j77L62k44N9q2J41J19k74K28oP0r2k45K67k66J00J3K30j41m1j26l6L34
$$ -81 -258 104 -140 -81 -163 -22 97 -177 51 45 115 23 -222 45 -221 -121 -108 122 -19 -60 -186 -222 112
2848A12j07o6k3N7J19j13J97q7l6k17J8K85J49k0j61J23r6j33M5K09k33O4j87
$$ 112 5 -61 -84 -27 92 -21 176 89 53 -164 -146 139 288 268 107 230 134 1 46 255 22 86 -101
2871a01J83p8Q3n9K24j71L4j25Qj47J04Q4J5j06K09o0j10O5p4n3K04j60J45k05
$$ -101 82 4 87 28 252 81 115 -10 -2 -149 -45 39 54 -52 157 97 -13 52 -22 -75 129 -31 114 -91
2895i1N9J05j30J04k9P1K3l38P9R0o2J54j77M4P1p4k26L23j28j85J53Q9K00J4
$$ -91 -32 73 -57 47 18 89 112 -226 -147 -57 -119 35 -142 -98 -27 -101 -327 -4 -132 -317 -164 -75 125 139
2919A39j64J18K3l12J39J33l2P8Pk21j4OJ83J85m71K59m6J87k20KK58j91J5M0
$$ 139 -25 93 116 -196 -57 76 44 122 129 -92 -106 -100 83 268 -203 56 10 197 -23 -21 237 46 61 101
2943A01j93L0k3p6J77K85l82J32J91l48L57j20j47N7m3J71r6J14o6K5k03J51j41
$$ 101 -92 -62 -85 -161 16 301 -81 51 242 -106 251 131 -16 41 -2 169 73 187 121 146 -57 94 -47
2966d7J51j87L6K21k55j4j37N9J99j69J62m1m4l0j08R0J49o0k06j1J21l1L8K2
$$ -47 104 -83 -47 174 -81 -95 -232 -173 26 -143 19 -22 -66 -96 -204 -114 35 -25 -231 -242 -121 -152 -114 -92
2990i2m7K05k44j91k9L21J08q2j54J83o7q8J01k18K53L35k39nk98L31j08K52j66
$$ -92 -139 66 -178 -369 -398 -77 31 -51 -205 -22 -89 -177 -76 -294 -41 294 55 50 -248 83 -25 227 61
3013F1j3L00m87K82m0k7R1K6l0J25j95p4Q5J43p6j43J78j20j05J1K5K3J55l56
$$ 61 48 348 -139 143 103 76 167 193 163 288 93 19 104 247 171 28 206 86 -19 -8 17 40 195 -161
3037a61L96k54p2J61p3J38J13j26r0O5j12j08L7Q9K74k87l5J10j77J98k03r5L55
$$ -161 235 -19 -91 70 -3 135 248 122 32 97 -15 -123 -86 3 277 -10 -45 65 -112 86 -117 -212 143
3060A43m4j60J8r2r1j01M50j72N9L04l61q4m4J76k30K44j58J61j35r0K24m3q5
$$ 143 99 -61 -43 -135 -226 -327 123 -49 10 314 -47 -131 -175 1 -229 15 -143 18 -117 -207 17 -26 -111
3083a11J48R3j49r4K16n63N97k7k08R8J40m7o7O4J96l83J59N9p9J47o3j99Q7P3
$$ -111 37 130 -19 -113 103 -460 137 110 -98 0 140 93 26 90 286 -97 62 121 42 189 126 -73 14 87
3107H7p5M0L1k7N8o7J33j07k4qq2K18k1K0j40j70K3J6J4k7j8K88j01J17k92J81
$$ 87 12 52 83 56 114 47 180 73 49 41 -41 177 156 176 36 -134 -111 -95 -81 -108 -126 162 61 178 -114 67
3133F7l45M67k29K5N6n6J01k39j00L59l2k3k09j2J41LM33m34j51K01J10R6m27
$$ 67 -278 189 -40 -15 41 -15 86 -153 -253 106 74 51 -158 -170 -29 -26 407 -27 -178 23 133 229 -198
3156a98M25j01l01J28J14k58L43p7N6k3N2j38j76L38p1k46K04L9N8r1o4J61l9
$$ -198 227 126 -175 -47 67 -191 152 75 131 108 160 22 -154 184 113 -133 71 110 168 77 13 174 135
3179A35M2j07k2o6K04N8l00K56l00K62j58J4J1J63j6k37Q0j37K65j53R9k27J09
$$ 135 177 70 48 -18 186 244 -56 200 -100 162 4 18 29 192 176 -61 19 -118 147 -6 93 -134 -25
3202b5Q6k43J60q7K52j52k32K38k5j49o0K64j21j65K84K21n66J98P5M2j34j32
$$ -25 61 -182 -22 -109 143 -9 -241 -3 -28 -177 -237 27 -94 -259 25 246 -320 -122 -47 -5 -139 -271
3224b71L70l8k28R8%J76l54J80J87j08M5Q7k09K24j29L5j23O7O7j46j27M77k00
$$ -271 99 61 -167 -69 -69 107 -247 -67 120 12 57 144 -65 159 30 65 -58 9 76 -70 -197 280 80
3247H0j54J88q1o2P2J43k33pJ72k71Q0J3J89j91K13p1R6m1k87K83J51k62j32L76
$$ 80 -74 114 33 -29 43 186 -47 -54 118 -153 -73 -60 129 -62 151 80 176 135 -152 131 282 20 -112 264
3271B64j75q5r0K1k1J41j29K0K2j93J10J74l08K35j05J17j38J25M7l5o0J90q2
$$ 264 89 4 -86 -65 -86 55 -74 -54 -32 -225 -115 59 -249 -14 -119 -2 -140 -15 32 -3 -63 127 45
3294D5J13k49j33J06M4J6J50K9l90L23K8J5j50M0RP9l49L64j14J26j82k3M8Q9
$$ 45 158 -91 -224 -118 -74 -58 92 121 -269 54 82 97 -53 -13 -4 75 -274 90 -24 102 -80 -103 -55 34
3318C4J55q4r9Q1n7o2P8J08m4Q1k37K9K73m97M19l12J72J32j05o3k2J51j19n2
$$ 34 189 105 6 87 30 -32 46 154 110 191 -46 -17 256 -241 178 -134 38 170 65 2 -20 131 12 -40
3342d0P4j08J27L1J2k09p5O7PO5j4Q4k02R4J17r0j72J30J66J9j08R2j08K4Q1m44
$$ -40 34 -74 53 84 96 -113 -188 -121 -114 -49 -63 21 -181 -87 30 -60 -232 -102 64 83 -25 67 -41 -17 64 -380
3368c80M35p5M8j84P5r3O0R9M7O8o5K4o7j77K89j59K9O6p8n8K33k3j65n6M05k29
$$ -380 55 -20 28 -156 -81 -174 -114 -15 32 100 35 59 -8 -185 104 -55 -26 40 -38 -96 137 114 -51 -107 298 69
3394F9Jo7P9Q9k49K01P9l8k56O6j3K14k08J92Q0k48J13k49J90L0J12r5j66pJ29
$$ 69 70 3 82 171 -78 123 202 164 -92 -26 -39 175 -33 159 239 -9 104 -145 45 75 187 92 -74 -81 48
3419D8j31j79L85rj90M5R8n9k21K3J41Q6j90j4o6L57p0k19K51k74M29l03j15J30
$$ 48 -83 -262 123 114 -76 -31 67 8 -213 -190 -49 37 -153 -167 -233 124 54 -165 86 -188 241 -62 -177 -47
3443d7L3L36l72J8J11j1L8k34j13P5l4K15j04m2N0R3j1J06r7L1j34K16j53k8J73
$$ -47 -14 322 -50 -32 79 68 106 -128 -241 -166 -200 15 -89 -131 -81 12 1 107 10 41 -93 123 -30 -58 115
3468A15Q5j49O7p1p4m4r2J03J47J77p3k68Q0l3Q0M3Kj29p9K0J43O8J5j07j06R7
$$ 115 200 51 118 47 -27 -71 -163 -60 87 264 191 -77 3 -30 50 93 95 -34 -113 -93 50 118 133 26 -80 17
3494A7N3M8L7j73j8o0L3l4R1O3j1M6j25J48l61J80K34j72j35J41j26r1L19j45
$$ 17 70 118 155 -18 -36 -96 -63 -97 -6 57 46 92 -33 115 -246 -66 168 -4 -139 2 -124 -215 104 -41
3518d1L0m7j7q4J24Q4k9M1P7j05m7rj2L21k76p7O9j36L43k61J93o8j28n3J17M5
$$ -41 -11 -58 -75 -159 -35 49 20 61 138 33 -14 -23 -35 286 10 -67 2 -134 209 -52 141 73 -55 -108 9 54
3544E4k8j16K30Ql6k22K00j74L35j12j60J37j52J08p5J45j31j46K34p7j84K44
$$ 54 26 -90 140 148 112 -110 90 -84 251 139 -21 116 -36 72 -3 142 11 -135 99 22 -162 82
3566H2j51J50k85L09O6j24J90l43L7J48K5J4k90J15J3Qm4q7J71K1R5m0P0k70J23
$$ 82 -69 81 -204 105 171 47 237 -106 -69 79 104 118 -172 -57 -44 -36 -80 -167 4 25 120 80 150 -120 3
3591CR6J24k66j29J66K8K96n47K16j99K87R5m48J93q7J92O9m7J79q4j39P8j85
$$ 3 99 223 -43 -172 -6 22 318 -229 -13 -212 75 170 -278 -85 -172 20 89 42 221 137 -2 76 -109
3614a09J28l5J12j4k6J45j10o4k82L03J4j05J66K02l10N4P8j01j51L60l35J34
$$ -109 19 -16 96 82 56 201 91 27 -255 48 62 -43 123 325 15 69 147 46 -105 255 -80 54
3636E4Q3K47m19J04k7j33L35J2j66J03k35j42J52J37j68J43j37M9J93j89L2n8
$$ 54 137 384 -35 69 42 -91 244 256 90 193 -42 -184 -32 105 -63 80 -57 -8 185 -4 28 -30
3658c0J82k59J54k19J29J16Lj12l2O8k36L50l19L18j14K4Q9k9L7l4j93J52N5j97
$$ -30 152 -107 47 -172 -43 73 76 -36 -68 0 -236 114 -205 113 -1 23 112 83 120 86 -107 45 100 -97
3682i7l4M6P6J00j10o6R5k7J80k44K42k27l3L71j73r8q9j4NO1J35k52J64J43l72
$$ -97 -131 -85 -9 91 -19 -85 10 -17 163 -81 161 -66 -99 272 99 1 -88 -102 -97 -36 99 -153 11 154 -218
3707b18J45L16k52N5M2n8M9j9j30K29j28l17K36L4k53O53l84p0K63o4N9l39L7
$$ -218 -73 243 -9 46 88 30 79 60 -70 159 31 -286 -50 -16 -269 384 0 -70 193 129 188 -151 -114
3730a14l0J82j53K41k36J03J92l8j17j87m6K66j6j22j2J93k57L8K66k2m3r2J53
$$ -114 -144 38 -115 126 -110 -7 185 147 30 -157 -203 63 47 -75 -87 106 -151 -113 153 131 88 -4 149
3753A49j21n5J92k84M2l3j27L10n1J09j64J82j14j88J86j59J05N7J14k5j53J92
$$ 149 28 -27 165 -119 -77 -110 -237 73 22 131 -33 149 35 -153 33 -126 -21 36 150 125 -28 164
3775A64k26J84k30K10M2k17K3K37J59k41J01k24K82k70L4M6m3kM1k07j55l9K76
$$ 164 -62 122 -108 102 144 -73 -50 187 346 105 206 -18 264 -6 28 74 31 29 70 -137 -292 -331 -55
3798e5O8mJ16l15K47J42j70q6mj7Q1q8M0J64N6l6j40k15J71k29L48l23Q4K77j76
$$ -55 13 9 125 -190 57 199 29 -57 -61 -78 3 -85 -45 119 175 139 -1 -216 -45 -274 74 -249 -165 112 -64
3823f4k1Q0l1K0Rk8Kk03L22o8M3J4j17kr1J61L6p8j03Q5o6K75L1j68j39L9N1M2
$$ -64 -85 -5 -36 -16 -7 -35 -33 -236 86 18 61 75 -42 -44 -135 26 62 -16 -119 -34 -100 175 206 38 -101 -62 -11 31
3851C1O9N4q9J17k65K33j38L07k98k32O73p12N3N2R5L72k96k64N27k88K0j38L95
$$ 31 100 154 65 182 -83 150 12 319 21 -211 462 -250 -197 -145 -50 322 26 -238 289 1 21 -117 278
3874B78j54k18K17O3j02j81l6L67k18K7J08k67L6K09r3J1j51J87l0j12k09M78
$$ 278 124 -94 123 186 84 -97 -133 234 16 43 151 -116 -80 129 36 47 -104 83 53 -59 -268 210
3896B10p6j0l3k08J09j72J03J9q9K55P2N5j63k31K63n9M9J12l90J72J8J60j33
$$ 210 134 124 91 -117 -8 -180 -77 -58 -147 108 180 235 72 -159 104 45 94 206 -184 -12 6 166 33
3919C3J24j05J46m2j31k97K88k12K19J24l63N65p00L85P2l06k02O73q1k66J37
$$ 33 157 52 198 156 25 -272 16 -196 23 147 -216 349 -351 34 106 -200 -402 271 190 -76 61
3940F1k46M0K7k7K47k3j22nk4j44K93k09J80l0j20K16k30K55j83p6J98j69o9J49
$$ 61 -185 -145 -118 -145 102 79 -43 -48 -72 -216 77 -132 48 18 -102 114 -116 139 -44 -120 78 -91 -160 -11
3964a1j37o8K53L7j09J27k2j22k2j17K99k91M23m70K81P0M1j63O9r2J40o8O0m8
$$ -11 -148 -216 37 74 -35 92 70 -52 -74 -191 108 -183 240 -230 51 121 162 -1 68 -24 116 48 108 60
3988F0J1r3J73j23o1J27n5P6j8j68M9K78j10j07P1j13P7j00oK08l6q8j19J2J44
$$ 60 71 -22 151 28 -33 94 39 115 97 -71 -22 256 146 39 110 -3 74 -26 -32 176 140 52 -67 -55 89
4013H9j40K15n7m6o6J63k18J05J43r8l26L64j3k89J99k16L45l37N5j35L45J1j02
$$ 89 -51 164 107 61 -5 158 -60 45 188 90 -236 128 115 -174 25 -191 154 -183 -128 -263 82 93 -9
4036io4k72K77j8Mk2O6K19j09k8J55l03j6K48j13j34K03j41J77m3J10k04j29J83
$$ -9 -73 -345 -68 -86 -82 -104 -38 181 72 44 199 -104 -120 128 15 -119 84 -57 120 77 187 -17 -146 37
4060C7j66K66l15J58J50j31m2o2j02J87j81K57R2j58L9l8L8po9k20L61q4j84K61
$$ 37 -129 137 -178 -20 130 -1 -43 -105 -207 -20 -201 56 148 -10 29 -9 29 22 -47 -267 94 10 -174 87
4084H7k60J69o1j1L4k5j12K74j20r9J83n2l39J95K19M1L72m65k6JJ11l09L97k26
$$ 87 -173 -4 -65 -76 -42 -67 -179 95 -25 -124 59 7 -332 -137 82 123 495 30 4 5 116 -193 204 -22
4108b2q24J087n92K29l47j60J73K03Q6R9j91L44O40q70J69M3p7K91M1j75j07j80
$$ -22 -846 241 -351 -122 -469 -629 -456 -253 -167 -68 -259 85 725 -145 24 67 -10 281 322 147 40 -140
4130a40%K59j42n9K02k15J94q0J15j33J69j91K58j46Nk61L32k99Q0N1j01K41j52
$$ -140 -140 119 -23 -82 120 -95 99 19 134 1 170 -21 237 91 96 -165 167 -132 -52 -1 -102 139 -13
4153a3O4n5K50m16L32l01K00K5j89L39m07M19j43j82K2K3j60K39r5j70K61L5k61
$$ -13 51 -4 246 -170 162 -139 61 86 -103 236 -171 248 105 -77 -55 -32 -192 47 -48 -218 43 78 -183
4176a83L76m03K03m2J07k57K14N3p9J81l94J14K18o5j16K47l22M49k27ln2m8l4
$$ -183 193 -210 -7 -49 58 -199 15 68 -11 170 -224 -110 108 43 -73 174 -148 301 74 71 19 -29 -63
4199f3P5K2j8p8K5M2J67m6J5j15r6J40j77J7J70j19p7k0K06p0R6j37m8K38j38
$$ -63 12 34 16 -62 -37 5 172 126 141 26 -70 70 -107 -90 80 -39 -116 -136 70 0 96 -41 -89 149 11
4224A1q1J64j33P4L7J72l04J84J6l4j0k16K48Pk49R1J7J18j25k2j02j27Nn2M36
$$ 11 -70 94 -39 35 72 244 -60 124 140 106 96 -120 128 135 -114 -23 -6 112 -13 -35 -137 -264 -259 -311 125
4249A25j98J22j5j09m6J30oo2J23J16l70L59l34N0M0K18l99K57r6k1R3j08k5p8
$$ 125 -73 49 34 -75 -121 9 3 -59 64 180 -190 169 -165 -115 -75 143 -256 1 -95 -116 -23 -131 -156 -234
4273b34K9M34j71j09j46R4P5j76L69r4P1p7N8k1l8M7j03K0J64k74K12J30k46j45
$$ -234 -205 229 58 -51 -197 -103 -28 -204 165 71 142 65 123 102 64 111 8 28 192 -82 130 260 14 -131
4297a31L4P1j44P2L78k37j66L62m4k54r1R2k16M00j97P8j33p9K40k52L88N7k95
$$ -131 -97 -26 -170 -98 280 43 -123 239 195 -59 -150 -58 -274 126 -71 7 -126 -205 35 -217 171 228 -67
4320f7r4J71Q0j15k3J4k18K81M8L0k58l83M19rL29K65j177R65m9r61J18J36K41
$$ -67 -161 10 90 -25 -48 -34 -252 29 77 107 -151 -534 -115 -124 205 470 -707 258 209 -752 -634 -498 -257
4343b57j09J10O41o89M00n12k70J543l93l91n3P53l94k44K55k77k81N57O3n41
$$ -257 -366 -256 385 -304 96 -416 -686 857 464 73 20 773 379 135 390 113 -168 389 452 -89
4363h9k02M64j32O46k60l98l55M58l50j82l91P66m18N04q10N77N72q08R0J66O31
$$ -89 -291 173 41 687 427 29 -326 132 -218 -400 -791 -25 -443 61 -749 -172 400 -408 -318 -152 479
4384D79l87k06l76R46p3p79L79l6l33j50L10j8L08o15L16N52l08o22M39J85m4
$$ 479 92 -114 -490 456 383 -396 -17 -53 -386 -536 -226 -244 64 -551 -235 317 9 -613 -174 11 -33
4405c3k53M72j39K53l04J30L3R5q1k95J07k07K99n2j07M0L48p57L5P74m27j32
$$ -33 -286 186 47 300 -4 126 159 254 173 -122 -15 -222 77 25 -82 -42 306 -451 -416 358 -69 -201
4427b01R3N06j70l72j12q6P04j49q81R28J85q31L91L7K0m0Q6L7j44L57o23l3J60
$$ -201 -108 398 228 -144 -256 -342 362 213 -668 260 445 -386 5 42 62 22 108 145 1 358 -265 -298 -138
4450a38P8J95q4j70L01q8j10P5Q9j12p2j40J27K27q0L3L1j22l38J54K45k00Q0
$$ -138 -60 135 51 -119 182 94 -16 59 148 36 -36 -176 -49 178 98 131 162 40 -298 -144 101 -99 -19
4473a9J65Ll38J19j80K71L02l50R0N6k08k10K23L09m82j2L01r4O3J75l41o0L21
$$ -19 146 149 -189 -70 -250 21 323 -27 63 119 -89 -299 -76 233 -249 -261 40 -54 9 184 -157 -217 104
4496A04k81R7J18j51J2K61k6k33J09J15k13J11O8pj08j28J49K2k35J18J11J40
$$ 104 -177 -80 38 -113 -101 160 134 -99 10 125 -88 23 91 84 -24 -152 -3 19 -216 -98 13 153
4518A53m8q6k4J58j20j44J45j60J38rK06l75L1P9k2q4J86O0K34k41j08K71l40
$$ 153 105 19 -5 153 33 -111 34 -126 12 3 209 -166 -135 -56 -78 -162 24 84 318 77 -31 240 -100
4541a00k07K75L98j85j64j19K5K7J5K09op4j18j07K66j80P5k49K56o4n4m6J79
$$ -100 -307 -32 366 181 17 -102 -77 -50 -35 174 168 94 -24 -131 135 -45 30 -219 37 -27 -81 -127 52
4564E2J03j82o0Jj01L43j42j1r0J08l46N23r1j35j34J74j59K76j82j49J51K98
$$ 52 155 -27 -87 -86 -187 156 14 3 -87 21 -325 198 107 -28 -162 12 -147 129 -53 -202 -51 247
4586B47l60J48K5j09Q2Q6p1j25J91m6L3m4j5j03L2j30J07L00P2k69J14k50J37
$$ 247 -113 35 60 -49 33 119 48 -77 114 68 101 57 42 -61 -29 -159 -52 248 320 51 165 -85 52
4609E2n1J5r6K0L22k00Or4K8m3J78k46K9O7J03p0o5j22M04k10p8J10j13p0R1n5
$$ 52 1 16 -80 -60 262 62 68 -26 2 -41 137 -109 -80 -13 90 20 -45 -167 237 27 -51 59 -54 -124 -33 -88
4635h8J86J03k83J4O5N7l12J89k4P8r9m3J92J09k67J07j92M19m44L01k88L53l82
$$ -88 98 201 -82 -68 -3 54 -258 -69 -93 -15 -114 -157 35 144 -123 -16 -208 211 -233 68 -220 133 -249
4658b49J03K28Nk33J69K50k53k55K40J14j23O3k95L30j33K9J6K4J91p3k22J9l0
$$ -249 -146 82 87 -146 23 273 20 -235 5 119 -4 59 -236 94 -39 -10 6 30 221 148 -74 -55 -85
4681h5mK81q1J93k93j39M02J76m51K48m33Q0Q7j30J54Q8k24M2L06p6k39j03L16
$$ -85 -89 192 111 304 11 -128 274 450 -1 247 -186 -106 -19 -149 5 93 -131 -89 217 141 -98 -201 115
4704A15k47O4J94m0k11K10j03j82M24n12K23M6j48Q2l6R3J84r6O8l41j0K68qk94
$$ 115 -132 -68 126 86 -125 85 -18 -200 224 -288 -65 -19 -167 -85 -121 -28 156 60 128 -213 -223 45 37 -257
4728b57K51P1k45R9K4J95k87J29k4o2L32l15N5q0L36m45K52K3P5p1j48P6l74M41
$$ -257 -6 65 -180 -81 -57 138 -149 -20 -44 -106 226 -89 -34 -114 222 -223 29 52 127 56 -92 -16 -390 51
4752E1j10J81k43J89k44L59j58K7j71J41K8j33K68k43Q2m3n7R6J8k21L04r9j95
$$ 51 -59 122 -121 68 -176 183 25 52 -119 22 50 -83 185 -58 24 -19 -76 20 38 -183 121 22 -173
4775a73L00m6q7N1k71j5K38j82L21j01M0j90K71j84J2K94j94k83O4J08M0l1O5
$$ -173 127 81 -6 45 -226 -241 -3 -185 136 35 75 -115 156 -28 -16 278 84 -199 -135 -27 13 -18 47
4798D7j61P1K9rK17j78j43kj01K83J20j48L0k6k18R0J85K03k79j38L1j08K5J62
$$ 47 -114 -43 -14 -23 194 16 -127 -129 -230 53 173 25 55 29 -189 -99 86 289 10 -128 -97 -205 -180 -18
4822a8J22M7p3n9k8J77j60R0p2Kj3J9o5J14On45N22j23J74M3j7k1Q2l92J47J46
$$ -18 104 151 78 19 -9 168 8 98 26 28 15 34 -31 83 89 -456 66 -57 117 160 143 122 204 -188 -41 105
4848A05k19K10l21K89p1N5L3k21J73q8K60j08k4j52j04J59J96l25M8J48Q7j93
$$ 105 -114 96 -225 64 -7 48 81 -140 33 -55 205 97 73 -79 -183 -24 172 -153 -105 43 130 -63
4870f3MML1k1Kn8L6m4P2j4J80j85pk6L2K16J0j38J99j29pP1l17K15p2j94K57k6
$$ -63 -59 -55 -24 -45 -43 -101 -65 -109 -37 -51 129 -56 -63 -89 -57 159 169 31 230 101 94 165 -152 63 -9 -203 54 28
4898B8%j30R9K48o0k28l2L16j94J22k85M3O8J11j26m5k1O5K8kJ29k31L96m18K05
$$ 28 28 -102 -3 245 185 -43 -75 241 47 169 -116 -73 -5 106 -20 -65 -86 -21 7 5 134 -97 299 -119 86
4923H6j0J03m43K42N9jk12j1J46l8m1J50q2j09J25O5L4J8k39K38j06q8M1J21j8
$$ 86 76 179 -264 -22 37 36 -176 -187 -41 -79 -120 30 -52 -161 -36 29 63 81 -158 80 -26 -114 -73 48 30
4948C0m9k0m08N83%Q0j71J67m9pk22L07j87J6J57m08J11k7j45L45l1l01M72k21
$$ 30 -19 -39 -447 136 136 216 45 212 163 156 -66 241 54 70 227 -181 -70 -97 -242 103 72 -229 243 22
4972B2k27L14k14O7n3K83N8j34J4ok46q2M90k05j77J49r5P3J71k31J44m12J46
$$ 22 -205 109 -105 -38 -91 192 250 116 130 124 -122 -204 286 81 -96 53 -42 31 202 -29 115 -297 -151
4995a51K70q0j51J41J28r3n9K8L11l08N2q9J13o4l3j67K30j44J49J07k17N9p0
$$ -151 119 39 -112 29 157 64 5 33 344 36 88 -1 112 48 15 -152 78 -66 83 190 -27 32 -38
5018c8O1K2p4n9J28K16p9k42K46p6j79M2j93rK45k77M31q9j94l8J81M0j93K38
$$ -38 23 45 -29 -88 40 256 177 -65 181 105 -74 -32 -225 -234 11 -266 165 76 -118 -156 25 65 -128 110
5042A10O9K5m66K01j68J16l7j78M89L5k18J08R6k28N1k2r8K59M0k70K54l6j99
$$ 110 179 204 -262 -61 -229 -113 -150 -328 161 196 -22 86 182 -46 5 -17 -115 144 184 -86 168 132 -67
5065f7L1J20j45J42K2n8K6p0j12J50p3J70M2kk95J3J73k78K30J75k52L5L96n00
$$ -67 -36 84 -61 81 103 45 71 1 -111 39 -34 136 178 176 -119 -106 67 -211 19 194 -58 -23 373 -127
5089a27J44k83K41l0O2j42M06l62%J76j21k7k0j0p8M08j95j3j28J4M26k06j55
$$ -127 17 -266 -25 -55 7 -135 271 -91 -91 85 -36 -63 -83 -93 -171 237 42 29 -99 -85 341 135 -20
5112b0nO4p6J21o0k09M48k79J20j01J37j41Q4j95K29j01o5l0K04j74J11k56L05
$$ -20 -25 39 -37 84 24 -185 263 -16 104 3 140 -1 83 -112 117 16 -49 -79 125 -49 62 -194 111
5135A11j17J70p0l4n6P5J26q0M8m0j05O5j23J88j58j41L6K7L11k57m4O1J45l53
$$ 111 -6 164 94 60 4 79 205 125 173 133 28 93 -30 158 0 -141 -105 -78 233 -24 -68 -7 138 -215
5159b15R1J42K9k48J20o8Q1R9k42K11k1K43k49L28l99r3K93l01J0K41N4k89M06
$$ -215 -124 18 47 -201 -81 -149 -68 31 -211 0 -21 222 -27 301 -98 -191 102 -199 -189 52 106 -183 223
5182B23p1rp0M0j86q8m1Q8K08k4n5K32q5j45O8M9mj01J2m3j19K72j25J82k46j75
$$ 223 152 143 73 113 -73 -161 -202 -114 94 70 15 247 162 17 85 134 130 29 41 -2 -121 151 26 208 -38 -213
5208b13J50o7N8J65JK4q0j51J14j1K65k02J08j7l53K47j7L3j48J59o1J73l35L03
$$ -213 -63 -130 -72 93 94 118 38 -113 1 -10 255 53 161 144 -209 38 21 54 -94 65 4 177 -158 145
5232A45j52j07K28j48Q3j40MJ15J89k35J93j71R7k34L15k19l0M4O3K4J00k71q6
$$ 145 -7 -114 114 -34 49 -91 -87 28 217 -18 175 4 101 -133 182 -37 -67 -23 40 64 164 -107 -193
5255a93L0J80M0r2l27J47L61j55O2n9K06k00J3Q6M2p7j89K98l99M03j15j55R1
$$ -193 -163 17 57 -35 -362 -215 146 -9 53 -6 200 0 13 99 141 64 -125 173 -226 177 62 -93 -2
5278bJ03j17p1J81j8q2J75j25K41k76J90j08J81l05Q8L27k60L4j21Q3j23J5j32
$$ -2 101 -16 -87 94 76 -6 169 44 285 9 199 91 272 -33 55 382 122 156 35 118 -5 10 -122
5301a22N7j46qJ3J15K10j56J6J8K4rN5k81o6L47PJ10l31J18O8o0J23m7J9j24J16
$$ -122 -65 -211 -219 -206 -91 119 -37 -21 -3 21 12 67 -214 -280 67 74 184 -147 -29 39 -21 102 55 74 -50 66
5327F6j79O7J08j35P9J80j18R2o0j57L51n15L01o3k82p7K86R7n2Q1j99J4J69l9
$$ 66 -113 -46 62 -73 6 186 68 160 100 -57 294 -221 80 17 -265 -342 -56 41 -11 70 -129 -115 54 15
5351A5j96Q3K47k48J21J78k45J8J35l62M04j90qJ50m4r7N3J48j35J51l0p6k87
$$ 15 -181 -98 149 -99 22 200 -45 -27 108 -254 150 -40 -48 102 58 -39 14 162 27 178 148 72 -215
5374b15L92j94j59J39m7P6j00J0Q6p6J87l07O7J0K08j02L7j10P6j59P0J58k09
$$ -215 177 -17 -176 -37 -84 -8 -108 -98 -12 -88 99 -208 -141 -131 77 -25 12 -98 -22 -181 -111 47 -162
5397a62Q6OK8O6L5k52O5Q9J51j68k64L99l07K20j59PK49k92K63p3m4J48j36p5
$$ -162 -76 -70 -42 24 59 -193 -128 -39 112 -56 -320 79 -228 -8 -167 -160 89 -203 60 -13 -57 91 -45 -120
5421a20J27K3q6N0n1K46q9j00J6J7l4nL1j59K9J90j02j79Q9j50N61k16l55J09
$$ -120 7 30 -56 -6 -57 189 100 0 16 33 -1 -6 25 -134 -105 85 -17 -196 -107 -257 304 88 -267 -158
5445a58p9K39J56j27r0N7j6N5n5K98l10N2O7j23K10n35L05Q7K49m06J67m1qn3
$$ -158 -237 2 158 31 -59 -2 -18 37 -18 280 -30 22 89 -34 176 -359 -54 33 282 -124 43 2 -6 -59
5469e9p4L24j68j47N5J55j00l0J39j62p1M5J74j23Q2J54k79K83r9k99O0M8J36
$$ -59 -133 191 23 -124 -69 86 -14 -44 95 -67 -138 -93 81 -42 40 194 -85 198 99 -200 -140 -92 44
5492D4l1j5j33J62j5m5J06j79Op3M89j09l34M1J71j32O7j24k7Q0j45k5K14j02
$$ 44 13 -2 -135 27 12 -33 73 -106 -100 -173 316 207 -127 -86 85 -47 20 -104 -131 -51 -196 -221 -7 -109
5516a09M4K93k56L3K10m76M38l17n6L71j03L0R9n3l32L9J88R1k32K08j17L1k3
$$ -109 -65 228 -28 5 215 -261 177 -140 -196 175 72 102 201 148 -184 -145 43 134 -98 110 -7 24 1
5539Aqk74K19oj23M27l53O4J07n8RpJ82j05nj04K7j4R3k82J17L46m02O7q5K75
$$ 1 -7 -281 -62 -68 -191 236 -117 -53 54 -4 5 -2 180 75 70 -34 -7 -21 72 -210 -93 253 -149 -82 -167 108
5565A08M8p4r2m2m6J24j53J72l0j67k9K40n6m3j58M06j04r5l3Q1j45pK97j20o1
$$ 108 156 82 -10 -52 -98 26 -127 45 15 -152 -181 59 3 -40 -198 208 104 9 -24 57 -88 -95 202 82 21
5590B1L04j64L2j5J0q1j92K56k61J65j18r0J1L0J86j49O7j52J84k01M33k52Nq8
$$ 21 325 161 193 178 188 107 -85 171 -90 75 -43 -133 -122 -92 94 -55 12 -140 44 -157 276 24 29 -59
5614e9J19Q6l11J36N7j31L10k63n8R8j87L63k10J20L2l31K58j15Q2J35m55O35
$$ -59 60 146 -165 -29 28 -103 207 -56 -114 -16 -203 160 -50 70 102 -229 29 -86 -4 131 -324 311
5636C11l78n3j62L82L6j24J66k14N7M0k58M03k52L60j81k8j22K0O8R0jl47o2J68
$$ 311 -67 -120 -282 100 136 12 178 -36 21 61 -197 206 -46 314 133 105 -17 3 71 161 160 -187 -249 -81
5660h1K94j31k91J39R3j32K99j04p5J47M5l41J50p8J66k35K39k50K19j29N5m6
$$ -81 213 82 -209 -70 23 -109 190 86 11 158 203 -138 12 -66 100 -135 104 -146 73 -56 -1 -47
5682d7R3J2j34J46o5k37K03k11L58l28J6K60j51J38j05J30j97K28k03j12NK46
$$ -47 46 58 -76 70 5 -232 -29 -240 118 -210 -194 66 -85 53 -52 78 -119 109 -94 -206 -201 45
5704D5j28j1O1J75L2j02M4j71j94K52l7m4J45n0o9K7K28p0k43L66j75o1N4OJ3
$$ 45 -83 -94 -33 142 174 72 116 -55 -249 3 -34 -78 67 17 -52 -25 203 133 -110 256 81 20 74 80 93
5729I3K1Qj60Q5Q9L8j52qM0p5P2j12M68l95N6k48J27J11m2o5j69K70O0k34J32
$$ 93 114 122 -38 47 136 174 22 14 54 -21 51 -61 407 12 68 -180 -53 58 16 -49 -218 52 112 -122 10
5754A0l0J20n8J08k91J90M2Kl93p4M58J21R1l41n0J26j97J41l9R3P5k89L81n4
$$ 10 -20 100 42 150 -141 49 91 93 -300 -374 84 205 296 -45 -95 31 -166 -25 -64 29 104 -185 196 142
5778A42j52r7nJ66O2j88O7J78n8j76J20l1Q7k93L80k06N2j02J10k02K27j0%k51
$$ 142 -10 -107 -112 54 116 -72 -5 173 115 -61 59 28 115 -178 202 -4 48 -54 56 -146 81 71 71 -180
5802a80O0lJ33N4J0j8l1N0L5j87k24N43j94q1R8r3O1j35J34L8j87J38r2J33m51
$$ -180 -120 -123 10 64 74 56 25 75 110 -77 -301 242 48 -33 65 -28 33 -102 32 70 -117 21 -71 62 -389
5827c89J52J58L03j12k05m4K48j42k7J22l24K80Q1m9R8j30j20J50j48J39m0j28
$$ -389 -237 -79 224 112 -93 -137 111 -31 -58 64 -260 20 101 52 150 20 -100 50 -98 41 1 -127
5849a27K68j12J19J9k77M3r8J98K36k42L9r4J23j7n1j6J83k05M9J78j17J46l83
$$ -127 141 29 148 167 -110 -67 -165 33 269 27 66 -28 95 78 27 11 194 -11 38 216 99 245 -138
5872a38P7m4K04k7j9m5j62RL34k24j23K58k72K02j59J51nn8L0m8n5J06J28j70
$$ -138 -61 -105 99 72 53 8 -154 -145 189 -35 -158 100 -172 30 -129 22 17 -41 -11 -59 -114 -8 120 -50
5896e0J91l6j09n0Q5J1j80J90J0j56J40Np2K27j03o7j4o4R9p3j66k5Q3O5Q6k3
$$ -50 141 105 -4 -54 31 42 -138 52 62 -94 46 51 -21 206 103 36 22 -42 57 -16 -182 -207 -124 -59 27 4
5922Dj26j64K47RJ55l56J90J37k6k7k09K92O0k58lp7K98p3K2o9J35l99K02q8K05
$$ 4 -122 -286 -39 -30 125 -231 -41 96 70 43 -166 126 186 -72 -75 -152 146 73 95 26 161 -238 -36 -124 81
5947H1KR3m9K2j79P8j56J11m8l3J0j43L00j21J76j68O0j54L07k63k51M48J64k92
$$ 81 83 176 127 149 -30 48 -108 3 -45 -78 -68 -211 89 -32 144 -24 36 -118 189 -74 -325 123 287 -5
5971eO1j56P0m8J9J88j09rJ7O9j10o0J82J73l97L1K40j16M6j48K18q6k3Q2k59
$$ -5 56 -100 -30 -78 -59 129 20 11 28 97 -13 -73 109 282 -115 -84 156 40 86 -62 156 70 47 129 -130
5996a30j5L29l30J03Q7k0j39K42j71Q5r6J61j24k40K30n3J17lO9j3m0j38K49j76
$$ -130 -145 184 -146 -43 44 24 -115 127 -44 41 -55 106 -18 -258 -28 -81 36 33 102 89 49 -89 160 -16
6020a6j48K19j60J65j9M2j03Q0j22K54k08O1p1q6MN7R3p4j33K33l5j53K33j06
$$ -16 -164 55 -105 60 41 83 -20 60 -62 192 -16 45 -26 -112 -108 -51 42 -32 -165 68 33 -120 113 7
6044Gj34P3J19j26K12j27K17l72K1o5J33J65L7n2l0m0j08K00j52PJ9O3J63k75
$$ 7 -127 -54 65 -61 151 24 241 -131 -110 -175 -42 123 160 108 78 38 -70 130 -22 -15 4 67 230 -45
6068d5N4J58m08K9K59p5j22ln2R6o0J54N3j4p9j93K82R3m1J44j26k17J77k19J22
$$ -45 9 167 -241 -212 47 -28 -150 -153 -205 -109 -169 -15 38 24 -55 -248 34 127 86 230 104 -113 64 -155 -33
6093c3pj38K34O4l34J10K12P5n2j41J92k31o5K74l33mL22k77M6L08l16K5L72k92
$$ -33 -40 -178 56 120 -214 -104 108 183 131 -10 182 -49 -114 160 -173 -177 145 -132 -86 222 -94 -69 303 11
6117A1p8n2M47k21k6n3LJ38r8J65lk84K6j5j22L06m39L09J38Mk38K22J48l24K15
$$ 11 -67 -119 328 107 81 28 31 169 71 236 233 -51 -25 -40 -162 144 -295 14 152 156 -82 140 288 -36 179
6142A79l17K76j28K20j27j36N4q1K45l36j88K73q1J14o4K37j42m9K5j86N2L9J18
$$ 179 -138 138 10 230 103 -33 21 -60 185 -151 -339 -66 -147 -33 -97 140 -2 -51 -26 -212 -160 -121 -3
6165cO7l28J53p5K69r1O5k3J72k75r9J97k82L64k34K65o0M5k97J42n4j71K12K73
$$ -3 64 -264 -111 -186 83 -8 57 34 206 -69 -168 29 -253 111 -123 142 82 127 -170 -28 -82 -253 -41 232
6189B32j00o9L1p0J52j55j5R9pk17K10k47J1J48k31J26Q8P5Q4J28k24qQ0m08K70
$$ 232 132 63 94 24 176 21 6 105 98 -119 91 -156 -145 3 -228 -102 -14 61 145 273 49 41 121 -287 -17
6214a7m3J7Q5k83N29j30m44K25j1l64M45o0QJ11j28Mp9R6J07k85K6J60J71j91
$$ -17 -60 -43 42 -241 288 158 -286 -61 -72 -436 9 -51 -43 68 -60 -56 -135 -39 68 -217 -191 -31 140 -51
6238e1L8L6r5k5N7L6j06J85k06J20M5j24J13L0j36J88j84o9J72j96o4K51k07R1
$$ -51 -13 23 -72 -97 -40 -4 -110 75 -131 -11 34 -90 23 53 -83 105 -79 -148 24 -172 -236 15 -192 -101
6262a01J88j54J69J7j34l7P6j8l06N69n75J29J65J24J04k22j27J30J81k41J23
$$ -101 87 -67 102 119 -15 -52 24 6 -300 269 -306 -177 -12 112 216 -6 -133 -3 178 -63 60
6283F0o4P6L3Lj07N2j53Q1j02K73Mk8j13K5L4l0k10P6J68j22L1K40L6m19j48P3
$$ 60 -4 72 105 108 1 53 -100 -19 -121 152 156 128 15 40 74 44 -166 -90 78 -44 -13 227 263 -156 -304 -231
6309b31K67o1P5J82r7k76P6M3j47L00j11j1n5j74K13M9j09jK68l47K44j51K5J68
$$ -231 36 -25 50 232 135 -141 -65 -22 -169 131 20 9 -46 -220 -7 42 -67 -68 200 -147 97 -54 -29 139
6333A39k00r9J87J3l50K62j5O9j54O6R0K56k64k00J79J09m4J32o3o3K84n12L7
$$ 139 -61 -160 27 40 -310 -48 -63 6 -148 -82 8 264 0 -200 -21 88 44 176 113 50 334 -178 -141
6356a41K15L9m28L95m4j70j7K76j42m5j16L43k39J38j14q2J2O5J52j44K3L4J97
$$ -141 74 113 -315 80 36 -134 -151 125 -17 -62 -178 165 -74 64 -50 -132 -120 -55 97 -47 -24 10 207
6379B07k45J12l0j85K09m2n9K8q4K87j48p7p6j2J6K27j35K5L2j83K41R8k09j12
$$ 207 -38 74 44 -141 68 26 -33 -5 -89 198 50 -27 -103 -115 -99 128 -7 18 50 -133 108 206 -3 -115
6403a15j02J56L30m52J42L5L4J78j76j23RJ24r8J90m16J95J8%O0K23k08j35K23
$$ -115 -217 -61 269 -183 -41 -6 28 206 30 -93 -84 40 -58 132 -284 -89 -71 -71 -11 212 4 -131 92
6426I2j43J74L7j82K62j15k43J28P1ok16Q6K45j84M6Q6j94k28M41j66K00p2k70
$$ 92 -51 123 160 -22 240 125 -118 10 81 75 -141 -55 190 6 52 138 -56 -284 157 -9 191 119 -151
6449a51K90k49K80l03K19M3k30K24l63O5k3J15Q3j34K40k0j09L6j28K19n1J92
$$ -151 139 -110 170 -133 86 129 -101 123 -240 -175 -198 -83 0 -134 106 86 -23 13 -115 104 53 245
6471B45j27k37J87r4R6M5j99O5j93L99l22j38J52l2L12k25p2K63L2o2N0l68K12
$$ 245 118 -119 68 -26 70 115 -84 -19 -212 187 -135 -273 -121 -153 159 -66 -138 125 157 95 145 -223 -11
6494a1j1l79M60J30p5o7k12R7j54K40J74o06K70L6J17j00K77k52J53r5j29L15
$$ -11 -22 -401 59 189 114 47 -165 -68 -222 18 192 -414 -144 -108 9 -91 186 -66 87 -8 -137 178
6516A78k7N1l46J70lpL1r9N3J88k27j14J17m2J23n6r2n0J61q6L2o0L7J21J7J26
$$ 178 151 202 -144 26 23 16 47 -52 1 189 -38 -152 -35 -77 46 -10 -102 -152 9 -77 -45 -105 -68 53 70 196
6542A96k74Q9M5k29N9N36l53k45K79o5n9O7Qj11j37J18K67o8j3l72J04q3J8K76
$$ 196 -78 11 56 -173 -114 422 69 -176 103 38 -21 46 54 -57 -194 -76 191 123 110 -262 -158 -241 -223 53
6566E3p1j92L97M6j63r9k24K18P1JK2l52K87O3J35j72M6j08m2Q2k6p1L89l04n9
$$ 53 -18 -210 187 233 70 -29 -253 -35 36 37 59 -293 -6 57 192 20 66 -42 -84 -2 -28 -99 290 -14 -73
6591g3J59J8J3l87L28L0q9j16j1K88k4r0q5R7j7J81k12R6j80j08L33k01j78K62
$$ -73 86 104 117 -270 58 88 -1 -117 -128 160 136 46 -39 58 41 222 10 106 -74 -182 151 -50 -228 34
6615C4l1j71K4n9L17k34Q0j39K45K63m94J97J22l08M2j49J68K08O7k83J89N0k70
$$ 34 3 -168 -144 -203 114 -120 -40 -179 66 329 -165 32 154 -154 -112 -261 -93 115 182 -101 88 138 -132
6638a32K37k54kJ02L6P6p5J98j59l1j30Q5P3j08J52p7K76j75q8J0r0J75j03Kk48
$$ -132 105 -149 -151 -49 -13 63 -12 186 27 -4 -134 -49 24 -84 68 -9 267 92 4 14 -76 99 -4 -2 -250
6663b50L94j87n2K07k23K81j39J1J37k9k95J46k3l8L0J42j5m2o8L9J24k26q4L41
$$ -250 144 -43 -95 112 -111 170 31 42 179 150 -145 1 -22 -60 -30 112 97 55 -13 26 150 -76 -160 181
6687A81p1j7m3r1o6j12K6J85m0J46J8q1K8k8k3p9n5j49L00R7p2r9k3J3J5j00L05
$$ 181 110 93 50 -41 -107 -219 -193 -8 -48 98 116 35 63 35 12 -67 -122 -271 29 126 54 -45 -68 -55 -40 -140 165
6714A65r8q2n3Q3j14o1PkJ0M1M8j53K86q4m7P5j09M53l38j00J10j51Q4n1J87k84
$$ 165 67 -15 -68 15 -99 -160 -153 -155 -145 -104 -56 -209 77 -7 -54 21 -88 365 27 -73 37 -114 -30 -81 106 -178
6740a78J49N8j40J40q7ok72J80K72k88M35k70m1l1J8r3K97k82K55j39j8J67m30
$$ -178 -29 29 -111 29 -58 -64 -336 -156 116 -172 263 -7 -48 -79 -61 -154 143 -139 116 -23 -41 126 -304
6763c04L65k2j06j6K42j13J20J74m30L2J84j84M6K2k13L00n2Q5k7K03j95j13j5
$$ -304 61 39 -67 -83 159 46 166 340 -90 -58 126 -58 -12 10 -203 97 45 130 103 306 111 -2 -17
6786a7P6k23m5L48l02q3J72r7oQ5q1O3j32j2L12l59K72p4J91m1Q3j49J72j20N6
$$ -17 59 -164 -209 139 -163 -246 -74 -171 -177 -92 -173 -110 -242 -254 58 -301 -29 -103 88 47 130 -19 153 33 89
6811H9P5m3j88j02J42K8k4p1P5j02J56q7p2J65J01r8J07k81M0K64l12L16j7L3
$$ 89 164 121 -67 -169 -27 1 -23 -94 -19 -121 35 -52 -124 41 142 44 151 -130 -90 174 -138 178 161 194
6835A94j95k05J97n4N0J43k75L5K02j70q1K79j99N3j34K10j37q9K44l78K24L93
$$ 194 -1 -206 -9 -63 -13 130 -145 -110 92 -78 -159 120 -79 -26 -160 50 -87 -176 68 -310 -86 307
6857C07k54o7k1K57M2m28J63K08k88J52k02M7K63j33j79J59j11p1PKJ10J23M2
$$ 307 53 -14 -35 222 264 -164 -1 207 -81 71 -131 -84 179 46 -133 26 -85 -156 -149 -147 -37 86 128
6880A28o7n1k32LK79P2m75K80K02j0j50l2Q2n5L6J85K05k58m06K24j08J54J36
$$ 128 61 10 -222 -219 60 132 -343 -63 139 129 -21 -53 29 -26 10 195 400 142 -264 -40 -148 6 142
6903A42k15n0K1K33j41K46k51N8K12l51m2J22O0L8j35K44k59J07m7J38j45K04
$$ 142 -73 -123 -102 131 -10 236 -15 43 255 -96 -138 -16 44 82 -53 191 -68 39 -8 130 -15 189
6925A89j24j26N4Q0j85K85j22Kl2j47J30k45M84L6o6k49j1qR5J40l07l2k2K15
$$ 189 65 -61 -7 73 -112 173 51 53 21 -126 4 -241 243 279 213 -36 -47 -55 40 180 -127 -159 -181 34
6949C4o5P6q7j7K93m66R8J83M3j5k53L49N9k15j48P7K79j60M0J37k51j5k93K54
$$ 34 -31 45 -42 -59 234 -232 -134 49 92 77 -176 173 232 17 -131 -54 225 65 105 242 -9 -24 -317 -63
6973f3k04L82r1j79K26j41J69j98R1p6j30N4m0K78J02J70m69J57m3k60J27J90
$$ -63 -267 115 24 -155 71 -70 99 -99 -8 -84 -214 -160 -200 78 180 350 -119 38 -5 -265 -138 52
6995E2j95J79mK36k07R5k79j17L47K9n47K36J40qk44L35p1k05M54k73J70r4m2
$$ 52 -143 36 32 268 61 156 -123 -240 107 136 -411 -175 -35 -43 -287 48 -23 -228 226 -47 123 29 -13
7018a3J62k62K31rk9O7k81J59k54K52K63l43K3J31l98L54l7j92J29r2K44M5j90
$$ -13 149 -113 118 109 80 147 -134 25 -229 23 286 -57 -34 97 -301 53 16 -176 -47 -139 105 150 -40
7041d0J20l46L25P9o6j98L2J05j46R3p4j06M04j16m2o0m9J41P2k91J35q5K07j77
$$ -40 80 -266 59 138 72 -126 -94 11 -135 -42 -116 -222 182 66 24 -36 -85 56 128 -163 -28 -113 94 -83
7065h3J43r8Q5k64K92j60K3jJ0J41j35Q9j17K08j58j49K52P4j30k28K55j94J65
$$ -83 60 -38 47 -217 75 -85 -62 -63 -53 88 -47 42 -75 133 -25 -174 78 152 22 -206 49 -145 20
7088B0K11k10o2j22M4J72o4M5Q8j76J02j98k2l7J50K5j6O0K31k48J02j30k3J77
$$ 20 231 21 -41 -163 -119 53 -11 34 122 -54 48 -150 -172 -209 -59 -34 -50 10 241 -7 95 -35 -58 119
7112A19j44M7j08J54O4j09o3J87l12R0N4K27l3k51R0O7j10o8K98k14J01Nk36K84
$$ 119 -25 22 -86 68 132 23 -40 147 -165 -75 -21 206 173 -78 12 79 -31 -99 199 -15 86 91 -145 139
7136A39j91J75Rp5J06m08K33NK26k99Q2L5j81o3K67r4P1R7Rj83N6j32N7J57jj55
$$ 139 -52 123 132 57 163 -245 -12 -7 219 -80 2 37 -144 -207 60 -34 37 134 143 -40 16 -116 -59 98 97 -58
7162e8o9J41P7k02m7M60k49n9lj44M06o7l62J79k39K9L33j78oK83k24J11lk44
$$ -58 -127 14 91 -111 -158 302 53 -6 -9 -153 253 186 -176 3 -236 -207 126 -52 -58 225 1 112 109 -135
7186a35N2R7m1p5L35j91o7K61m48J07q0K01o0k45K25L0l1J04l8r6Q0M3J0L7L8
$$ -135 -83 14 -27 -102 233 42 -25 236 -212 -105 -185 16 -44 -289 -64 -34 -65 39 1 -95 -15 28 38 75 113
7211A13l20L48N0M8k69j77L40o2J3K2k52J43J79l08LK91k78Q8L13k30q0P9P1r1
$$ 113 -207 141 191 239 -30 -207 133 71 84 106 -146 -3 176 -132 -129 162 -116 -28 285 55 -25 54 125 34
7235C4j85J63j68K13n0l3r2lj04J77J51Jm05J46R0J11P3j71J40j04N5n6K51j07
$$ 34 -151 12 -156 57 7 -26 -118 -121 -225 -48 103 104 -301 -155 -65 46 119 -52 88 -16 39 -17 234 127
7259A27k19K8k3j77J41N47k19l3k57J2j89M60k12l4j81J52J29K4j97R45j135Q11
$$ 127 -92 -64 -87 -264 -123 424 205 172 -85 -73 -262 198 -14 -48 -229 -77 52 76 -121 824 -311 500
7281E00o42QJ3K73J65m87L5J62jO5K04k79J65Jj05j1j34M5J34j1r1k1J1j99J95
$$ 500 -142 -134 -121 152 317 -170 -135 27 26 91 295 16 181 182 77 66 -68 -23 111 100 9 -12 -1 -200 -5
7306ej03J01J60o0l6k18N0l8J49j15R4P8k19J84n6J14p9pm3l4j42J69R9J87j28
$$ -5 -108 -7 153 93 57 -161 -111 -149 0 -115 -21 57 -162 22 -34 80 1 -6 -49 -83 -225 -56 43 230 102
7331A02o9J50K11l11p4j45j46L33j86J58N0q7K01m18J54L13l21j24K76k04K02
$$ 102 33 183 394 83 9 -136 -282 51 -135 23 73 -14 187 -231 -77 236 -85 -209 67 -137 65
7352F5j78J07J6J65j69k1N0J50pj35j20J57k10K62k22L13j7k03K7j6Ro4K18j82
$$ 65 -113 -6 10 175 6 -15 35 185 178 43 -77 80 -130 132 -90 223 206 3 30 14 23 -41 177 -5
7376em1P2Q8k15L23j07j47%J26p4k24J73m4K52k06K2Qn8O3K45j52p1n0j4P2k4
$$ -5 -46 26 114 -101 222 115 -32 -32 94 20 -204 -31 -75 177 -29 -7 1 -57 6 251 99 28 -22 -36 36 12
7402A2j13P5L7rK47l54j4L62j93O2j44q1r0K79q9L1J27j36K51m21J72n2o3K7Q4
$$ 12 -101 -26 11 2 249 -105 -119 243 50 112 -32 -113 -203 76 -13 18 145 9 260 -161 11 -41 -104 -77 7
7427GL9K68k39r6J88k32j0J67M5j35J43k56J37j21K25K3j50J08k49K12m5j33J38
$$ 7 46 314 75 -21 167 -65 -75 92 137 2 145 -111 26 -95 130 153 3 111 -138 74 29 -104 34
7450C4k94M46m24L81k67p7K69j26N6K22l34K32j19j34N2P3K3j08L25l18J09r8
$$ 34 -260 186 -238 143 -124 -201 68 -58 -2 220 -114 118 -1 -135 -83 -10 13 -95 230 -88 21 -77
7472g7L14m49L6K44M3m2j19J74K71k58k12K38j65J82j36j91K70j5j66l9RqK81
$$ -77 237 -212 -176 68 111 69 -50 124 395 137 -75 163 -2 180 44 -147 123 108 -58 -97 -88 -96 185
7495A85l95K5Q6KJ87k75L71p6k44L59m64KJ39p2j57Q0P6K21n1Q9r8j09J03K8k9
$$ 185 -210 -185 -99 -97 90 -185 186 110 -134 225 -239 -237 -98 -170 -327 -247 -171 50 -1 88 -10 -119 -16 12 -17
7520a7j68R9J75Mj05L5j80M01j39p9n1p9K65j47k3Mk70J90k6K40m2l32J09K95
$$ -17 -185 -86 89 93 -12 23 -157 244 105 26 -25 -104 161 14 -9 -5 -275 -85 -111 129 87 -245 -136 159
7544A59m4J49l60K10k29L0K14k2k34N14l34j54J31K5o9k20K35L4P3j43N0J57j66
$$ 159 115 264 -96 114 -115 -85 129 107 -127 387 53 -101 30 55 -14 -234 1 35 108 -35 15 172 6
7567FK0j02k6M92j23j57l92K29J58j55k79K94J6qK4K8P0l8j8M7M0O2l1j9l32J17
$$ 6 26 -76 -102 390 267 110 -282 -53 105 -50 -329 -35 -19 -27 -3 25 95 57 39 86 126 188 157 138 -194 -77
7593g7J67j17J0J81o0K5l02N7K4R5j14N6J42J18k12R6j35K0P4N2l06K67M0l92
$$ -77 90 -27 -17 164 104 129 -173 -116 -92 3 -111 -55 87 205 -7 89 -46 -26 48 100 -206 61 101 -291
7617b91J87Q3j30KL52k52L5j36L93m97K08j2J29k97K42j89j2K21N6k67K39j53
$$ -291 -104 -21 -151 -149 203 -49 -14 -150 243 -254 -46 -58 71 -226 16 -173 -185 36 92 -175 64 -89
7639h9n3O2L24n18K80j77L40j13m12O28k01O6j96j57O4J64OM3o2J13j96K38l07
$$ -89 -142 -80 244 -274 6 -171 169 56 -356 272 71 137 -59 -216 -152 12 18 61 -1 112 -84 154 -153
7662a53K3pL03n1n3j6j29J76j17L8k53J14LL44l98J58M6l3j15O0R6J5q3R3j91
$$ -153 -130 -137 166 115 62 46 -83 93 -24 14 -239 -125 -122 222 -176 -18 28 -5 -120 -60 36 51 -32 61 -130
7687a30L2L34m65M65k83K7j3K12j20l04L08j44K83k23J19j91r7J88n9L2L5r7L49
$$ -130 -98 236 -229 236 -47 -20 -33 179 59 -245 63 -81 202 -21 98 -93 -190 -2 -61 -29 6 -91 258
7710B58k46k50RL09p2rqj05K25k04K35j80k31O3J32m3K55p7o1o1j4J1L5k4M5J45
$$ 258 12 -238 -229 80 8 -1 -9 -114 111 -93 142 -38 -269 -206 -74 -117 138 61 0 -61 -75 -64 -29 -53 -8 137
7736A37j59M4Kr7J13j18J39k10J50j13K78k47J45l5l8Q2j40m3j48M33m0j86J18
$$ 137 -22 22 24 -73 40 -78 61 -149 1 -112 166 -81 64 29 -9 73 -67 -110 -258 175 135 -51 67
7759F7N0n1o2j0J40mj00Q3l66L32K0P7j83J41j22q4L96m3m21p9O79n30M25m18
$$ 67 117 66 4 -6 134 130 30 113 -253 79 99 176 -7 134 12 -72 324 281 -140 -219 460 -70 355 -63
7783f3J29K85l65m2r7K72J08m71K31J45K36n44K00j33K40l20J50L81j70k77J84
$$ -63 66 351 -14 -56 -153 119 227 -244 -13 132 368 -176 24 -109 131 -189 -39 342 172 -105 79
7804G9N87j159M86J0K60J55r71L83K58n5lj21J93k04rK41j08p1M1l6O2J00J2k53
$$ 79 666 -493 -7 3 263 418 -553 -170 88 33 30 -91 102 -102 -111 130 22 -49 -8 -44 18 118 130 -123
7828a23LJ87l15L32M4r5nj45J44j40P0j57K4L35k67K84k21L11rl42k8M7j88R4
$$ -123 -120 67 -248 84 128 33 28 -117 27 -113 -43 -200 -176 159 -108 176 -45 266 257 -85 -113 -66 -254 -160
7852a60J31J15o5Q6n2q9J83j92m3n4j08J66O4O6O4k75N2l8J3J56n5j10O7K3K61
$$ -160 -29 86 21 107 55 -34 149 -43 -86 -140 -248 -82 -18 48 112 -163 -111 -149 -136 20 -35 -145 -78 -55 206
7877B06k12L3j52k0J52N6R9k87J10J23k04J33q8J48j77n1J47P1j48QO5j75K4J49
$$ 206 -6 27 -125 -145 7 63 162 -125 -15 108 -96 37 -51 97 -80 -131 16 87 -61 -53 12 -163 -139 10
7901A0K28n17K95P2j31M4j38K49j24M8j65K80k94K66k97J71J8k19N3K99l37j20
$$ 10 238 -279 16 88 -43 1 -137 112 -12 36 -129 151 -143 123 -174 -3 15 -204 -151 148 -189 -309
7923c09L17o3J27j39n7JL14r5m9k15R5J00k36L33Q3n6n52N07j30j45J43P5k6l
$$ -309 8 -55 72 -67 -124 -123 191 96 47 -168 -73 27 -209 124 207 151 -401 106 -24 -169 -26 49 23 20
7947B0N8q2J9j40K85k10P8j30K96k77K35j19k51R2J26o2o3K68k3k7O3l4J90j98
$$ 20 78 -4 15 -125 160 -50 28 -102 194 -83 152 33 -218 -126 0 -62 -125 143 120 93 156 122 312 114
7971A14k18K77m0j25K12k50J05k6k66J72m6J36j79Q8p3J19Ok12L27K5j85K22k85
$$ 114 -104 173 133 8 220 -30 75 49 -217 -45 -91 45 -134 -46 -119 0 6 -206 121 146 -39 183 -102
7994a02J0K35L0P8l25j6pJ58o2q8J36j14J42N4N0m9j73L8m6K2j60R8M1O5K84k76
$$ -102 -92 143 173 251 -74 -90 -97 61 -1 -89 47 -67 75 129 179 130 -43 -5 -51 -29 -189 -91 -50 15 299 23
8020B3O1j3q4L01j69n7M6j1k89J82j02K99k83R4RQ3q4k90N39o8j70O6O0j75R3
$$ 23 84 71 -13 288 119 62 108 97 -192 -10 -112 187 -96 -2 7 90 6 -284 255 187 17 83 143 -32 61
8045F1q3o4K05L1r7o2j6N1j22L09j77o0J4p1N0R6l3j03J15k67P8M24l95K45j54
$$ 61 -22 -86 119 150 53 -9 -25 26 -96 213 36 -24 -10 -81 -31 65 32 -71 44 -223 -145 279 -116 129 -25
8070b5j9J31j57J36q2j39O4L37k21J13k03L6J22J9k3j4j68K25j91M8N7j57J73
$$ -25 -44 87 -70 66 -16 -155 -91 246 25 138 -65 -29 93 112 89 75 -93 132 -59 -11 46 -111 62
8093F2m2J42o8P9o5p3J03l25J94k58L10Nj03O1j17m9K00k8J07j98J40j14J44M
$$ 62 20 162 94 173 108 35 138 -187 7 -251 59 64 -39 22 -95 -144 56 28 135 -63 77 -37 107 111
8117A11l9j7p4K02l78rJ05Q6K15k53%k6J33k84M09l50P8q7L49j76n6J13L8k22
$$ 111 72 55 -19 183 -195 -204 -99 -13 202 -51 -51 -77 56 -228 181 -169 -91 -178 171 -5 -61 52 90 -132
8141a32J80M0o8M9k4mj64q7K94l39M17J51k60m2j61J71J26k30K66l95J80J10r0
$$ -132 48 88 20 69 45 41 -123 -210 84 -255 162 313 53 11 -150 21 147 -83 183 -212 -32 78 -12
8164a2j45J0N2K34J02k13Kk66K53q4O0j26K05K20k14k50K70k04K65q7m8%J58k63
$$ -12 -157 -147 -95 139 241 28 30 -236 17 -67 -7 -133 72 292 78 -172 98 -106 159 72 24 24 182 -81
8188h1N3J36r
$$ -81 -28 108 99
8191I9
$$ Imaginary data points
##PAGE= N=2
##DATA TABLE= (X++(I..I)), XYDATA
0@%%%%%%%%%%%Qj6J6j6K4l2L5m3N6o8P9r4J15j36J56j83K14k47K85l29L77m28
$$ 0 0 0 0 0 0 0 0 0 0 0 0 8 -8 8 -8 16 -16 19 -24 32 -36 43 -51 64 -72 84 -99 115 -132 153 -176 201 -227
33b27M86n51O23p03P91q88R94j108J233j371J522j689J867k062K279k514K768
$$ -227 259 -292 331 -372 419 -469 525 -583 650 -721 801 -888 979 -1083 1196 -1318 1450
50A450l047L356l697M073m490M959n486O081o761P548q472R571j0904J2561j4688
$$ 1450 -1597 1759 -1938 2135 -2355 2604 -2882 3199 -3562 3986 -4486 5085 -5819 6742 -7946
65g946J7529k1546K7743l9052R7456k55683K52826O7476l45013L28076j65772
$$ -7946 9583 -11963 15780 -23272 74184 -181499 71327 138803 -206210 121866 -43906
76d3906m5332K04166j56284L5490N2466o4816L0156o2600Q4258m5399j9462R3305
$$ -43906 -89238 114928 -41356 -5866 46600 -18216 11940 -50660 33598 -11801 -31263 62042
88F2042j08462N5081L8899j15366Q8375k2996j9549M6990n1208K7786J0078j4113
$$ 62042 -46420 8661 47560 -67806 20569 -2427 -21976 25014 -26194 1592 11670 -2443
100b443q383q274N2729o0329J8359L3134o1753P2601n6756j3139R8989j16669
$$ -2443 -10826 -19100 33629 -26700 -8341 24793 -36960 35641 -21115 -34254 64735 -51934
112e1934N4527L0242q7010J09425p6734j3179R7870j10638O1491O944o4899R0993
$$ -51934 2593 32835 -54175 55250 -21484 -34663 63207 -47431 14060 21004 -43895 47098
124D7098o4568M698M0118n0700N0486m4948J6665L6455p4880P1537l4885k3854
$$ 47098 -17470 -12772 27346 -23354 27132 -17816 -1151 35304 -39576 31961 -2924 -26778
136b6778Q4982j00245M0248M7945q8572O6018j8924k4560N0038m6640K1123K05
$$ -26778 58204 -42041 -1793 46152 -42420 23598 4674 -19886 30152 -16488 4635 4840
148D840q697K1332m3324M5487j1330l7505O0840m8665J0023L5389n9409M1216
$$ 4840 -3857 17475 -25849 19638 8308 -29197 31643 -17022 -6999 28390 -31019 10197
160A0197n52k5364K6875k3188J8845q472q887K4928l4884L1008n547l3191N4169
$$ 10197 9645 -15719 11156 -12032 6813 -1659 -10546 14382 -20502 10506 4959 -28232 25937
173B5937l8697j126L6028m7756L4867l773k7244L9567k8010P008J0712k3973K9548
$$ 25937 -12760 -13886 22142 -25614 9253 5480 -21764 17803 -10207 -3199 7513 -16460 13088
186A3088j9319j184J9286k5998K2292p631j0838K2950k1062J0119L037j3059J9195
$$ 13088 -6231 -7415 11871 -14127 8165 534 -10304 12646 -8416 1703 4740 -8319 10876
199A0876j6262N019R078j6855J6540r204k890J4072j6430J0440q08o646J0908
$$ 10876 -5386 -367 8711 -8144 8396 -808 -3698 10374 -6056 4384 3576 -3070 7838
212G838j1206P494j071o554J2057j2387P340K889j3220J6136j0707j877J2955
$$ 7838 -3368 4126 3055 -3499 8558 -3829 3511 6400 -6820 9316 -1391 -3268 9687
225I687j7941J3051n90j1839J6690j2260K44J0974j5654R645P01r440R711m577
$$ 9687 -8254 4797 4207 -7632 9058 -3202 -2958 8016 -7638 2007 2708 -6732 2979 -1598
239a598j153L897l506K058k497K728j238k765O559o123l4N868p580L598L560o440
$$ -1598 -2751 1146 -2360 -302 -2799 -71 -1309 -4074 2485 -3638 -3672 2196 -5384 -1786 1774 -4666
255d666K415L217m309P34M293m600K84N577o779J839N709p402M266J382n028L860
$$ -4666 -2251 966 -3343 -2609 1684 -2916 -2632 2945 -3834 -1995 3714 -3688 578 1960 -3068 792
271G92n4j346P67J182o30k001L479o24k718M545k724j322M110m446K038K441l587
$$ 792 738 -608 159 1341 711 -1290 2189 1565 -1153 3392 668 -654 3456 -990 1048 3489 -98
288i8J380J601j756J11R66o33p07J166j594L13J374j966J115j047J186N06m180
$$ -98 1282 2883 1127 1238 2204 1571 864 2030 436 749 2123 157 1272 225 1411 1917 -2263
305b263M853j569m036O878n695n57P295r375K965N252q501M805N53l606L826k147
$$ -2263 2590 1021 -3015 3863 -1832 -2389 4906 -4469 -1504 3748 -4753 52 605 -3001 825 -1322
321a322m55R58q25K179m847L159L308p408M779K368p863Q020j664p650J1451m230
$$ -1322 -1777 -819 -1644 535 -4312 -1153 2155 -5253 -474 1894 -5969 2051 387 -7263 4188 -42
337d2o806J1590o816j673R131j0513M101N777j0397P132J753p407Q999o684K62
$$ -42 -6848 4742 -2074 -3747 5384 -5129 -1028 4749 -5648 1484 3237 -4170 4829 -1855 -1593
352a593P474r481N752J384p163Q619n364j450R855j0455L157L489q750R607l033
$$ -1593 5881 -3600 2152 3536 -3627 4992 -372 -1822 8033 -2422 735 4224 -4526 5081 2048
367B048n940J1391q341p47P282q760N801J131q185R347m562l823Q512q875L955
$$ 2048 -3892 7499 -842 -1589 5693 -3067 2734 3865 -4320 5027 465 -3358 5154 -3721 234
382B34N088j1341R538j666o960J0346p931k27P568j0061N284K231p063O846l603
$$ 234 5322 -6019 3519 1853 -5107 5239 -2692 -2919 4649 -5412 -128 2103 -4960 1886 -1717
397a717q85M959o123L357J19k467L127l055J518J648l404K566p24n55J837j468
$$ -1717 -2602 2357 -3766 -409 -290 -2757 370 -2685 -1167 481 -2923 -357 -1081 -1636 201 -1267
413a267N24K30J68o61O9J729k439K242o86j580M215m136J241K895n395N734k311
$$ -1267 -743 -513 -345 -1006 -937 792 -1647 595 -91 -1671 2544 -1592 -351 2544 -2851 2883 572
430E72k766O886o807L241K546o815P312l871j356O083p573N033J2m962P428o497
$$ 572 -2194 4692 -2115 1126 3672 -3143 4169 298 -1058 5025 -2548 2485 2497 -2465 4963 -1534
446a534K111L471o916O883l659k135O488p145M123L71n045O403m707R78K451n175
$$ -1534 577 4048 -2868 4015 356 -1779 4709 -2436 1687 2058 -2987 3416 -1291 -313 2138 -3037
462c037M838k359p07K893n065M843k362j332M323o232M867p94l492O327o549K781
$$ -3037 1801 -558 -1265 1628 -3437 1406 -956 -2288 2035 -4197 670 -124 -3616 2711 -3838 -1057
478a057K755o871P775m684q73O490q337N949j310m429Q231o950K926K538p471
$$ -1057 1698 -5173 2602 -2082 -2955 3535 -4802 1147 -163 -4592 3639 -3311 -385 2153 -5318
493e318R088n197j074O591r012P042n15n782Q876p354K636M250q034O848k755
$$ -5318 3770 -1427 -2501 4090 -4922 2120 1605 -4177 4699 -2655 -19 4231 -3803 3045 290
508B90j693N486o129M110j065k191N631o194L633L95m356O895n353M93L473o641
$$ 290 -1403 4083 -2046 2064 999 -1192 4439 -1755 1878 2273 -2083 4812 -541 -48 3425 -3216
524c216O923l865j125N311o787N230j026l981O485o732L531K194p255P588m340
$$ -3216 3707 -158 -1283 4028 -2759 2471 1445 -2536 3949 -2783 748 2942 -4313 3275 -1065
539a065o80N967q823N881j338l964Q806q735L041L234p689P716l413k314N969
$$ -1065 -1745 4222 -4601 1280 -58 -4022 4784 -3951 -910 2324 -5365 2351 -1062 -3376 2593
554B593o708M572o91l497N692m853K411J495n028N992l882Q21L553o434N510j930
$$ 2593 -4115 457 -234 -3731 1961 -2892 -481 1014 -4014 1978 -1904 -1083 2470 -3964 1546 -384
570c84j676N035n788L253P69l265M637m118J652J717l898N140l978N28L773n529
$$ -384 -2060 2975 -2813 440 1209 -2056 2581 -1537 115 1832 -2066 3074 -904 -376 3397 -2132
586b132N046j906l216O513n590K282K220o110O036k575j373M458n297L573j92
$$ -2132 2914 1008 -2208 4305 -1285 997 3217 -2893 3143 568 -805 3653 -1644 1929 1737
601A737l290M275l877K248J170l815L741k903r2K924l999L144j121k039L655l295
$$ 1737 -1553 2722 -1155 1093 2263 -1552 2189 -714 -806 2118 -1881 1263 142 -1897 1758 -1537
617a537J469O46k674K987j690l33J247k068J936p83k07P46j733K179j422l95K337
$$ -1537 -68 578 -2096 891 -799 -1132 115 -1953 -17 -800 -1007 -261 -1994 185 -1237 -1632 705
634G05l038K602j26k580L283k110rK338l023K482n61j154K198j950J178p6j020
$$ 705 -2333 269 143 -2437 846 -1264 -1273 1065 -1958 524 -37 -1191 1007 -943 235 159 -861
651h61K286j981M76J013k158K746q45j393K756k504J057P60k025K268j385q0J471
$$ -861 1425 -556 -80 933 -1225 1521 676 -717 2039 -465 592 1352 -673 1595 210 130 1601
668A601j162L37r2k12Q57q05P2M96n54O50q90qL74j74m72M05R2n29M5L67o27P51
$$ 1601 439 776 684 472 1329 524 596 1092 538 1188 298 290 664 490 18 423 515 -14 31 398 -229 522
690E22p97k56J078j232K95R1l57O52o03k84L51J6J00m93N9M30l03p9O9j0J15m24
$$ 522 -275 -531 547 -685 -390 -299 -656 -4 -607 -891 -540 -524 -424 -917 -858 -428 -731 -810 -741 -751 -636 -1060
712a060M39m2M43j65o97J120n17k70M96m15J011m43l10O67l98L28Q0o17J419j077
$$ -1060 -621 -663 -220 -385 -1082 38 -479 -749 -253 -668 343 -100 -410 257 -141 187 267 -350 1069 -8
732hk60J311j210R16k87p01J786j080j34P22q62J172r18k47J116r64M37m56J17
$$ -8 -268 1043 -167 749 462 -239 1547 467 333 1055 193 1365 447 200 1316 352 789 333 450
751D50R71j270N70J50r42J032j077nR66j102Q04n24j11R51j662J084l87l00Q12
$$ 450 1421 151 721 871 -71 961 -116 -121 845 -257 547 23 -88 863 -799 285 -102 -402 410
770D10j169O63L43j592J310o06J31M09j468J284o60K76N38j607J478k2j742K758
$$ 410 -759 -96 247 -1345 -35 -641 -510 -101 -1569 -285 -945 -669 -131 -1738 -260 -282 -2024 734
788G34j344l30Q29j147J306n08m31J359r18l0Q92k002K548j520l1J191q67R59
$$ 734 -610 -940 -111 -1258 48 -460 -891 468 -450 -480 412 -1590 958 -562 -593 598 -269 690
806F90o14n04J764n30m1j8n43J020j120M30k3j18O41r17L98N82q97R55r12m7J273
$$ 690 76 -428 1336 806 765 747 204 1224 104 534 511 393 1034 117 515 1097 200 1155 243 196 1469
827A469j240J59N59p46N75p54J76N62q71M14l22M2N22j203P91m6o34P77j171P42
$$ 1469 229 388 947 201 776 22 198 760 -111 303 -19 23 545 -658 133 87 -547 230 -941 -199
847a99K61j245J124k79m14P53o67j89N68o09M61r5k04o4J35q5Kj78O90m93K36
$$ -199 62 -1183 -59 -338 -752 1 -666 -855 -287 -896 -435 -530 -734 -798 -663 -748 -746 -924 -234 -727 -491
868d91J7l67J75m47O21M31n07L58O2L08q0P6R4l2k5J27j15o9L33k22L5L53j34
$$ -491 -474 -841 -666 -1113 -492 -61 -568 -210 -148 160 80 156 250 218 193 320 205 136 469 247 282 635 501
891E01r0M51o81O57l77l12O67k41k7M32o26J49J02l08J97l79J93J16n8J7m62L62
$$ 501 411 862 181 838 461 149 816 575 548 980 354 503 605 297 494 115 308 424 366 383 -79 283
913B83n77J30L08m62J48L54n36N29n98j60P32r17O53k34n02R35r13L04M01r15
$$ 283 -294 -164 144 -318 -170 184 -352 177 -421 -581 151 -766 -113 -347 -849 86 -827 -523 -122 -1037
933a037R40p58K67N69r54J091o02l82J038j043N45M57j185J163k63n25P78l91
$$ -1037 -97 -855 -588 -19 -973 118 -484 -866 172 -871 -326 131 -1054 109 -154 -679 99 -292
951b92M38k88M3M19k54K06j55k65Q24n29M18k63l26J096r21N5R30j392J360o14
$$ -292 146 -142 -99 320 66 272 117 -148 676 147 565 302 -24 1072 151 206 1136 -256 1104 490
971D90j73R63j529J049P9q26J014j237N80P66j211O44o66M2J064j517M71K36q80
$$ 490 317 1280 -249 800 879 53 1067 -170 410 1176 -35 609 -57 -15 1049 -468 3 239 -641
990f41J209r93L09M95j306J153r0n07M75q92P17J55q43P86j004Q52k71r54Q62
$$ -641 568 -425 -116 379 -927 226 136 -371 104 -788 -71 84 -759 27 -977 -125 -396 -1350 -488
1009d88r8J40M39p29O78m24j53O71r24Q15j60m34O56k58O1J72j50O59n99o1N02
$$ -488 -586 -446 -7 -736 -58 -482 -635 36 -888 -73 -233 -667 -11 -269 -208 -36 -186 473 -126 -187 315
1030C15p23J057q09q5J207j313R35k03o03J319j041M33O79j169N05k37K10P15
$$ 315 -408 649 -160 -245 962 -351 584 381 -222 1097 56 489 1168 -1 504 267 477 1192
1048A192j066K28K85k90N06p53R0K88k86N28n40p4M44m78K80j66qk48o6N31l52
$$ 1192 126 354 639 349 855 102 192 480 194 722 182 108 552 74 354 188 180 -68 -134 397 45
1069D5m53L46m09O99k94p03Q51n37P4K02l63N86q11M26J13m65L74l64L95Q4l67
$$ 45 -408 -62 -471 228 -66 -769 82 -455 -381 -179 -542 44 -767 -341 -228 -693 -319 -683 -288 -204 -571
1090e71K58k9J6M51p91Q2M43k66K12r2P9L05l78K12p9J10J51k82N36m73K48J29
$$ -571 -313 -342 -326 125 -666 -584 -141 -407 -195 -287 -208 97 -281 -69 -148 -38 113 -169 367 -106 142 271
1112B71l35O21o7l68P31p88O63j91m47R86q92Q4K81n48O88j70o38R78q82O95j77
$$ 271 -64 557 490 122 853 65 728 537 90 1076 184 268 549 1 689 519 -119 859 -23 672 495
1133D95o18R65q99J71K82m40L95j15n43P35o85L56k86j16O11p71K63J72l72N63
$$ 495 -123 842 -57 114 396 -44 351 236 -307 428 -257 99 -187 -303 308 -463 -200 -28 -400 163
1153A63q04J04K90m61O10n82J38O52j248J076m08l14J079j199R58l07n15J070
$$ 163 -641 -537 -247 -708 -98 -680 -542 110 -1138 -62 -470 -784 295 -904 54 -253 -768 302
1171C02p55K62N11j035J046n25k93R64r42O21J36r16J271r44L70P76j266J028
$$ 302 -453 -191 320 -715 331 -194 -487 477 -465 156 292 -624 647 -297 73 849 -417 611
1189F11l59l26O63p98N71J77n91J011r77L07M54q51Q49p44M60L32j001J130n71
$$ 611 252 -74 589 -209 362 539 -52 959 -18 289 743 -108 741 -3 457 789 -212 918 347
1208C47k82Q51j190O06m9m34Q71q42J19M69j043J080o06k82M42p19Q06r5r19J138
$$ 347 65 916 -274 332 283 -151 720 -122 -3 466 -577 503 -103 -385 57 -662 144 49 -870 268
1228B68n62L3K89j008R30o09J18N25m40K35Q0n32P18o52L28J98n59P70p33N33
$$ 268 -294 -261 28 -980 -50 -659 -541 -16 -456 -221 -141 -673 45 -607 -279 -81 -640 130 -603 -70
1248g0P4n49J001q76K04O18q79Q56m06l51R01q86P84kp84J307j009j6O28p26N62
$$ -70 4 -545 456 -420 -216 402 -477 379 -27 -378 523 -363 421 419 -365 942 -67 -83 545 -181 381
1269C81l84J53J107j479P95l5m67Q48m66j78L54q02O52k76J56J02n05K94J80n94
$$ 381 -3 150 1257 -222 573 538 71 919 453 275 629 -173 479 203 359 461 -44 250 430 -164
1289a64M70m77QL20n00N16n14K73M36p44L96j93k60O52m55j9J79l92L40l68J89
$$ -164 306 -171 -163 157 -343 173 -341 -68 368 -376 20 -173 -433 219 -236 -255 -76 -468 -128 -496 -307
1310c07L2j73L31n0k57K83m10K14L20k91K66m09L45J56l96M97l08J9K65m81L52
$$ -307 -275 -448 -117 -167 -424 -141 -551 -337 -17 -308 -42 -451 -106 50 -346 151 -157 -138 127 -354 -2
1331bjk07M00j63q9K05kJ67m05K68M2n6J41k42R9K25j4j06O4J02j11M6k22K04
$$ -2 -3 -210 190 27 -62 143 141 308 -97 171 213 157 298 56 155 380 366 260 324 426 315 361 139 343
1355C43j07J25j92L6K98n12K66l8O5j53j56k6J45k26L68m13O5J3m9K10l72K5M08
$$ 343 236 361 169 205 503 -9 257 219 284 131 -25 -51 94 -132 236 -177 -112 -99 -148 62 -310 -285 123
1378A23m51L2m7j02M21l30K87J21k63J20K2k94J40O3j48k2l9J0L68m70M72k05
$$ 123 -328 -296 -343 -445 -24 -354 -67 54 -209 -89 -67 -361 -221 -158 -306 -328 -367 -357 11 -459 13 -192
1400a92J35L27m04J38N2k75J46J91k05k4J34j52K67J04j27Q3j51l6L86k53R1J13
$$ -192 -57 270 -134 4 56 -219 -73 118 -87 -111 23 -129 138 242 115 198 47 11 397 144 235 348
1422C48j26p6J36M6K33k40L2J7J70j40j97n1J90j74rop8J21N7o1l5M5J7j51J22
$$ 348 222 146 282 328 561 321 353 370 540 400 203 152 342 168 159 153 75 196 253 192 157 202 219 68 190
1447A90j56ml54J16L77m79K26j11j04O7l89K57j08j08L88M0N9l32J33J49j92L07
$$ 190 34 30 -324 -208 169 -310 -84 -195 -299 -232 -621 -364 -472 -580 -192 -152 -93 -425 -292 -143 -335 -28
1469b8l80K45k89P0J59j14L44k19J65k8JrJ75l6n1J20j02J69j65q3K88m12N17
$$ -28 -408 -163 -452 -382 -223 -337 7 -212 -47 -75 -74 -83 92 56 5 125 23 192 27 -56 232 -180 337
1492C37m8l81K10l6K46J93k54P3r7j13L68j99K4p3N0J28o7m21L91r0o3q2p0J31
$$ 337 289 -92 118 82 328 521 267 340 243 130 498 299 323 250 300 428 361 -60 331 241 178 96 26 157
1516A57l05L01j92l5J72j91J80l97R0K60l42J9Q8k30K92p2j15M22n08L77j24k7
$$ 157 -148 153 -39 -74 98 -93 87 -310 -220 40 -302 -283 -195 -425 -133 -205 -320 102 -406 -29 -153 -180
1538a80Q3r7J30j81m8J5O4Q7R9l20K27K47k68j06qJ53N2k03M38k39M5k3M5K47
$$ -180 -97 -194 -64 -245 -293 -278 -214 -127 -28 -348 -121 126 -142 -248 -256 -103 -51 -254 184 -55 -10 -33 12 259
1562B59%l3p0k77K80l1K59j17k38J23K7p8J97l15L62ol29M40m03O9L02l06J8K20
$$ 259 259 226 156 -121 159 128 387 270 32 155 182 104 301 -14 348 342 13 453 50 119 421 115 133 353
1586C53l08K28j32N5p4o7j70N3j49L67k51P7Nj58J90k64J61j54R8J5k64K82o4
$$ 353 45 273 141 196 122 55 -115 -62 -211 156 -95 -18 -13 -171 19 -245 -84 -238 -140 -125 -389 -107 -171
1609a71l72K03L05r4K4k35q5K80j20K39R1k33j32J02J26r2l0J15m18N10k19l8
$$ -171 -543 -340 -35 -129 -105 -340 -425 -145 -265 -26 65 -168 -300 -198 -72 -164 -194 -79 -497 13 -206 -244
1631b44K91j92R0O0q9N27m92j2L08k43L05l68N8K36k99N17j78k72L82k18J94K09
$$ -244 47 -145 -55 5 -84 443 -49 -61 247 4 309 -59 -1 235 -64 453 275 3 385 167 361 570
1653E70m61P6o2J12J16l05L89k85N6j20J06Ml6j58L71n96R0K50l21L27n40K08
$$ 570 109 185 123 235 351 46 435 150 206 86 192 196 160 2 373 -223 -133 117 -204 123 -417 -209
1675b09N5j56K59m1l31N52m34J94j2l59K99l20R4J75j1J84k52j8K71n4r9p4m9
$$ -209 -154 -310 -51 -92 -423 129 -305 -111 -123 -482 -183 -503 -409 -234 -245 -61 -313 -331 -60 -114 -213 -287 -336
1698c36K13N4K5j4j83K77m07K83K81k59J69k25Q7J54j61J99j43J15j18n6J55M0
$$ -336 -123 -69 -44 -58 -241 36 -371 -88 193 -66 103 -122 -35 119 -42 157 14 129 11 -45 110 150
1720A50k5K07k32O3K35k56K39p2j04O5j40J74P3l86L45n9m9j7j52K95L8k11M3
$$ 150 125 332 100 163 398 142 381 309 205 270 130 304 377 -9 336 277 228 211 59 354 392 181 224
1743B24j60L6J27j72Q5k88q9K80j9k1k65j00M08l67K87p1J65j43p4p1Q1l03K53
$$ 224 64 100 227 55 140 -148 -237 43 24 3 -262 -362 46 -321 -34 -105 60 -83 -157 -228 -147 -450 -197
1766a97J9l3O8j26K32l23J39L50m81J01J00r7k3K39QJ36k89RJ95J40j8J91ok23
$$ -197 -178 -211 -143 -269 -37 -360 -221 129 -352 -251 -151 -248 -271 -32 -24 112 -177 -168 27 167 149 340 334 111
1790A11k06J66j05M9K83j11L1k18J04M0M9J57k48J46K30m62J86Oj25K62q3j21
$$ 111 -95 71 -34 15 298 187 218 0 104 144 193 350 102 248 478 16 202 208 83 345 262 141
1812A41Kj32N3M1k49J16j14J03P2j44K43l60J48J27k00J17o9j17J36j37J77Pl15
$$ 141 143 11 64 105 -144 -28 -142 -39 33 -111 132 -228 -80 47 -153 -36 -105 -222 -86 -223 -46 -39 -354
1835c54J78J26jp6o5J19l98L44j37L5J08K11l33J91j53N8J18p8J7r9L22k42J59
$$ -354 -176 -50 -51 -127 -192 -73 -471 -127 -264 -229 -121 90 -243 -52 -205 -147 -29 -107 -90 -189 133 -109 50
1858E0K9q3K32l5j11L0k86K22J32p3Q7r3k25M13j26j32M05m88K73j47L45q1m28
$$ 50 79 -4 228 193 82 112 -174 48 180 107 194 101 -124 289 163 31 436 -52 221 74 419 338 -90
1881i0K62m99N59jQ6J09q52N04M50j180J300r19L83R3L06n58j27J94j9J76m34
$$ -90 172 -327 232 231 317 426 -426 78 528 -652 648 -271 112 205 511 -47 -174 20 1 177 -257
1902b57J25Q9k27P0k07K91j66Mj41N37j99l18J29J29k65J95M5m1r4J22J21N9j71
$$ -257 -132 -43 -270 -200 -407 -116 -282 -278 -419 118 -81 -399 -270 -141 -406 -211 -166 -207 -301 -179 -58 1 -170
1925a70K2pk2PJ07j8L0L5Jn4J18L5J02j03j18k8j23M92l26K04pj64L2j26L18P2
$$ -170 -148 -155 -177 -170 -63 -81 -51 -16 -15 -69 49 84 186 83 -35 -63 -186 306 -20 184 177 13 45 -81 237 309
1951C09k94J14J79k37j26o5K16K43l97J14k0L21j76K2q4m7K28m7j46r1q1L11O2
$$ 309 15 129 308 71 -55 -120 96 339 -58 56 36 357 181 203 119 72 300 253 107 16 -65 246 308
1974C08n15J56r7K13k51L78k35P8Pl13J42k7J32k20m2j60J96j0J1o9K02K65k69
$$ 308 -207 -51 -148 65 -186 192 -43 35 42 -271 -129 -156 -24 -244 -286 -446 -250 -260 -249 -318 -116 149 -120
1997a20p1P4Oj20J55k1J16q5qJ44j72MJ96O0k5j8j58J42oj81L25lj69J62j12K22
$$ -120 -191 -117 -111 -231 -76 -97 19 -66 -74 70 -102 -98 98 158 133 115 -43 99 93 -88 237 234 65 227 115 337
2023C37k47K5p2L96l76Q4P9k15J15P5j08o0j42J19Q%j8Q4J82k11j7o3m2m8J71
$$ 337 90 115 43 439 63 147 226 11 126 201 93 33 -109 10 18 18 0 84 266 55 38 -25 -67 -115 56
2048E6j15J85k16J72k28j6j65J07J3K67l54K31k7j42J25k04QL30j42j52Q9R5K3
$$ 56 -59 126 -90 82 -146 -162 -327 -220 -207 60 -294 -63 -90 -232 -107 -311 -303 27 -115 -267 -178 -83 -60
2071f0r5JJ59k37K85j14l0L22m61L43K2k03k97L77N7J19k05Q5J79l37K20j73l0
$$ -60 -155 -154 5 -232 53 -61 -91 231 -230 113 135 -68 -365 12 69 188 -17 68 247 -90 130 -43 -73
2094g3pK18L74l46j5Q2j05J80j0j98m2O4L8j73N3J48K83j46l86R0N3K99n06J59
$$ -73 -80 138 512 166 151 233 128 308 298 100 58 122 160 -13 40 188 471 325 -61 29 82 381 -125 34
2118C4Qj69J49j3K8j65Q7n8q6J50P6j41j87p6R9L21j51k29J75q7J78O7L0k13q7
$$ 34 42 -127 22 9 37 -128 -41 -99 -185 -35 41 -100 -287 -363 -264 57 -94 -323 -148 -235 -57 10 40 -173 -260
2143b60l09N36j66j2J71k33J47k01K46r9K70l11L16m6n9J54j49k3j19M13m82K92
$$ -260 -569 -33 -199 -211 -40 -273 -126 -327 -81 -180 90 -221 95 49 -10 144 -5 -28 -147 266 -216 76
2165G6k4P7l22L08k2LK07k46p4K16K0o9j65K29J35k31m2N4n7j1p0L16j72l09L03
$$ 76 52 129 -193 115 93 96 303 57 -17 199 219 150 -15 214 349 118 76 130 73 62 -8 308 136 -173 130
2190A30j34o4K29j34L9J75j89j53nj92L21p9Lm8J67j15O7r0L1r6J5j52L04l27
$$ 130 -4 -68 161 27 66 241 52 -101 -106 -298 23 -56 -53 -101 66 -49 18 -72 -41 -137 -122 -274 30 -297
2214b97J75J59j59J74j07j78L9r9K22j72L09j50k19J5K73j51j6K4k3J59QK68j34
$$ -297 -122 37 -122 52 -55 -233 -194 -293 -71 -243 66 -84 -303 -288 -15 -166 -182 -158 -181 -22 -14 254 120
2237A20o9m3j29L21l38K45l28K81N3n1j34J46l0m0L68o6k87Kk2J63N0J8k97K17
$$ 120 51 8 -121 200 -138 107 -221 60 113 62 -72 74 44 4 372 306 19 21 -1 162 212 230 -67 150
2261A50N6k39J70p4j2R9j05J3Jm14L43j04j9M8K52l41L14k25M9K4K09q2k19m8
$$ 150 206 -33 137 63 51 150 45 58 59 -355 -12 -116 -135 -87 165 -176 138 -87 -38 -14 195 113 -106 -154
2285a54J31Q4n4L95n18m6n2KJ53j19k37M16r3k60L89o6M2J03j59P9k49K40k6J4
$$ -154 -23 61 7 402 -116 -162 -214 -212 -59 -178 -415 1 -92 -352 37 -29 13 116 -43 36 -213 27 1 15
2309A5K1L2q8J38k50K65R3k27M8J27o5MJ87l37J03R5j43J45r9r3M4J12R7j10q
$$ 15 36 68 -20 118 -132 133 226 -1 47 174 109 113 300 -37 66 161 18 163 64 -29 15 127 224 114 106
2334A06n8J31n5j26l2J30J49j42R8PN3k96r1K01j74L6J97l17J71k10N25l29j84
$$ 106 48 179 124 -2 -34 96 245 103 201 208 261 -35 -126 75 -99 -63 134 -183 -12 -222 303 -26 -210
2357b10J36j16Q3J46j16K13k37K6q0J07j27oJ77k38m4K08j59K42M4qj26oj52L12
$$ -210 -74 -190 -107 39 -77 136 -101 -75 -155 -48 -175 -181 -4 -242 -286 -78 -237 5 49 41 -85 -91 -243 69
2381F9m83M34k49J8M95p9k58J02M4N0J34l51q0Q5L16M46j208K31j13M26J43n62
$$ 69 -414 20 -229 -211 284 205 -53 49 93 143 277 -74 -154 -69 247 693 -515 -284 -397 29 172 -390
2403c90M18J52Pjq7k36K85k92N00m00p1L84Qj38kk13K14j44r6k9J91J3k04J36
$$ -390 28 180 187 186 99 -137 148 -144 356 -44 -115 269 277 139 137 -76 138 -6 -102 -131 60 73 -131 5
2427Ej46J74q2L2j45J17j08k03K33p9L13k90j87M38j08k1J40j46R2j93R3j67J88
$$ 5 -141 33 -49 -17 -162 -45 -153 -356 -123 -202 111 -179 -366 72 -36 -57 83 -63 29 -164 -71 -238 -50
2450e0q2M4J50j17J00q7o6K29q2j0l3m0j55K40o9J40l2j39J81M1nk87L07k7q4
$$ -50 -132 -88 62 -55 45 -42 -108 121 39 29 -4 -44 -199 41 -28 112 80 -59 122 163 158 -129 178 151 67
2475F7K2L5l8Q0K5J45k86j72K73j59J73M2R5l45L01l71J30L34m05K46k14J76k86
$$ 67 89 124 86 166 191 336 50 -122 151 -8 165 207 302 -43 258 -113 17 351 -54 192 -22 154 -132
2498a32J8J60j0k90J97m3m2K16N0l54K17l12J69J91j09J1K8k03J70j60J6N3J25
$$ -132 -114 46 36 -254 -57 -100 -142 74 124 -230 -13 -325 -156 35 -74 -63 -35 -238 -68 -228 -212 -159 -34
2521c4k33J75J5J39m2j49Q6J83q9k50J7k93P37k87J14m0l7q4J16k9q5j53K99R3
$$ -34 -267 -92 -77 62 20 -129 -43 140 51 -199 -182 -475 262 -25 89 49 12 -72 44 15 -70 -223 76 169
2545A69j06M8K19k00k36K10k3J84j09J89j64k75M2J56J00K5K0J0j19j4j3pl31
$$ 169 63 111 330 130 -106 104 81 265 156 345 181 -94 -52 104 204 229 249 259 140 126 113 106 -225
2568b25L37j77K17j42n0k8K23r3o0p9q2M22l98r1J21K08j27j43K12r6j85r0K93
$$ -225 112 -65 152 10 -40 -68 155 62 2 -77 -159 263 -135 -226 -105 103 -24 -167 45 -51 -236 -326 -33
2591c3j7k27J69j09J13RJ45j69L2K0K72k92r0L69k58K62k84J02J97n8Q7m32R6
$$ -33 -50 -277 -108 -217 -104 -95 50 -119 -87 -67 205 -87 -177 192 -66 196 -88 14 211 153 240 -192 -96
2614i6Q0M3k70K94J45k10J2K44k50K35l46L67l12qJ68J24k61Q3O3kk17L13j8m8
$$ -96 -16 27 -243 51 196 -14 -2 242 -8 227 -119 248 -64 -72 96 220 -41 42 105 103 -114 199 181 133
2638A33J35q3j26R6%j73p3r6J91j97L86n19L65M3l7p8m9m9J49K2K8j28J25Q5l98
$$ 133 268 185 59 155 155 -18 -91 -187 4 -193 193 -326 39 82 45 -33 -82 -131 18 40 68 -60 65 150 -248
2663b48K24M3j71R8Nmr6j08J45l1J98J83m70K18P5k86J14R4k78L59l16J97Q5q1
$$ -248 -24 19 -152 -54 -49 -53 -149 -257 -112 -143 55 238 -232 -14 61 -225 -111 -17 -295 64 -252 -55 30 -51
2687e1J88L1k31l4M4J81j09K35l56K58j69J7J51Q0j37P6k2k12J71J42j84n3M8
$$ -51 137 168 -63 -97 -53 128 19 254 -102 156 -13 4 155 235 98 174 152 -60 111 253 69 16 64
2710F4Q1M2M9j48J44M7k41Mr0j50K53J38k72L8K5R9k30J84M9k0j14M7N4j95J10
$$ 64 145 187 236 88 232 279 38 42 -48 -198 55 193 -79 -41 -16 83 -147 37 86 66 -48 -1 53 -142 -32
2735c2J25o5R1j78j05J87k54J50j86M8J44P5q1r8J05O0r9j89J71k02L12J69k99
$$ -32 93 28 119 -59 -164 23 -231 -81 -267 -219 -75 0 -81 -179 -74 -14 -113 -302 -131 -333 -21 148 -151
2758a51P9K30j25j91L82r8%k12K60j29qr5Q4N6n1j14K92k80K07O1j68R5j02K30
$$ -151 -72 158 33 -158 224 126 126 -86 174 45 37 -58 26 82 31 -83 209 -71 136 197 29 124 22 252
2782B52j73N5K09k50J8L0o5K1j33j16J79j40K60k63J40Qqpj09L0R5j88K88m4j
$$ 252 79 134 343 93 111 141 76 97 -36 -152 27 -113 147 -116 24 32 24 17 -92 -62 33 -155 133 89 88
2807H8k67K4l8J47j01M4p5J72k9O5k76Q3J51j88M3O4J83k55K7K0k01K23o4L21
$$ 88 -179 -155 -193 -46 -147 -103 -178 -6 -35 30 -246 -163 -12 -200 -157 -93 90 -165 -138 -118 -319 -96 -160 161
2831A61l84j6L38j95j2o9O8jR2J3N8J0k76L63k12J95l15J54N3kJ18l0j14K97l75
$$ 161 -223 -239 99 -96 -108 -177 -109 -110 -18 -5 53 63 -213 150 -62 133 -182 -28 25 23 141 111 -3 294 -81
2856h1J66J32k51P0o1L4k14M27m05K30M5j42K24j61n5k4rN6lL4l%J78m16K63R8
$$ -81 85 217 -34 36 -25 9 -205 222 -183 47 92 -50 174 13 -42 -66 -75 -19 -22 12 9 9 187 -229 34 132
2882A32j27j07j74K12k7J42or6Q3j88M2l7K77l77L9P1j06J99K2k8k82L58k78K51
$$ 132 5 -102 -276 -64 -91 51 45 -51 32 -156 -114 -151 126 -251 -212 -141 -247 -48 -26 -54 -336 22 -256 -5
2906ePj56L46o2j70m8O5j29J96J07j37J63O9l31K63j96J94j58jJ3J86k89L66k62
$$ -5 2 -154 192 130 -40 -88 -23 -152 44 151 14 177 246 -85 178 -18 176 18 17 30 216 -73 293 31
2930C1k02O17k95l01J06j0J21J48k47J61j83L40j97M1j92L6l9R1q4N6O3L92p80
$$ 31 -171 446 151 -150 -44 -54 67 215 -32 129 -54 286 89 130 -62 -26 -65 26 -58 -2 61 453 -327
2953c27N68j00l82K07r7MK99k55J87nj69J6j24J21K58k83j25o4M49k71r3L6J05
$$ -327 241 141 -241 -34 -131 -127 172 -83 104 99 -70 -54 -178 -57 201 -82 -207 -271 178 -93 -186 -150 -45
2976d5q3j34P5l1L23j60j11J77J00j98l9j07J86q4J07J88n5l04L33j4o9K68l07
$$ -45 -128 -262 -187 -218 105 -55 -166 11 111 -87 -126 -233 -47 -131 -24 164 109 -195 138 124 55 323 16
2999A6m2o8L65k88k5P9J48j45J91j21K12k19R2j05q0J31J12L6l44J63k67J60l4
$$ 16 -26 -94 271 -17 -42 37 185 40 231 110 322 103 195 90 10 141 253 289 -55 108 -159 1 -33
3022c3J13Q0k97L09k66QO7j8n8k04L67J17m19J71p6j29L63k19l9K73j81K65k15
$$ -33 80 160 -137 172 -94 -86 -19 -37 -95 -299 68 185 -234 -63 -139 -268 95 -124 -163 110 -71 194 -21
3045b1l39L47L7j65N5J32k74L96l77N7P8NQ2J8p5j24m5N2K96m7k26j39L49j04
$$ -21 -360 -13 24 -141 -86 46 -228 168 -209 -152 -74 -69 13 31 -44 -168 -213 -161 135 88 -138 -277 72 -32
3069c2j64n5K12R3m6l4Q4l07K33m1P7K8J0j8J12j62K19k62j9J87K9M3k89M49l05
$$ -32 -196 -251 -39 54 8 -26 58 -249 -16 -57 20 48 58 40 152 -10 209 -53 -72 115 144 187 -102 347 42
3094D2j30J61P0l30J58l02K04K71mj82L63n09j20K43Q1J4p9j12j86J91O5L18k98
$$ 42 -88 73 143 -187 -29 -331 -127 144 140 -42 321 -188 -308 -65 16 30 -49 -161 -347 -156 -91 227 -71
3117g1j13J83l1K7j35JQ3klj40L37p0l11J51K79j31j96J68J52k42J08l19M21j44
$$ -71 -184 -1 -32 -5 -140 -139 -56 -58 -61 -201 136 66 -245 -94 185 54 -142 26 178 -64 44 -275 146 2
3141Bo8j48K59M3k1n5q6J72m2j78K07N8K8j38K02k46L4r7m8L47l44M48k84k23
$$ 2 -66 -214 45 88 67 12 -74 98 56 -122 85 143 171 33 235 -11 23 -74 -122 225 -119 329 45 -178
3165a78J41M3k8R6L4K43m46M21l39n5L62m18J93n9l5p6j35M35k57J13o1l25L50
$$ -178 -37 6 -22 74 108 351 -95 326 -13 -68 294 -124 69 10 -25 -101 -236 199 -58 55 -6 -331 19
3188A9k77R2K13p1m3M4n9k37J54l0K60n5j91k1K48J64j54N7l00K13k12K13J62
$$ 19 -258 -166 47 -24 -67 -23 -82 -319 -165 -195 65 10 -181 -202 46 210 56 113 -187 26 -186 27 189
3211A89m52L09p4o4M02l19N2q2q4J09K4R2j50J10M5k39K62l8rj85K59k00O6J15
$$ 189 -263 46 -28 -92 310 -9 43 -39 -123 -14 10 102 -48 62 107 -132 130 92 83 -102 157 -43 23 138
3235A38L18k74N7m28M2L31J0k71N6O5Q4o8j17O8P1O5j90J00j0k75M41j85j24K68
$$ 138 456 182 239 -189 -147 184 194 -77 -21 44 128 60 -57 11 82 147 -43 57 47 -228 213 28 -96 172
3259A72k63rn9K02j94K15M5l75J67k5K49l74O8K69k56J8k1K35l92K07P4K29j27
$$ 172 -91 -100 -159 43 -151 64 109 -266 -99 -124 125 -249 -181 88 -168 -150 -171 64 -328 -121 -47 182 55
3282E5q4j41R5L24l16J86k77j8K22r7p1J1l1L21P9k24K4k52K74l9j43K00J4k02
$$ 55 -29 -170 -75 249 -67 119 -158 -176 46 -51 -122 -111 -142 179 258 34 58 -194 80 41 -102 98 112 -90
3306i0K37j90oN7P2j99J38J72l39J29k6J23j9m6L4Q7r5k89L16k63J12j12KL04
$$ -90 147 -43 -49 8 80 -119 19 191 -148 -19 -45 78 59 13 47 134 39 -250 66 -197 -85 -197 -195 109
3330A09r2lo9r1K39J43k04j94M7J68r4j11j04L60Q2j26o1j21N1p9K04k08k6J2
$$ 109 17 14 -55 -146 93 236 32 -162 -115 53 -41 -152 -256 104 186 60 -1 -122 -71 -150 54 -154 -180 -168
3354a68O4n6J85n2l7j75K2K60j15M5q0J29Nk6K30k62L8P2p1j77J30R6K4k00N47
$$ -168 -104 -160 25 -27 -64 -239 -217 43 -72 -27 -107 22 27 1 231 -31 7 79 8 -169 -39 57 81 -119 428
3379D28o84N03q1k17J80j75J75K2N4j02o6j58K01K4l82M27Pkj92k54L26k67K99
$$ 428 -256 247 166 -51 129 -46 129 151 205 103 37 -121 80 104 -278 149 156 154 -38 -292 34 -233 66
3402F6j46j74J93L6kK48l03Q3R8p7Q5L3j43Kj22R9J67J09l32O9N0O6k03J37j72
$$ 66 -80 -254 -61 -25 -27 221 -82 1 99 22 107 140 -3 -1 -123 -24 143 252 -80 -11 39 105 -98 39 -133
3427a33K33k15n9L11l94L21j14j36J10j34N8J43J39o7n1j84K22k19K13o3n5J93
$$ -133 100 -115 -174 137 -257 64 -50 -186 -76 -210 -152 -9 130 63 12 -172 50 -169 44 -19 -74 119
3449A19L5j45p4J40o0L0J70pk64K32l08J26K21l26J8O1Jk43J90O1P3j17K10k04
$$ 119 154 9 -65 75 15 45 215 208 -56 176 -132 -6 215 -111 -93 -32 -31 -274 -84 -23 50 -67 143 -61
3473f1J34k72L22k09k40L65J0n8J92j62n8O8p1J71k51K91k11K68m16K04J30k84
$$ -61 73 -199 123 -86 -326 39 49 -9 183 21 -37 31 -40 131 -120 171 -40 228 -188 16 146 -138
3495a38K2J6K82j49J58j64n4J0pQ6j6k91J48J26l4J1k37J18L01j28o8K64j73j91
$$ -138 -116 -100 182 33 191 27 -27 -17 -24 62 46 -245 -97 29 -5 6 -231 -113 188 60 -8 256 83 -108
3519a08K84l27J43J55n7j40K78o3j66Q9M5n9J83q2P3j02n4R7l39J22m7J48r6j6
$$ -108 176 -151 -8 147 90 -50 228 165 -1 88 133 74 257 175 248 146 92 189 -150 -28 -75 73 -23 -39
3543c9p3Q6R8N2q1J2J0Nj86L97l6j13m67L98j16j04n7J40o5J20K69l66K67j69
$$ -39 -112 -26 72 124 43 55 65 70 -116 281 245 132 -335 63 -53 -157 -214 -74 -139 -19 250 -116 151 -18
3567a8L6l48L37k27J00J83k98O4N33m14j04k9P3%J47m3p9J13j32J65P4m7J05k07
$$ -18 18 -330 7 -220 -120 63 -235 -171 362 -52 -156 -185 -112 -112 35 -8 -87 26 -106 59 133 86 191 -16
3591a6J2j38K25q4j62J89J41j70K24l52J19j4J45J73m17JJ5J96N3k03K28l61J27
$$ -16 -4 -142 83 -1 -163 26 167 -3 221 -131 -12 -26 119 292 -125 -124 -109 87 140 -63 165 -196 -69
3614f9J78j7l4k4p1P2J01j13o4J95j77P5P7O2k54j59J95O3L7k7O0k42K91k64J81
$$ -69 109 92 58 34 -37 35 136 23 -41 154 -23 52 129 191 -63 -222 -27 36 73 46 106 -136 155 -109 72
3639G2O3m26K71K13l29L15r6j48K6j04J36j03J20k47K46n7J33l27J42J73J19k11
$$ 72 135 -291 -20 193 -136 179 83 -65 -39 -143 -7 -110 10 -237 9 -48 85 -242 -100 73 192 -19
3661a9J18l0n6j2j17J11J23o4M7j52%O3n0J28rJ68j26j50L2j8j4J55r3r2P9O1
$$ -19 99 69 13 1 -116 -5 118 54 101 -51 -51 12 -38 90 81 249 123 -27 5 -13 -27 128 35 -57 22 83
3687H3K9J12j25k45J32j38L00k1q9k9K96l70j13J84N5M7j49M2l5N7l66R0J50N8
$$ 83 112 224 99 -146 -14 -152 148 127 38 9 305 -65 -178 6 61 108 -41 1 -34 23 -343 -253 -103 -45
3711d5O4J3J57r0l25nj1m9J58J04oJ06k9j15m9K11k84j30J48M6L44j81j6O2K5
$$ -45 19 32 189 99 -226 -231 -242 -291 -133 -29 -35 71 42 -73 -122 89 -195 -325 -177 -131 213 32 16 78 103
3736A03j35K01j43j85J3J76j95j7K56L9J00k83J07j12J57K0j12r6M01j78J0M9
$$ 103 -32 169 26 -159 -146 30 -165 -182 74 113 213 -70 37 -75 82 102 -10 -106 295 117 127 176
3758A76j51n3K8nN8LJ40j95Q3q4j29K50j16Q9J37k74j11J69j20J15k17L42k83
$$ 176 25 -28 0 -5 53 56 196 1 84 0 -129 121 5 94 231 -43 -154 15 -105 10 -207 135 -148
3781a48p6J91o4J20k83K96p6L3j41M6J53r0n3j91M13l1n3kr6N3o9P7L4j50j44
$$ -148 -224 -33 -97 23 -260 36 -40 -7 -148 -102 51 -39 -92 -283 130 99 46 44 -52 1 -68 9 43 -107 -251
3806b51K51K86k14j19k38K74J40J6j80j07K07J66j75j9n3k3J84k1k12K2Q0L4j28
$$ -251 0 286 72 -47 -285 -11 129 145 -35 -142 65 231 56 37 -16 -39 145 124 -88 -66 14 48 -80
3829h0P1j14L0M3J49k57L53j93J30J03m45K08M8j00N9K22l32O1j17J75J37j42
$$ -80 -9 -123 -93 -50 99 -158 195 2 132 235 -210 -2 46 -54 5 227 -105 -44 -161 14 151 9
3851IMr1j34L10o0j56L93l54J28P7J80k88MJ57l22L2J6P9l39J28J31K19l55J11
$$ 9 13 -78 -212 98 38 -118 275 -79 49 126 306 18 22 179 -143 -111 -95 -16 -355 -227 -96 123 -232 -121
3875a21K9J75j64P1m2J1K04k91K08k00o6P8O6J34j99J27O8j02J29lO4p7Nk80J74
$$ -121 -92 83 -81 -10 -52 -41 163 -128 80 -120 -186 -108 -42 92 -107 20 88 -14 115 112 176 99 104 -176 -2
3900bM7O5k4K38n2k72l7j36L19k98m0L28k0k07J13J29j60r7K87j06l9N2J09N1
$$ -2 45 110 86 324 272 0 -37 -173 146 -152 -192 136 116 -91 22 151 -9 -106 181 75 36 88 197 248
3924B48j59j42k8K20k50p4J78r8j08N67m96K54R5l57K43o7N3J30j20l73J01R5
$$ 248 89 -53 -81 139 -111 -185 -7 -105 -213 354 -142 112 207 -150 93 26 79 209 89 -284 -183 -88
3946h8j07K09J7l21L29Q3Q4j83L4j93jJ14j32J14K47l33j56K99r3j0K49k67J86
$$ -88 -195 14 31 -290 39 122 206 23 57 -136 -137 -23 -155 -41 206 -127 -283 16 -77 -87 162 -105 81
3969H1O8k16Q5k13J64N5k0J52j50M1k48L73j91K9J33j69k25L12j93K03j66L06
$$ 81 149 -67 18 -195 -31 24 4 156 6 47 -201 172 -19 10 143 -26 -251 61 -132 71 -95 211
3991B11k00r7N7R0L3L1l56J89k3k70M42j75K38l73L55n4j58J69q7k90L13k3o3
$$ 211 11 -86 -29 61 94 125 -231 -42 -65 -335 107 -68 170 -203 152 98 -60 109 22 -268 45 22 -41
4014d1nJ4k05K92nk49J99j80N4n4J12K16L8m26L45J9j67m8K2m9k1J14J86k35M
$$ -41 -46 -32 -237 55 50 -199 0 -180 -126 -180 -68 148 186 -240 105 124 -43 -91 -69 -118 -139 -25 161 -74 -70
4039g0J44j80L4J24k53J00L32n10K97O6j61m0J86O2j85j52K19j2p5K14o8k69J69
$$ -70 74 -106 -72 52 -201 -101 231 -279 18 84 -77 -117 69 131 -54 -206 13 1 -74 140 72 -197 -28
$$ [...]
8191b81
##END NTUPLES=NMR FID
##END=
