##TITLE=1H_SR55_oil3
 d2o, 8 sc, 
 12.05.2021
##JCAMPDX= 6.0         $$ Bruker NMR JCAMP-DX V2.0
##DATA TYPE= NMR FID
##DATA CLASS= NTUPLES
##ORIGIN= UXNMR, Bruker Analytische Messtechnik GmbH
##OWNER= root
$$ XWIN-NMR		Version 3.5
$$ Wed May 12 13:09:57 2021 Russian Standard Time (UT+4h)  she@DPX200
##.OBSERVE FREQUENCY= 200.131506
##.OBSERVE NUCLEUS= ^1H
##.DELAY= (6, 6)
##.ACQUISITION MODE= SIMULTANEOUS
##.ACQUISITION SCHEME= undefined
##.AVERAGES= 8
##.DIGITISER RES= 18
##SPECTROMETER/DATA SYSTEM= spect
##.PULSE SEQUENCE= zg30
##.SOLVENT NAME= D2O
##.SHIFT REFERENCE= (INTERNAL, D2O, 0, 15.7039)
##AUDIT TRAIL= $$ (NUMBER, WHEN, WHO, WHERE, WHAT)
$$ ##TITLE= Audit trail, XWIN-NMR		Version 3.5
$$ ##JCAMPDX= 5.01
$$ ##ORIGIN= Bruker BioSpin GmbH
$$ ##OWNER= she
$$ F:/spectra/data/she/nmr/H-F/1/audita.txt
$$ ##AUDIT TRAIL=  $$ (NUMBER, WHEN, WHO, WHERE, WHAT)
(   1,<2021-05-12 13:08:49.50 +0400>,<she>,<DPX200>,
      <created by zg, POWCHK disabled, PULCHK disabled
       configuration hash MD5:
       00 E9 B6 7A A2 85 ED C7 34 08 36 98 17 FE 4E 26
       data hash MD5: 16K
       D0 B9 29 42 1E 64 BC 85 B3 53 CE C0 43 22 C0 E8>)
$$ ##END=
$$ 
$$ hash MD5
$$ 0A 75 2A CB 60 AC CB E2 08 CF C7 39 05 F4 F7 58
##$RELAX= 
##$RELAX= 
##$RELAX= 
##$RELAX= 
##$RELAX= 
##$RELAX= 
$$ Bruker specific parameters
$$ --------------------------
##$DU= <F:/spectra>
##$EXPNO= 1
##$NAME= <H-F>
##$PROCNO= 1
##$TYPE= <nmr>
##$USER= <she>
##$AMP= (0..31)
100 100 100 100 100 100 100 100 100 100 100 100 100 100 100 100 100 100 
100 100 100 100 100 100 100 100 100 100 100 100 100 100 
##$AQSEQ= 0
##$AQ_mod= 1
##$AUNM= <au_zg>
##$AUTOPOS= <>
##$BF1= 200.13
##$BF2= 200.13
##$BF3= 200.13
##$BF4= 200.13
##$BF5= 200.13
##$BF6= 200.13
##$BF7= 200.13
##$BF8= 200.13
##$BYTORDA= 1
##$CFDGTYP= 0
##$CFRGTYP= 5
##$CHEMSTR= <none>
##$CNST= (0..31)
1 1 145 1 1 1 1 1 1 1 1 1 1 1 1 1 1 1 1 1 1 1 1 1 1 1 1 1 1 1 1 1 
##$CPDPRG= <>
##$CPDPRG1= <>
##$CPDPRG2= <>
##$CPDPRG3= <>
##$CPDPRG4= <mlev>
##$CPDPRG5= <mlev>
##$CPDPRG6= <mlev>
##$CPDPRG7= <mlev>
##$CPDPRG8= <mlev>
##$CPDPRGB= <>
##$CPDPRGT= <>
##$D= (0..31)
0 1.2 0 0 0 0 0 0 0 0.06 0 0.03 0 0 0 0 0.0002 0 0 0 0 0 0 0 0 0 0 0 0 
0 0 0 
##$DATE= 1620810528
##$DBL= (0..7)
120 120 120 120 120 120 120 120 
##$DBP= (0..7)
150 150 150 150 150 150 150 150 
##$DBP07= 0
##$DBPNAM0= <>
##$DBPNAM1= <>
##$DBPNAM2= <>
##$DBPNAM3= <>
##$DBPNAM4= <>
##$DBPNAM5= <>
##$DBPNAM6= <>
##$DBPNAM7= <>
##$DBPOAL= (0..7)
0.5 0.5 0.5 0.5 0.5 0.5 0.5 0.5 
##$DBPOFFS= (0..7)
0 0 0 0 0 0 0 0 
##$DE= 6
##$DECBNUC= <off>
##$DECIM= 32
##$DECNUC= <off>
##$DECSTAT= 4
##$DIGMOD= 1
##$DIGTYP= 9
##$DL= (0..7)
0 120 120 120 120 120 120 120 
##$DP= (0..7)
150 150 150 150 150 150 150 150 
##$DP07= 0
##$DPNAME0= <>
##$DPNAME1= <>
##$DPNAME2= <>
##$DPNAME3= <>
##$DPNAME4= <>
##$DPNAME5= <>
##$DPNAME6= <>
##$DPNAME7= <>
##$DPOAL= (0..7)
0.5 0.5 0.5 0.5 0.5 0.5 0.5 0.5 
##$DPOFFS= (0..7)
0 0 0 0 0 0 0 0 
##$DQDMODE= 0
##$DR= 18
##$DS= 0
##$DSLIST= <SSSSSSSSSSSSSSS>
$$ [...]
##$SUBNAM2= <"">
##$SUBNAM3= <"">
##$SUBNAM4= <"">
##$SUBNAM5= <"">
##$SUBNAM6= <"">
##$SUBNAM7= <"">
##$SUBNAM8= <"">
##$SUBNAM9= <"">
##$SW= 16.9725357007746
##$SWIBOX= (0..15)
0 0 2 0 0 0 0 0 0 0 0 0 0 0 0 0 
##$SW_h= 3396.73913043478
##$TD= 16384
##$TD0= 1
##$TE= 0
##$TE2= 300
##$TE3= 300
##$TEG= 300
##$TL= (0..7)
0 120 120 120 120 120 120 120 
##$TP= (0..7)
150 150 150 150 150 150 150 150 
##$TP07= 0
##$TPNAME0= <>
##$TPNAME1= <>
##$TPNAME2= <>
##$TPNAME3= <>
##$TPNAME4= <>
##$TPNAME5= <>
##$TPNAME6= <>
##$TPNAME7= <>
##$TPOAL= (0..7)
0.5 0.5 0.5 0.5 0.5 0.5 0.5 0.5 
##$TPOFFS= (0..7)
0 0 0 0 0 0 0 0 
##$TUNHIN= 0
##$TUNHOUT= 0
##$TUNXOUT= 0
##$USERA1= <user>
##$USERA2= <user>
##$USERA3= <user>
##$USERA4= <user>
##$USERA5= <user>
##$V9= 5
##$VALIST= <valist>
##$VCLIST= <CCCCCCCCCCCCCCC>
##$VD= 0
##$VDLIST= <DDDDDDDDDDDDDDD>
##$VPLIST= <PPPPPPPPPPPPPPP>
##$VTLIST= <TTTTTTTTTTTTTTT>
##$WBST= 1024
##$WBSW= 4
##$XGAIN= (0..3)
0 0 0 0 
##$XL= 0
##$YL= 0
##$YMAX_a= 124283
##$YMIN_a= -101948
##$ZGOPTNS= <>
##$ZL1= 120
##$ZL2= 120
##$ZL3= 120
##$ZL4= 120
##$ABSF1= 10
##$ABSF2= 0
##$ABSG= 5
##$ABSL= 3
##$ALPHA= 0
##$AQORDER= 0
##$ASSFAC= 0
##$ASSFACI= 0
##$ASSFACX= 0
##$ASSWID= 0
##$AUNMP= <proc_1d>
##$AZFE= 0.1
##$AZFW= 0.1
##$BCFW= 1
##$BC_mod= 2
##$BYTORDP= 1
##$COROFFS= 0
##$CY= 11.3945322036743
##$DATMOD= 1
##$DC= 2
##$DFILT= <>
##$DTYPP= 0
##$F1P= 15.9154993809931
##$F2P= -4.1035820241983
##$FCOR= 0.5
##$FTSIZE= 0
##$FT_mod= 4
##$GAMMA= 1
##$GB= 0.15
##$INTBC= 1
##$INTSCL= 1
##$ISEN= 128
##$LB= 0.24
##$LEV0= 0
##$LPBIN= 0
##$MAXI= 10000
##$MC2= 0
##$MEAN= 0
##$ME_mod= 0
##$MI= 1.114404
##$NCOEF= 0
##$NC_proc= 0
##$NLEV= 6
##$NOISF1= 3.799351
##$NOISF2= 2.8
##$NSP= 1
##$NTH_PI= 0
##$NZP= 0
##$OFFSET= 15.70392
##$PC= 1
##$PHC0= -11131.81
##$PHC1= 9.401
##$PH_mod= 1
##$PKNL= yes
##$PPARMOD= 0
##$PSCAL= 0
##$PSIGN= 0
##$REVERSE= no
##$SF= 200.130013532006
##$SI= 16384
##$SIGF1= 3
##$SIGF2= 2
##$SINO= 400
##$SIOLD= 16384
##$SREGLST= <1H.CDCl3>
##$SSB= 0
##$STSI= 0
##$STSR= 0
##$SW_p= 3612.71676300578
##$SYMM= 0
##$S_DEV= 0
##$TDeff= 0
##$TDoff= 0
##$TI= <>
##$TILT= no
##$TM1= 0
##$TM2= 0
##$TOPLEV= 0
##$USERP1= <user>
##$USERP2= <user>
##$USERP3= <user>
##$USERP4= <user>
##$USERP5= <user>
##$WDW= 1
##$XDIM= 8192
##$YMAX_p= 0
##$YMIN_p= 0
$$ End of Bruker specific parameters
$$ ---------------------------------
##NTUPLES= NMR FID
##VAR_NAME=  TIME,          FID/REAL,        FID/IMAG
##SYMBOL=    X,             R,               I
##VAR_TYPE=  INDEPENDENT,   DEPENDENT,       DEPENDENT
##VAR_FORM=  AFFN,          ASDF,            ASDF
##VAR_DIM=   8192,          8192,            8192
##UNITS=     SECONDS,       ARBITRARY UNITS, ARBITRARY UNITS
##FACTOR=    0.0002944,     1,               1
##FIRST=     0,             0,               0
##LAST=      2.4114304,     0,               0
##MIN=       0,             -101948,         0
##MAX=       2.4114304,     124283,          0
$$ Real data points
##PAGE= N=1
##DATA TABLE= (X++(R..R)), XYDATA
$$ [...]
2372d48n35J10R56J252q59p41m80j09J125P24k10j038o82L88P54O49mj060o52
$$ -448 -983 -873 83 1335 476 -265 -745 -854 271 995 785 -253 -935 -547 207 856 852 -208 -860
2391h60K06N50J079L1j144r27L30J072P17j93r83q50J50R56R21k34q43j042K76
$$ -860 -654 -104 975 1006 -138 -1065 -735 337 1054 861 -122 -972 -822 134 1055 821 -22 -1064 -788
2410g88J019L79P9n71r65J15P79P62J0q35p49j64P42J041k3p05p85l07J255N22
$$ -788 231 610 689 118 -847 -732 47 809 819 -16 -765 -929 -187 854 831 126 -659 -966 289 811
2430H11L7p89r96J72R30L95J57n67q55p7N90J012J17p71q27m20P63J296l27m22
$$ 811 848 59 -937 -765 165 560 717 150 -705 -782 -192 820 937 166 -661 -1081 -318 978 651 229
2450B29n66j020J338R73m7o75j164MQ02P22L86r87m99j92M1J428L78j287np91
$$ 229 -337 -1357 -19 954 907 232 -932 -928 -126 596 982 -5 -504 -696 -655 773 1151 -136 -141 -932
2470i32O71J085K0l32j020o79Q13Q99N55n10j324K4K75J056M54r12r55K07J80
$$ -932 -261 824 844 512 -508 -1187 -374 525 1080 570 -754 -730 -455 601 1055 143 -812 -605 -425
2489d25J049M99r00n77l87M10P92M03l78j065l97P17M58Q31n46j203j16O09M63
$$ -425 624 1123 223 -354 -741 -331 461 864 486 -579 -976 -259 199 1030 484 -719 -835 -226 237
2508B37R55q07j251J84J10J051O03o65p67o72N64O60O42j98r49q43P87O15N43
$$ 237 1192 385 -866 -682 -572 479 1082 417 -350 -1022 -458 202 844 646 -303 -1146 -359 256 799
2527G99j20r93o97L81R36O55l23q94n60J50J116L24k54p01q03N29Q62L83j76o92
$$ 799 679 -314 -1011 -630 306 961 638 -256 -816 -666 450 774 520 -181 -984 -455 407 790 614 -78
2547g8j094P35O18P04k1j051p57J88R70P85m17n85r97l5J318P24m13o45p11M0
$$ -78 -1172 -437 181 885 864 -187 -944 -756 214 999 582 -3 -1000 -1035 283 1007 594 -51 -762 -722
2567g22J023M47j13q87n80J50P53J041m08r43n12k90R86R00j60p66n58l02Q43
$$ -722 301 748 635 -252 -832 -682 71 1112 704 -239 -751 -1041 -55 845 685 -81 -639 -941 -98
2586i8J021j66p59r67J82O63P32K49q41q54J8P31Q75np57o33k48O12J013k6n38
$$ -98 923 757 -2 -969 -787 -124 608 857 16 -838 -820 -89 786 781 24 -609 -857 -245 768 742 204
2607B04r03j98O85P50M16r91o95j90O06J011L45r29p56j94P43P29K50p09q16l19
$$ 204 -699 -897 -212 538 954 -37 -732 -922 -316 695 1040 111 -645 -839 -96 633 883 174 -642 -961
2627i61O71O84N29n86j050o6P03O84L13o47r29l9L61R27J7l94p92l35N05Q84K46
$$ -961 -290 394 923 337 -713 -779 -76 608 921 274 -655 -694 -333 594 611 217 -575 -910 -405 479 725
2648G25m88q57k88P42Q18K53n21q31l93M97Q91K76l04r10n36N72Q18L36m95o98
$$ 725 237 -620 -908 -166 652 905 384 -447 -840 -343 548 824 520 -390 -926 -354 464 800 305 -393
2668c93n39N11R25K65l71q15m27L75R41K75j87p41o48J22J389K33m91p62n68M07
$$ -393 -932 -421 504 769 398 -417 -844 -469 472 747 560 -181 -829 -707 682 915 424 -338 -906 -499
2688d99J010N02o44p09n71L06J048N83n44o74q50M66P94P13l91r65k09K4P09Q52
$$ -499 511 1013 369 -340 -911 -605 443 1026 482 -192 -1042 -576 218 931 540 -425 -634 -610 99 951
2708I51m89o84l97M1Q42P35n42p54l18P0O99Q08l95p49n64J16Q13P21j0j369l03
$$ 951 462 -222 -619 -578 264 999 457 -297 -615 -545 154 962 567 -182 -746 -630 183 904 894 -475 -778
2729g78mP36R52l82p22l45r0P86N66j4j083m72J52P91M40K01q71q03M47O01N09
$$ -778 -782 -46 906 524 -198 -543 -633 153 719 705 -378 -850 -698 93 533 734 -137 -940 -493 108 617
2750F17J27p45q55L41L73R44j13o25r45L23O38N35J96n98j067J07P92O60J33o82
$$ 617 744 -1 -856 -515 -142 802 689 64 -881 -558 80 615 811 213 -854 -747 45 705 838 156
2770A56p57j62O67O71J73r30m10k16P24O81K33o08r85L2Q31N17J62m27j143nO84
$$ 156 -601 -763 -96 575 748 -182 -592 -808 -84 597 830 222 -763 -731 100 617 779 352 -791 -796 -112
2791a12O62L5k89j110P1O18R29K5l83r03k56M86Q64J98q18m46n08O10R68J63n70
$$ -112 550 585 296 -814 -743 -125 804 829 446 -457 -713 -227 637 835 17 -429 -937 -327 641 804 234
2812B34p03j66L56P18L43o55o09k50N68O32L53o37p63j50L99Q62Q7k88p08l26
$$ 234 -469 -635 -279 439 782 127 -482 -732 -164 468 821 184 -579 -729 -330 532 619 331 -377 -703
2832g03L98P86L57l24p62n16L51Q68M41l46j034j99J34J005M69p67p08k05K67
$$ -703 -305 481 838 514 -248 -764 -413 455 896 550 -484 -683 -549 456 925 158 -550 -755 -488
2851d88P07P49p04q73j24L12O12M76p0j230k04N57L47Q14l15r42l48O9R28N96
$$ -488 219 968 264 -609 -733 -421 191 667 597 -633 -837 -280 67 881 566 -376 -724 -655 273 869
2871H69l84p67n77J77J094M38j75r56m11L36P44K99r6j035j13P4P09M24k8p02
$$ 869 485 -282 -859 -682 412 850 675 -281 -692 -356 388 687 591 -444 -557 -483 226 650 622 -80
2891h0m96j75R90L59M3p47q76L85Q98L18J21o88j058N59O51M23j35o99k47q9O65
$$ -80 -576 -751 239 598 641 -106 -982 -597 301 619 740 52 -1006 -447 204 627 492 -207 -454 -543 122
2912A22M67l61l97m46r0P39O52j39k32r40k68J075L78K83q87p35Q4O53Q66j14
$$ 122 589 228 -169 -615 -705 34 686 547 315 -625 -893 182 560 843 -44 -779 -695 -42 824 710
2932G10p31o43M0N35R33m29n19l60l82P62Q15k91k48r95J76N78N77K38o11q46
$$ 710 -21 -664 -624 -89 844 415 -104 -464 -846 -84 731 440 192 -803 -627 -49 528 766 155 -691
2952f91J55L91Q09J97q22n36j17M16R83j44o42m27k55N95P42l6n77l93l14M65
$$ -691 -536 -145 664 861 39 -497 -614 -198 785 641 -1 -428 -683 -88 654 618 41 -352 -666 -201
2972b01N86L62n84r44K26L09R09J34o45q10M5L12P45K32m54n19l77O04L42Q6L
$$ -201 385 747 163 -781 -555 -246 663 797 152 -658 -613 -301 444 676 222 -297 -674 -70 272 358 361
2993C61r11j16Q35QO66m87r04j31K89P42N96o73n44k27J83P20L82m90n94m48M17
$$ 361 -550 -666 169 177 843 356 -548 -679 -390 352 948 275 -269 -496 -313 407 789 299 -295 -743 -326
3014c26M88M66k28p56l14J94Q66J62n2q32k65K68N83M94n91l74n19M25Q35K9j35
$$ -326 162 628 400 -356 -670 -476 390 552 500 -332 -597 -329 254 748 157 -217 -736 -311 524 553 418
3035D18p32m46L47R69J57l37p61k29J53R06M43l44r94l45K11Q05L31m1o71n44
$$ 418 -314 -760 -413 556 713 376 -385 -614 -461 445 888 544 -450 -795 -584 221 552 511 -160 -704
3055g04K42O14M72j85l32q68L56O15N89k24p64l78R6O63M65k14o32m57j4N96O73
$$ -704 -462 152 624 439 107 -761 -405 210 799 575 -189 -567 -471 192 657 443 -189 -646 -660 -64 609
3076F09p4o35n56J54N24P84l89n45k94o5L78P85j66p14l53J8M13P02jp03k47j72
$$ 609 535 -100 -656 -502 22 806 417 -128 -422 -487 -109 676 510 -204 -557 -539 -126 576 575 -128 -375 -547
3098e47N68O63j24o49n04K09M64M27M6o65n46K33K37Q39J19o84n74J37L73O51
$$ -547 21 684 560 -89 -593 -384 80 507 553 -112 -658 -425 -188 651 770 86 -488 -351 22 673
3118F73K7o29n35k40O32M71K53n70p40K56M04N57K07n42q16L0O64M82o5l51p77
$$ 673 700 71 -464 -704 -72 399 652 82 -658 -402 2 559 766 224 -592 -562 102 584 519 168 -609
3139f09J3O60M58m9k48o82m89R50N12j27j7p51k92O13O19j12o5r94k41P28M65
$$ -609 -596 64 522 473 225 -457 -946 4 516 389 372 -379 -671 -58 561 449 384 -610 -851 -123 342
3160C42K37m36o72j13N59M99L90m90n98l63M20P31R5k64o10m25N15O42M09q08
$$ 342 579 143 -529 -642 -83 416 806 316 -282 -645 -225 506 601 337 -273 -698 -183 459 868 60
3180F0l51l55K74R70M7l52m87k75M0Q73J09k35p97m62N54P86M18n38n02l02K14
$$ 60 -291 -646 -372 598 645 293 -194 -469 -429 444 553 318 -479 -941 -387 399 817 279 -223 -525 -311
3201c11N78K80l18n76k03L30M76M12k39r93l7K18O35N71o39n47k73J1Q21N13k62
$$ -311 267 547 229 -347 -550 -220 256 668 429 -564 -601 -383 252 823 184 -363 -636 -625 196 709 447
3222D47p53l52J85O13M96p4o13p58M76N26K28r8p68k56K87M86O47j05q62k85J
$$ 447 -306 -658 -473 140 636 562 -51 -809 -333 193 421 323 -445 -701 -414 72 719 614 -248 -533 -532
3243e32P27K59nn60m23J69M92N44q5o71p71L86O95L17o8o06n87J74N94M36N5o12
$$ -532 195 454 449 -111 -534 -365 127 671 586 -85 -856 -470 225 542 474 -132 -719 -545 49 485 540 -72
3265g2n22O3O95L07O9n20o70J08O35M69k76r0o47k92O71N08J34m78l03j63K33
$$ -72 -594 -531 164 471 540 20 -650 -542 93 562 286 196 -451 -743 -72 436 570 92 -211 -374 -141
3286a41L67J94k65o47M7K97N97k8m39m75k33O85O01m4n22l63j56M22M91R0o03
$$ -141 226 420 155 -492 -445 -148 449 421 -18 -493 -726 -41 560 516 -6 -369 -525 -103 388 478 -125
3307a25l87j35N56L52N85p10n12l19M42O27J51n46l46j74L56P53K35o83p02P2
$$ -125 -512 -647 -91 261 846 136 -376 -695 -253 374 525 -21 -367 -541 -185 568 803 120 -582 -510
3327e10K45N48J25j02n96k49J46L95M01k78m06N2j81Q74J32m21l67m44O68K63
$$ -510 -265 283 408 306 -290 -539 -393 2 403 125 -281 -229 -410 464 596 175 -192 -636 32 295
3347B95M32l67q14o6L65M04M19l01q73J41R8K01P33m93l58k94M0O91J48j10n33
$$ 295 727 360 -454 -520 -155 249 668 367 -506 -365 -267 -66 667 174 -184 -478 -438 253 401 291 -242
3368b42m09L80O33K7R0q15l58O01M03J11r4o70K4nN22K82k00o36j59J89M02K87
$$ -242 -651 -271 362 389 479 -336 -694 -93 310 421 327 -343 -319 -324 198 480 280 -356 -515 -326 76 363
3390C63R4n60p16L60N75O13l33p15m03L93M26N53l54p45P3J73M11K87m51j16l60
$$ 363 457 -103 -819 -459 116 729 396 -319 -722 -329 97 650 296 -449 -376 -203 208 495 44 -72 -432
3411d32m7O60J50Ol55o42K65N40K50l7m07m85N0N64M19l29k07l69Q4K53M58K0
$$ -432 -479 181 331 337 -18 -660 -395 145 395 358 -49 -534 -484 80 499 170 -37 -406 -322 -69 389 409
3433D09k52o05k02P55K88j07m16j10j26N06J51J12n30j87l17N07O33J05o14l37
$$ 409 157 -448 -650 105 393 286 -130 -240 -366 140 291 403 -127 -314 -631 -124 509 614 0 -337
3453c37r6M97M88l74l52j64j5L45M22n8k92l42j74J91M51M67o40n26P8J71P23
$$ -337 -433 64 552 178 -174 -338 -353 -8 414 356 64 -278 -452 -261 190 657 17 -509 -431 -260 463
3474D63J44m98o14R3L39O76n6k62q16M5O82k8K75l6p33o1L19L91R8k74o21p2L64
$$ 463 607 109 -505 -412 -73 603 547 285 -531 -486 196 168 443 407 -326 -387 -68 323 421 147 -474 -546 -182
3497a82M45K51j25n90l29M43N17J63n36k94l23N35L38J46k64n10l2J92L23K71
$$ -182 263 514 389 -201 -530 -87 430 593 57 -237 -560 -25 313 459 195 -315 -347 -155 168 439
3517D39k3r31J61J20M78M53m06n93j11J98N20J00j56j94o67K91N25L17m29k37
$$ 439 416 -515 -354 -234 244 697 291 -302 -413 -215 305 405 249 55 -612 -321 204 521 92 -145
3537a45l56K68M26K11k93k46m49J90O69L48m35n16j08K3N82K42j03l94m66L11
$$ -145 -501 -233 193 404 111 -135 -584 -394 275 623 188 -328 -436 -413 169 411 308 -86 -552 -241
3557b41O36Q8R8q61m3j93O36L72k46m32k32J29M32L62k51n14j26J55M80J08K4
$$ -241 395 483 581 -280 -323 -516 120 492 246 -186 -418 -289 143 505 254 -260 -386 -231 249 357 381
3578C81o41j20j53O51K23J29o16k67J63M08K35K49p37k15j12N24M80l87k07p76
$$ 381 -260 -380 -533 118 341 470 -146 -413 -250 158 393 642 -95 -310 -422 102 582 195 -12 -788
3598g88M24L74L30k1k78m22P9L13L57j5l32n60O3M59N36j83l02m51N7L54K78J07
$$ -788 -364 10 340 319 41 -381 -302 11 368 353 21 -539 -476 -17 519 336 34 -417 -360 -6 272 379
3620C79l88m10j37N64M48J78m04o73J5M39K17J90k08m50k59L48L40J20k16m89
$$ 379 -9 -419 -556 8 456 634 230 -443 -428 11 228 418 210 -240 -499 -151 189 309 93 -396
3640c96M8J35O18Q4l58l36m13L43P38m5m24l38r1K31O35k7m11n6l09J19N70J28
$$ -396 -348 -213 405 489 131 -205 -618 -275 463 418 -6 -344 -435 -204 431 404 -7 -63 -372 -253 317 445
3662D45k09m66l51K34N40K90j14o06m4J97L32J40q6o00P2j54Q01n8k99q5l93K46
$$ 445 236 -230 -581 -347 193 483 369 -237 -281 -84 248 388 302 -298 -226 -380 421 363 64 -21 -414 -168
3684a68K35L09j83k66m77K50L45M01k32n15j51L17J30O03l95m60l7K05R3L13K1
$$ -168 67 376 193 -73 -550 -300 45 446 214 -301 -452 -135 -5 598 203 -257 -294 -89 4 317 338
3705C38m26p0q0J47L49J74o63k8l9K95N48j63n49l66M24K86K90m1n21k90M2K74
$$ 338 -88 -158 -238 -91 258 432 -231 -259 -298 -3 545 382 -167 -533 -109 177 467 426 -95 -385 -343 -69
3727f9L94j51l81j52O1P41P8M1o91m7q5M17K30R1n74l18L17K5K80o8O0n07J1L65
$$ -69 325 174 -207 -359 -298 443 521 562 -129 -176 -261 156 386 477 -97 -415 -98 -73 207 139 199 -308 -297 68
3751F8J59K79p12k03O4M48K38Q0l33n57J8L83M29O9l07l09j35M15K61p8k48k75
$$ 68 227 506 -206 -409 -345 103 341 421 88 -469 -451 -68 361 430 123 -186 -321 94 355 277 29 -246
3773b46k71N19L57L4m74j06j17L06K43l0j52n55K30j26Q35M4n08j53k71M65M95
$$ -246 -517 2 359 393 -81 -187 -304 2 245 215 63 -492 -262 -388 447 491 -17 -170 -441 24 519
3794E19j98l29l20k99M36M87J75k08n26K36J7J88K19j86n80m4L43L65N3k54m57
$$ 519 321 -8 -328 -627 -191 296 471 263 -263 -27 -10 178 397 211 -369 -413 -70 295 348 94 -363
3815c63j7J38O16L5k55l88k11L28K49L94j87m64j36J27K67M11m60l04j70L89O6
$$ -363 -380 -242 374 409 154 -234 -445 -117 132 526 339 -125 -261 -134 133 544 84 -220 -390 -1 65
3836F5K51jm10m90L86O47k01J6m87j34K66L60N8l3m66j44N7M45J12J5n02j69J82
$$ 65 316 315 -95 -585 -199 448 247 263 -224 -358 -92 268 326 293 -173 -317 -260 185 297 312 -190 -359 -177
3859a77K51P0L47m39o65M29L12L67l37k07l69QM11N05l21m27j88r5O08K07r7k51
$$ -177 74 144 491 52 -613 -184 128 495 158 -49 -418 -410 1 506 185 -242 -430 -525 83 290 193 -58
3881e8p7l24M63K61j35K5m11j49M63K99l9n17r8mJ17P50l10k79l60O6L70M17k05
$$ -58 -135 -459 4 265 130 155 -256 -405 58 357 318 -199 -297 -301 -184 566 256 -23 -383 -317 53 470 265
3904B65j61l97j11L63L59j79k08j92k88M83J32L87m98j59l00L71M61K94o70j39
$$ 265 104 -293 -404 -41 318 139 -69 -261 -549 -66 66 453 -45 -204 -504 -133 328 622 -48 -187
3924a87k40L76M28l11L4k12k76J37O25o8l03q6k14N8M90j9j57m41K07N5L36m9
$$ -187 -427 -51 377 66 100 -112 -388 -251 374 306 3 -83 -297 -239 251 232 75 -366 -159 -104 232 183
3946A83j42k09j94P3O69Q5k39m59j72L00K58K55j80l75k69K45J39N38l28l33j20
$$ 183 41 -168 -362 -289 380 465 226 -233 -405 -105 153 408 228 -147 -416 -171 -32 506 178 -155 -275
3967b75J31L30N3j23l13k44L33J98N2N3l90j7O1J63K99j33l20j92J49J86L73k88
$$ -275 -144 186 239 116 -197 -441 -108 90 142 195 -195 -212 -151 12 311 178 -142 -334 -185 1 374 86
3989H6k27k03J59L39K00nk56o17M26L02K41k03m38j32k23M98J94K25l55m07L1
$$ 86 -141 -344 -185 154 354 349 93 -524 -98 204 445 242 -196 -328 -551 -53 141 366 11 -396 -365
4010c65M92L52k43k74j76j45M29L81q4l28l94J33J48K68j8k06l12J62K68N4O5
$$ -365 127 479 236 -38 -214 -359 70 451 367 39 -355 -222 -74 194 176 -30 -342 -180 88 142 207
4031B07j35m11N2K01K50K36l93l34n7L95L76q0l17l04n6N54L3jj10k65j05k6N22
$$ 207 72 -339 -287 -86 164 400 7 -327 -384 11 387 307 -10 -314 -370 184 217 216 106 -159 -264 -290 232
4054B32K42l75m03J16K85K10J63n16l41mM35J41L12o63j37J8J75M04J46m03k43
$$ 232 474 99 -304 -188 97 307 470 -46 -387 -391 44 185 497 -166 -303 -285 -110 294 440 37 -206
4075b06n5J46J95M91m00l98R6O9J17K41mo70Q9j56Q13J39k68m24QJ58L08m6M0
$$ -206 -261 -115 80 571 171 -227 -131 -62 55 296 292 -378 -289 -445 368 507 239 -185 -177 -19 289 243 283
4098B83o49k4P9L64N43j70n88M3q1L48J02O1l22m21K03K85J21l6l04m57M00L57
$$ 283 -366 -390 -311 53 596 426 -162 -119 -200 148 250 311 -11 -432 -229 56 177 141 -163 -620 -220 137
4120A37M07m26k13l00K08K34L61k21j4n64ON52K0O9l41k85J0N72K7Qk65m31K01
$$ 137 544 118 -95 -395 -187 47 408 187 173 -391 -385 167 187 256 -85 -370 -360 212 239 247 -18 -449 -248
4143b48M12J51j48j54m52k8N81L26k60m11k23J92J83L85l5k40l06l1J82N99j16
$$ -248 164 315 167 13 -439 -467 114 440 180 -231 -454 -262 -79 306 271 31 -275 -306 -124 475 359
4164C59m53k67j72M41N27j64m78J4j12K24N58N5n36k38j50K44M70K57p23k91J81
$$ 359 -94 -361 -533 -92 435 271 -207 -193 -305 -81 477 532 -4 -242 -392 -148 322 579 -144 -435 -254
4185b54K72L31K4k46k72j81L02L61J8k34k86j73L32M12O3l15l09k98O0M21L31
$$ -254 18 349 373 127 -145 -326 -24 337 355 121 -165 -338 -6 406 469 154 -155 -453 -393 28 359
4206C59j85l22k75K69L85N0j07l49l53M88J55K45k83k56l94N60J52K85k73l34
$$ 359 174 -148 -423 -154 231 281 174 -175 -528 -40 115 360 77 -179 -573 -13 139 424 151 -183
4226a83P7K4J58L03r5n10k42M74K00J69l75k74O7J39L18L47m71l11K5M8L60J90
$$ -183 -106 -82 76 379 284 -226 -468 6 206 375 0 -274 -207 -68 250 597 126 -185 -160 -112 248 438
4248D38j05m83k88J98L58K89j65l08j44J46L21Q5Ln53j11J61L17J94k03k31m75
$$ 438 333 -150 -438 -240 118 407 242 -66 -210 -64 257 342 345 -208 -319 -158 159 353 150 -81 -556
4269e56L75K38M05k33m40k44N2N44M01j39m77k77J66K13L78mm13m72J84L98J95
$$ -556 -181 57 462 229 -211 -455 -403 141 542 403 -74 -351 -185 28 406 402 -11 -483 -299 99 294
4290B94o5m20j54J82J71L15j33j71k28j80O38L6j38j23l12l8L70J57M9m06j93
$$ 294 229 -191 -345 -163 8 323 190 19 -209 -389 249 285 147 24 -288 -326 44 201 250 -156 -349
4311c49j19L50O79k62j68m69J18n9N45J99o92J4j88L42N51p5l89m49P0M23L13
$$ -349 -468 -118 561 299 131 -338 -220 -279 266 465 -227 -213 -401 -59 492 417 28 -421 -351 72 385
4332C85N9l06m47j33J91M56K60o49k27M4J56O26kl69j90o1N5M67k0m5o37j82O38
$$ 385 444 138 -309 -442 -251 205 465 -184 -411 -367 -211 415 413 44 -146 -207 -152 315 295 250 -387 -569 69
4355F9K01J12k85l14Q2P4L56J54l76k36l39J31P23K2j86m18j71J86O38p1j06m79
$$ 69 270 382 97 -217 -135 -61 295 449 73 -163 -502 -371 352 374 188 -230 -401 -215 423 352 246 -233
4377b33m03P18J94K16l17m99j41J02M18L67j27l66k83O0M48K92l33j7n40K04M55
$$ -233 -636 82 276 492 175 -324 -465 -363 55 422 295 -71 -354 -294 154 446 113 96 -444 -240 215
4398B15J07L3n89j90J40M55J51j76j74q9j41M12M56l49n56q1Q2L94M66k74l32
$$ 215 322 355 -234 -424 -284 171 322 146 -28 -117 -258 154 610 261 -295 -376 -294 100 566 292 -40
4419d0m57N6N17L01Jn46j88j50O35L92j75k83m28J86K70M05j9n95l65J06N57K82
$$ -40 -497 -441 76 377 378 -168 -356 -506 129 521 346 63 -365 -179 91 496 477 -118 -483 -377 180 462
4441D62R1l68n94R2J90N74j15m55l41K04K91M92k27k88m89K97L96K47l1n11l52
$$ 462 553 185 -409 -317 -127 447 332 -123 -464 -260 31 523 296 8 -481 -184 212 459 428 -83 -435
4462d35j05N49J56K03j91n42j06O10L28M5o05k99j3L97L15K38m99n29R5K90L44
$$ -435 -540 9 165 368 177 -365 -471 139 467 512 -93 -392 -405 -8 307 545 46 -483 -388 -98 246
4483B46Q0l13m07N7L35L51j81M7o35J93K52M47Ok53o94j26M07M88L46n58n61o
$$ 246 326 13 -394 -337 -2 349 168 215 -420 -227 25 472 478 225 -469 -595 -188 300 646 88 -473 -479
4505d79K45M38P0j31l46k10K56M13Qj72m14j40M14L80J00k05n39j95M49N51J6
$$ -479 -234 204 274 143 -203 -413 -157 256 264 92 -322 -462 -48 332 432 227 -312 -507 -58 493 509
4526E09l16n61k7K86K57K96k88l17l02J02M82L05j47n17k14K74N53K79m52o00
$$ 509 193 -368 -395 -109 148 444 156 -161 -463 -361 121 426 279 -238 -452 -178 375 654 202 -398
4546c98j60M37J67M80m05m32k13L85M72J02p1o51j13J0O66J97k00l19m35L15K47
$$ -398 -558 -121 46 526 121 -311 -524 -139 333 435 364 -287 -400 -390 276 473 273 -46 -481 -166 81
4567H1L75r8n75j29K62L11J49p7m05l45L4P13oj60l40k51K08M51J43k02j40o02
$$ 81 456 358 -217 -346 -84 227 376 299 -106 -451 -417 296 290 130 -210 -461 -253 198 341 139 -1 -603
4589f03J45M54L89n2l54n00L53J08M89j58k62n52K76J77P04j75n41m15K05L47
$$ -603 -458 -4 385 333 -21 -521 -168 -60 429 271 9 -543 -267 -90 614 439 -102 -517 -312 35
4609C5M30R9o15l73L2N50M00k24l55n29MO17K63K20n64l16m2L47M38M4m71k48
$$ 35 465 564 -51 -424 -392 158 558 334 -21 -550 -546 71 334 554 -10 -326 -368 -21 417 461 -10 -258
4631b58j84O22J49o8k95k51m39O52N70j41k23l93k74L59N03rk59l53k56M69O17
$$ -258 -442 180 329 261 -34 -285 -724 -72 498 357 134 -259 -533 -174 329 320 61 -292 -548 -79 538
4652E38Pm19m45k08L43O41J31m00l13m29M67O08n5k52o03M8K82M81K97n66m30
$$ 538 545 126 -319 -527 -184 457 588 188 -125 -554 -87 521 466 214 -389 -341 -59 422 719 153 -277
4673b77r7R6O28J16m20l86O3o3N56L80l66o80L4R7O88K51m17m05l71N12Q0P49
$$ -277 -374 -278 350 466 46 -340 -277 -340 216 596 230 -450 -416 -319 369 620 203 -202 -573 -61 19 768
4695G68l95p55q8K87L87J67k39m27l29L34M31N84n53m38m26J86O85M16l14n69
$$ 768 373 -382 -470 -183 204 371 132 -295 -624 -290 141 725 172 -266 -692 -506 179 595 281 -288
4715b88j79M17K03M69l17p55K4J96M15M64k24n02o59L13N89L08k57k35n65L29
$$ -288 -467 -50 153 622 305 -450 -426 -230 185 649 425 -77 -736 -423 166 474 217 -18 -583 -254
4735b54O55R9k22l22j83j92N36M84k47k50n92M3N91N36l84m08l13K0O12L20k48
$$ -254 401 500 278 -44 -227 -419 117 601 354 104 -488 -445 146 682 298 -110 -423 -403 209 529 281
4756B81l72o49K03N23N04k82l63l44N7O75L63j11o18r3k29M82O03j81m53l06n7
$$ 281 -91 -740 -537 -14 490 208 -155 -499 -442 233 596 485 -133 -226 -455 27 630 449 -4 -310 -367
4777c67M82O65m33n87k30k30Q61L28r3m71k95j18N14N53l01l12l96M1L21N52q
$$ -367 115 780 347 -240 -470 -700 161 489 396 -75 -370 -488 26 579 278 -34 -430 -389 -68 484 476
4798D76m67n59Q5L65M09M11q26k32l51N61O14K19m81p31rM94M68pm37k72k14L89
$$ 476 9 -550 -465 -100 309 720 -106 -338 -689 -128 486 705 224 -507 -516 -22 446 439 2 -270 -484 -95
4820i5N01j45Q6p13j07M52L22K14k30n96j28K37P06J81m96p08q1M63N99Ql13n22
$$ -95 406 261 347 -366 -473 -21 301 515 285 -311 -439 -202 504 685 189 -519 -600 -137 462 470 157 -365
4842c65l99P79L32K67k46q01j54M59N50O2l27n91J7PQ03J04l46o46q8L19N38K12
$$ -365 -764 15 347 614 368 -433 -587 -128 422 484 157 -434 -417 -410 393 497 151 -495 -583 -264 274 486
4864D86k18n29l61L74M33L37l6n65m29L07N22K50j76o26m19M15P29j1k14m15k56
$$ 486 268 -261 -622 -248 185 522 486 -79 -508 -201 321 571 395 -231 -650 -235 494 483 269 -146 -402
4885d02J05P51K89m50l85k83LP05L87m77n22l08J63O97K03j35n08k16J22N28M13
$$ -402 -297 454 743 293 -92 -375 -372 333 720 243 -279 -587 -424 273 476 341 -167 -383 -261 267 680
4906F80m02m77k71P2L53O14l77k36k66QM13L56K0p62k15O4P05M16l11n45l12J78
$$ 680 278 -199 -470 -398 -45 569 192 -44 -310 -302 111 467 487 -275 -490 -426 279 695 384 -161 -473 -295
4928b95M48L02p8m75l29K86K79L33k60k94m24K38M63L56Oq14j10j94O09O86m00
$$ -295 153 455 377 -98 -427 -141 138 471 211 -83 -507 -269 194 550 556 -258 -368 -562 47 733 333
4949C33n89j46k1O61N33l09m44n38O3L70M50J7l01p03J37O58J34O8m41n14O4M63
$$ 333 -256 -402 -423 238 771 462 18 -520 -457 -87 363 380 79 -624 -487 171 305 373 -68 -582 -518 -55
4971e5M14J35l55q81L68J95N84Km41m93J1M20O21N3o98k99j25N29N18J28o57m86
$$ -55 359 494 139 -742 -374 -179 405 407 -34 -527 -516 -96 525 578 -120 -419 -544 -15 503 631 -26 -512
4993e12m0L84J001k50o17m14j81L99O39K72o99m46l3N14M58R7l64q08Q3L33O66
$$ -512 -552 -168 833 583 -34 -448 -629 -230 409 681 -18 -464 -497 17 475 572 208 -600 -517 -184 482
5014D82K0m12j88m95L08P69Q0l75n59j66L02O62K52o28l57j57J43N96J92k48m68
$$ 482 502 90 -98 -593 -285 484 564 189 -370 -536 -234 428 680 52 -305 -462 -319 277 469 221 -247
5035b47j28K45M68L47p64l35k86M90M77J89j63p87j26M45L90N13m75o04k86M25
$$ -247 -375 -130 338 685 -79 -414 -700 -210 267 456 293 -494 -620 -175 215 728 253 -351 -637 -212
5055b12N93J76l19n24k23K65M35L80k11n22m68L22M34M88j49p99j46J15P61Q2
$$ -212 381 557 238 -286 -509 -244 191 571 360 -162 -630 -308 126 614 465 -334 -480 -365 396 478
5075D78k00n56k63J58N32N52k30n86m72K46N72K67q5o39m73L99N76L04k20o57
$$ 478 278 -278 -541 -383 149 701 471 -115 -587 -341 231 498 413 -226 -699 -300 276 580 360 -297
5095b97k18L10L42M70j49p45j79K73K42N98k07p53l40J71M04Q98m59m96m08jP02
$$ -297 -515 -205 137 607 458 -287 -466 -193 49 647 440 -313 -653 -482 -78 820 361 -135 -543 -544 158
5116A58J30L78q94k64J63O92K58k43l96n91K12J97Q54m03k25m26k29P87N55k27
$$ 158 288 666 -228 -492 -329 363 621 378 -18 -609 -397 -200 654 251 26 -400 -629 158 713 486
5136D86p01k52q6P25K18J66o38k13l99Q97K78K28p24m09q2N14N03o3m74o84K02
$$ 486 -215 -467 -553 172 390 556 -82 -295 -694 203 481 709 -15 -424 -506 8 511 448 -26 -710 -508
5157e08O42K91J38l23p90J70M10L73K7m14o13R0L77M25L52o84l33j70N10N53J17
$$ -508 134 425 563 240 -550 -380 30 403 430 16 -597 -507 -130 295 647 -37 -370 -540 -30 523 640
5178F40m33p13k28N89L94L38l47o93o9M01N65J54n24n85j08N34M62K79o36l40
$$ 640 207 -506 -734 -145 249 587 240 -453 -522 -121 444 598 74 -511 -619 -85 377 656 20 -320
5198c20r9L27O67j6l66n01m06N81N00J43m47o71J16M22L51J51q2o48j08K60P23
$$ -320 -419 -92 575 559 193 -308 -714 -133 367 510 63 -608 -492 -70 281 432 350 -298 -406 -146 577
5219E77j9k42o74l01L92O96K15m78n41m21O71L57J58l04m82j79L23O62L45m14
$$ 577 558 316 -358 -659 -267 429 644 166 -375 -796 -125 232 390 86 -396 -575 -252 410 755 341
5239C41o95k05L31O30K29k63p36l13M79M73K77j26o43j44L9L64N66j38p66l20
$$ 341 -354 -559 -228 402 631 368 -368 -681 -202 271 548 422 -221 -365 -326 38 604 466 -300 -620
5259f20K76N88L67j93m59n13J59Q32J28k14l64m83J92O88L63m09m49n36K14M85
$$ -620 -344 244 611 418 -41 -554 -395 437 565 351 -13 -496 -304 384 747 338 -111 -647 -433 52
5279E2M65m9p12l96L45N55K37k68o58j75J90O21L48j60m49o78K73O96M6K35o19
$$ 52 517 468 -244 -640 -295 260 497 229 -429 -604 -414 207 555 395 -54 -732 -459 237 283 518 -101
5300a01l96J15K50O74j8p86k68Q1L32P33j09n02n97m3P32M78k28l79k82l03O24
$$ -101 -497 -382 -132 542 524 -262 -530 -449 -117 616 507 5 -592 -635 97 575 347 -32 -314 -617 7
5321GM69R5m18o98L3N58M52J39o62n62k8O46N77j48l87n65l7N54M72q8l88m57
$$ 7 476 571 153 -545 -512 46 498 637 -25 -587 -615 31 608 460 73 -492 -529 25 497 409 21 -436
5343d36M7M12K52J97k66n35J08NO82q9k37o19J6O36L53J30m16q83J51N05L19L55
$$ -436 -389 23 275 472 206 -329 -221 -216 466 377 140 -479 -463 173 526 656 240 -643 -492 13 332 687
5365F87n93n94Q7K97L86L02p95j90k88N59N94J25l55n37j81M36O26K5l84n89j45
$$ 687 94 -500 -413 -116 270 572 -223 -413 -701 -142 452 577 222 -315 -496 -60 566 591 207 -382 -527
5386e27L30M82L06l40o80LR6O09M52m34p58j43L76N32N63p22n07k93L95O12M28
$$ -527 -197 285 591 251 -429 -426 -330 279 731 297 -461 -604 -228 304 867 145 -362 -655 -260 352 780
5407G80n32m84m91O21M69K78l71o57k45L15N82K84k40n61k16K79L65K69j96m48
$$ 780 248 -236 -727 -106 363 641 270 -387 -632 -317 265 549 309 -252 -468 -189 176 445 249 -199
5427a99n69M61L76M65k43p07O0J57L78M89k52n07p30N13N35K32j05n34m47K57
$$ -199 -768 -307 69 534 291 -416 -356 -199 179 668 416 -91 -821 -308 227 459 354 -180 -627 -370
5447c70P30J96m2n57m57J46O71J31ko65m89M92N45L28k05p99j61J06O50K32j6
$$ -370 360 556 514 -43 -500 -354 317 448 446 -219 -708 -216 329 657 452 -347 -508 -402 248 480 464
5468D64n36n89M20O57J57k35n47l98J39O49L63o5p30j65J2N56L33j10m42o58K08
$$ 464 -72 -661 -241 416 573 338 -209 -607 -468 181 544 479 -251 -416 -404 152 485 375 -67 -725 -517
5489e17P52L55j96m73m19O1O46K41R3m65m92q7N50M18k32n22k08J74O00M08j58
$$ -517 235 590 394 -79 -498 -437 209 450 543 78 -414 -501 49 467 235 -287 -495 -321 279 687 529
5510E29m10n04J0K60P56l33l38n08J08L84O80m3n87k95r2J44O62K52n88o40LM27
$$ 529 119 -385 -375 -115 641 308 -30 -538 -430 -46 634 591 4 -291 -383 -239 423 675 87 -553 -550 -123
5532a23O25o4m03n09pM83L87J05m41m94j12N97L73n4j10q02J33L29O19n3l88l60
$$ -123 502 438 35 -474 -481 2 389 494 53 -441 -553 44 417 363 253 -549 -416 -87 532 479 91 -269
5554b69k67K46N46L25l42n72j43M88O00j18k75o51j62L87O42K60l54o69p1J16
$$ -269 -536 -290 256 581 239 -333 -476 12 612 494 219 -432 -594 -207 435 695 341 -328 -399 -283
5574b83N25L42m85l39m65N99M05K72k89n36m87M77O19J68j58p29k33L37O29K04
$$ -283 242 584 99 -240 -705 -106 299 571 282 -254 -741 -264 355 523 365 -364 -597 -260 369 573
5594E73k74n94m21M08P51J33m63o14j38M78P38R5l83o15k27Q1N99M32m10k46m01
$$ 573 299 -295 -716 -308 443 576 113 -501 -639 -161 577 672 289 -326 -553 -472 127 559 149 -97 -498
5615d98J58P09J63l99l91j34l0O05L46l94n05j2l1O40J54On17m04L20L32N23m76
$$ -498 -340 369 532 133 -258 -392 -422 183 529 135 -370 -382 -413 227 381 387 -130 -534 -214 118 641 165
5637A65l07l72N1O89K57j1o03l91J37P06J78j01n56k52R2K54O92k35n42l22K28
$$ 165 -142 -514 -463 226 483 472 -131 -522 -385 321 499 398 -158 -410 -318 -64 628 393 -149 -471 -243
5658b43L58K60J25o65j62k0M77L85l0m44l78k86O15O41j74l06o28J12M25N65j77
$$ -243 115 375 500 -165 -327 -347 130 515 485 41 -337 -623 -8 633 459 153 -475 -363 62 627 450
5679D50o95q5J20K60M90k75k36n68R1M14M67p5m33m10J5N10L20l8l82o23%P29
$$ 450 -245 -330 -210 50 540 265 29 -539 -448 -34 433 358 -75 -485 -470 40 360 322 -60 -683 -683 46
5701D6K96J6m06k66k19O37L64n1n64k6k84M12L97O7k95l31k14P43j05J11Jq10
$$ 46 342 358 -48 -314 -533 104 468 417 -147 -173 -457 -45 352 419 124 -207 -421 322 217 328 329 -481
5723d81k1K16Q08J12m82n11O1L09L37J59m87n79j8M57P64l02k08o18RN13K51M16
$$ -481 -502 -286 522 634 152 -359 -298 11 348 507 20 -559 -577 -120 644 342 134 -484 -475 38 289 705
5745G05n48n66n8J17P31L73m78p89jL41M53L68m25p10n5M51J76L75j42n49l9J20
$$ 705 157 -409 -467 -350 381 754 276 -513 -514 -173 280 648 223 -487 -542 -91 85 460 318 -231 -270 -150
5767a50N40J76k68p32n9J75O08N63m72o98k14K83O15K36l48m69j66J89M69K40
$$ -150 390 566 298 -434 -493 -318 290 853 381 -317 -531 -248 367 603 255 -214 -380 -191 278 518
5787E18k55n49j17J96K47M94j73o53j47K80L99L60j32p40k82J79Q80jp3o56m77
$$ 518 263 -286 -403 -207 40 534 361 -292 -439 -159 240 600 468 -272 -554 -375 505 504 431 -225 -702
5808g02N16L90L27j62n61l82L61K86N33k30n88j08j00N04L83j56k90k92k99P22
$$ -702 -186 204 531 369 -192 -574 -213 73 606 376 -212 -320 -420 84 467 311 21 -271 -570 152
5828A52L99j98m34m23Q1N89L75J6p95l63K83M04K84K13n91m97K49K77L89j65k22
$$ 152 551 353 -81 -504 -423 166 541 557 -238 -601 -318 86 370 583 -8 -505 -256 21 410 245 23
5849B3l47l4N07M57k79k91n11k4P43J99L1o00l85o1N27M37L0m84l18NK72N73p6
$$ 23 -324 -358 149 606 327 36 -475 -499 244 443 474 -126 -511 -572 -45 392 422 -62 -380 -375 -103 470 394
5872C94l99o28J05M44M97n6m93m02J84K72N63j8p23l67K93M87L25Q7n88k98j12
$$ 394 -5 -633 -528 -84 413 357 -136 -538 -354 -82 481 463 -260 -627 -334 153 478 565 -23 -321 -433
5893d33M62L25J79m98o15J77K91N29J33n01o29J59M03O55j1m26o20o7N50J68M07
$$ -433 29 354 533 35 -580 -403 -112 417 550 49 -580 -421 -18 637 626 200 -420 -487 63 231 638
5914F38m76p03m5L49Q97q6m72o40j22M93N74J53l73n14k42M68M95J21k54m74k94
$$ 638 162 -541 -586 -237 660 574 102 -538 -660 -167 407 560 187 -327 -569 -101 394 515 261 -213 -507
5935e07L96N20K03n28k85j56R6O28J08k33o28NK28N59q5J4n23k60J28O81J03k49
$$ -507 -111 409 612 84 -201 -357 -261 367 475 242 -386 -381 -153 406 321 335 -188 -448 -320 361 464 215
5957B15m89j22N0Q35Q8m18l31m97L44N24N29l98m52m09L91M96J79m61k80l89M19
$$ 215 -274 -396 -346 489 577 159 -172 -669 -325 199 728 330 -122 -531 -140 356 535 74 -206 -595 -176
5978a76M74K59l98m76k14K93M72L47k27n21l34J48K99N54j85m66k79J04L99N13
$$ -176 298 557 159 -317 -531 -238 234 581 354 -167 -501 -353 -54 500 315 -151 -430 -326 73 586
5998E86k79o23k10J8O42K84l9m88j80k66N77N20k10l81n55K51O58J4j02k56n00
$$ 586 307 -316 -526 -508 134 418 379 -109 -289 -555 22 542 332 -49 -604 -353 305 319 217 -39 -539
6019e39L54M06L80qn88n16L59L77K15m2n13l76n4N16M88N4m62o13K8P86P2P7m64
$$ -539 -185 221 601 593 5 -511 -152 225 440 398 -115 -491 -545 -29 459 513 51 -562 -534 252 324 401 -63
6042f3k91j45M19L77J92n12m69Q0L13M26J60n14m53J00M83L11R8l16o60N3M89
$$ -63 -354 -499 -80 297 489 -23 -492 -412 -99 327 487 -27 -480 -380 103 414 512 196 -464 -411 78
6063G8K75N7j53q08J94L56L57L0k56n45o7L93N33j54j98m88q0N44K24K03o75j19
$$ 78 353 410 257 -551 -357 -1 356 386 130 -415 -482 -89 444 290 92 -396 -476 68 292 495 -180 -299
6085b99k78M78M23K61k59p32p8K97O29J4l62l58l58N30N03Ql08m91n8M39L11K21
$$ -299 -577 -99 324 585 326 -406 -484 -187 442 456 94 -264 -622 -92 411 419 111 -380 -438 1 312 533
6107E33k98o31q6L77K94M86o08l32k63K25P75%o7n82l00M54K96L10k59n29m22
$$ 533 235 -396 -482 -105 189 675 67 -265 -528 -303 472 472 405 -177 -477 -23 273 583 324 -205 -627
6128f27O54J20L55l93k79j72J41M61J09k4m71l51J38M78M23k11n36k97J21P76
$$ -627 27 147 502 109 -170 -342 -201 260 369 345 -126 -477 -339 139 562 351 -185 -482 -361 415
6148D15J8j81m65m41L84N08J80j42l06k21j07N04K64J2n25m66J93N49K17q5m75
$$ 415 433 252 -213 -654 -270 238 418 276 -30 -251 -358 146 410 422 -103 -569 -376 173 390 305 -170
6169a70k23K45M20k6mk75o50M12K97O03k89o34M3j98O55L28j77n64k58K32M62
$$ -170 -393 -148 272 246 242 -33 -683 -271 26 629 340 -294 -251 -449 206 534 357 -207 -465 -233 229
6190B29J53j13l80l60M2N71K69k21j50n49J55M17O27l75m30m01N1N46K66J83n41
$$ 229 382 269 -111 -471 -429 142 411 190 40 -509 -354 63 690 315 -115 -516 -465 81 347 530 -11
6211a1n21L4M98O24k51m76l93j5N73M87K03r09k35r6M14N20j14k31k21l33M09
$$ -11 -532 -498 0 624 373 -103 -496 -511 62 549 752 -157 -392 -488 -74 446 332 101 -120 -453 -44
6232d4L57J58m70m61pL78N19R0n20m62M9K82L41J94k42o06N2K46N73K8m06n29
$$ -44 313 471 1 -460 -467 -89 430 520 0 -462 -413 -131 210 404 162 -444 -392 -146 427 455 49 -480
6254d80RM51N38j44k73n43J2N51K86j5l37n29P4L27L12J71k22m99J4J94O59J9
$$ -480 -471 -20 518 374 101 -442 -430 121 407 392 55 -474 -400 -73 239 410 188 -311 -297 -103 556 575
6276E75l12o62p3M73K43K26l83l14m56N72L84K71k71o48k45N20L26M27o32k67
$$ 575 263 -399 -472 1 244 470 87 -227 -683 -111 273 544 273 -375 -620 -100 226 653 21 -246
6296b46k39K47M79K25l41n69J6K39M42J98l44k76m79J92N60K65k29m07r6R4M21
$$ -246 -485 -238 241 466 125 -444 -428 -189 253 451 107 -169 -648 -456 104 369 140 -267 -363 -269 152
6317A52K76k49m45j32M7N60J43Nn31o10M74M95L3K52n72l28J33N67M51m71l90
$$ 152 428 179 -266 -398 -351 209 352 357 -174 -784 -310 185 218 470 -102 -430 -297 270 721 250 -140
6338a40l53K66M57O0m1l38l74Q7O82K5j38k40l19J4N18K04n2m45m32J28O30K89
$$ -140 -493 -227 230 290 249 -89 -463 -376 306 331 193 -47 -366 -352 166 370 318 -127 -559 -431 199 488
6360D88m66j90j84J1M20M23k79l76k73k2N85K77K2m34m10O3L05N25j17k36n07
$$ 488 22 -168 -352 -341 79 502 223 -153 -426 -448 137 414 436 2 -408 -345 -40 485 368 132 -375
6381c75N2L44L68J0m17l11J78J27N89k54l11k39k59N98M33k65m31j74q1M70L41
$$ -375 -323 21 389 399 -18 -329 -151 -24 565 311 0 -239 -498 100 533 268 -163 -337 -418 52 393
6402C93p7k58m63j46L26P09l49j34m85m0O35L34K0l83m52K4N01K44j38j53m13
$$ 393 316 58 -405 -551 -225 484 135 1 -484 -524 111 445 465 82 -370 -346 155 399 261 108 -305
6423c05j8L67K98K68n91j94k94M35K61p3j90l96N6L00N69j40l77m04R7j34P62
$$ -305 -323 44 342 610 19 -175 -469 -34 227 154 -36 -432 -376 -76 493 353 -24 -428 -331 -465 297
6444B97K7l51m22j6L19N56L0l12n01L4J11M40K37j89o71J85J96L17K34k02p91
$$ 297 324 -27 -449 -465 -146 410 440 128 -373 -339 -228 212 449 260 -411 -226 -30 287 521 319 -472
6465d72J17J35M75J84k62o44N4L12M36K0k19m53r7J24N44J75j94m44r3K52K58
$$ -472 -355 -220 255 439 177 -467 -413 -101 335 355 136 -317 -414 -290 254 429 235 -209 -302 -50 208
6486B08K31l13l72l20M00M89Rk70m84K6L42K81J41o6m64m99N40M42P1k24j80m01
$$ 208 439 126 -246 -566 -166 323 332 62 -422 -396 -54 227 368 302 -162 -661 -121 321 392 168 -12 -413
6508d13J58M79K30J92q25j20l0K91M09j22n56l98K27O63L66k6p42r6j92N28M34
$$ -413 -255 224 454 646 -179 -299 -329 -38 371 249 -307 -705 -478 185 551 525 -217 -313 -505 23 457
6529D57k74j09m53K46K13O57l46m67l41o1N60K38J33m82k64j27N53L65k53l50
$$ 457 183 74 -379 -133 80 737 391 -76 -417 -478 82 320 453 -29 -293 -420 133 498 245 -105
6549a05l23L2M30J99Q0j61k70k20M36L15L2o04l42J10N00L77k06k12m25k77M85
$$ -105 -428 -396 34 233 313 152 -118 -338 98 413 445 -159 -501 -391 109 486 280 68 -357 -634 -149
6570a49N41J59m32n93Q1L80L69j0l65n18J21P41J75k47k48l59j7M47K80n7l14
$$ -149 392 551 119 -474 -393 -13 356 346 -19 -537 -416 325 500 253 5 -354 -371 76 356 299 -15
6591a5n90Q7N08O17l12j63o22J71J60M96K15k87o70k1L61O48j4m18p38J23N29
$$ -15 -605 -518 -10 607 295 132 -490 -319 -159 337 552 265 -405 -426 -65 583 569 151 -587 -464 65
6612F5K79k8k6n81m95J186n18K1L62m68k0k53P84Q1k89j67n35K78O01k6j7p78
$$ 65 344 316 290 -291 -786 400 -118 -97 265 -203 -223 -476 308 389 100 -67 -602 -324 277 251 234 -544
6634e44J25O5M52K18q6m54k60M87M29j44j6n03k40K92M35Q2j76m00l3Q4M42L93
$$ -544 -419 -354 98 316 230 -224 -484 3 432 288 272 -231 -471 -179 256 338 162 -238 -271 -187 255 648
6656F48m23m13j17P9M10L05j46n92k5K12L32K70l25l26l70R1O35O3j6n26j82J00
$$ 648 225 -188 -305 -226 184 489 343 -249 -274 -62 270 540 215 -111 -481 -390 245 308 292 -234 -416 -316
6678c16O27L5j60k26l42J78N08j11N8k95m15J09M43L21L0m64n30J30P75J01k53
$$ -316 311 346 186 -40 -382 -204 304 193 251 -44 -459 -350 93 414 444 -20 -550 -420 355 456 203
6699B03l20l35J68M87L35l11m01k66K03K24L09J09l91n14J33K38M14q2m35l02
$$ 203 -117 -452 -284 203 538 227 -174 -440 -237 -13 296 405 14 -500 -367 -129 285 203 -232 -534
6719e34J17O12K77l88k68j12j54N32L78m6l20l75R4J99L24j21k26j85j51K28O44
$$ -534 -417 195 472 84 -184 -296 -450 82 460 414 94 -281 -187 12 336 215 -11 -196 -347 -119 525
6740E25q4o09j13j11M66L92J19m72m38j56L93L13J52l01n23K59M12M6J87m76k71
$$ 525 441 -168 -281 -392 74 466 585 113 -325 -481 -88 225 377 76 -447 -188 224 270 457 -19 -290
6761b90o9L03K27J31j49n59l7N10L26j68K19q69RL82K11K82l76m66j08K29N50
$$ -290 -359 -56 171 302 153 -406 -443 67 393 225 444 -425 -416 -34 177 459 83 -383 -491 -262 288
6782B88J5k92k39m25M10O61J36n55l75k1K57L90L15n12l80k10K70N40L50l52n43
$$ 288 303 11 -228 -653 -243 418 554 -1 -376 -397 -140 250 565 53 -327 -537 -267 273 623 271 -272
6803b72k2J93N93j38l64j58k91L78N93k19k32j32l07J26M99R9k06l27k71J34O00
$$ -272 -294 -101 492 354 -10 -168 -459 -81 512 293 61 -71 -378 -252 247 346 140 -187 -458 -324 276
6824B76pj77l92LK27J20M10j68m84k32pO48L11n08k30k3p3N25K49m21l83K3j57
$$ 276 269 92 -300 -297 -70 50 460 292 -192 -424 -431 217 528 20 -210 -233 -306 219 468 47 -336 -313 -470
6847d70O24K94l9q85J01O1L84N20l36k88n96M27L16K60k32m87k24K91M32P6k6
$$ -470 154 448 409 -476 -375 -314 70 590 254 -34 -630 -203 113 373 141 -346 -570 -279 153 229 203
6868B03k22m60J63O34J54j53n80k98K18L59M40j85m02k1k52M96L56p8l14m75J97
$$ 203 -19 -479 -316 318 472 319 -261 -559 -341 18 458 273 -129 -150 -402 94 450 372 58 -417 -220
6889b20K26K51J60m99l31J0O19L03j24l08n09M1L44L20R4o23j28J71K46M20j67
$$ -220 6 257 417 -82 -413 -403 216 519 395 87 -422 -381 -37 283 377 -246 -374 -203 43 463 296
6910B96k52l32j20L75M93n2m44l92K17K69J91O1l01l23j97M92M23ln06k18J1L1
$$ 296 44 -288 -408 -33 460 408 -36 -428 -211 58 249 310 9 -314 -511 -19 404 401 -105 -323 -312 -281
6932b81O39J54m28n28J19M22L04l15P3n21J85R9K99J64l87l86j26K03N99J79n52
$$ -281 358 512 84 -444 -325 97 401 86 159 -362 -177 -78 221 385 -2 -388 -514 -311 288 467 -85
6953h5m2k92K46M47K46m22l93j49N40J54n8k94k03o6L14L44m3L9n67m2P1N71P9
$$ -85 -127 -419 -173 274 520 98 -295 -444 96 250 192 -102 -305 -371 -57 287 244 283 -284 -326 -255 316 395
6976C95l26m54J30J01L27L01l92m15j51L73O06j27j70k36j44k0L38L06k66m13
$$ 395 69 -385 -255 -154 173 474 82 -333 -484 -111 495 368 198 -38 -182 -202 136 442 176 -237
6996b37k9J02K64J05N0n25j06J27M23R9P9m71k99J93L58N26n48l20j13K66M35
$$ -237 -266 -164 100 205 255 -270 -376 -249 174 273 352 -119 -418 -225 133 659 111 -209 -322 -56 379
7017C79%k13k66m24M06O5M69l26l81j61J38M94L09l53j10k63Q8J84M84l86j38
$$ 379 379 166 -100 -524 -118 -53 416 90 -291 -452 -314 180 489 136 26 -237 -149 35 519 133 -5
7038en72J93N45J37j73j67m62RQ10J27n3n24l68K61M09J96p6m81pk59O29K16J1
$$ -5 -577 -384 161 298 125 -42 -504 -495 315 442 389 -135 -503 -242 167 363 287 -194 -201 -460 169 385 396
7061C96n04j45p3N34K56k97k56m48K68L30M40j71l23m72J58K57N05j33k22m87
$$ 396 -108 -253 -326 208 464 167 -89 -537 -269 61 501 330 7 -465 -307 -50 455 322 100 -387
7081c87j38O01K44k5k52l13o7L65J89O5l09l02R7K20K78k18j68l93J52K29M32
$$ -387 -525 76 320 295 43 -270 -337 28 217 282 -27 -329 -232 -12 266 48 -120 -513 -361 -132 300
7102C00O2j82n56q0M41K23K08l83m10K4L02K98j0j9m77r3K94L52J47m24l67j7
$$ 300 362 180 -376 -456 -15 208 416 33 -377 -353 -51 247 237 218 -259 -352 -58 294 441 17 -350 -367
7124c67M24J98J19O5o94l41O2R33J5k06l20l49M90K54J67m30l53j54L97M85L1
$$ -367 57 255 374 439 -255 -596 -534 399 414 208 -112 -461 29 283 450 20 -333 -487 -90 395 426
7145D26k04n00j34L92L60r5k72j37k46J33N75P6k51l34j34J80L73J54q8o70o3
$$ 426 222 -278 -412 -20 340 245 -27 -164 -410 -277 298 374 123 -211 -345 -165 208 362 274 -396 -459
7166d59J90N09K36k04o35j14K18M01K88l16m51r5M73J79L33k00o49k25J71N23
$$ -459 -269 240 476 272 -363 -477 -259 142 430 114 -337 -432 41 220 553 353 -296 -521 -350 173
7186A73L09j97m65j96O2O16K13j78n97k13K31J93O49l60p23n3M87L7M25j81l37
$$ 173 482 285 -180 -376 -314 302 515 337 -260 -473 -242 -49 600 240 -483 -536 -49 -12 413 232 -105
7207a05l77J8O91K7R9m65r1j57M14L76j33l77l52O3N47M25m53j11k98Q4K86K02
$$ -105 -482 -464 227 254 353 -112 -203 -360 54 430 297 -80 -432 -369 178 603 150 39 -259 -175 111 313
7229C13k6l83k58j03N07M23k27k68k57k3qN78K2l40k26m5M70K30Q1k40o82J89
$$ 313 287 -96 -354 -457 50 473 246 -22 -279 -302 -310 268 290 -50 -276 -321 149 379 460 220 -462 -273
7251b73M15NL38o42j41j02L90K78J3k82k80o0M91J06J94l05o28OJ91O60K3j83
$$ -273 142 147 485 -157 -298 -400 -10 268 281 -1 -281 -341 150 256 450 145 -483 -477 -286 374 397 214
7273B14n84K64K78K06qk43l04m00O63L01p1k16l68J0K39L28J0k25k76j79K68L60
$$ 214 -370 -106 172 378 370 127 -177 -577 86 387 316 100 -268 -258 -19 309 319 94 -182 -361 -93 267
7295B67J77j86n73k6K28L38K03l54m18K08j15N72J07m04l30r9J88M74J74p8n48
$$ 267 444 258 -315 -341 -113 225 428 74 -344 -136 -251 321 428 24 -306 -405 -217 257 431 353 -195
7316a95k38J06N26J80l73k09l28J96O42J62l53l01l84L05K81K25j77k30j88K98
$$ -195 -433 -327 199 379 6 -203 -531 -335 307 469 116 -185 -569 -264 17 242 65 -165 -353 -55
7336e5K43R2J5o04n1J53L89L15j94m73l54J25N41M27m31n04J12p1N56L03j39p38
$$ -55 188 280 295 -309 -360 -207 182 497 303 -170 -524 -399 142 569 138 -366 -254 -325 231 534 395 -343
7358c43p9J57M71R6j08m44j16o9M82M73k94l18m19L19L30K72k50k86k80K32N06
$$ -343 -422 -265 206 302 194 -250 -366 -435 47 520 226 -92 -511 -192 138 410 160 -126 -406 -174 332
7379C32J33j02n84o1q7N07J79k4m04j87J95K75K24ll00p66N08K72L47q2m58n67
$$ 332 465 363 -221 -282 -369 138 317 293 -111 -298 -103 172 396 393 93 -673 -165 107 454 372 -86 -653
7401f53L98O12J32k95k51l79K10K78N42j59k44n32P5N45R0M4n28j38k2K42M15
$$ -653 -255 357 489 194 -57 -436 -226 52 594 435 191 -341 -266 279 369 413 -115 -253 -275 -33 382
7422C82j03j78m41M8K75L84p2k66m05l0L59N73r0o02k12p8M04M17n3k58n27O6
$$ 382 279 101 -340 -292 -17 367 295 29 -376 -406 -47 526 436 -166 -378 -456 -52 365 312 54 -473 -407
7444d07L18K28K21l58k67k42M24M47K2k43m52m0K50N86R6m47k49k28K65L72J78
$$ -407 -89 139 360 2 -265 -507 -83 364 386 143 -309 -349 -99 487 583 136 -113 -341 -76 296 474
7465D74l59o13KN37K2M13m97l07l93M98O75J55l17m74k30K64L20K06l35m77Q8
$$ 474 115 -498 -496 41 63 476 -21 -328 -721 -223 452 607 290 -184 -414 -150 170 376 41 -436 -348
7486c48J96N22Mk53k82k87M49J33J88j02m14k41L83L03M5j2l75l06L11K01K93
$$ -348 -152 370 374 121 -161 -448 1 134 322 220 -194 -435 -52 251 296 284 -91 -397 -86 115 408
7507D08m64m6k18K82K49L11l98k80j55J07M63J51k29n03n0M6L03L89j24o01r0
$$ 408 -56 -102 -320 -38 211 522 124 -156 -311 -204 259 410 181 -322 -372 -326 -23 366 242 -359 -449
7528d49J04L39L39j17l12l13m5P55j77J88o34J00k7J99N09j27l62l78J49M19K60
$$ -449 -345 -6 333 216 -96 -409 -454 301 124 312 -322 -222 -249 -50 459 332 -30 -408 -259 160 420
7549D20j37l41k25J35P1L81j06l44j21R1L38K53l61l02j85J63K43K69k9k49q6
$$ 420 283 -58 -283 -148 -77 304 198 -146 -267 -176 162 415 54 -248 -433 -270 -27 242 213 -36 -122
7570a22k83M12M63k21l85j57q0L38N18k08k12l32k75N33K69J43m41m73K34L18
$$ -122 -405 7 470 249 -136 -293 -373 -35 483 275 63 -269 -544 -11 258 401 -40 -513 -279 39
7590C9K88j44k27l25JN79K75m8m74k15k93M85M88j06k22l58%Q0M90Q9l31m77l8
$$ 39 327 183 -44 -369 -368 211 486 438 -36 -251 -544 -59 429 323 101 -257 -257 -177 313 402 71 -406 -444
7613d44M05L93J13m36j77k75L19N14p6k61l95l5J84N47n3m24k34n5L94J49L28
$$ -444 -39 354 467 31 -146 -421 -102 412 336 75 -320 -355 -171 376 323 -101 -335 -390 4 153 481
7634D81m21l01k74M93J53L37k69m74k32M25M68p0j41m80r6N02RL71m64n88J58
$$ 481 60 -241 -515 -22 131 468 199 -275 -507 -82 386 316 175 -305 -401 101 110 481 17 -571 -413
7655d13J38M65K92l43p06J86K45K92J13r6m29k00K83N25L0j91l62k75L25L90K37
$$ -413 -275 190 482 139 -567 -381 -136 156 269 173 -256 -456 -173 352 382 191 -171 -446 -121 269 506
7676E06k85l23l83L00L47M6Q4m94j64M2N99J02k97j59l07K38J9M03Q7n07k04J34
$$ 506 221 -102 -485 -185 162 208 292 -202 -366 -324 275 377 80 -79 -386 -148 -129 274 361 -146 -350 -216
7698b16M14j8K1l09j7n0L15K94Ko30j45M2N98Mn6m84k50K19M96R0K2o40j59K41
$$ -216 198 180 201 -108 -125 -175 140 434 436 -194 -339 -297 301 305 249 -235 -485 -266 230 320 342 -298 -457 -216
7722b16K19M14j22n57l30L78N10Q2j79l53k12J92J79K23P2k60l96P4L45L55n3
$$ -216 3 417 295 -262 -592 -214 296 378 199 -154 -366 -174 5 228 300 40 -356 -282 63 418 365
7743C65k44p26L08L03L45M3m47j40o6M52R9j03k08l34J09K43K47K17o54o9r0K88
$$ 365 121 -605 -297 6 351 394 -53 -193 -259 193 292 189 -19 -353 -244 -1 246 463 -191 -260 -350 -62
7765f2L64O9m46k17p1L59N19j46k78k07q2Q9N81J3n19l77J19L00L96J3k25n66
$$ -62 302 371 -75 -292 -363 -4 515 369 91 -116 -198 -109 472 485 -34 -411 -292 8 404 417 192 -374
7787c74m6M04K42J36l77k92j00K41M39K4l61ll31M06K10M34p74j67k7J86K77K21
$$ -374 -420 -16 226 362 -15 -307 -407 -166 273 297 -64 -67 -398 8 218 652 -122 -289 -316 -130 147 368
7809C68l89l89J05J63K88J05j89m19J23L02O2K17j22l83k24K42J55K46m0k69k50
$$ 368 -21 -410 -305 -142 146 251 62 -357 -234 68 130 347 225 -158 -382 -140 15 261 221 -48 -298
7830b98P6M10K20n4n81k38L81L40N3m8o04p1L58J61J20k59l70O1J44L02J76k48
$$ -298 -222 188 408 354 -227 -465 -84 256 309 261 -343 -414 -56 105 225 -34 -404 -343 -199 103 279 31
7852C1j29m50L81M35L13l18m67k45K09M68L01k91l84m37K91N32J51k99l20k43
$$ 31 -98 -548 -167 268 581 263 -204 -449 -240 228 529 238 -146 -583 -292 240 391 92 -228 -471
7872d71M03J33K05N5n73k09L2O52K02l16n59J60j05M57K61l43n6j55m5O07P0p5
$$ -471 -68 65 270 325 -248 -457 -425 227 429 113 -446 -286 -391 66 327 -16 -72 -227 -272 335 405 330
7894C30n17j14L6K08L26J31m97k80J67L77K16p8n05l42Q0L14N91j72k55k95q3
$$ 330 -187 -301 -265 -57 269 400 -97 -377 -210 167 383 305 -200 -542 -462 -148 443 271 16 -279 -362
7915c62N89J02l1k81n40J88M34KK05n42j92K83L37J38J34m36m05J21J97L91K8
$$ -362 227 329 298 17 -523 -335 99 101 306 -236 -428 -145 192 330 464 28 -377 -256 -59 332 360
7936C60l38l59J8L99J90n4k39k11m5M36J22K06m39m51K80P9L35J34l39m56q4N57
$$ 360 22 -337 -319 80 270 216 -23 -234 -279 157 279 485 46 -405 -125 -46 289 423 84 -372 -456 101
7958A01K13mk08m79Q7J93K67L63l89n78J9K71K71K36k11l73j55M41J81q4o2l05
$$ 101 314 310 102 -377 -290 -97 170 533 144 -434 -415 -144 127 363 152 -221 -376 65 246 162 100 -205
7980b05l54N39L67N7k00m68j24L10J55M57l38m35p3L20K71N4k21m28j0Q8N37L7
$$ -205 -559 -20 347 404 204 -264 -388 -78 77 534 196 -239 -312 8 279 333 112 -316 -326 -238 299 336
8002C36k95l96n9q3O33J98k16m90j35N90nN14l62n36p8J26L09M06k68n34Q5L5
$$ 336 41 -355 -414 -497 136 334 118 -372 -507 83 78 592 230 -306 -384 -258 51 457 189 -345 -260 -225
8024b25O19j5J61p73j45L71J48K40Q0o68j45K98L70Mn0o63K12J12J82L60j65m05
$$ -225 394 379 540 -233 -378 -7 141 381 461 -207 -352 -54 316 320 270 -393 -181 -69 113 473 308 -97
8046i7k88L34K61O3j39k33j44J08K70K58r4n45k05K36M78Q0j13m42l01K49K35
$$ -97 -385 -51 210 273 134 -99 -243 -135 135 393 299 -246 -451 -215 263 343 230 -212 -513 -264 -29
8067b9M37j29k27n15J01M33K92r6l80k57J59K10L45j01j75k93j58L09K80Q2l03
$$ -29 408 279 52 -463 -362 71 363 267 -113 -370 -211 -1 344 243 68 -225 -383 -74 206 288 -15
8088a5l15M7N44J00o6k25m15n8M26L57k12j69l90J69K35L41J13n68k44p7M01K98
$$ -15 -330 -283 261 361 295 70 -345 -403 23 380 168 -1 -391 -222 13 354 467 -101 -345 -422 -21 277
8110B77K28m99o06L71L30N0J16j89k55k54M50J40L43l24n28m5L63K49J23l67k08
$$ 277 505 6 -600 -229 101 151 267 78 -177 -431 19 159 502 178 -350 -395 -32 217 340 -27 -235
8131b35o9P4N37j76j27l73J60P0N54j81l6l76j78M05K54mk60l53k0J19M27J12
$$ -235 -304 -230 307 131 4 -369 -209 -139 415 234 198 -178 -356 49 303 299 39 -314 -334 -215 212 324
8153C24q8l21l13K35L82K24m50m41P3L65M5L52j93n14O2K36L40j08k09k72q5L03
$$ 324 236 -85 -398 -163 219 443 -7 -448 -375 -10 35 387 194 -320 -258 -22 318 210 1 -271 -356 -53
8175e3N22k62p7l15k98J04N49J12l29p6l19K57K54L85l07j10
$$ -53 469 207 130 -185 -483 -379 170 282 -47 -123 -442 -185 69 454 147 37
8191C7
$$ Imaginary data points
##PAGE= N=2
##DATA TABLE= (X++(I..I)), XYDATA
0@%%%%%%%%%%%%%%%Lj1J6j6J6j7K5l2L3m1N0n8P1q1R1j06J22j38J56j79K04k29
$$ 0 0 0 0 0 0 0 0 0 0 0 0 0 0 0 0 3 -8 8 -8 8 -9 16 -16 17 -24 26 -32 39 -42 49 -57 65 -73 83 -96 108 -121
37a21K57k89L23l60M02m48M96n48O06o71P41q16R00r91J091j202J324j461J614
$$ -121 136 -153 170 -190 212 -236 260 -288 318 -353 388 -428 472 -519 572 -630 694 -767 847
56H47j785J980k203K461k761L117l553M099m800N741p082R189j3159L6780j11232
$$ 847 -938 1042 -1161 1300 -1461 1656 -1897 2202 -2598 3143 -3939 5250 -7909 28871 -82361
71h2361R890M0972L7477J18305j14993n4307k438J380R7759j6788j9252P519j01744
$$ -82361 -72471 -31499 5978 124283 9290 -45017 -47455 -46075 51684 34896 15644 23163 -78581
84g8581N6598L8762j3275Q1370q6180p6897N5720K94Q8777O850j13194p127n617
$$ -78581 -21983 16779 3504 84874 -1306 -78203 -22483 -22189 66588 73438 -39756 -46883 -52500
97e2500O4527P2729p2845k4214l4200k792R5393j9913o071k701q5037M8529L4531
$$ -52500 12027 84756 11911 -12303 -46503 -49295 46098 26185 20114 17413 -67624 -19095 15436
110A5436o569N4736o6622n3913L1266J4204O4967p161o0954k0158k4220P5914
$$ 15436 8867 63603 -3019 -56932 -25666 -11462 53505 46344 -14610 -34768 -58988 16926
122A6926M6544n5393J022m8962j6354Q9346k743j0389n262n8483J1042L2124K9381
$$ 16926 63470 8077 9099 -39863 -56217 33129 30386 19997 14735 -43748 -32706 -582 28799
135B8799J6333n0356j9596j2120J3163P5614j4603m2133j0331l7082M2714N5178
$$ 28799 45132 -5224 -24820 -36940 -23777 51837 37234 -4899 -15230 -52312 -9598 45580
147D5580j7883j5669m0922j5288M2299K6010J6360k9313m4674L282J3112M4335
$$ 45580 27697 12028 -28894 -44182 -1883 24127 40487 11174 -33500 -30218 -17106 27229
159B7229J9451m7101j9820j4791J1902O1485k385l2613j9514k5126K6468M4426
$$ 27229 46680 -421 -20241 -35032 -23130 38355 35970 3357 -16157 -41283 -14815 29611
171B9611O751k4357l9040n407J7224L2845L1499m0266l9852N862M013L9996L0005
$$ 29611 36362 12005 -27035 -32442 -15218 17627 49126 8860 -30992 -25130 -21117 18879 48884
184D8884m1015l3738m805J3937L5900J9713j9861m4572j2244K7526K3217K4988
$$ 48884 7869 -25869 -30674 -16737 19163 38876 19015 -25557 -37801 -10275 12942 37930
196C7930j0441n5687j0747K5248K7346K8934j8881m9492j4425K2806L7919J8351
$$ 37930 27489 -28198 -38945 -13697 13649 42583 23702 -25790 -40215 -17409 20510 38861
208C8861j9720l9242k0068K5973L3472J2091j0174l8962j9367K5357K3807J7227
$$ 38861 19141 -20101 -40169 -14196 19276 31367 21193 -17769 -37136 -11779 12028 29255
220B9255m539m0380j9189K0235K5349J8498n515l5951k5032K0371L3216J0343
$$ 29255 24716 -15664 -34853 -14618 10731 29229 23714 -12237 -37269 -16898 16318 26661
232B6661n477k9449l1040K1541L7188N744o524k5339l0557J6543L9457J0078j2636
$$ 26661 21184 -8265 -39305 -17764 19424 25168 18644 -6695 -37252 -20709 18748 28826 16190
245A6190k2815k6021P964M0934J6200j7650k1909k1926K997L9054K0088j7312
$$ 16190 -6625 -32646 -24682 16252 32452 14802 -7107 -29033 -26036 13018 33106 15794
257A5794k3206j9316J663L3776K2470j2586k4549j9354M17K9874K4270q816k3705
$$ 15794 -7412 -26728 -25065 8711 31181 18595 -5954 -25308 -24891 4983 29253 20437 -3268
270c268k0490k149K7708K6846p364k2826j9838n940K6507K9779p127k3788j7778
$$ -3268 -23758 -25907 1801 28647 21283 -1543 -21381 -27321 -814 28965 21838 -1950 -19728
283a9728o796K3273L2347n306k7658j5292m476J7627L3068p91l1205j5469M4J3823
$$ -19728 -26524 -3251 29096 23790 -3868 -19160 -23636 -6009 27059 26268 -4937 -20406 -20362 -6539
297f539L0264M861l2104j9239M231J2981K5379R462k8942k4543M530J5260K1789
$$ -6539 23725 28586 -3518 -22757 -18526 -5545 19834 29296 354 -24189 -19659 -4399 17390
310A7390J1255k4131k8318J349J7842K1171J1596k0831l0013k153J9343K2551
$$ 17390 28645 4514 -23804 -22455 -4613 16558 28154 7323 -22690 -24843 -5500 17051
322A7051J1012j9451l0564l984J9258K3750J1174j8892l1416m030K0220K1465
$$ 17051 28063 8612 -21952 -25936 -6678 17072 28246 9354 -22062 -26092 -5872 15593
334A5593J2152j6863l2856l862K0916J9073J1797j3371l2780o676K2273J8991
$$ 15593 27745 10882 -21974 -25836 -4920 14153 25950 12579 -20201 -26877 -4604 14387
346A4387P968q936k9362j2905K3349K1321L192n559k5301j7863K2389K3687K661
$$ 14387 22355 13419 -15943 -28848 -5499 15822 19014 13455 -11846 -29709 -7320 16367 19028
359A9028p028k2166j7134J6469K7205N354j2592j8403j5525J0683L0694O784j5287
$$ 19028 12000 -10166 -27300 -10831 16374 21728 9136 -9267 -24792 -14109 16585 23369 8082
372H082j6696j6383J0953L0187O898j2727k0378j5247J2565K6221J0428j2681
$$ 8082 -8614 -24997 -14044 16143 23041 10314 -10064 -25311 -12746 13475 23903 11222
384A1222k2715j1217Q845K5563J3223j5830j7390j1726K687K8908J1523j4273
$$ 11222 -11493 -22710 -13865 11698 24921 9091 -8299 -20025 -17338 11570 23093 8820
396H820j3056j5830J842K6662J3983r613j8695j2917K249J8758K3319j0343k4784
$$ 8820 -4236 -20066 -18224 8438 22421 12808 -5887 -18804 -16555 2203 25522 15179 -9605
409i605n305j932J7131K6131j2343k2353p474k70J8114J8726m362k1952j4571
$$ -9605 -14910 -16842 289 26420 14077 -8276 -15750 -16020 2094 20820 16458 -5494 -20065
422b0065Q219J3326J5044M028k7002j3813R703R889J9587M6k6014j0530L143J6220
$$ -20065 -11846 1480 16524 20552 -6450 -20263 -10560 -671 18916 18962 -7052 -17582 -14439 1781
436A781J8085n020j7200j6432L031J9468J1296L022j7655k2203Q959J2296J3977
$$ 1781 19866 14846 -2354 -18786 -15755 3713 15009 18031 376 -21827 -12868 -572 13405
449A3405R671k4540j8365N363J0489K0976M122k0371j8896j767K1152J5117P1
$$ 13405 23076 -1464 -19829 -14466 -3977 16999 21121 750 -18146 -19913 1239 16356 16427
462A6427j0210k7477J213K5778N166O253j0493k7203M365J6549J1966N190j4551
$$ 16427 6217 -21260 -20047 5731 10897 17150 6657 -20546 -16181 368 12334 17524 2973
475B973j5672o014J4243K2401m663q530j4071j5124K2741J8846m212m848k2751
$$ 2973 -12699 -18713 -4470 17931 13268 4738 -9333 -24457 -1716 17130 12918 8070 -14681
488a4681o809K1530J2449N435j4000j9772J587Q956J9069M269j8251p720q870
$$ -14681 -21490 40 12489 17924 3924 -15848 -14261 -5305 13764 18033 -218 -7938 -16808
501a6808Q426K5558m367q470r633j7793J7821J9752l07m565k1627q612J5112J6972
$$ -16808 -8382 17176 12809 4339 -5294 -23087 -5266 14486 14179 9614 -12013 -20625 -5513 11459
515A1459J0530j8732j7792J059K868K4873P721k4746n170n281K330K4691R01j1006
$$ 11459 21989 3257 -14535 -13476 -10608 14265 21986 -2760 -7930 -13211 -10881 13810 14711 3705
529C705r544j0095R267J1927J0064k562k3953l072O652Q414K1783j1860k3624
$$ 3705 -5839 -15934 -6667 5260 15324 12762 -11191 -14263 -7611 803 22586 10726 -12898
542a2898L59O96J8937J4655j6738j2830q262O840K0164K196n004j4263j0934J3436
$$ -12898 -12539 -11843 7094 21749 5011 -7819 -16081 -9241 10923 13119 8115 -6148 -17082 -3646
556c646P841P820J223k3099l595P712M889J8862o138k1185l233J810J4901J3457
$$ -3646 4195 12015 13238 -9861 -13456 -5744 -855 18007 11869 -9316 -12549 -10739 4162 17619
570A7619q411j4133j2772Q768J7642J735J688j5624j6717J5069R617M710N501
$$ 17619 9208 -4925 -17697 -8929 8713 10448 12136 -3488 -20205 -5136 4481 9191 14692
583A4692j8751j2218P257J0524J2510j818j3778j2767j264K0787J0472o466p917
$$ 14692 -4059 -16277 -9020 1504 14014 12196 -1582 -14349 -15613 5174 15646 9180 1263
596A263j7915K145K1965M712j672j0926j5524O242J2897Q342j61j3664q904K63
$$ 1263 -16652 -14507 7458 12170 10498 -428 -15952 -9710 3187 11529 11368 -2296 -11200 -10937
610a0937J0519J3747l334r512j0677n175J7178J2128m332p122j5520k305J8604
$$ -10937 -418 13329 9995 483 -10194 -15369 1809 13937 9605 2483 -13037 -15342 3262
623C262R717k193j0897j2346J53J2411J3721l071j3071n940m355R576J7904m490
$$ 3262 12979 10786 -111 -12457 -12304 107 13828 10757 -2314 -8254 -12609 -3033 14871 10381
637A0381j1306o683o093J0292J6697n64j2167j1307j536R095J4737L839j5938
$$ 10381 -925 -7608 -13701 -3409 13288 12724 557 -10750 -12286 -3191 11546 15385 -553
650e53j1230J811O510J4049L729j4952r436m81P202J2802K587r572j1148k626
$$ -553 -11783 -9972 -3462 10587 14316 -636 -10072 -10553 -3351 9451 12038 2466 -8682 -11308
664a1308P992J0915N414q820j3761j628O539J1785P700j1596j2969r99O053J2380
$$ -11308 -3316 7599 13013 4193 -9568 -11196 -4657 7128 14828 3232 -9737 -10736 -4683 7697
678G697O519j0850j3104j125P414J0107O067p464j4975j739R290P226O643m919
$$ 7697 14216 3366 -9738 -10863 -3449 6658 12725 5261 -9714 -11453 -2163 5063 11706 6787
692F787j6339k350R485P696N936m266j4512n488R417J0352L265l283j2163q428
$$ 6787 -9552 -11902 -2417 5279 11215 6949 -7563 -13051 -3634 6718 9983 6700 -5463 -13891
706a3891R190J2027K356k950j1830q603Q197J1972L994l642j1619p982O096J2789
$$ -13891 -4701 7326 9682 6732 -5098 -13701 -5504 6468 10462 6820 -4799 -12781 -6685 6104
720F104N124m629j0708q480N231J3072N183m159j0023r367N308J3044M405l419
$$ 6104 11228 6599 -4109 -12589 -7358 5714 10897 6738 -3285 -12652 -7344 5700 10105 6686
734F686r244r425M143J3130M929m314q114q230J517J3769N980n588o921p511m78
$$ 6686 -2558 -11983 -7840 5290 10219 5905 -2209 -10439 -8922 4847 10827 5239 -1682 -9193 -9671
749i671J3386P997o266p939o162o66J1673R706n530j0008n221J50R759J0924m455
$$ -9671 3715 11712 5446 -2493 -8655 -9321 2352 12058 6528 -3480 -8701 -8551 1208 12132 7677
764G677j1113n730Q11Q999J0755k680j1809o326J338Q998R716j574j1504o996
$$ 7677 -3436 -9166 -8355 644 11399 8719 -3090 -9416 -8078 920 10636 9062 -2442 -9438
778i438J328Q442R540q90j0706p203J079P309R901J62j1112p075J121O504R581
$$ -9438 -8110 332 9872 8982 -1724 -8927 -7848 -539 9362 9524 -1588 -8663 -7542 -1038 8543
793H543J638j0910q069J454N700R065K893j0296r571K023O651P357L708r061j0859
$$ 8543 10181 -729 -8798 -7344 -1644 7421 10314 18 -9553 -7530 -879 6478 10186 1125 -9734
808i734K005P737O316L037p530j1269P77Q987O184J858o136j0726r54R664O651
$$ -9734 -7729 8 6324 9361 1831 -9438 -8661 326 6510 8368 2232 -8494 -9448 216 6867
823F867J067n434j0180j885Q930P376J424n562r702k070P673Q321J476n348r169
$$ 6867 7934 2500 -7680 -9565 -635 6741 8165 2603 -7099 -9169 -1496 6825 8301 2953 -6216
838f216l300P269Q851J330m462r306m397P857Q923J170l473r580n118P764R329
$$ -6216 -9516 -2247 6604 7934 3472 -5834 -10231 -2374 6549 7719 4246 -5334 -10452 -2688 6641
853F641J467m765p710n500N891J0910J413n950o007n837M175J2112J319n722n476
$$ 6641 8108 3343 -4367 -9867 -3976 6934 8347 2397 -3610 -9447 -5272 6840 8159 2437 -3039
868c039n590L497J0453L393n445p302l748K842Q767N866o541p726k225J301R244
$$ -3039 -8629 -5132 5321 8714 3269 -4033 -7781 -4939 3828 9694 3153 -4573 -6798 -5497 3747
883C747N978o419p035l806K395Q964M905m482p876m541L517P711N769l733r603
$$ 3747 9725 3306 -3729 -7535 -5140 3824 8729 4247 -3629 -8170 -4653 3058 8827 5094 -4509
898d509k928K068P282P983n356q853k735J290Q219P221m864q561l863K851O978
$$ -4509 -7437 -5369 1913 9896 4540 -4313 -7048 -5758 2461 9682 4818 -3743 -7606 -4755 2223
913B223N499j293r958m464M753L678O687N06j0689m196K937M297P382o40q098
$$ 2223 7722 6429 -3529 -7993 -3240 438 7125 7631 -3058 -7254 -4317 -20 7362 6722 -1376
928a376o648J738Q638M047k22o361r419M429Q256K296J081p631p024M152N204
$$ -1376 -8024 -6286 2352 6399 6177 -184 -9603 -5174 3082 5378 6459 -1172 -8196 -4044 1160
943A160N067j90p525m289k21O629O294j872m450p402q82R645L884M16m555j0723
$$ 1160 6227 6037 -1488 -5777 -5998 631 6925 5053 603 -6799 -7681 1964 5848 6264 1709 -9014
959i014K659Q318L193K113p451p262K046N434O939j686n773l701l558P665P202
$$ -9014 -6355 1963 5156 7269 -182 -7444 -5398 36 6975 5289 -484 -4185 -7743 -78 7124
974G124l713r50o654m929R460N183J12l024q686q41N129P342K623r023m177p51
$$ 7124 3411 2461 -4193 -9122 338 5521 5633 2609 -6077 -6918 -1789 5553 8176 -847 -5024 -5775
990e775K334J1228j209p980j592l898N330Q304k121k973n922k664O574L927K902
$$ -5775 -3441 7787 6578 -1402 -2994 -6892 -1562 6742 4621 1648 -4274 -6938 -364 3563 6465
1005F465l820q147N47K187O502M677q124m410r55O73J0311J188o649l574m019
$$ 6465 2645 -5502 -4955 -2768 3734 8411 287 -4123 -5078 -4405 5906 7094 445 -3129 -7148
1020g148M534P942L72l085p654j206N028L191N482m449r217J950J333M785O903
$$ -7148 -2614 5328 5700 2615 -5039 -6245 -1217 1974 7456 3007 -6210 -4260 -2927 1858 8761
1035H761o462o856j115J766P926K735l657o542m136O116M726J542K3q967k729
$$ 8761 2299 -4557 -5672 -3906 4020 6755 3098 -3444 -7580 -1464 3262 4804 4827 -4140 -6869
1050f869O071K610L638j207p706j644J885M845M677l071n224m033J373P915K348
$$ -6869 -798 1812 5450 4243 -3463 -5107 -3222 1623 6300 3229 -1995 -6028 -4655 3260 5608
1065E608j633n550o365N013O265J642l47p671l885N139M001K992j605o187k708
$$ 5608 3975 -1575 -7940 -2927 3338 4980 4633 -3038 -6923 -1784 2217 5209 3604 -2583 -5291
1080e291J888N670K816k127l245n604Q22P874K233j319l723o697J726P758K866
$$ -5291 -3403 2267 5083 2956 -289 -5893 -5071 2803 5036 3717 -6 -6703 -4977 2781 5647
1095E647j928n137m298J120O225M758l100m779k670p89O056M531k416l636l684
$$ 5647 3719 -1418 -5716 -4596 1629 6387 3287 -1492 -4162 -4951 1105 5636 3220 -416 -4100
1110d100j278N636N000q83m349m988O0M982N227m21n665l936L8M613N958j617
$$ -4100 -5378 258 5258 4375 26 -4962 -4902 80 5307 4886 -779 -4715 -4677 -64 5894 4277
1126D277n412l111k96M440N499j199m882l050o69L813N270k9m863l846J23K660
$$ 4277 -1135 -4246 -4542 -102 5397 4198 -684 -3734 -4403 -590 4680 4651 -212 -4058 -3935 -1275
1142a275N668J222o083l835M43K568N548J429n589m869P30L387M274J836m934
$$ -1275 4393 5615 -468 -4303 -3860 -1292 4256 5685 96 -4773 -4043 -656 3618 5454 520
1157E20n315O50L700L440K315l816o239M79L427L838K017l454n799n89L865M358
$$ 520 -4795 -4145 -445 2995 5310 1494 -4745 -4266 -839 2999 5016 1562 -4237 -4826 -961 3397
1173C397J464l216n379j284M111L988J493k868n379j299M263L269J946k340n858
$$ 3397 4861 1645 -3734 -5018 -907 3081 4574 1706 -3673 -4972 -709 2560 4506 2166 -3692
1188c692j501L898L875J932k096n591k097L995M295J102j722m789l186M026M941
$$ -3692 -5193 -1295 2580 4512 2416 -3175 -5272 -1277 3018 4120 2398 -2391 -5577 -1551 3390
1203C390M36j649m617k875L323N303O58k147l666l082K475N552J400k899l478
$$ 3390 3826 2177 -2440 -5315 -1992 3311 3969 1822 -1844 -4926 -2451 3101 4501 1602 -1876
1218a876k650J683N664J874k985l574k710J855N153K316k434m220k444J384M919
$$ -1876 -4526 -2843 2821 4695 1710 -1864 -4574 -2719 2434 4750 2316 -1904 -4348 -2964 1955
1233A955K847k418l848k870J188M957K965k423l871k683J108M701L187k230l936
$$ 1955 4802 2384 -1464 -4334 -3146 1811 4776 2353 -1518 -4201 -3093 1608 4795 2565 -1371
1248a371k441L83M731L537k194m466j621L55L775M024j755m773j618P23L041M201
$$ -1371 -3812 -3429 1302 4839 2645 -1821 -3442 -3087 688 4712 2957 -1816 -3434 -2711 330 4531
1264D531j147m889k149J265K769L481n02m719k876J717L322K954K97m883l145
$$ 4531 3384 -1505 -3654 -2389 380 3861 3359 -1360 -4236 -2519 803 3757 4054 -829 -3974
1279c974J124L332L205K9m341l640J094L748K942J53m004l636O34L783K683N41
$$ -3974 -2850 482 3687 3716 -625 -4265 -3171 577 3519 3672 -332 -3968 -3334 449 3132 3673
1295C673l617l933Q72L497K475P58l561m266J072L040K988N01k937m263RL932
$$ 3673 56 -3877 -3005 492 2967 3725 164 -4102 -3030 10 2998 3499 562 -3701 -3692 240
1311B40K533N57k198m613l77M049K440M13j794m647m30L776L020J54k521l429
$$ 240 2773 3330 1132 -3481 -3858 191 2631 3044 1250 -3397 -3827 -51 2969 3123 602 -2827
1327b827j019L292M005l97k463k857j929L448M031j58k527l076j472L098L819
$$ -2827 -3846 -554 3451 3054 591 -2266 -4195 -747 3284 3126 599 -2477 -3949 -851 2968
1342B968O37k765l482q90K263M137J042l313k896j415K461M388K71k725k529j811
$$ 2968 3605 840 -2642 -3532 -1269 2868 3910 597 -2299 -3714 -1253 3135 3406 681 -1848 -3659
1358c659K391L909Q11k269l056j590J860L948J664k919l177j044Q10M475K218
$$ -3659 -1268 2641 3452 1183 -1873 -3463 -1603 2345 4009 1090 -2087 -3131 -2321 2154 4372
1373D372l514k871j069R28M141J893k580l486j056J853K813K261j947m196n03
$$ 4372 858 -2013 -3082 -2154 1987 3880 1300 -2186 -3242 -1389 1424 3685 1738 -2458 -2961
1388b961J670K135K842j523l949j216J057L087K450j440l758k096J864L280J741
$$ -2961 -1291 844 3686 2163 -1786 -3002 -1945 1142 3592 2152 -1606 -3702 -1838 1442 3183
1403C183p30m187j993K259K738J997p73m488j217J672K266K761j306l603j862
$$ 3183 2453 -1734 -3727 -1468 1270 3267 2494 -1994 -3211 -1539 727 3488 2182 -1421 -3283
1418c283J051L155K039n94k914l439J827L374J281O02l485l866K283L038K051
$$ -3283 -2232 923 2962 2368 -546 -3985 -2158 1216 2497 3099 -386 -4252 -1969 1069 3120
1433C120m58l496k572J124L266K336j406k343k148o27M277J508p53j525l344J83
$$ 3120 2662 -834 -3406 -2282 984 3320 1914 -429 -2577 -3204 1073 2581 1828 303 -3041 -2858
1449b858L631J613K43k422l289M59K476K942L39l742j890l88K969L412j414k493
$$ -2858 773 2386 2629 207 -3082 -2623 -147 2795 3134 -608 -2498 -2886 83 3495 2081 -412
1465d12j902p81L656K383j041j668k926k03L230K160L91k622k858r1J998L473
$$ -412 -2314 -3095 561 2944 1903 235 -2691 -2894 336 2496 2887 265 -2593 -2684 -686 2787
1481B787K63l699j487o18J732M525p38k843j756j204K737L127l32k067k596k9
$$ 2787 3050 -649 -2136 -2754 -1022 3503 2765 -78 -1834 -3038 -301 2826 2494 427 -2169 -2198
1497b198J753J895J640k456l183L52Q06L172K083l660k424n29J538L647O35k741
$$ -2198 -445 1450 3090 634 -2549 -2197 -1391 1781 3864 204 -2220 -2749 -1211 2436 3071 330
1513C30k459j194L157K416n8j097l447QK235J132J728j525l692O52L97K299K391
$$ 330 -2129 -3323 -166 2250 2192 1095 -2352 -2344 -109 1023 2751 1226 -2466 -1814 -1417 882 3273
1530C273k052k940q68J286K868J435j631l060j898K855K430L53j58m157p39K620
$$ 3273 1221 -1719 -2587 -1301 1567 3002 1371 -1689 -3587 -732 1698 2051 1893 -2264 -3003 -383
1546c83J636J268j024l366o04J207K503J295j374k049k062J243L328P01p18k044
$$ -383 1253 2521 1497 -1869 -2473 -1266 1237 2532 1158 -891 -2953 -1710 1618 2319 1601 -443
1562d43k997J676L255J039o81l196j664J495K490J772j189k731j002K98K943J503
$$ -443 -3440 -1764 1491 2530 1849 -1347 -3011 -1516 974 2746 1557 -1174 -2176 -1878 1065 2568
1578B568j210j626k184L34L342R15o92j840k374O98K982J615o36k530j855N78
$$ 2568 1358 -268 -2452 -2118 1224 2139 1447 -393 -2767 -2069 913 2528 1892 -638 -2493 -1915
1594a915K483K454j607k235j109j63K785K184j511k031j339J71K417J903m91k541
$$ -1915 568 3022 1415 -820 -1929 -2092 693 2877 1366 -665 -2004 -1833 584 2487 1996 -545
1610e45j573J08K239K011Q7l041j403K60J573K879m12k673j621J25K121K151j03
$$ -545 -2118 -2010 229 2240 2327 -714 -2117 -1857 -284 2595 2183 -490 -2111 -1986 135 2286 2183
1627B183k333k145M71K048J650N31k444k189N88J270K403K47k688j713J21J885
$$ 2183 -150 -2295 -1824 224 1874 2405 -39 -2228 -1640 -370 2033 2280 -408 -2121 -2000 -115
1643a15K007N49k508k088J93J992J608N25j761k690L21J920J462Q58j824k552
$$ -115 1892 2441 -67 -2155 -1962 30 1638 2163 402 -2288 -1967 -47 1415 2273 449 -2103
1659b103J28J771J744M88j394k463m72K281J696J87j224k409n94K272J928L85
$$ -2103 -1975 -204 1540 2028 634 -1829 -2301 -20 1676 1863 639 -1770 -2364 -92 1836 2221
1675B221j517k147j071K134K010M54j561k005q00J743K011O41j319k118j060J767
$$ 2221 704 -1443 -2514 -380 1630 2084 523 -1482 -2282 -539 1472 2113 794 -1324 -2384 -617
1691f17K174L02j188j888j066J567K199M03j108k049r05J024K585N07j199j746
$$ -617 1557 1859 671 -1217 -2283 -716 1483 1886 778 -1271 -2176 -1152 1433 1940 741 -1005
1707a005j073J052K611J09j045j571j118P95K570R95j534j492j134L22K821R82
$$ -1005 -2078 -1026 1585 1694 649 -922 -2040 -1245 1325 2320 786 -706 -1840 -1518 1303 2285
1723B285j494j864r45P24K210J465j474j946r01R21J771J451j059k352q55R76
$$ 2285 791 -1073 -2018 -1294 916 2381 907 -1039 -1940 -1019 752 2203 1144 -1208 -2063 -1087
1739a087J705J477r53k243r21P89J983J408p36k444r80N83J815J591n81k214r78
$$ -1087 618 2095 1142 -1101 -2022 -1233 750 2158 1422 -1022 -2002 -1419 396 1987 1406 -808 -1786
1756a786N90J428J787m67k292j416J211J173J777l34k388j367P26J609J499p1
$$ -1786 -1196 232 2019 1552 -740 -2156 -945 228 2005 1671 -717 -2084 -1358 251 1750 1679
1772A679k231j495P83J667J197k2j917j762M96K212J132j69j518k032P05J668
$$ 1679 -552 -2047 -1264 403 1600 1578 -339 -2101 -1605 607 1739 1570 52 -1980 -1275 393
1788C93J218p0j561j924L61J968J054J62j456j787j72K225J344j57j694j696O9
$$ 393 1611 1541 -20 -1944 -1583 385 1439 1601 145 -1642 -1814 411 1755 1598 -96 -1792 -1723
1805a723J861J360k4j279j963n1J853J678j20j498j703o6J707J735m3j603j517
$$ -1723 138 1498 1474 195 -1768 -1819 34 1712 1592 94 -1609 -1675 32 1767 1724 121 -1396
1822a396l66J711J931n64j270j073r64J692J941k97j137j330n20J380J696L24
$$ -1396 -1762 -51 1880 1316 46 -1027 -1991 -299 1642 1345 208 -1122 -1642 -262 1434 1758
1838A758j593j378m07J044J896O12j764j373m84J137J974M01j631j483l42J272
$$ 1758 165 -1213 -1620 -576 1320 1932 168 -1205 -1689 -552 1422 1823 192 -1291 -1633 -361
1854c61J547M21j052j849k09R51J605Q00j515j407m94Q48J699Q47j178j568o28
$$ -361 1186 1607 555 -1294 -1503 -552 1053 1853 338 -1069 -1563 -715 984 1831 653 -915 -1543
1871a543O99J831P47r60j957m52J189J211J296j493j788l03Q17J490R97q23k020
$$ -1543 -844 987 1734 774 -1183 -1635 -446 765 2061 568 -1220 -1523 -706 784 1781 958 -1062
1888a062n40J045J103J104o28j903p90R51J519N58L5k352j038J598J204O30k74
$$ -1062 -1602 -557 546 1650 1022 -881 -1671 -720 799 1357 1392 -960 -1998 -400 804 1434 1160
1905A160k236m13P18J631R22j102j208j082L42K202L52l56j128j711J196J480
$$ 1160 -1076 -1489 -771 860 1782 680 -528 -1610 -1268 934 1286 930 -198 -1909 -713 767
1921G67N99J4j794j491J069J270J346n01j914j045N65J718Q82q26q62j422K05
$$ 767 1366 1380 -414 -1905 -836 434 1780 1279 -635 -1680 -1115 603 1485 659 -203 -1625 -1420
1938a420K227M75m68p23j815N32J459J135Q2j895j071K67J074K027o23j866m53
$$ -1420 807 1282 814 91 -1724 -1192 267 1402 1484 -411 -1482 -1215 -141 1886 1263 -603 -1056
1955a056m57J813J437j014r57j322J96J614J054m11q72j416N42R02J100K96j741
$$ -1056 -1513 300 1737 723 -234 -1556 -1360 254 1308 897 25 -1391 -849 53 1153 1449 -292
1972b92q63R8O29J885J0j759p24m84J414J723k69j431j102l65J734R87K09j735
$$ -292 -1155 -1057 -428 1457 1467 -292 -1016 -1500 -86 1637 1368 -63 -1165 -1530 204 1191 1400 -335
1990c35j096O28M58J202N70j512q95J80K89J622L37j449j053l95J071J633k9n66
$$ -335 -1431 -803 -345 857 1427 -85 -980 -800 -511 1111 1448 -1 -1054 -1449 -378 1255 1226 660
2008F60k075j12J735P09M53q15k156L82J042J211L58j048j404r6P22J268N12r34
$$ 660 -1415 -1527 208 917 1370 555 -1601 -1219 -177 1034 1392 344 -1060 -1156 -434 834 1346 412
2026D12j198p90J454J128K37p47j239p32J267R37M23n94j699l34J253J092N40
$$ 412 -786 -1576 -122 1006 1243 496 -743 -1475 -208 729 1152 558 -1141 -1475 -222 870 1410
2043A410j017j320l61Q45J463J63n08j132q74N70J675K6l02j133j002P72J495
$$ 1410 393 -927 -1288 -443 1020 1183 675 -457 -1331 -761 914 940 638 -495 -1497 -725 770
2060G70M65m06j495p67P64J264J012j287j048n61M43J695M60p13j180p61N77J521
$$ 770 1235 829 -666 -1433 -669 595 1607 320 -728 -1289 -846 849 1309 596 -584 -1345 -768 753
2078G53N23o35j243q12N29J284Q50l51j434p23M48J269R79q02j157m02J03J362
$$ 753 1276 641 -602 -1414 -885 399 1249 898 -536 -1259 -811 458 1437 635 -522 -924 -821 541
2096E41R18q11j215o99L86J180R08j99j383q06N48P50J150k54j645n21K08Q13
$$ 541 1459 648 -567 -1266 -880 300 1208 1009 -374 -1180 -632 118 1268 1014 -631 -1152 -944 -131
2114a31J285j94j483o68J86J103J166l33j175j129P24Q72P43J11j391j015M50
$$ -131 1154 960 -523 -1191 -1005 98 1264 931 -244 -1373 -649 223 966 1077 -314 -1329 -879
2131h79R90Q69j1j065r51K04J205P16q3j177j060J86J215P78J52r28j206J29R10
$$ -879 111 980 969 -96 -1047 -843 362 1078 995 -182 -1242 -1056 159 937 1089 161 -1045 -916 -6
2150fR16L0q32j259PJ266Q01K92j009j299q7J380O20M04j046j228j63J252J127
$$ -6 910 940 108 -1151 -1144 122 923 1215 206 -1093 -1180 200 820 1224 178 -1050 -1213 39 1166
2169A166k97o62j347oJ113R70Q1q32r43m01R50J095J43q83q33m48P92J583L2r50
$$ 1166 869 207 -1140 -1146 -33 937 1018 186 -757 -1158 -208 887 1030 147 -686 -1134 -342 1241 1273 323
2189C23j187l38Q74J189M13r50j075l60O16J413J92p77j125k70O10J278K54p00
$$ 323 -864 -1202 -328 861 1274 324 -751 -1111 -495 918 1110 333 -792 -1062 -452 826 1080 380
2207C80j037k30M85J333J62p54r93n47Q30R04N66r21r64l11N24J103P59q79j312
$$ 380 -657 -887 -402 931 1093 339 -654 -1201 -371 533 1099 178 -786 -1097 -573 530 1289 410 -902
2226i02j16M61J159O02p66j145l59N51J005O46m07j398l68O64P08P68m85j165
$$ -902 -1018 -557 602 1204 438 -707 -1066 -515 490 1136 729 -669 -1037 -373 335 1103 618 -547
2244e47n46P64P94P67o83j136m85L66J185O61m85j023o26N50J070L91j22j452
$$ -547 -1093 -329 465 1232 549 -587 -1072 -706 479 1140 655 -368 -994 -444 626 1017 895 -557
2262e57o16N94R90O27k58j122p33M70J008O65p2j363o48K69J244N32k64r42j097
$$ -557 -1173 -579 411 1038 780 -342 -1075 -605 403 1068 996 -367 -1015 -746 498 1030 766 -176 -1273
2281a273N29J142N20k05r53r31N23J030N59m03o47q53o8J320Q10o98p11o69J56
$$ -1273 -744 398 918 713 -240 -1171 -648 382 941 538 -109 -962 -1030 290 1100 402 -309 -978 -822
2300h22J223O17l88p71p34j04J182Q33oj076r86J69R11R26j33r88p02j06R46J173
$$ -822 401 1018 630 -141 -875 -979 203 1036 1030 -46 -1032 -863 48 974 841 -147 -849 -955 -9 1164
2320A164m70o33j045o3R75R94j48r44o96k6Q16Q15K02j204m09k25P59J098qr70
$$ 1164 694 61 -984 -1047 -72 922 774 -170 -866 -892 -76 739 941 -263 -672 -897 -138 960 952 -18
2340a8q56k8Q56R13o8p21r67R5O59Q06M32j027j045J50O96R46R9o72j061O1L08
$$ -18 -874 -902 -46 867 799 78 -889 -794 -135 671 1103 76 -969 -819 -123 823 922 250 -811 -750 -442
2361d42J042L16r07p81j35O36J011L07n19j550J47P50R51M03p82j545J13P12J090
$$ -442 600 916 9 -772 -907 -271 740 1047 528 -1022 -875 -125 826 1229 447 -1098 -985 -273 817
2380H17L13r36r26k24Q17O03L43m15q32r23J257O92L47l17j303m82J080P57L99
$$ 817 1130 194 -732 -956 -139 464 807 392 -440 -1363 -106 586 933 616 -687 -1169 -89 668 1067
2399A067o95j103l92R46J039J02n84r18o28O99J372j85j53r42p80R71N80L88m53
$$ 1067 372 -731 -1123 -177 862 964 380 -538 -1166 -467 905 720 567 -375 -1155 -184 396 784 331
2418C31q49m20K65J114Q61o53j141m27J77J402M56p61p06m93K86J343j07j55j028
$$ 331 -518 -938 -673 441 1302 649 -492 -919 -742 660 1116 355 -351 -844 -558 785 678 523 -505
2437e05m81O35P29J71K12j073m29J53O42J303r90o84k66m26J219J115q09n57r16
$$ -505 -986 -351 378 549 761 -312 -741 -588 54 1357 367 -317 -583 -1009 210 1325 516 -41 -957
2456i57N2J187P19n16q79n74N49N20P48j30j343j17L02L22J380n36j009o03J08
$$ -957 -905 282 1001 485 -394 -968 -419 101 849 719 -624 -741 -439 -117 1263 727 -282 -885 -777
2475g77Q77P90l41n08j177M10J037N43K8r89r88P36N40P35j74j017m26P5M66J137
$$ -777 100 890 549 41 -1136 -726 311 854 882 -107 -1095 -359 181 916 742 -275 -701 -626 -160 977
2495I77l37p03n98l09R50P09M2o50q49nR29N09K63j130j040K32J091Q09j92q07
$$ 977 640 -63 -661 -970 -20 689 731 81 -768 -773 156 665 928 -202 -1242 -1010 81 890 698 -109
2515a09o09k53P72J248l99n88p92j11Q23P63q9k39j213k66Q49P94M80p56j209
$$ -109 -718 -971 -199 1049 650 62 -730 -841 -18 745 656 417 -796 -1062 -213 581 1061 305 -904
2534i04K3O33J002J49q81m56o15P91J185j57m58q00l08P00O76P2m40q73k82O24
$$ -904 -881 -248 754 903 22 -434 -1049 -258 927 770 312 -488 -796 -96 580 652 212 -661 -943 -319
2554c19J116J80p93q09l00M59J197K23q96n64m56O03J152P8m24q48n38M82J022
$$ -319 797 977 184 -625 -925 -466 731 954 58 -506 -962 -359 793 871 447 -401 -939 -457 565
2573E65L00l60j087k09L76P57Q47q71q91j38L63P10O18o55q04m35N23J097K46
$$ 565 865 505 -582 -791 -415 342 1189 318 -573 -711 -348 362 980 325 -479 -914 -391 706 952
2592I52m04j089m63N17P19O15j79j066k03QQ02N90l45p26m84J66R67M54mj356
$$ 952 548 -541 -1004 -487 232 847 668 -398 -601 -593 209 799 454 -272 -756 -590 377 831 827 -529
2612e29l73L34R82K67j69j023j83J96O94N79j87p59r35O13M93P99k42o77r28L58
$$ -529 -902 -568 414 681 512 -511 -694 -498 196 775 588 -171 -1106 -493 0 799 557 -120 -1048 -690
2632f90J234K86j93o79q80K74R83M86j77p05p91R7J160O43n26o03p30K51O92P06
$$ -690 544 830 637 -42 -922 -648 335 821 644 -61 -852 -755 405 1048 522 -81 -811 -560 132 838
2652H38j12q17q37K05P32R59k77q42o92J39O32R47j84q11o80J72O88O80j24o69
$$ 838 726 -91 -928 -723 9 968 691 -151 -843 -704 -72 875 691 -120 -800 -628 60 740 616 -53
2672e3o44P5N84Q39j72o13q14P4O36R37q8p62o13k89Q05Q89lq09o19j5O23Q17
$$ -53 -697 -622 -38 801 629 16 -798 -724 -88 849 761 -1 -614 -903 -98 791 788 -21 -640 -655 -32 785
2694G85P3q84p25j28O83P89J62p00n76k26P24O25K01r02o73o7O48P95J66o92q11
$$ 785 858 -26 -751 -879 -196 593 755 55 -521 -747 -23 602 803 -99 -772 -839 -191 604 770 78 -733
2715g33l6O15O75L64q01o74l1M07P88L54n79p99k74M22O65M39m23j134n1N98P17
$$ -733 -769 -154 521 885 84 -590 -621 -214 574 928 349 -450 -724 -302 363 802 379 -755 -806 -208 509
2736E09N18n57j118q8N14O46K43m51o22m23M68Q68J97k12q50m82P11O02L17m76
$$ 509 1027 470 -648 -736 -222 424 667 216 -406 -829 -361 507 704 492 -358 -840 -129 473 790 314
2756C14p29l29K12J266J65p47n23l74L53Q59L21m75m39o99L79R99J27n1j066l73
$$ 314 -415 -744 -532 734 899 152 -371 -745 -392 467 788 313 -126 -825 -446 553 680 629 -437 -810
2776h10K87R50M82n28q05l70L27O82P97o18o16o76K92Q11N90l66n16p20mJ075
$$ -810 -523 427 909 381 -424 -794 -467 215 1012 394 -222 -898 -606 205 795 429 -87 -807 -811 264
2796B64M88l80n94l64j77Q74Q36m63q45j55k89Q76R51l21j052l25j7Q79P74l73
$$ 264 752 372 -222 -586 -763 111 947 484 -361 -516 -805 71 1022 701 -351 -676 -693 186 960 587
2816E87p88o42J44Q60M55N8r57n84M84M49N22M4q38p67M21P33O36k15n52o19j16
$$ 587 -201 -843 -699 161 616 674 -283 -867 -383 66 588 632 -206 -973 -552 181 817 602 50 -569 -685
2837f85O28O05J52o77q80L41N93O08J80p69q18J50N95O79M0q87m21r2P24N67n5
$$ -685 -57 548 700 23 -857 -516 77 685 865 96 -722 -572 23 702 742 -145 -566 -658 66 633 578
2858E78k47j046m8R52J14M65m68r70p0O83P52J82q53o83j32O75Q15j20p00n28
$$ 578 331 -715 -763 189 303 768 300 -670 -740 -57 695 877 24 -659 -791 -116 699 579 -121 -649
2878f49k44Q79N94o7l63p42j12P12M50K98m07q92j16K84P33M62n00p24n25N19
$$ -649 -893 -14 580 513 150 -592 -704 8 458 756 349 -543 -659 -375 358 820 320 -404 -929 -410
2898d10J129j61k78o53n31Q44O40J20m74p81j14N19O98L15n11p84j48J60O99O09
$$ -410 719 558 280 -373 -904 -60 580 700 226 -555 -669 -150 548 863 352 -432 -580 -420 279 888
2918H88o21o23p0J6R36L01o21n46n18O05O80K55l59q52j67N32M81O71o57r30Q6
$$ 888 267 -356 -426 -410 526 827 206 -340 -858 -253 427 682 323 -529 -696 -164 317 988 331 -599 -513
2939e13R9Q14N40q33l52o75M45R74K46m83n81o62N42Q84L01k88r22l46N02L68
$$ -513 -414 400 940 107 -245 -920 -475 499 745 262 -319 -981 -439 445 746 458 -464 -810 -308 60
2959F0P97n29p46l75L71N59O90m01r02l08J35Q13N65o8p58p06M25N11K97J87p26
$$ 60 857 328 -418 -793 -422 137 827 426 -476 -784 -649 164 729 661 -97 -803 -378 133 430 617 -109
2980a09o73L40N51N37l5p29n02J76O36M48j47o08p62K40P63M52j82l29r70K58
$$ -109 -782 -442 109 646 611 -118 -620 -444 192 640 493 -115 -877 -637 126 578 396 67 -903 -645
3000f45Q08M19K77j098m26QP58O42M3q02o75J0P37N02n1l44p39r0N05Q15j33n23
$$ -645 163 582 859 -239 -665 -657 101 743 786 -16 -691 -681 56 558 507 163 -576 -666 -161 654 521 -2
3022bo39j8Q35N54m5p65m39l19O88Q32Op38m61k9M77Q87j34o58p45J39L35P66
$$ -2 -641 -659 176 730 685 -80 -519 -838 -150 682 688 -50 -511 -540 -63 824 690 32 -713 -574 -239 527
3044E27J6l89p76k7M16Q18K79r28m01o5J85J036j23o50l25l06M06P96K79n72q62
$$ 527 543 154 -622 -649 -233 585 864 -64 -465 -530 -345 691 568 -82 -407 -713 -307 489 768 196 -666
3065f66m4M94P03J95m43o37k92L23Q07L84o16p34p1K52O96N11n05q29k32Q73J94
$$ -666 -710 -216 487 682 239 -398 -690 -367 440 824 208 -526 -597 -345 351 862 357 -472 -704 169 363
3086C63K39k83o38l43O20M99M74o17p97j68K93Q73L0m9r18k65K53O74M65m55o32
$$ 363 602 319 -319 -662 -42 457 931 314 -483 -651 -358 515 545 496 -422 -687 -434 240 705 250 -382
3107c82j56J89P13J96k32p33k87M63M68M98n39n48k99K65Q20L53l58o29m93M96
$$ -382 -538 -349 364 560 328 -405 -692 -229 239 737 198 -350 -649 -384 436 789 431 -198 -691 -195
3127a95N70J27Q5n64n81P0P02M43j94q46j02k6P21N44m51n45k67j23J029L26k49
$$ -195 375 502 587 23 -558 -488 214 657 463 -383 -485 -511 210 754 303 -242 -509 -632 397 723 474
3148D74o91k64l6N92N00j36p30l37J26O55M82k20n51n12J04N08N02M6o88k18k05
$$ 474 -217 -481 -517 75 575 439 -291 -628 -502 153 635 415 -136 -648 -544 -36 466 512 -176 -394 -599
3169e99P61N19N0q05o50K34N52O16m2o82l98k72M00J025l85m73n07n0N92O72o7
$$ -599 162 681 731 -74 -724 -490 62 678 636 -46 -444 -716 -316 709 324 -149 -656 -706 -114 558 491
3190D91o31l82k68O10O35O6m74o21K02L21L92M13p66n02P2K62O99N2n84m47j75
$$ 491 -140 -522 -790 -180 455 521 47 -574 -372 -51 341 754 -12 -514 -442 -180 519 571 -13 -460 -635
3211f35P16K99J46l34p53K5L83O26J32o06m17j36N22M74K93o80o23p5N84L81K27
$$ -635 81 380 526 192 -561 -536 -153 473 605 -1 -418 -554 -32 442 735 55 -568 -643 -59 322 549
3232E49m78m50k74M32O09J91j85r48Q9K33M89L22m65m69k47O49J76K43j62q34
$$ 549 71 -379 -653 -221 388 579 394 -554 -465 -232 257 579 114 -355 -602 47 223 466 304 -530
3252e30l8K88O14K41m83o00q4L51N53L09m12n42l85M02O20J61l32m17l58M36M67
$$ -530 -568 -280 334 575 92 -508 -592 -241 312 621 209 -333 -718 -316 304 465 133 -284 -642 -206 261
3273B61L70l72o74j68K22P12J83k15o82m49N21M60O07m13o92n6M1O87K72l33n89
$$ 261 631 259 -415 -583 -361 351 534 319 -363 -812 -291 169 776 363 -329 -385 -344 343 615 282 -307
3294c07k20PP63M23l48o89l2n0O62M79k74n76l15J02L91N62l79m36k79L36K23
$$ -307 -527 -520 243 666 318 -371 -403 -453 209 688 414 -162 -477 -375 16 578 199 -237 -516 -180 43
3315D3M30J61r28m00K39L51Q91n66m81j33Q8N21L14Q0q15k40M5N69K83n3o36o32
$$ 43 473 634 -294 -694 -455 -104 787 221 -260 -393 -305 216 530 610 -205 -445 -400 169 452 399 -237 -869
3337h69P70J54N05j40o11l06K36L74M77n7p58l90J95O17L75j15l93q14K01O50
$$ -869 -99 55 560 420 -191 -497 -261 113 590 533 -225 -615 -420 197 572 457 64 -750 -549 101
3357A01L14J76m22p79K45L72K48J92k65p56L1M36N88J86n03m64k55O05M65l10
$$ 101 415 591 169 -610 -365 7 255 447 182 -574 -543 -107 481 667 164 -300 -555 50 515 205
3377B05Nq10k1P72K30J74p37m69L46LO22L39o80k60l43N61N16R9m98n31l34Q57
$$ 205 210 -600 -621 151 381 555 -182 -651 -305 -302 320 659 -21 -281 -624 -63 453 552 54 -477 -811 46
3399D6L47P5l09o88P4N20K84K74n60n59j91M25P64J35n40m43j17K44P39J94o08
$$ 46 393 468 159 -529 -455 65 349 623 63 -496 -687 -262 502 637 97 -346 -463 -219 520 714 106
3420A06n30l0M28L20M49m68r15R5L55L75M75n25p13J21K14M26L83m16k52n09K75
$$ 106 -424 -454 -26 294 743 275 -640 -545 -190 185 660 135 -578 -457 -243 183 566 150 -102 -611 -336
3441c36O22q3J62q37p7K11L32O23m6j102j19M21M90K50j97p29p2K21N49L71l46
$$ -336 286 203 365 -472 -549 -338 -6 617 571 -531 -650 -229 261 511 314 -415 -487 -266 283 654 308
3462C08n81n73O49L47M76j84n25n16M35M79K56r5o78l56L34M21L96l93l43o27
$$ 308 -273 -846 -197 150 626 442 -83 -599 -164 315 571 476 -202 -558 -224 197 593 200 -143 -770
3482g70J90R86j19M6m23m58R6L48M11P4l59m41J60L64L81k51l20l30J17L91N70
$$ -770 -580 406 287 333 -90 -548 -452 -104 307 381 22 -419 -259 105 486 235 -85 -415 -298 93 663
3503F63l93m74m12K16O38P6m3l05n19J19O50P7N3l30l86p4L95N87mo07n59j01
$$ 663 270 -204 -616 -400 238 314 271 -34 -553 -434 216 293 346 16 -370 -444 -49 538 534 -73 -632 -733
3525g33N50O67k64m09k60P7M00K78J88o32k31j52P29L40p7n07m80K37K82J93J57
$$ -733 -183 484 220 -189 -449 -372 28 306 494 -138 -369 -521 208 548 471 -36 -516 -279 3 196 353
3546C53l65p02L10L98M36jm10j88k79O46J61p2k33m62l1L11M61Q7m28l64o0J99
$$ 353 -12 -714 -404 -6 430 429 19 -169 -448 198 359 287 54 -408 -439 -128 333 420 -8 -372 -432 -233
3568b33M96L64m58o18j20M30L75L17l31m96l94O03K80L14k48n77j19N54L00M1
$$ -233 263 627 169 -449 -569 -139 236 553 222 -274 -668 -65 215 529 281 -296 -415 139 439 480
3588D80k41o51j9L52L49O1j04n72l8L01M64K56m58l33j51k3P46J63k51o13k33
$$ 480 239 -412 -431 -79 270 331 227 -345 -383 -82 382 638 180 -153 -304 -327 419 582 331 -282 -515
3609e15M95M08j6j94m27k67L85L72K30j99l08m36K07M80L21k94l59m03L16L94
$$ -515 -20 388 372 178 -249 -516 -131 241 471 272 -36 -472 -265 215 536 242 -117 -520 -204 190
3629A90K94j78m52j14j53O86q8J31m91l38R4O31L08n04j21l73J88L90J54J59l93
$$ 190 484 306 -146 -260 -413 273 185 316 -175 -513 -419 212 520 16 -105 -478 -290 100 254 413 20
3650B0m76K33M61J84j44k86m15j51O49K22r9l93l89J76M94L54j29l90l21L71k3
$$ 20 -456 -223 238 422 278 -8 -423 -574 75 297 198 -195 -584 -408 86 440 311 -79 -400 -29 -52
3671e2N75j75m01k51j42N81M59r1n90l54L02J45M02Q8n24l34o4L07N81K2m81l52
$$ -52 523 348 -53 -304 -446 135 594 503 -87 -441 -139 6 408 496 -28 -362 -426 -119 462 484 3 -349
3693c49j27L23N46p0l28n69O6N29J8M02m43k92j47M21L08K1j23m75j50L36M03
$$ -349 -476 -153 393 323 -5 -574 -508 21 39 441 -2 -294 -441 -20 288 309 186 -289 -439 -103 300
3714C00R9j31p53%N86k3L00k11m09r8J85L55J31l50k18n2J97N17q5l31j2l38L59
$$ 300 399 268 -485 -485 101 78 378 167 -242 -340 -155 200 331 -19 -237 -289 -92 425 340 9 -3 -341 18
3737A8L43J2j41m40j90J22N10Q7j50l44m22M52L88M8j97l35j73L15L02QK45m41
$$ 18 361 373 232 -208 -398 -276 234 321 171 -173 -595 -143 245 293 96 -239 -412 -97 205 213 458 17
3759A7j33N1M33R7k12n22k77L53J96N21l20m39j44J39M91L03k99m54k95K22N80
$$ 17 -116 -65 368 465 253 -269 -546 -193 3 524 204 -235 -379 -240 251 554 255 -199 -494 -272 308
3780C08L91n36l41j82O8L95K92j45l31l41l2N57K7J93l71l87J73L50K40j54k67
$$ 308 699 163 -178 -360 -292 103 395 250 -81 -422 -454 103 130 323 -48 -435 -262 88 328 174 -93
3801i3k81J20K61J77Q7l55l29QL65N07J1n12k46lL98L16j34l86j24n2L07L83k94
$$ -93 -374 -254 7 184 271 -84 -413 -405 -40 467 478 -34 -280 -283 115 431 297 -89 -213 -265 42 425 131
3824A31jp62N34L06j3Ok60j77j86L13L41J54l81k91rO9N49%l46k38k34N62K61
$$ 131 130 -632 -98 208 195 201 -59 -236 -422 -109 232 386 5 -286 -295 -226 323 323 -23 -261 -495 67 328
3847C28P4l98m91K20L02J53J00k12l60mK31N44J2l26k83k47K78K81J08l42r3j94
$$ 328 402 4 -487 -267 35 188 288 76 -284 -288 -57 487 499 173 -110 -357 -79 202 310 -32 -125 -319
3869c19J26N84P9l00o14J95O3N04K7k50l03p2J51M77j79M1k55m58L22L68K10o0
$$ -319 -193 391 470 170 -444 -249 -186 318 345 95 -208 -280 -129 348 169 210 -45 -503 -181 187 397 337
3891C37m28l62L29K24L98k15o66P3M3O02O6n10l2p1j00N17J37k98l06j72M23K4
$$ 337 -91 -453 -124 100 498 283 -383 -310 -267 335 401 -109 -141 -212 -312 205 342 44 -262 -434 -11 13
3913A3L88k91l29j86J60L88J63j42m95l6J89K86Q0K4m75j29J08N36l5J64m97m15
$$ 13 401 110 -219 -405 -245 143 306 164 -331 -367 -178 108 188 212 -263 -392 -284 252 217 381 -116 -531
3935e31L44J75K43J46o18o8J03J91K67k8k73k33j45M02M18%m67k76J87K11N43
$$ -531 -187 -12 231 377 -241 -309 -206 -15 252 224 -49 -282 -427 -25 393 393 -74 -350 -163 48 591
3956E91l17l68l39J27M52J25k17J1m58J51R7M98m6l31l30J65J48K22K66n08k86
$$ 591 274 -94 -433 -306 146 271 54 65 -393 -242 -145 353 307 -24 -354 -189 -41 181 447 -61 -347
3977c47m6M04L83j15j17o03r5L92L98N1k59l01J08J30K91n7k98J70n16J24O19
$$ -347 -393 11 394 279 162 -441 -536 -144 254 305 46 -255 -147 -17 274 217 -81 89 -427 -303 316
3998C16K43n63k40r8K65K14M77m77m10q7L13L35J08l72l01L1oN02j14q8k44j61
$$ 316 559 -4 -244 -342 -77 137 614 137 -273 -360 -47 288 396 24 -277 -246 -252 250 136 48 -196 -357
4020c57K08L19N44m84n84Q0J40M86j14M0m61j32lM62K67l47j54k43M4L95L18k25
$$ -357 -149 170 714 230 -354 -274 -134 352 238 278 -183 -315 -318 144 411 64 -90 -333 -289 106 424 199
4042A99m80k37K57M00L24l62k45j16J02L18K24p8k67l56K69n7L55R3m15m68K70
$$ 199 -281 -518 -261 139 463 101 -144 -260 -158 160 384 306 39 -317 -48 -105 250 343 -72 -540 -270
4063b70M40l0L5k97k57J10K26L70Ol89l90K07K14K33N6l90j14N1J99K59mk6o41
$$ -270 170 140 175 -122 -379 -269 -43 327 333 -56 -446 -239 -25 208 264 -126 -240 -189 10 269 265 239 -402
4086d02J93M13J66r3j35m80k1L86K18k7m25q3j50P16J29j02l55k46pK77M04j25
$$ -402 -209 204 370 277 142 -338 -359 27 245 218 -207 -290 -440 276 405 303 -52 -298 -305 -28 376 251
4108B51l46k25K3L42K12km45q1l20O92J00P2j86l47P4K72J56P2m03j86l13N27
$$ 251 -95 -320 -297 45 257 255 -190 -271 -591 101 201 273 87 -260 -186 86 242 314 -89 -275 -588 -61
4130f1L06K09l33l16k11M09M52k96j88O4j76M0N18O4n05k07j33K63N21Ok55l54
$$ -61 245 454 121 -195 -406 3 455 159 -29 35 -141 -101 417 481 -24 -231 -364 -101 420 426 171 -183
4152a83J3o4N12J34k58k54n04M90L63J1K9o05R7LL25L16m54j85l3N5M05J51j14
$$ -183 -170 -234 278 412 154 -100 -604 -114 249 260 289 -316 -219 -216 109 425 -29 -214 -247 -192 213 364 250
4175B50m96j19K85L66J01l01k34k68M22J00M86k60n78k4L14J13K32M9q69K8J13
$$ 250 -246 -365 -80 286 387 86 -148 -416 6 106 592 332 -246 -270 44 157 389 438 -431 -403 -290
4196b90L61M42o5n52k15QL98J97j2k63m50K01Q7N09l37k11r6K2M39K62k12k49
$$ -290 71 513 448 -104 -319 -311 87 284 272 9 -441 -240 -153 356 19 -192 -288 -266 173 435 223 -26
4218b6l67L32K53K86k16m69j10O7L99K05j43r3n57O0M73J39J60m25k36L8K18L00
$$ -26 -393 -61 192 478 262 -207 -317 -250 149 354 211 118 -439 -379 94 233 393 -32 -268 -230 -12 288
4240B88p8k30j87l23N09J59K34m05j80J4N2M45J32l91k73L8K61K12N6k08n27Q
$$ 288 210 -20 -207 -530 -21 138 372 -33 -213 -199 -147 298 430 39 -234 -196 65 277 333 125 -402 -394
4262c94L11L45K9j93l41j27J75M46l7j47m93P5K51L16J37j55n95j17M52L13L27
$$ -394 -83 262 291 98 -243 -370 -195 251 214 67 -426 -351 -100 216 353 198 -397 -514 -62 251 578
4283E78p19j77K1J29K67K36l75k48M3R2M30J05l28m01j24M37K21K86m56l52o3
$$ 578 -141 -318 -297 -168 99 335 -40 -288 -245 -153 277 382 54 -347 -471 -34 187 473 17 -335 -398
4304c98L24L69O3j68n07p0J45N26L2j96n04K5K23J23M34j57m58j70K05K94J07
$$ -398 -74 295 358 190 -317 -387 -242 284 316 120 -384 -359 -136 -13 421 264 -194 -364 -159 135 242
4325B42q7m96l6MM15M24j55m44m35L15N47P1j91o01l7J73K29L55J6o17j03J05
$$ 242 155 -341 -377 -373 42 466 311 -133 -568 -253 294 365 174 -427 -464 -291 -62 293 309 -308 -411 -306
4347c06M46M02j18n70j00L6K83J95k1k90l14l7M95M04k88m27m60L53K62M86o4
$$ -306 140 542 424 -146 -246 -210 73 268 247 -43 -357 -394 101 505 217 -210 -670 -317 -55 431 367
4368C67l12l68J3N11J34k3m33q2m23P47O0K52m12n52P3L77K50L28m49m51J81K6
$$ 367 55 -313 -300 211 345 322 -111 -193 -616 131 191 443 31 -521 -448 -71 179 507 58 -393 -212 -186
4390a86L44J31k22l90L1L21N19n0o07k56l2O29K01j45l60j86m4K80L79J70n03
$$ -186 158 289 67 -323 -292 29 548 498 -109 -365 -397 232 433 288 -72 -258 -302 -22 357 527 24
4411B4k35n4K27L59K84m35n94Q4J05P35J19n45m63r7N57K82O7k67m74R2J79R7
$$ 24 -211 -265 -38 321 605 170 -424 -340 -235 500 619 74 -389 -486 71 353 420 153 -321 -229 -50 47
4433D7N35l68m08j53J67M15K50l59n16L0J07L17K34k7m28l64N10K09L92m81n38
$$ 47 582 214 -194 -347 -180 235 485 126 -390 -360 -253 64 298 271 -157 -521 -11 198 590 109 -429
4454d29k26O26L62K85m91l45j33J35M40K71l75l37j15K33L88Q3p8l77l44K75L73
$$ -429 -655 -29 333 618 127 -218 -351 -216 224 495 120 -217 -332 -99 289 372 294 -83 -427 -152 221
4475B21K23j22n09k60K67M41R4r9m21k32n3O10J12k44j29l74p0P24L64m15k02
$$ 221 444 322 -187 -447 -180 261 355 256 -165 -397 -450 160 272 28 -101 -475 -545 179 543 128 -74
4496g4j05j04K57M99j61l87l43K52L96k4K16n01l23p9P09K13k17l41k95K52K50
$$ -74 -179 -283 -26 473 312 -75 -418 -166 230 206 422 -79 -402 -481 228 441 224 -117 -412 -160 90
4517I0K97K36o40l97n6N49L94j18l77m69P4J56P41l5n81l20K40J19O95j22m62
$$ 90 387 623 -17 -414 -470 79 473 355 -22 -491 -417 -261 480 445 -136 -456 -216 -97 598 476 14
4538A4k50P9J15N19j63k71n94Q1M69L35J33n85k41m8K18O29Q8l20o62j4M77K20
$$ 14 -236 -157 -42 477 314 43 -551 -470 -1 334 467 -118 -359 -407 -189 440 528 208 -454 -468 9 229
4560B29K18l55l49k20M30M07J32m63l10o4N24K09j23j07o00p2L14N80O1m36m04
$$ 229 447 92 -257 -477 -47 360 492 29 -281 -345 179 388 265 158 -442 -514 -200 380 441 5 -399
4581c99j37M48M06K32k35p32N0L25L35J43m17l83k05N37M26j69j17m70j16K49
$$ -399 -536 -88 318 550 315 -417 -367 -42 293 436 19 -364 -569 -32 394 225 108 -362 -478 -229
4601b29M81J62k83l45l63K57Q48O9m87l57j59J65O59o9j52l78m51M73L64K94k36
$$ -229 252 414 131 -214 -577 -320 528 597 110 -247 -406 -241 418 349 197 -181 -632 -159 205 499 263
4622B63m74j3q6O19M29o39k27m11L69L97M65n24l28l55J90O50L10n47k11l80N9
$$ 263 -211 -224 -310 309 738 99 -128 -539 -170 227 692 168 -160 -515 -325 325 635 88 -123 -503 -444
4643d44P58K21l14m02l14J89L72M85N4o78m48R6N41L47J92q20l13J13N21M06k74
$$ -444 314 535 221 -181 -495 -306 66 551 605 -73 -521 -425 116 463 655 -165 -478 -365 156 562 288
4664B88n17l84L81L70M47n20k93k92J55N34L90j43m98l97N3N24J89j5m76l68J30
$$ 288 -229 -613 -232 138 585 65 -228 -520 -365 169 559 416 -82 -479 -426 98 287 272 -204 -572 -442
4685d42N61L4L72p33l69J57N58M58l30j88l07j23N71K78r3l79p48M28L55K49K51
$$ -442 119 153 525 -208 -577 -420 138 596 266 78 -229 -352 219 497 404 25 -723 -295 60 309 560
4706E60n88m25J40L85N01j59m68m91L8M61M82K11n57n49M6L52M95K9k03m88k39
$$ 560 -28 -453 -313 72 573 414 -54 -545 -507 -46 436 647 90 -459 -413 -61 434 463 260 -228 -467
4727d67L81M11K35o38l54j26M87N31j01j73l98m64Q78K44K44n56n48J45j25Q34
$$ -467 -86 325 560 -78 -432 -558 -71 460 359 186 -212 -676 202 446 690 134 -414 -269 -394 440
4747D40J72m33o01o9L57N28Q9m75l19n04O91M92K11m38o86m3N15K45M10l45q02
$$ 440 612 179 -422 -491 -134 394 483 8 -311 -815 -124 368 579 141 -545 -588 -73 172 582 237 -565
4768e65J15N02L95J24l26o19mR9N45M78n44m29n67O00M54L21k58o87l04L79O81
$$ -565 -450 52 447 571 245 -374 -378 -279 266 744 200 -229 -796 -196 258 579 321 -366 -670 -291 390
4789C90J81m25n09j28J17M34P47n19n37k84K02N98K03j57m33l20P5N38K99k12
$$ 390 571 146 -363 -491 -374 60 807 288 -249 -533 -331 267 470 313 -120 -440 -365 173 472 260
4809B60m54m23L73N04K98p0r86n0K49M69O60m92m10m66M28L48L34k82k43n15L4
$$ 260 -194 -617 -244 260 558 488 -498 -548 -299 170 830 338 -72 -538 -110 238 572 290 47 -468 -434
4830d34O55K63J45p10n85K23O41L00k47m83l89J88O61K72l80k47p6m58P58M25
$$ -434 221 484 629 -81 -666 -443 198 498 251 -232 -621 -433 228 500 120 -127 -203 -661 97 522
4850E22l49k23n01L75M12O8J06m09n85J15M08N67j98m83k33j23P93L32o6n54l82
$$ 522 173 -50 -551 -176 236 304 410 1 -584 -469 -61 506 308 -175 -408 -531 262 594 528 -26 -408
4871d08J39N33K22j62k56n69J46M62M96k39m12l69K6L59M24K05n95n72j21P02
$$ -408 -269 264 486 324 68 -501 -355 107 603 364 -48 -417 -391 -32 392 597 2 -570 -691 11
4891A1P77l97m07n54L39K96M86p4n91m81o3P84K78P0n14k67j82J90P04J64k95
$$ 11 788 391 -16 -570 -231 65 551 477 -114 -595 -658 126 404 474 -40 -307 -489 -299 405 569 274
4912B74p20m5M21M06K0l42m55r9N03L42R9m73m99K71K95K82K89n17m31p6M95L29
$$ 274 -446 -491 -70 336 356 14 -441 -540 -37 305 404 -69 -568 -297 -2 280 569 52 -379 -455 40 369
4934C69N0k20n23k54M96J93N34j92o64l22K68N84K42m47n51k10M57L35L24l08
$$ 369 419 199 -324 -578 -82 111 645 453 -211 -533 -265 319 561 114 -437 -647 -190 145 469 161
4954A61o11j01K27Q91Qk87l32n32L41M35K53p3o54k57L26N07K33l42m76l13J81
$$ 161 -450 -551 -324 567 575 288 -44 -576 -235 200 453 380 -274 -531 -205 302 535 193 -283 -596 -415
4975d15Q13L91m07n65j29P4N62J19k1p41l44M31M26M64l99n51l90L59M28O38k57
$$ -415 398 789 382 -183 -312 -238 324 443 422 -319 -663 -232 194 658 259 -292 -682 -323 105 743 486
4996D86n95m43J29N47N57m36n08m57M38K93N64k90o05k51K7Q47K15m6p05l96J80
$$ 486 -109 -552 -423 124 681 245 -263 -720 -282 11 575 285 -320 -571 -544 303 518 472 -233 -629 -449
5017d49N39L79k12m52l31K96L55Q0L07o70k88J37L78M59J56r80k54Q3L73N60j06
$$ -449 90 469 257 -195 -526 -230 125 205 512 -158 -446 -309 69 528 684 -296 -550 -467 -94 466 360
5038C60m76n19K01N38L01J2n57k24q5M59M83mo74m84J37M93N33N9m50p71J81L28
$$ 360 -116 -635 -434 104 405 417 -140 -364 -449 10 493 489 -185 -669 -532 -39 494 553 103 -668 -487 -159
5060a59Q28j67m53n62J31K97P64k03m63o40Q0N63L58N8l57n20j25N76J72L17m32
$$ -159 669 502 49 -513 -382 -85 679 476 13 -627 -547 16 374 432 75 -445 -570 6 178 495 63
5081F3m53j43L74N57Q6m68l27k41O10M77j9n71l07m10N28N24L48n89k86l12L84
$$ 63 -390 -533 -159 398 484 16 -311 -552 58 535 516 -55 -362 -772 -244 280 628 39 -247 -559 -175
5102a75N56jk76o91m7L43P49R1n21k61m74N10N47L24m79n19m32N43O38K67o70
$$ -175 381 380 104 -587 -634 -291 458 549 28 -233 -707 -197 350 674 195 -324 -756 -213 425 692 22
5123B2n64O7L67L43J24k38n01N6J59M65L71m54n79k83M67N70J45l66o04k34M66
$$ 22 -542 -475 -108 235 359 121 -380 -324 -165 300 671 217 -362 -645 -178 392 537 171 -433 -667 -201
5144b01N25M69m39p39j84J62Q11J61l47p70L5N9P36L62m63n19l14J78N60M55j07
$$ -201 324 793 354 -385 -569 -407 404 565 218 -552 -517 -458 278 640 177 -342 -656 -478 82 537 430
$$ [...]
8191a78
##END NTUPLES=NMR FID
##END=
