##TITLE=1H_SR55_oil12
 CDCl3, 8 sc, 
 30.04.2021
##JCAMPDX= 6.0         $$ Bruker NMR JCAMP-DX V2.0
##DATA TYPE= NMR FID
##DATA CLASS= NTUPLES
##ORIGIN= UXNMR, Bruker Analytische Messtechnik GmbH
##OWNER= root
$$ XWIN-NMR		Version 3.5
$$ Fri Apr 30 15:07:08 2021 Russian Standard Time (UT+4h)  she@DPX200
##.OBSERVE FREQUENCY= 200.131506
##.OBSERVE NUCLEUS= ^1H
##.DELAY= (6, 6)
##.ACQUISITION MODE= SIMULTANEOUS
##.ACQUISITION SCHEME= undefined
##.AVERAGES= 8
##.DIGITISER RES= 18
##SPECTROMETER/DATA SYSTEM= spect
##.PULSE SEQUENCE= zg30
##.SOLVENT NAME= CDCl3
##.SHIFT REFERENCE= (INTERNAL, CDCl3, 0, 15.7039)
##AUDIT TRAIL= $$ (NUMBER, WHEN, WHO, WHERE, WHAT)
$$ ##TITLE= Audit trail, XWIN-NMR		Version 3.5
$$ ##JCAMPDX= 5.01
$$ ##ORIGIN= Bruker BioSpin GmbH
$$ ##OWNER= she
$$ F:/spectra/data/she/nmr/H-F/1/audita.txt
$$ ##AUDIT TRAIL=  $$ (NUMBER, WHEN, WHO, WHERE, WHAT)
(   1,<2021-04-30 15:05:45.68 +0400>,<she>,<DPX200>,
      <created by zg, POWCHK disabled, PULCHK disabled
       configuration hash MD5:
       00 E9 B6 7A A2 85 ED C7 34 08 36 98 17 FE 4E 26
       data hash MD5: 16K
       92 BC 5F FC B9 51 F2 E4 77 A9 4C 04 1E 9B E2 39>)
$$ ##END=
$$ 
$$ hash MD5
$$ F1 31 48 4D 71 47 B5 6F BC 28 0F 9C 78 9B 80 1D
##$RELAX= 
##$RELAX= 
##$RELAX= 
##$RELAX= 
##$RELAX= 
##$RELAX= 
$$ Bruker specific parameters
$$ --------------------------
##$DU= <F:/spectra>
##$EXPNO= 1
##$NAME= <H-F>
##$PROCNO= 1
##$TYPE= <nmr>
##$USER= <she>
##$AMP= (0..31)
100 100 100 100 100 100 100 100 100 100 100 100 100 100 100 100 100 100 
100 100 100 100 100 100 100 100 100 100 100 100 100 100 
##$AQSEQ= 0
##$AQ_mod= 1
##$AUNM= <au_zg>
##$AUTOPOS= <>
##$BF1= 200.13
##$BF2= 200.13
##$BF3= 200.13
##$BF4= 200.13
##$BF5= 200.13
##$BF6= 200.13
##$BF7= 200.13
##$BF8= 200.13
##$BYTORDA= 1
##$CFDGTYP= 0
##$CFRGTYP= 5
##$CHEMSTR= <none>
##$CNST= (0..31)
1 1 145 1 1 1 1 1 1 1 1 1 1 1 1 1 1 1 1 1 1 1 1 1 1 1 1 1 1 1 1 1 
##$CPDPRG= <>
##$CPDPRG1= <>
##$CPDPRG2= <>
##$CPDPRG3= <>
##$CPDPRG4= <mlev>
##$CPDPRG5= <mlev>
##$CPDPRG6= <mlev>
##$CPDPRG7= <mlev>
##$CPDPRG8= <mlev>
##$CPDPRGB= <>
##$CPDPRGT= <>
##$D= (0..31)
0 1.2 0 0 0 0 0 0 0 0.06 0 0.03 0 0 0 0 0.0002 0 0 0 0 0 0 0 0 0 0 0 0 
0 0 0 
##$DATE= 1619780745
##$DBL= (0..7)
120 120 120 120 120 120 120 120 
##$DBP= (0..7)
150 150 150 150 150 150 150 150 
##$DBP07= 0
##$DBPNAM0= <>
##$DBPNAM1= <>
##$DBPNAM2= <>
##$DBPNAM3= <>
##$DBPNAM4= <>
##$DBPNAM5= <>
##$DBPNAM6= <>
##$DBPNAM7= <>
##$DBPOAL= (0..7)
0.5 0.5 0.5 0.5 0.5 0.5 0.5 0.5 
##$DBPOFFS= (0..7)
0 0 0 0 0 0 0 0 
##$DE= 6
##$DECBNUC= <off>
##$DECIM= 32
##$DECNUC= <off>
##$DECSTAT= 4
##$DIGMOD= 1
##$DIGTYP= 9
##$DL= (0..7)
0 120 120 120 120 120 120 120 
##$DP= (0..7)
150 150 150 150 150 150 150 150 
##$DP07= 0
##$DPNAME0= <>
##$DPNAME1= <>
##$DPNAME2= <>
##$DPNAME3= <>
##$DPNAME4= <>
##$DPNAME5= <>
##$DPNAME6= <>
##$DPNAME7= <>
##$DPOAL= (0..7)
0.5 0.5 0.5 0.5 0.5 0.5 0.5 0.5 
##$DPOFFS= (0..7)
0 0 0 0 0 0 0 0 
##$DQDMODE= 0
##$DR= 18
##$DS= 0
##$DSLIST= <SSSSSSSSSSSSSSS>
$$ [...]
##$SUBNAM2= <"">
##$SUBNAM3= <"">
##$SUBNAM4= <"">
##$SUBNAM5= <"">
##$SUBNAM6= <"">
##$SUBNAM7= <"">
##$SUBNAM8= <"">
##$SUBNAM9= <"">
##$SW= 16.9725357007746
##$SWIBOX= (0..15)
0 0 2 0 0 0 0 0 0 0 0 0 0 0 0 0 
##$SW_h= 3396.73913043478
##$TD= 16384
##$TD0= 1
##$TE= 0
##$TE2= 300
##$TE3= 300
##$TEG= 300
##$TL= (0..7)
0 120 120 120 120 120 120 120 
##$TP= (0..7)
150 150 150 150 150 150 150 150 
##$TP07= 0
##$TPNAME0= <>
##$TPNAME1= <>
##$TPNAME2= <>
##$TPNAME3= <>
##$TPNAME4= <>
##$TPNAME5= <>
##$TPNAME6= <>
##$TPNAME7= <>
##$TPOAL= (0..7)
0.5 0.5 0.5 0.5 0.5 0.5 0.5 0.5 
##$TPOFFS= (0..7)
0 0 0 0 0 0 0 0 
##$TUNHIN= 0
##$TUNHOUT= 0
##$TUNXOUT= 0
##$USERA1= <user>
##$USERA2= <user>
##$USERA3= <user>
##$USERA4= <user>
##$USERA5= <user>
##$V9= 5
##$VALIST= <valist>
##$VCLIST= <CCCCCCCCCCCCCCC>
##$VD= 0
##$VDLIST= <DDDDDDDDDDDDDDD>
##$VPLIST= <PPPPPPPPPPPPPPP>
##$VTLIST= <TTTTTTTTTTTTTTT>
##$WBST= 1024
##$WBSW= 4
##$XGAIN= (0..3)
0 0 0 0 
##$XL= 0
##$YL= 0
##$YMAX_a= 191109
##$YMIN_a= -182368
##$ZGOPTNS= <>
##$ZL1= 120
##$ZL2= 120
##$ZL3= 120
##$ZL4= 120
##$ABSF1= 10
##$ABSF2= 0
##$ABSG= 5
##$ABSL= 3
##$ALPHA= 0
##$AQORDER= 0
##$ASSFAC= 0
##$ASSFACI= 0
##$ASSFACX= 0
##$ASSWID= 0
##$AUNMP= <proc_1d>
##$AZFE= 0.1
##$AZFW= 0.1
##$BCFW= 1
##$BC_mod= 2
##$BYTORDP= 1
##$COROFFS= 0
##$CY= 11.3945322036743
##$DATMOD= 1
##$DC= 2
##$DFILT= <>
##$DTYPP= 0
##$F1P= 15.9154993809931
##$F2P= -4.1035820241983
##$FCOR= 0.5
##$FTSIZE= 0
##$FT_mod= 4
##$GAMMA= 1
##$GB= 0.15
##$INTBC= 1
##$INTSCL= 1
##$ISEN= 128
##$LB= 0.24
##$LEV0= 0
##$LPBIN= 0
##$MAXI= 10000
##$MC2= 0
##$MEAN= 0
##$ME_mod= 0
##$MI= 1.114404
##$NCOEF= 0
##$NC_proc= 0
##$NLEV= 6
##$NOISF1= 3.799351
##$NOISF2= 2.8
##$NSP= 1
##$NTH_PI= 0
##$NZP= 0
##$OFFSET= 15.70392
##$PC= 1
##$PHC0= -11122.68
##$PHC1= 15.00103
##$PH_mod= 1
##$PKNL= yes
##$PPARMOD= 0
##$PSCAL= 0
##$PSIGN= 0
##$REVERSE= no
##$SF= 200.130013532006
##$SI= 16384
##$SIGF1= 3
##$SIGF2= 2
##$SINO= 400
##$SIOLD= 16384
##$SREGLST= <1H.CDCl3>
##$SSB= 0
##$STSI= 0
##$STSR= 0
##$SW_p= 3612.71676300578
##$SYMM= 0
##$S_DEV= 0
##$TDeff= 0
##$TDoff= 0
##$TI= <>
##$TILT= no
##$TM1= 0
##$TM2= 0
##$TOPLEV= 0
##$USERP1= <user>
##$USERP2= <user>
##$USERP3= <user>
##$USERP4= <user>
##$USERP5= <user>
##$WDW= 1
##$XDIM= 8192
##$YMAX_p= 0
##$YMIN_p= 0
$$ End of Bruker specific parameters
$$ ---------------------------------
##NTUPLES= NMR FID
##VAR_NAME=  TIME,          FID/REAL,        FID/IMAG
##SYMBOL=    X,             R,               I
##VAR_TYPE=  INDEPENDENT,   DEPENDENT,       DEPENDENT
##VAR_FORM=  AFFN,          ASDF,            ASDF
##VAR_DIM=   8192,          8192,            8192
##UNITS=     SECONDS,       ARBITRARY UNITS, ARBITRARY UNITS
##FACTOR=    0.0002944,     1,               1
##FIRST=     0,             0,               0
##LAST=      2.4114304,     0,               0
##MIN=       0,             -182368,         0
##MAX=       2.4114304,     191109,          0
$$ Real data points
##PAGE= N=1
##DATA TABLE= (X++(R..R)), XYDATA
0@%%%%%%%%%%%Qj6J6j6K4l2L2m0N2o0P2q8J04j20J39j63J89k17K49k85L24l68
33a96M16m68N26n92O64p41Q26r19J020j130J251j382J527j685J855k042K250k479
51a299K731l010L321l672M064m511N028n629O340p191Q236r558J1279j3617J6988
66I500k2270L1701n3276J83247M2207l49552K37318j55101J8452K04368j99416
77e2822N9096p251r7814K75665j84111j18614K27270j62678N3407J25350k41675
88a24177J06094P0604p9535J20202j44406m0236J73270j28186P1545K8408k05306
99a51723J97926L9007j55708J25509j05378k3145J54815j04707M0689j7458r7390
110i7563J87798q2984q3933J55030j36702K4566J25071j48508L7853L3975l2460
$$ y = [0, 0, 0, 0, 0, 0, 0, 0, 0, 0, 0, 0, 8, -8, 8, -8, 16, -16, 16, -24, 28, -32, 40, -48, 56, -64, 75, -88, 101, -116, 133, -152, 172, -196, 220, -248, 278, -314, 350, -391, 435, -484, 536, -594, 657, -725, 802, -883, 972, -1070, 1180, -1299, 1432, -1578, 1743, -1929, 2135, -2376, 2652, -2977, 3363, -3828, 4408, -5150, 6129, -7488, 9500, -12770, 18931, -34345, 148902, 191109, -158443, 78875, -76226, -57774, 146594, -52822, 6274, -977, -98791, 176874, -7237, -125851, 101419, -61259, -7852, 117498, -124177, -18083, 52521, -27014, 93188, -51218, -91454, 81816, -46370, 25175, 53583, -151723, 46203, 85210, -70498, 55011, -50367, -73512, 81303, -23404, 17285, -173, -97563, 90235, 7251, -76682, 78348, -58354, -33788, 91283, -57225, -19372, 14603, -17857]
121a7857Q3264r9840p230Q4624r5695Q1190L4593j43577Q5368K9365o1490O2315
133C5030m6898j2605M6701m1535N2848j9999o9267R5754l2717m3104Q5176o1229
145a1845p468N4071n5709K2764N667j1934M1404o0693J1871M3897o6900N2041
157A7166J9905p4411M5098M081k6474K7986j7411J1283m995k0110M4377l3285
169f790k0489N7965l4639j2856L9036l0037k470J3917q512J1487j4487R164J3898
182A5187l9685K2724J7664l8976K8192R406k9440J7340o712l113R029q356K1927
195A5187j7149j9577L4550k1022l747L5927l1052o894J8985r629P719m648J875
208E25N636k0924K2350M325l2865K7449O141k5918J9798j08j3635Q829N21M649
$$ y = [-17857, 65407, -34433, -41663, 42961, -52734, 28456, 63049, -80528, 4840, 34205, -27285, 35030, -11868, -24473, 22228, -19307, 33541, 13542, -55725, 40029, 7312, -35792, 49384, -11845, -19313, 34758, -20951, 1813, 7480, -4454, 36950, -23743, -11872, 32025, -34875, 17166, 37071, -37340, 7758, 11839, -14635, 13351, -4060, 7223, 2228, -17882, 26495, -6790, -27279, 30686, -3953, -16809, 22227, -7810, -10280, 3637, -4875, 6612, -7875, 1289, 15187, -24498, -1774, 15890, -23086, 5106, 14512, -14928, 2412, -4300, -7413, 1616, -6740, 15187, -1962, -21539, 13011, -8011, -11758, 24169, -6883, -13777, 5208, -4421, 3298, -1350, 525, 6161, -14763, 7587, 11912, -20953, 6496, 12637, -13281, 6517, 6409, -7226, 1603, 2124, 6773]
222F773r261k955K0845j9442m712K5548k2680p2K3812k0562l139R472k871M490
236E246p241P370R28k0589K2522K026k5967K3591J280j9928J5819k394p390L576
250a151J504Q862j5204j349J9937k2103J731K4363k4996P1J8554j4963j175O663
264G44N99j621q654J4712k089k1155K4635j21k3761K2447O43j8067J1973K128
278B413l363l026J754J1480j7207r2K3058k2756j881K4929j9446l875J6521q070
292D39l824J412P675j724j4842J8961J240k5202K2705N839k5781J6359O713j5279
306e309L625O199K108j2179K239J8282k1829j418K7228k2538p041K4100j3554
319h7q285J2777J429o847n932J4453k829k0216K2982L796k7126J9556O659k2429
$$ y = [6773, -2488, -5443, 15402, -4040, -8752, 16796, -5884, -5956, 17856, -2706, -5845, 3627, 756, 5246, -1995, 5375, 6303, -14286, 8236, 10262, -15705, 7886, 9166, -10762, 5057, 2663, -4727, -1151, 353, 9215, -5989, -7338, 12599, -9504, -7773, 16590, -8406, -8335, 10219, -4744, -5919, 744, 1343, -278, -8932, 5780, 3691, -17464, 7171, 7050, -16711, 5736, 6379, -11688, 285, 2413, -950, -3976, -2222, 9258, -7949, -8041, 15017, -7739, -9620, 15309, -4137, -8012, 8509, 439, -3385, -1973, 5702, 3978, -10864, 8097, 9337, -15865, 6840, 12679, -13102, 3257, 9970, -5309, -1684, 4515, 6623, -5556, -3317, 14965, -6864, -8282, 18946, -3592, -10633, 13467, -87, -8372, 4405, 5834, -1013, -6945, 7508, 4679, -15537, 7445, 11241, -15885, 3671, 10330, -12099]
333a2099R648R016o601n687M556J0036j7906n61K5091k1607o218K7271j8485q809
347a2355J8646m805o365J206Q840k504j6935J9645M103k7167K2144P748k6360
360a4159J4219P757j3254K483M846M584j2005j388K1306j9495o856K9737j9417
373a642r845K3886j2312p231J0261J935j371j0963J1330N527k4765K0197J0894
386A5901l0706J6779J0913k2130Q506N371l180j743k050J2966j4808q908K9578
399A6489j6678j2915K7468j5557r783J8853o349n281P34N949M440j8426J0302
412g54R826k4280J8407J2133k9223R710J0613j1521M791L13J265l777m794J8607
426A1316j3664j4068K7376r418j1232K0001j3082p403J2693Q03N50j0635M765
$$ y = [-12099, -2451, 6565, -36, -5723, -1167, 8869, -9037, -9598, 15493, -6114, -12332, 14939, -3546, -12355, 6291, 1486, -4879, -3673, 5167, 2663, -14272, 5373, 9476, -17691, 4453, 12201, -14159, 60, 7817, -5437, -2954, 1892, 6476, -5529, -6917, 14389, -5106, -11962, 17775, -1642, -11487, 12399, 87, -7144, 3117, 5052, 3681, -7282, 4048, 9575, -15190, 5007, 15901, -14805, 1974, 12887, -9243, -737, 4634, 1454, -289, -2339, 10627, -4181, -13089, 16489, -189, -13104, 14364, -1193, -10976, 7877, 1528, -3753, -3019, 2930, 7370, -11056, -754, 9072, -15208, 3199, 15332, -13891, -4181, 6432, -5089, -298, 15, 1280, -2497, -7291, 11316, -2348, -16416, 10960, 1542, -9690, 10311, -2771, -10174, 2519, 3322, 3872, -6763, -1998]
439a998J1193j8329Q998J1030k3940J3552J3734k0057K185M621j803L866k023
452A029N815r743q555K3442p389j4785J8280o829p887J5490o768p947L755N927
466C835N014j2462J187P686j4050J0888J1821k1290K445J0560p611K979Q59k858
480i97j937J211J0809r384j2042J5798q02p001J1577p136j0272Q738N942l454
494A050m397L368L53n861P855J695j2807N292J1302p329m973L474j818r34R226
509E496q8j2386K804Q478n180j073L878k933j041N456J466j0151j993J3239j781
524D191n012N415r219k315J4779k618p404n92K556O117o118l53L695j1828J2765
539D059R882k1132L301O564o899J1070j534q583M80j371J3506n792j4811J6748
$$ y = [-1998, 9195, -9134, -136, 10894, -13046, 506, 14240, -5817, -3632, 989, -814, 3052, 1029, 6844, -2899, -11454, 11988, 4599, -10186, 8094, 1265, -6622, 8868, 2100, -5847, -2092, 3835, 8849, -3613, -2426, 5260, -8790, 2098, 13919, -7371, -4926, 5634, -1977, 1002, 1861, -997, -2934, -1723, 9086, -298, -12340, 3458, 2656, -4345, 7232, 96, -10176, -1438, 4504, 1050, -3347, 21, 374, -5487, 2368, 4063, -8744, -3452, 7850, 521, -4452, -978, -2796, -3730, 5496, 5408, -6978, -4174, 4304, -876, -1949, 1929, -1004, -2045, 3411, 4877, -5274, -7267, 5972, 4191, -821, 4594, -4625, -6940, 7839, 5221, -2183, -2775, -219, 5898, -220, -573, 3122, -8706, 4059, 13941, -7191, -3890, 2674, -4225, 6845, 5311, -3272, -2792, -4163, 9343, 3551, -11260, 5488]
553E488l757p140J7036j5915q383J9762l412k745p65p135Q891l644J792Q563k0785
568a2149P860J8561k1647L913P140j4086J5165L010j2232J020n701J4773L534
581I161k0026J3847k494j2364K4729r568j7489J7308j554L01K033j0639O088k638
595c305M174J5126k4318k873K2217j4564L315J0858j9079N108J0292m653m53r001
609g156P528P864j3647J1708j449j9996K0612M887j7069R022j466l608O167l531
623a34L326o530j828J8079j4155q761J7937j0539k456J4867j0257o056N961K420
637A874P53p089M808M199j3129J0637O211k0141R512J1485j3515K958M051n999
651c385N38K949N275p459o125J5173o638q638J6010p600q664J3552j890o652J452
$$ y = [5488, 1731, -5409, 11627, -4288, -12671, 7091, 3679, 934, 169, -6966, 1925, -1719, 73, 8636, -12149, -4289, 14272, -7375, -3462, 3678, -10408, 4757, 7767, -4465, -3445, -9146, 5627, 9161, -10865, 2982, 488, -11876, 12853, 3285, -14204, 3104, 1550, 1851, 3884, -6755, -667, -3305, 869, 15995, -8323, -11196, 11021, -3543, -228, 10630, -8449, -3341, 6951, 2298, 1845, -7156, 372, 8236, -5411, 6297, 4848, -15148, 5464, 10351, -6718, 2304, 838, -2770, 3397, -134, 3192, -3338, -5166, 12913, -1242, -10003, 7934, -2605, -5061, 9806, -451, -6507, -546, 1874, 2627, -4462, 346, 4545, -8584, 2053, 8264, -11877, -2365, 9120, -4395, -1437, 2614, -3385, -2847, 102, 5377, -2082, -8207, 6966, 328, -8310, 7700, 100, -8564, 4988, 3098, -3554, -2102]
666b102K923J401n830N427M316j4079O208J0701j3182K146Q938q813j470O338
680B922j94m863J92P754m880p016J1896l058j0122J2328j69j0394O870K627n158
695a265j183M636K262q845M152P196j2571K701J0556j0207n65P523m394l127K761
710c70L995m595l890R403l535p980J0277p17r039P582K575o946P42M231q26n118
726d211M291M448r389J961Q821r092q49Q928n885l268O072J4m210K57N825l592
742A21n568R392j764q179Q813O22p412M633K171l569j228L686J091n937L108M939
758D919p783J530O631o795p62N390k452k043K086K241k899k417N785k057n354
773c980P031m9o630N169J152m893J481K362p95l140K425K970o188J758N609p180
$$ y = [-2102, 821, 2222, -3608, 1819, 6135, -7944, -1736, 8965, -4217, -2071, 6867, -1946, -3416, 2922, 2728, -2135, -1943, 5811, 931, -6085, 5811, 2753, -7369, 4959, 4790, -5604, 1266, 3893, -1265, -2448, 2188, 4450, -4395, -243, 6953, -5618, -2917, 7639, -2568, -3133, 4390, -4, -3131, -370, 3625, -970, -4860, 4543, 1008, -6972, 3305, 2588, -6451, 1131, 3706, -3240, -2498, 1733, 907, -4211, 80, 4528, -4861, -2900, 5921, -3171, -4020, 4908, -977, -4245, 1827, 1841, -2369, -2112, 3713, 121, -5447, 3945, 2181, -5998, 2815, 3437, -3975, 658, 2829, -740, -1968, 1718, 2809, -3128, -20, 4919, -2864, -1334, 5297, -1498, -2260, 3130, 678, -1365, 721, 2962, 63, -2354, 3431, 1374, -3980, 3051, 3002, -3628, 1541, 2693, -2200, -719, 1643, 848, -2292, 133, 3103, -3085, -1327, 4282, -2898]
789b898O81N787n177j095M171r54k256P64L083l081k651O006j900n060O829q15
805A434n410M300J056l074K41K731j41l939K602K782n547K136M774o139p7N471
821C200l717j445L101O69l048K60L935l600k361O480k047m335N376n58m595K986
837C01K585k693j519L707n54n125M591K113o084K890L661m916n72L526j162k570
853a821K597K257n124k74O093m861j787O060l063k899L918K89l246m30M796j310
869A195n076N171N07p132O072K768o902K182L199l069r44J452K339l718k6O912
885D930p408k621R913n422l267P799m216k771L182J354q67m003N161J497q037
900d776O144K975j0081O546M462p885K084J849j393k38K32M287n441k708J0457
$$ y = [-2898, -2217, 3570, -1607, -2702, 1469, 515, -1741, -977, 2106, -975, -3626, 2380, 480, -4580, 2249, 1434, -3976, 324, 1380, -1694, -1453, 1278, 1137, -2802, -200, 2582, -2965, -829, 3945, -2194, -2271, 3200, -517, -1962, 1139, 1808, -1240, -980, 2955, -645, -3006, 3474, 1427, -2908, 2468, 1910, -2685, 301, 2886, 193, -1326, 2381, 1827, -3298, 1293, 3406, -2678, 212, 3873, -1043, -1615, 1911, 749, -1821, 776, 3033, -2091, -2365, 3728, -1133, -2920, 3140, 77, -2822, 1096, 1385, -1861, -2291, 2505, 1195, -3881, 1290, 1797, -5335, 737, 3505, -3397, -1215, 1984, -1085, -2029, -577, 1762, -1956, -1982, 4930, -2478, -5099, 4814, -608, -3875, 3924, -292, -3063, 119, 1473, 606, -3397, 1764, 3261, -4776, 1368, 4343, -5738, 808, 5270, -2615, -531, 1318, -75, -313, -81, 4206, -1235, -3943, 6514]
915F514o610n376J0413m024l978O967l297k572J260K567J662p197L449N094j0064
930e192N442N957j1054L783N639n300k31J22J26M56j169O435n794p181J2833l175
946A697p216R216l811m051O222j146k006k321K735N634p818J193N613j0372N172
961a259Q886j0644m90M941j997J427j636J434r80l884R833k932j0611J0278N35
976B901o640Q119k974n914M316K475J646n688j597P886n959Q03P162j2054J778
991c740J1421o972j726J399k533L438j06J574j517q061R004L805j0536N955k0
1006A385p058R574K54p112J070r5N524j465n773N962n320j339J2496q633n616
1021f146R050l997P35K915m994J067m93L355L317j0554K569P508p887N247K356
$$ y = [6514, -96, -5472, 4941, 917, -3061, 3906, 609, -1963, -703, 1864, 3526, -3671, -222, 4872, -5192, 250, 6207, -4847, -1064, 4575, -725, -956, -834, -708, -252, -1421, 5014, -780, -7961, 4872, 1697, -5519, 3697, -114, -4165, 2057, 911, -1095, -3416, -681, 4953, -2865, -1672, 3941, -6431, -1259, 7627, -3017, -3507, 1434, -563, 864, -772, 662, -318, -4202, 5631, 2699, -7912, 2366, 2901, -3739, 4380, 1406, -4508, -192, 2283, 3929, -1759, -3356, 4530, -1429, -626, 6536, -5518, -3740, 7681, 709, -1017, 382, -2151, 1287, 1181, 2755, 1238, -6823, 2181, 5986, -4550, 1405, 1385, -5673, 3901, 4155, -2957, -1887, -1982, 3542, 2077, -3696, 2266, -3054, -4393, 8103, -530, -6146, 2904, -1093, -358, 2557, -2437, -1370, -1863, 1492, 4809, -5745, -3176, 4332, -3555, 1692, 4048]
1036D048j0897O230L984m090J211l067K322K336m166N296l430o304J1404j717
1050C160p039O172l587j508P254l570r73j360Q9O163n606j676O080o558L171O036
1066F248r032N85M564l073K800r80j896R22k214N130p87p024N866J464n559N656
1082B670j682m760N658n40j614N09k346L003q68j589M248m418r37O520n141p48
1098b035M209k956M66J440j941m48m16K359J134m651K552J697l920L381J385n135
1114b879K634J652k124j15M36L93Nl16L225l262k722N453q63l366L357j251k521
1131b264L812L69j812m87J611j06k003J935O49m055K455L535l927j027L346k008
1147B3j154K839p76k441J540J880j935j961L455k29l036K753R75m540K129K821
$$ y = [4048, -6849, -619, 3365, -725, 486, -2581, -259, 2077, -2089, 3207, -223, -6527, 4877, 3160, -3879, 2293, -1294, -2802, 4452, 882, -91, -1451, -1362, 4801, -805, -2481, 3599, -2959, 212, 6248, -2784, -2199, 2365, -708, 2092, 1112, -784, 138, -2076, 3054, 2267, -4757, 1109, 2573, -2986, 2670, 988, -3772, 1886, 1346, -268, 241, -2105, 898, 30, -1559, 2689, -1729, -2666, 3854, -1287, -2035, 2174, -782, -316, 1124, -817, -1265, -1681, 678, 1812, -2839, -287, 1410, -2510, 871, 2256, -2879, -245, 1407, -717, -832, -396, -3, 2, -314, 2911, -351, -3073, 2380, 1517, -1849, 1508, 257, -2264, 1548, 1917, 105, -382, 1229, 1123, -880, 1055, 1704, -2351, 104, 3639, -288, -1315, 2031, 23, -1131, 1708, 932, -1509, 31, 1911, -24, -1985, 1470, 1241, -1795, 958, 1933, -2607, -478, 2343]
1163B343l380m92K874j055j654J590J758l679j0M521k998k579M623j597l177M004
1179A092J68l345R83K494j456k154K922M82m042K546K953m428P0M046l140p98
1195a607K948m70k544J182K607k192k168M286j130l875M711K54m433K143K615
1210B327k734p47K901k82l831L022K278n125J292M230m177j034M403j503l250
1225b230K820J443l216j99M149k661k961M668j91m448L449J806m453Q92K888j739
1241A7k257K873J196m240J186L832m183p16M874k821k478L628K24k905N65L061
1257A856k248k149M050o07m060L813J546m605J576K935k457j734L633l16l412
1272b179J979K848m188l82M777l096j955M254r64l021K161J960k342j035L040
$$ y = [2343, -1037, -1529, 1345, 290, -1364, 226, 1984, -1695, -1705, 2816, -182, -2761, 1862, 265, -2912, 1092, 1260, -2085, -1102, 1392, -64, -2218, 704, 1186, -2856, -310, 2643, -1785, -1715, 2331, -809, -1607, 1341, 871, -1673, -491, 2116, -76, -2244, 2042, 912, -2963, 1748, 2002, -2431, -288, 2327, -407, -1154, 1747, 1465, -2366, 656, 2934, -2191, -899, 3331, -846, -1880, 2523, 1020, -2230, 590, 2033, -1183, -1382, 2767, 106, -2855, 1813, 1622, -2826, 623, 2429, -2024, -1132, 1756, 17, -2240, 633, 1829, -2411, -1225, 2607, -1576, -2292, 2582, -239, -2717, 911, 1135, -1770, -1205, 1856, -392, -2541, 1509, 902, -3158, 655, 2201, -2404, -828, 2107, -350, -2084, 1549, 1233, -2179, -200, 2648, -1540, -1922, 2855, -241, -2196, 2058, 1094, -1927, 234, 2194, -148, -1183, 1857]
1287A857j007l350L767R37m252K053K400l437J60K561o07k443J579J871l399N3
1303a257L928l049j709M219j486k827K811O52k593N83K377j555k273L253K46m106
1319b786K747K335m306J084K436k630l04K410k47j971P40J479j554j493L733j518
1335A55k364L615p47k926K198Q40j179k30J059J07k096J344J980l003M24K613
1351A790k543j44K296j755r22K501oj440n46J394n0j651K537r8l268K421J331
1368A847l045J380J234k259Q51J576j159j555P64J806j032j255K257j745j085
1383a420L251j287k483K640m5j173O76k28l85o45J431J263l087O2K576k243J175
1400G8J540l531Q04K168j147m80q5O09J88q53J665j215k496L832M84l139K220
$$ y = [1857, 850, -2500, 1267, 2204, -2048, 5, 2405, -1032, -872, 1689, 1082, -1361, 218, 2089, -1310, -1257, 2671, -378, -2087, 2132, 646, -2181, 630, 1282, -1311, -728, 1649, 94, -2179, 1074, 1320, -2786, -39, 2296, -2010, -926, 1510, -1120, -1424, 986, 739, -1232, -492, 987, -567, -2060, 1673, 155, -2209, 1406, 659, -2267, -69, 771, -408, -638, 421, 528, -1568, -224, 1756, -1247, -823, 1790, -753, -897, 1399, -356, -1278, 1223, 1217, -223, -769, 625, 575, -1076, 1461, 1363, -1905, 516, 1847, -1198, 182, 1416, -843, 8, 1584, 425, -1130, -366, 1440, 408, -847, 1410, -335, -1420, 1831, 544, -1939, 701, 656, -517, 159, -69, -454, -1099, 332, 1595, -1492, -1430, 1146, -1097, 78, 1618, -1913, -1109, 1059, -88, -568, -653, -44, 144, -709, 956, -259, -2755, 1077, 1561, -1578, 642]
1417F42j047j198K894k46j496q71P16K268j773o65K056k896J289L556m109n10
1433a390K088p13M93M52q92k83n13L063q12l997L057R64k293K239j015k679K573
1450C42J258m47j927l30K481j689k8K580m008J36M347k507j564J470q46O42R87
1467H97k28j321j837L843O83m173K351M18k894L267M36l416P66J968J86j527p87
1484a368K113k025M43L915m361j851M702j103j066J115j169M1P48J325p37l746
1500c024L204K507m433K326R13m275L262K022k756n59M8J811l04j178J979k657
1516a114r07N846k494m199M018p79j246K614j139j721K91J580K066m387K80L602
1532B311l879J616L339n629N55L774j691m25q32P19M60j595K958r76m578N207
$$ y = [642, -405, -1603, 1291, 1045, -451, -1322, -606, 1662, -111, -776, 1280, -1616, -327, 3229, -880, -1390, 698, -15, 478, 930, 38, -245, -758, 2305, 1493, -2504, 553, 1517, -776, 1463, 448, -2231, 342, 1600, 1153, -774, -1104, 1377, -312, -340, 2240, -1768, -1632, 2715, 208, -1356, 114, -732, -90, 897, 669, -652, -2489, 1354, 2037, -2136, 215, 633, -2261, 1006, 1442, -1974, -1208, 760, 946, -581, -1368, 745, -1280, -837, 3078, -1283, -3134, 1568, 465, -601, 514, -655, -614, 134, 1459, 722, -3024, 180, 2687, -1746, 580, 1493, -2782, 480, 2502, -254, -813, -765, 1046, 742, -436, 1543, -1114, -2021, 3825, 1331, -2868, 1150, 371, -875, 1739, 600, -1121, -830, 750, 2816, -1571, -1291, 2311, -1568, 48, 3387, -2242, -1687, 2087, 396, -29, -861, -142, 318, -1277, 1681, 705, -3873, 1334]
1548A334P28m650L263r0l194L076Q30j396j103k98L657k428j558M188l886p25
1564b252N648l852j750L526j552oP59m97K18k328K830J633m888K407J927m040
1580b217L025J263l622J142J389l6q67j463K254l73j735L850k289l267M650l67
1596A337k695K546o21j158Q18K29P40k545Q77K971l549L30K693l381N65K765k506
1613e84l84J334m8n06l51J419o06k013K974l19l369K750N79k234J533N57j380
1630f48k20R49N35j791M10K216k202m99K598k090m24K307r51j172R85L04n69l01
1648e63J383m09j946K312K48k198J209R78j779M38J196r47j032J579J66r72M16
1665G9Q46j366M2J483o72j256J544N2j270N87Q65j127k54J264o62q18J217O1j365
$$ y = [1334, 2062, -2588, 675, 585, -2609, 467, 1297, -99, -1202, -1500, 2157, -271, -1829, 2359, -1527, -2252, 3396, -456, -2206, 1320, -232, -238, 521, 24, 242, -2086, 744, 2377, -2511, -104, 1823, -2217, 808, 2071, -1551, -409, 980, 944, 77, -1386, 868, 495, -1240, 2610, 321, -2946, 1704, 1337, -1358, 1188, 567, -591, 227, 456, 1196, -1349, -472, 2499, -1050, -720, 1973, -1408, -843, 1922, -584, -968, 366, 318, -188, -539, 880, 274, -1739, 1235, 916, -2453, 297, 876, -1358, 175, 732, -648, -868, 81, 616, -1175, -765, 1451, -751, -1250, 1348, -742, -1166, 1141, 190, -982, 3, 307, -262, -563, 820, 411, -1535, 777, 1025, -1173, 36, 1014, -765, -327, 869, -78, -1110, 469, 635, -337, 79, 925, -441, -399, 1084, 412, -844, 700, 752, -518, 69, 934, -193, -447, 817, 155, -663, 554, 615, -750]
1684g50M68J004q58n17J024j81j041Q88M82j336N49J011j019n77J311l73j074
1701i89P46O91j222P5J264j174j45J267o55j006J216L18j363P73Q28r36n75J150
1719B63l10r23J116N76j756Q77Q11r96j45R58j31r15N58J088j357j33J786j639
1737b72k24J579q24q61R73J87q30J44R84o86r20J451o5j441J243N98j765L94J218
1756H83r74n01J505k11j508R22P32j498L2J671j183o94J128J1j063P23P60j141
1774d06k59J612o62j515J590L12j703O95J054j295l63J643m19j495J132J052k062
1791a089L49K073j806m91K015q77j401J413O86j658O4J889j193j353K504k79k300
1808a454K427j1j714N82R82q42p69J383P05k228O22J912k160Q1J903j541q21K041
$$ y = [-750, -282, 722, -136, -653, 371, 190, -851, 37, 519, -817, -268, 743, -276, -853, 458, 85, -989, -243, 448, -774, -699, 565, -609, -754, 513, -142, -1148, 68, 386, -977, -204, 624, -312, -887, 263, -47, -970, 146, 722, -1034, -157, 654, -342, -487, 471, 340, -575, -17, 1071, -286, -419, 1367, -272, -496, 1083, 259, -602, 371, 558, -272, -128, 856, 170, -750, 701, 636, -805, 438, 1036, -729, -335, 883, -91, -592, 913, 702, -806, 116, 848, -650, -618, 1053, -130, -824, 304, 315, -748, -25, 735, -406, -665, 947, 285, -1230, 360, 672, -1031, -336, 718, -577, -940, 703, 284, -1211, -79, 973, -1089, -740, 1333, -473, -964, 1051, 174, -1227, 186, 872, -786, -722, 1167, -26, -1379, 1125, 846, -1454, 973, 962, -752, -170, 812, -30, -799, 584, 1289, -939, -317, 1595, -565, -484, 1419, -122, -943, 1098]
1826A098m72j338N25Q52k59j147J786j70k497K185R56k788J475P80j673L73P91
1843D77j78j178L69J703j430j141L017k039j223L333j696j416K137n22m20m51
1859f58N37N16j372J234J085l193J184K584l112P59J271j533J58J119p2p70q44
1876a107K105m59k290K993r55k310L515o70k261J576l6j3N4q3N65j568R09K294
1894B259l359M9K894k566K01K045k026p7Q68L58K41j743J201J69j763K429r2l306
1912b218K696O27k041J338n70j14O24l10Q45j686o38L093j638r74J972k110R9
1929a005K624j453q00J8L64J521j959N71O09k577K659J128l469J449M64r07J548
1946G85m35p78p3j87J905r55j862K622j195k65K446k634o02K039l20K7o61m17
$$ y = [1098, 626, -712, -187, 665, 406, -741, 1045, 875, -1622, 563, 1519, -1269, 206, 986, -687, -314, 477, 299, -879, -510, 1193, -237, -1378, 1639, -400, -1623, 1710, 14, -1402, 735, 213, -207, -658, -121, 395, -977, 257, 1342, -1851, -667, 1917, -1195, -436, 835, -698, -540, 579, 507, -263, -1107, 998, 539, -1751, 1242, 287, -2023, 1492, 822, -1439, 137, 101, 88, 142, 59, 624, -944, -35, 2259, -1100, -1051, 1843, -723, -522, 1523, -503, -580, 288, 646, 887, -856, 345, 514, -1249, 1180, 1088, -2218, 478, 1105, -936, 402, -168, -282, 342, 32, 877, -809, -1447, 1646, 8, -966, 1006, -1104, -1005, 1619, 166, -634, -616, -252, 1269, -690, -119, 490, -2087, 572, 1700, -1769, -320, 144, -763, 785, 350, -428, -501, -688, 1217, 262, -1600, 1022, -173, -438, 2008, -626, -1228, 811, 491, 518, -143, -560]
1964e60J249j060J281M49k873J517J404k073R81j0j344J632J54n06m39p72K147
1981A177o57j409J893j580l43K492j537q49J163n94M84P1n03L99j102R35J242
1998A282k699Q50J185j427J158N04j813R52K71j27K34j265P27J57q33J723j028
2015a49j050J824m72r60J293j046K99P29l89L55r86N7J691j905J01J684j933N95
2033b62J492j825J88J124o88M83n51R7N13j288J739l1k521J984N15j956J773k26
2051E60j543J420N2no05k31J386r02r07K146j887p34K459j123p65J052o91Q2R2
2070a44K79J79j470J508P37k148P33J257k180R86J293j817L58N46j66l04l40J027
2088C34k43j046J995j056j691K592n93j486J584l10o49O14K10Q7j146O38J257
$$ y = [-560, 689, -371, 910, 1359, -1514, 3, 1407, -666, 315, 305, -1039, 593, 747, 241, -198, -970, 1177, 520, -889, 1004, -576, -919, 1573, 36, -813, 350, -244, 240, 311, -192, 207, -895, 40, 1282, -1417, -567, 618, -809, 349, 853, -960, -8, 263, 136, 370, -895, -168, -11, -844, 879, -149, -1199, 625, 153, -807, 486, -560, -261, 468, 79, 434, -552, -495, 1196, -709, -608, 1076, -857, -262, 1230, -595, -407, 717, 29, 512, -39, 58, 571, -717, 1022, 991, -1530, 454, 969, -987, 786, 560, -983, 437, 489, 484, -121, -352, 1034, 132, -775, 1371, -516, -1250, 1209, 86, -679, 373, -318, -236, -144, 135, 314, -1156, 352, 1089, -1059, -326, 931, -1249, -263, 1030, -787, -429, 117, -49, -353, -693, 334, 91, -955, 1040, -16, -1707, 885, 292, -1194, 390, 80, -569, 45, 255, 342, -804, -166, 1091]
2105A091k041M99J809k070L14J553j104q22R04M72m13n19R08m3j527J711M53k327
2123a152J660K04j402R25O97r64o75Q73R04j599J95J643j830o7J703q79j026J432
2141F42l96j176R64O47n61p50J323m96j436J515N71j793N57J132j140n10J574
2158F67p07q21Q39M23j127M9J404r29n03J114j60j169P24N24r90M69R69n23r44
2177f91J190k3j406Q38J042j292j39J312r45o44J274rr70M04Q66r95k70J218m21
2196C39j023J144L1j006M95P39r08l26R99k23j041J050O55j373L34R40q66l41
2214c81Q69j10j047Q17O26j366j7J216p65p79J587m54r05R08J76p74p6R40m92
2233b7p31R10K00r96M53N80p96K9J019r42l85Q29J12p17K44O60p36m3N57j57l72
$$ y = [1091, -950, -451, 1358, -712, -398, 1155, 51, -771, 133, 605, 192, -327, 581, 538, -989, 722, 1175, -1152, 508, 712, -690, 235, 932, -32, -707, 166, 1070, -529, -334, 1309, -521, -588, 1115, 236, -790, 642, 246, -930, 34, 681, 120, -630, 693, 197, -1239, 276, 847, -946, -389, 743, -397, -907, 667, -40, -861, -22, 401, -726, -677, 727, -202, -705, 409, 249, -920, -196, 328, -662, -193, 776, 253, -691, 499, 476, -930, -92, 950, -342, -481, 831, -114, -758, 516, 507, -463, -59, 807, -188, -458, 760, 339, -684, 460, 491, -515, -20, 719, -189, -515, 484, 261, -780, 270, 925, -448, -114, 826, -40, -381, 488, 378, -669, 148, 774, -592, -609, 607, -158, -937, 650, 196, -709, 199, 375, -399, -475, 465, -27, -758, 152, 352, -644, -191, 389, -407, -378, 641, -301, -686, 143, 255, -462, -218, 442, -294, -337, 220, 63, -309]
2254c09O14N8p34K32O24m00l00P05k02m32K96K23o55K10Q63q07k56N85k37m80
2274d02R65k53l58L7O36o48k39O12J20j007P91L20j368M58R21o74l64Q11m22m18
2294d82N13J22m92j32J034o20o13J119m87o19P92L46j054N81o1q3m6L23K8o88
2314e19N10O90j158J8Q17o93j64R36o14j84L83K59k21m01N56p8m85R96l48j151
2334h51J063L52p20L24j8l79K54L07O8o75j9J115o32o19J197j060k51J432m82
2353D06p05L71L78l91p5P9K24r57R15Q53j958L84R52j059O24O64j292m4Q23J91
2373C83m68n58J065m56r15J631o77j267J828kj447J114l04j83%K1K85p94J48J721
2393A125j579k74J600j742K54J589j209m02N12K95K46j011Q47j39j126J381N47
$$ y = [-309, 305, 363, -371, -139, 485, 85, -215, 490, 288, -144, 152, 375, -280, -70, 793, -14, -270, 315, 78, -402, 563, 310, -48, -11, 625, -23, -262, 350, 470, -537, 254, 574, -794, -336, 585, -89, -453, 358, -64, -482, 31, 153, -339, -471, 563, -57, -670, 449, -38, -657, 135, 481, -573, 8, -53, -136, -182, 141, 169, -519, -9, 681, -477, -459, 358, -335, -499, 437, -177, -361, 22, 281, 60, -341, 215, 137, -348, 648, 300, -851, 212, 564, -156, 168, 150, -229, 25, 332, 400, -275, -294, 821, 189, -430, 767, -293, -544, 888, 406, -299, 72, 450, 59, -16, 63, 287, -670, 245, 1098, -860, -476, 476, -583, 41, 705, -587, -631, 192, 383, -85, -643, 422, -34, -949, 682, 5, -1262, 566, 564, -883, 231, -73, -256, -256, -235, 50, -744, -596, 1125, -454, -728, 872, -870, -616, 973, -236, -638, -126, 169, 415, -596, 251, 112, -1014, 367, 914]
2410I14k156J369N28j042N75K2l26P8Q6O28q16o99J825j124m95J758j293q97J784
2429G19k83m94j56K8P51q45N95j26j184J356J166k513Q38O13q34M74Q9j80m62
2448d48j26J324n40j213J486n97o16J693r94r83J009Q0O4q97N09L30q59P86R76
2467I84k027N57J259j223L62N72j117M32J57O58q29p59J246L32q45R12p09p54
2485g92J479j51r07K94J5K66J62k43M04j303P69J143j203k36Q47q20K76P35q22
2504h7n00L27O41j05q72O69M1p60J412k17j310N79N98o77K77J79l03q9J9N79p55
2525c54j31J069n70k48O53p46l23Q57o4m38K84j36R1l81N13K59j018O19Q52j286
2545d98J95P46o17J28M28m32k23J98L43j44m54P90n58l33J077o14o00O96K63l38
$$ y = [914, -1242, 127, 655, -387, 188, 210, -116, -38, 48, 676, -140, -839, 986, -138, -633, 1125, -168, -1065, 719, 436, -58, -214, -186, 565, -280, 315, 189, -995, 361, 1527, -986, -148, 465, -369, 105, 194, 14, -448, -574, 750, 210, -1003, 483, -114, -730, 963, -31, -1014, -5, 75, 139, -758, -249, 81, -778, 8, 984, -1043, -486, 773, -450, -88, 484, -633, -201, -44, 614, -215, -974, 272, 604, -241, 671, -38, -792, 687, 536, -371, -77, -62, 204, 366, 123, 527, -776, -7, 1136, -67, -303, 544, -276, 0, 735, -87, -587, -260, 381, 276, -596, 73, 114, -646, 766, 549, -761, -182, 416, -261, 16, 195, -108, -197, -178, 401, -354, -485, 584, 14, -234, 419, -327, -650, 207, 143, -295, -11, -147, -56, -437, 76, 335, -683, -64, 788, -498, -303, 443, -174, -46, 382, -50, -273, -75, 268, 124, -330, 460, -98, -431, 646, 32, -568, 128, 391, 53]
2565E3M9k36K08k5k2L58p05M8Q76p85j8R03j103L80P26n39l16K99J3r4j50L20
2587B40q5p25P94K04r09L95K37l61J84J96j83j13L2N76p12j40N41n50J07Q28q42
2608b86k42Q51j77j78O7L1k87Q4J30J37m79K85M84r75N54L27n35j74P18l63o5
2629i3K48j05m96L39M58k09k98N88j60n27L73J35m11K84K30o41j82O97j23m29
2649c22M76J31l02p8O15n82k15M57K04p44M80J09m02l9O50l79n53O84K71q77M71
2670E5L72o15l8P09l92m55K92L33n94K36M95q34J45Q82o38n70P46J29p68J08Q93
2691D91o31m88R67l85o32P05M38j043OQ55n64k18Q68J67q71L61L33n89k84J023
2711E09n37l06R15n43p56R05M36p92j17P07N2j032Q23O9o57L34M54n65k48Q93
$$ y = [53, 102, -134, 74, 49, 27, 385, -320, -272, 604, -181, -199, 704, -399, -19, 707, 168, -148, 151, 164, 70, -80, 240, 155, -570, 224, 428, -481, -86, 151, -210, -26, 170, -13, -126, -94, 482, -230, -370, 171, -379, -272, 556, -286, -528, 323, 146, -32, 35, 66, -221, -137, -7, 130, -349, -64, 420, -555, -1, 326, -209, -383, 335, -28, -93, 155, 50, -446, -107, 351, 142, -156, 432, 272, -255, 118, 253, -158, 126, 356, -285, -467, 230, 107, -322, 154, 285, -17, -95, 520, -62, -277, 180, 384, -360, 120, 229, -173, -212, 438, 59, -494, 190, 461, -416, 55, 427, -188, -226, 483, 91, -364, -72, 261, -333, -97, 398, -436, -291, 591, -47, -617, 129, 258, -510, -402, 491, -140, -628, 339, -46, -678, 27, 465, -578, -572, 283, -281, -499, 369, 536, -335, 26, 359, -230, -514, 509, -28, -334, 581, 38, -718, 187, 623, -169, -286, 421, 473, -559, 264, 333, -324, 10, 464, -101, -349, 544]
2731E44n20l15N86K69p25j53J112r62l03J027l91n77L97M68j047M62O30l59l65
2750b22J71M68r43M30M52r36M47M00n61q4O68k63l14K25M03m33o20J217m48p04
2770f47Q09O7o87M07N13q41J13L27J45m83P9P29r20L6J110r61k88J321p93k51
2790b15L26k4k73R4M41J69r31N25M18j058Q17N5q89P95M10p83NPJ97J86n69P92
2812D95o53j58J121p24p44J097n19k48O94m00o6l4L22M66j089J76O60j084J098
2831D10J79j279N40M67o63M67j95j71N09q57J070n16p81J469m16p14P45l95j85
2850c16P13k69k62o4j36R13n89j65N20j003N75R63j111q2P48q96P10J70n34K33
2870A18k78N14M69j363O21J47o09J194l76j094J008n49J09N41o31L86k76n3P67
$$ y = [544, 24, -291, 295, 564, -161, -314, 798, -164, -467, 560, 169, -408, -11, 457, -590, -128, 502, 143, -222, -51, 417, -526, -96, 356, -580, -133, 267, -294, -378, 290, 27, -287, -62, 341, -92, -712, 505, 57, -647, 162, 229, -458, -51, 462, -379, -266, 61, 206, -277, -198, 531, -389, -353, 757, -204, -492, 829, 36, -215, 111, 87, -186, -92, 349, 518, -413, 112, 530, -528, 289, 344, -545, 250, 660, -123, -118, -111, 86, 272, -297, 495, -158, -316, 805, 81, -663, 434, -85, -333, 361, -39, -105, -139, 183, 649, -440, -264, 396, -688, 410, 589, -690, -150, 317, -346, 121, -74, -245, 264, -593, 477, -39, -820, 649, 233, -481, 264, -131, -316, 397, 128, -134, -198, -334, 579, -10, -175, 345, -658, -83, 880, -231, -313, 435, -461, 249, 419, -115, 118, -160, 354, 823, -540, 81, 228, -381, 813, 437, -657, 351, -198, -89, 452, -179, 207, -69, -122, 645]
2889F45q95m7J128j013p2P66j024L34O98n04j75j03j6P46p30L90J62j164R57N66
2909F49j225P05k10m26J044m07l53J34m60R28l53o70J036q38O5J169j448K04P02
2928B46j68j61K21m73O89o85L37O82j321M19J138j230K84L29n72N26j96J44Q4
2947B93q17O93N27j130R51l46q38J373n07n00L04J57l7j04J5K22o31O19N52j136
2967c40n3Q41q62L60J45k99O9J47K94lq74P20k66m04J167p39n56Q51Ln13M48k24
2989h8K91n03K41M78q72J40P86p80l4M92n01P6O62m52k72P4N66M5j119J150J9
3010C99r88J115Nr40L61M07o59M09k12K14n03O4Q08o61k10R28k70l09O12m75m02
3031c07N34N0k52L7J51j0o03M43N83j180N22N21p13j93P59n92R3M16J25n53k57
$$ y = [645, -250, -297, 831, -182, -254, 512, -512, -178, 520, 16, -159, -262, -278, 468, -262, 128, 290, -874, 83, 649, -576, 129, -81, -507, 537, 130, -223, -89, -549, 379, 26, -644, 392, -446, -381, 788, -660, -456, 246, 78, -83, 138, -335, 354, -331, 6, 688, -633, -214, 924, -306, -22, 307, -265, 261, 65, 209, 293, -524, 169, 696, -434, 517, 171, -667, 706, 199, -301, 3, 160, 123, 19, 34, 256, -375, 244, 796, -340, -393, 448, -414, -54, 91, -208, -139, 8, 302, 299, -575, 145, -121, -525, 642, -97, -653, 198, 201, -312, 136, -88, 203, -300, -59, 419, -453, -313, 473, -307, -341, 151, -350, -274, 388, -64, -336, -262, 304, 349, -770, 380, 399, -589, 526, 531, -409, -48, 359, -300, 109, -103, 111, -392, -328, 480, -181, -391, 537, 267, -42, 570, 95, -307, 227, 277, 25, 62, 213, 203, -400, 43, 626, -554, -32, 489, -224, -417, 342, -250, -157, 259, 384, -169, -426]
3052d26P82o92k42Q08l85k68P18M8p76K52K81p1k18J61K30m48J62P74j055K55
3072a10K89n66l6N10J6l03K27K20l27m55P13l87k69O99L89j207N45J93l14M0O1
3093g2L14m09K12L77m89k61Q81o31k50P51k25o47O64J66o76L20L75m17j97K13
3113aP5m48N41J34n41J15M62l36j10L43j49k02Q3K93m50j97M47j38r9L11l05k18
3135c90L42L84m97p8L27j01m55M89O9m25K77L76m66J04P8L9l48L76J3k74m8K59
3157E1k3n2L22j33k18J27J13l40K27L27j73j72j8o6j79J12K27j38j96K82N1j2
3179A19J41j66m52O03j48k0j62N43l15k92L83q5q5J6J0k48Q5L1k09J76L22j75
3201G2k01K56N3k92J21l5r0M5J05K05p87N94p0l54N83J15l23l43N55l7k09m3J07
$$ y = [-426, 356, -336, -578, 230, -155, -423, 295, 343, -433, -181, 100, 29, -189, -28, 202, -246, -84, 690, -365, -110, 179, -387, -423, 87, 103, -200, 27, 247, -80, -535, 178, -209, -478, 221, 610, -597, -52, 141, -173, -133, -72, 242, -167, 45, 422, -67, -328, 553, -78, -328, 423, 198, -449, 215, 381, -295, 25, 400, -17, -214, -1, 74, -374, 167, 301, -240, -125, 337, 1, -109, 234, 85, -117, -34, 259, -191, -388, 59, -79, -178, 133, -172, -390, -48, 336, -161, -239, 88, -13, -468, 21, 90, -335, -58, 318, -148, -44, 34, 73, -275, 101, 114, -160, -208, 51, 28, -24, 298, 165, -53, 74, 187, -153, 74, 401, 228, 56, 38, -28, -207, -95, 132, -6, -202, 80, 131, 119, 260, 94, -358, 245, 97, 77, -85, 458, 143, -149, 234, 149, 64, 80, 90, -158, -73, -42, -251, -75, 247, 72, -129, 127, 180, -112, 9, -26, -116, -71, 34, 239, -548, 46, -24, -378, 205, 320, -3, -346, 209, 172, -37, -80, 27]
3224B7l05K07L12l72j72N25l51K24p6J14l21L06J70l41K2K12J5k75J70M7l07K94
3246A25L10p07J50K45K67n56K33K94m86K26M10m91J12K58k03n21M29J57k51j35
3266a34L11N6o56M50J77p43Q29K02p48j1K98j01Q2J4L54o97Q0N97m76n8K2J02
3288e0k39N12k47l45J63K60R9k61j64L67m07K89K99q64O05M29n16J09j41J06j38
3309a34p8P61n54m32P81j33o12O70j10l49M90j42N4j05j66M58q92L27P25r34L49
3330b6P31q67R6K44k05Q9M7J22j83l20P14k14p75Q09J85p52M47L4o56O48o1L1
3352A38l21O1K72k14k35J027j074q1R30n27k76K98j11Q6J05j57J74p60O29N09
3372D73r02K75K77q06J102o8j047N98P1J85K16o92L21j81k6Q51m87o98Q05l26
$$ y = [27, -278, -71, 241, -131, -303, 222, -129, 95, 19, 133, -188, 118, 288, -53, -31, 181, 196, -79, 91, 138, -169, 125, 435, -272, -122, 123, 390, -166, 67, 361, -125, 101, 511, 20, 132, 390, 187, -334, 95, 252, 1, -134, 177, 233, -423, 27, 204, -539, 290, 492, -256, -267, 31, -70, 12, 26, 380, -317, -237, 360, -116, -174, -152, -50, -289, 223, -24, -369, -206, 54, 153, -108, -272, 95, -312, -23, 276, -588, 17, 446, -70, 39, -102, 4, -134, -212, 549, -5, -437, 344, 211, -401, 269, 159, -190, 300, 158, 212, 107, -59, 399, -493, -166, 559, -375, -26, 705, -162, -66, 178, -27, 62, 109, 231, 48, -272, 442, 228, -547, 262, 447, -305, 142, 176, -480, 168, 107, 138, -183, -122, 150, -64, -299, 728, -346, -427, 503, -24, -300, -2, -113, -27, 78, -79, 95, -665, -36, 473, -429, -154, 123, -683, 419, 351, -696, -98, -27, 158, 374, -318, 3, -178, -204, 647, 160, -538, 267, -59]
3392e9l0M02o44K41K23k0j07j65j40O59k23k15N76p79K80M49o12j59L54j93M68
3413C06j42Nl91k96Q77Kp54M24J56k62O35k81l75JM4K45l30j43N83m04r2N74l56
3436B6n27M66k55K48K55o05L29j94K60Lm32M26j10j66M15L7m88L63J54k31O9j50
3458a07N05n00N3L58n57l3N63n50J41K43k12Q5J39J7k14K16k03J01j98J16K30
3479A93m18R4N01o77L13J24l09L98m42P0K03K10K8l43j91L35j83l6J94j26m5M1
3501f6J59j08r6Q6R8j60J79J00m35K21L59o27K61K13m20O8J26J29k10j29K35M6
3523B9l85M69l3n80O47J02n77M89O4k41j88K74J41m49L85J11k13oR2k94RL31P3
3546B50p22M51P8j80K1L64m59L6M69j34m49N42j05n33L00J51q6k28K30J73k57
$$ y = [-59, -89, 313, -331, -90, 133, 113, 6, -159, -299, 360, 137, -78, 498, -281, -1, 448, -164, -323, 31, -162, 306, 164, 169, -222, -518, 359, 361, -393, 31, 187, -75, 560, 279, -96, -95, -51, 194, -136, -279, 304, -100, -192, 382, 26, -501, -35, -290, -42, 213, -392, -63, -257, 3, 6, -426, 0, -110, -276, 139, 176, -312, 51, 205, -26, 43, -107, 398, -102, -49, 309, -248, -281, 282, -268, -127, 116, -96, -11, 128, 145, -69, 147, -56, 45, -153, -37, 193, -225, -131, 370, -307, 6, 130, -179, 219, -223, -153, 50, 260, 288, -55, -246, 89, -94, -130, 64, -62, -107, -66, 93, -15, -111, -25, 73, -87, 92, 192, -243, -22, 337, -290, -29, 184, -236, -168, -42, 87, -123, -252, -17, 29, -356, 113, 80, -500, 147, 249, -328, 161, 225, -16, -204, 70, 211, -238, 147, 258, 45, 39, 131, -163, -154, 177, 250, -472, -21, 57, -123, -102, 262, -197, -161, 308, 174, -275, 267, 162, -371, -71, 80, -6, -234, -4, 169, -88]
3567h8J50M9j70l2L71m45j13O29m62j40J01K3j76K45L33k60j52J77n6l11m0P01
3589C34o15J92J16j84j64k2N47m52M03N4m14J69J15k4q0k46M98m79L66lj31k59
3611b79M03K7m44J71L97l30q6O02o28r3N86j67j78J30J94l08k4K2k9k53N74q0
3633B07m02K05M37n05J76J37j82j85K56K66o23L6L72l1k44K54k01J2q1K36l23
3654a83J5L50k27j76J46N1j36J18J31k83j19M80k58kL35k23l50M10J78l52L6K59
3676B00j0n88J65K85k34K38K44p11M47Q2J0l25N2K80j75k0L98l98K2L20j59k40
3698a17K1K96k44J50j0j5j82J90j65q9L90r0j67N4J6P6j92j40K87k52j6L63j96
3721c2j55K55l71J09M49j72k87J15L5j17q1J50K17l20L83j7m40P9L58k66K83L
$$ y = [-88, 62, 111, -59, -91, 280, -165, -278, 351, -111, -251, -150, -127, -303, -58, 275, 15, -137, 40, -16, -327, -367, 334, -281, -89, 27, -157, -321, -343, 204, -248, 155, 209, -205, -36, 79, 55, -25, -271, 227, -252, 114, 111, -20, -279, 124, 151, -293, -122, 275, -55, -141, 461, -167, -260, 326, 159, -19, 111, 305, -3, -27, -5, -34, -287, 287, 207, -195, 10, 447, -58, 118, 255, 73, -112, 144, 410, -213, -177, 195, 164, -80, 174, -27, -15, -96, 140, -183, -168, 182, -45, -221, -75, -24, -160, -42, 89, -194, -313, 167, -91, -93, 242, 19, -331, 79, 257, -95, -59, 200, 190, -398, -233, 52, -182, 56, 300, -411, 36, 118, 128, -197, -145, 135, -40, -60, 338, -60, -38, 282, 123, -117, -96, 200, -44, 106, 96, 81, -101, 89, -76, -165, 225, 135, -32, 22, 38, 114, -78, -218, 69, -183, -199, 164, -32, -187, 68, -303, -194, 255, 83, -204, -89, -54, -171, -252, -102, 115, -205, 178, 161, -279, -200, 158, -108, 175, 178]
3743A78j87p1j80K67K7m47N08j12J49N7l09J06j14J31L3M8R1j96j44K41K4l09
3765b09N26l73j19L91l03q5J70k14M15j91OK63k45j51L87m19j55P67n27Q0O2k25
3787a49J68J32l71J63K9K9L28m48K44j2l71L50j53o0L67p7k20J52k81K90l07r3
3809b90L04p6l55O20l36K11M30p15jK23M7K12k70k27N75o71P3N45o72M29J11k38
3831g1p1L20l47M04q1O9j22n58O48l2l20l6K73k92L62k2j10j87K03J38j69j67
3853a68M69k14n0O36r57R6N79l29J68P4n01j29L93j72J8j96M23L67q93L33K79
3874B26p10N45J09l61q5L61l40K85j53L29n43l9N66l24l80P27m8l59L75k82M3
3895e8NLL60m27L3L52m54J16M50o86O3O39m92L4J8j69J77J46m7K6m83O66j75k88
$$ y = [178, -9, -80, -260, 7, 34, -413, 95, -17, 132, 189, -120, -14, -128, 3, 36, 84, 175, -21, -165, 76, 100, -209, 317, -56, -175, 216, -87, -172, -2, -216, 199, 8, 14, 277, 32, -119, 268, -151, -306, 461, -66, 14, 76, -149, 19, 151, -220, -57, -28, 1, 329, -119, 125, 113, -258, 92, -61, -121, 246, 169, -51, 101, -180, 110, -197, -290, 14, -62, -417, 203, -133, 78, 508, -207, -208, 15, 62, 274, 4, -223, 352, -319, -246, 299, -373, 56, 167, -71, -142, 178, -169, 235, 154, 223, 101, -457, 191, 159, -161, -197, 76, -216, 146, 124, 14, -173, 30, 168, -1, -168, 301, 87, 37, 673, -284, -188, 391, 62, 230, 304, -197, -326, 67, -105, -87, -283, 140, 507, -386, -53, 226, -484, 61, 170, -191, -276, 85, -255, 30, -123, 206, -337, -376, 190, -134, -514, 213, 165, -194, 181, -101, -58, -53, -50, 310, -117, -84, 268, -186, -70, 380, -306, -243, 396, -96, -62, -44, -213, -36, 110, 63, 89, -394, 272, 97, -191]
3919a91M89n1k51L70k88j3m2k40M23l00J42J99l14p8L34l58K50K57m51L5pK34
3941A49o8m5K79l91l18N23l1k61N6K44j22j01m1L47l07j94L09K7m42M85l38m1
3963b81N36k01j42J20k6l47L49k08P5p1L40N6n47K17K02k23J07L37o25L60K70
3984B98Pj69l6K5j40k02O30n14k46M31K13n33L82p6J0j15R6J49m89L80J11l41
4006a29K87L02m95oR4L7m85N57j86kk5K66l68LK33K13l01J39l25oJ74J58k35R2
4030hO9K24n51K95J51m93K97q3qj83M24M1m88L12j4K64l76L17k16n2J76j24j52
4053a78J23L64n58L21J02L3k80J86J36O9k73J91m27L74M5l82J19J76l7l04K71
4074G1L9q9J5k1J3o0k2R5k43M59k26j38j14L92j4k16J80J53m47R4L27k31q4L0
$$ y = [-191, 298, 247, -4, 366, 78, 65, 23, -217, 206, -94, 48, 247, -67, -145, 189, -169, 81, 338, -113, -78, -85, 149, 81, 36, 315, -76, -394, 129, 98, -163, -107, 137, 15, -86, -127, 220, -87, -281, 28, 55, -387, 98, -240, -281, 255, 54, -88, 32, 6, -341, 8, -200, -125, -196, 144, 200, -347, -130, 72, -151, -44, 293, -332, 28, 298, 305, 136, 100, 125, -15, -217, 413, -101, -347, 84, 297, -236, 146, 70, 80, -35, 61, 210, -279, 101, 212, -129, 158, 460, -35, -41, 53, 90, -395, 162, -24, -26, -51, 215, -153, -150, 83, 296, -5, 134, -191, -197, -23, 135, -100, -8, 61, 285, -266, 29, 180, -313, -16, -99, -107, -290, 134, 175, -313, -1, -15, 249, -127, 190, -26, -78, 98, -26, -178, -55, 309, -249, 72, 174, 207, -73, 113, 249, 318, 45, 236, -191, 183, 228, -154, -35, 141, 104, -200, 71, 110, 21, 36, 15, 28, -32, -54, 41, -202, 257, 31, -107, -221, 171, 157, -59, 121, 274, -173, -79, 248, 17, -67, -37]
4098c7J8k98L89j78O6j9L44m82K81Jr4l07N25j72q8J45J46m76K29J1m7J9l2J83
4122A27l20J21N2j65k57M64N7k59L69l0k88J26L1k73R6K74Pj37j18J27k52J20
4144a28J99j13K16J8R8l87P9Q9j34K74M6J43k92L6j2k07K04k8j6M5K01l34n6K86
4168B27j92j30oL29k54r5L47l00k84L47j33K10j5k26J25L2R5Q8k99J91q2j70J81
4191a4K5j47Q8OL0%oJ60l88K62Jj20m10P62l50j58M13O5l19M2P5m1m6M6J61k42
4217a05J77J26k07j2J38J49l35J31K42l57o4J92J64m13L72ol14L82k17k58K7K26
4239C8k05J67K14M0n02K13K24l02R2J29l04Q6K85m5l35K65j9p2j27l3K04l01J91
4262i7M12m80O7N7pj67L12m72J92J06O5k2k95O02l92N9J18l63J51J16m2pK99j10
$$ y = [-37, -19, -317, 72, -106, -40, -59, 285, -197, 84, 85, -9, -316, 209, 37, -51, 94, 240, -236, -7, 4, -43, -24, -56, 127, -193, -72, -20, -185, -442, 22, 79, -180, 189, 159, -129, -3, 28, -245, -149, 125, 132, -5, -123, 4, -248, -128, 71, -42, 174, 192, 290, -97, -18, 71, -63, 211, 257, 400, 108, 144, 132, -75, 129, 101, 85, 130, 331, -3, -59, 227, 35, -95, -101, 228, -26, -121, 226, -74, -358, -11, -144, 66, 51, -175, -50, -18, 77, 165, -134, 57, -25, -195, -14, 11, -136, -48, -42, -12, -12, -18, 142, -246, 16, 17, -103, -513, 249, -101, -259, 154, 219, -100, -58, 17, -24, -70, -24, 137, -105, 72, 198, -9, -21, 117, 266, -69, 62, 304, -53, -117, 75, 239, -174, 198, 192, -122, 260, 43, -215, -188, 38, -167, 0, 214, 254, -248, -35, 189, -113, -21, 108, -196, -110, 175, 130, -205, 60, 41, -31, -158, -191, 13, -288, -97, 315, -165, -98, -41, -48, -215, 97, -375, -183, -77, -12, -34, -329, 273, -119, -60, 58, -305, -154, -38, -80, -87, 212, 102]
4286A02j69M2j25R3m5L41J76n24L0J92j72j85O24k50j54J8L1R3l54M50k34o0N43
4309D63n45k82N56p4PJ43m93L13J15l02M93p04M7M03k21O4K69m84Q3L63l3k50
4331f9Q8l4J31l52O44j10p31L97J60l11K29k0l49M27j90n2J52k37M85j22l89L91
4353A38l46J24M52o05o6M40j08J90p3k18Q7Q3j36K92l51J70K71n55K43J79n47
4374c36L62K85j94j45R6m5N8k25J81O0k87M51l72l90N37k00J1O70n04L8k03O7
4396h5J60o9m2n9K5n7L71l73J69K82k92qJ84k74K10n24L23R2l67M34N5l24L09
4419A40j52p1M2n5N7j68J69Q2Q5k51M17l85N5M39n45N8J02k78L24K00k56q8k30
4442c09N71j64l16Q8K68m84M23J44j40q7J46j22j25P1K80l23J56j1j61n0K87k36
$$ y = [102, -67, -25, -150, -57, -102, 239, 415, -109, -79, 113, -59, -244, 380, 130, -24, -6, 25, 118, -236, 214, -20, -80, 463, -82, -364, 192, 118, 125, 268, -225, 88, 203, -99, 394, -310, -263, 140, -81, -17, 252, -232, -149, 214, 181, -69, 19, -15, 116, -236, 408, 298, -433, -36, 124, -187, 42, 22, -327, 100, -90, -142, 10, -227, 258, 136, -253, 138, -208, -84, 368, -237, -303, 137, 29, 219, 146, -72, 15, 98, -38, 254, -97, 73, 344, -211, 32, 211, -336, 26, 311, 117, -28, 68, 23, 81, -144, 37, 97, -190, 261, -111, -501, 36, -164, -153, 517, 13, 51, -152, -85, 75, 6, -36, -95, -70, -127, 244, -129, 40, 322, 30, 22, 206, -68, 142, -382, -59, 33, -334, 100, 155, -169, 140, -12, -83, -41, -96, -39, -207, -38, 44, 129, -122, 295, -90, -35, 404, -141, -83, 19, -259, 65, 265, 9, -79, -309, 262, 98, -218, -130, 138, -346, 77, 221, 81, -6, 140, 18, -107, -36, 244, -79, 77, 66, -95, -145, 142, -94]
4464i4j38L96j21k60J28K35o0j38J27R4k49J78P8m57L09J25m35q1L72j29J33m9
4486c6k5k6K24j16k5j12J64r6j41J53K66m63J78J60R6l87Q3J40j75J45J91k97
4508i9j99N78l33P2l6P4N5j94L84k80k14K10j7kJ92J8l76K53J60k04j30K37j9
4531A30Q7k20K38l18J10P8j01J15q2j18j64L17J04k18J5K27o5j08J2J18j95J18
4553H0m3j10J09K07k85j28J53J02q2k44J61P1j12J94k88L5K03K68n45J91%N9j29
4576a33J36j72L5K91j47L8j8J69k20p2m0J89o8R0J22l00r0J63N5k74J13K54k7
4599I4j20P4j6o5M0K1M0J28r4l23O06j42k26k25L63j42k38K05j9J6q2J91pK04
4623B83j30j94J20N7j55j15J68k7k16M18l35K42j72K87j12l20l1L02k07J92Rk8
$$ y = [-94, -232, 164, 43, -217, -89, 146, 86, -52, 75, 169, -80, 98, 176, -281, 28, 153, -282, -363, 9, -120, 13, -36, -61, -87, 137, 21, -4, -116, 48, -48, -189, -36, 230, -233, -55, 105, 201, -186, -103, 37, -138, 7, 198, -99, -298, 280, -53, 19, -17, 57, 112, -82, 302, 22, -192, 18, 1, -1, 191, 209, -167, 86, 246, 42, -88, 149, 130, 217, -3, 235, -83, 27, 105, 4, 119, 37, -81, -245, 72, 176, -42, -27, 200, 135, 27, 39, 157, -38, 80, 37, -73, 36, 243, -42, -170, -17, 85, 3, -241, -80, -9, -121, 73, -215, -180, 23, 291, -254, -63, -63, -4, -133, 3, -169, -134, 157, 10, 48, 30, 199, -21, -93, -133, 56, -12, 78, 200, -100, -190, -27, 28, -246, -133, 121, 94, -26, 48, 32, -33, 7, 28, 68, 196, 102, -221, 385, 243, 17, -208, 155, 13, -225, -20, -39, -23, -105, 86, 79, 283, 153, -41, 79, 136, -19, -134, 34, 7, -209, 209, -126, 116, -56, 231, 119, -201, -232, 70, -137, 55, 64, 36]
4645C6j79J80k16J00p5K14m0L6j39j57K3J28J58R5r6j73K47k27Q1M49m13j01J57
4668H8L6R3j03j70J54K7k32J24J7j05P0j1k51J9M7N1K04m5nK02l72n4K43M5j34
4693f2N6K12j40j43N8K18k01L7Nj17j06L43j94p4J59j26M1R3j25J41m02L29k39
4716b37K23J95l56J56Nj25J24m6K7P1j21m5J23K57k00M9l38L83j92N9M9j32o8
4739a39M3L62j98o9k1J27j8m6K41l60j01J95k3P8j2N5qK2k66L40m32L33K74o41
4763b64Q8K60r7OK9j15ln3L28j56k28L70j32j04M68m46k14L78k28P8Q2q5K98j26
4787A34k83P06p52J30K24m88M75Q5o16K62P3m3j7k64K35J22p8P6J30l56M00j48
4809Gr7L64l90J20J85o7k63K8k07L97k04J00P1m0j91N28m05j09K84j21J97l7n1
$$ y = [36, -143, 37, -179, -79, -154, 60, 20, 56, -83, -240, -217, -89, 69, 164, 68, -105, 142, -85, -4, 445, 32, -69, 88, 124, 217, 114, -56, 98, 125, -107, 17, 34, -71, -1, -12, -263, -244, -197, -146, 58, 13, 8, 210, -162, -216, 27, 72, -62, -6, 206, 66, -77, -19, 199, -2, 35, 40, -77, -183, 160, -34, -108, 51, -75, -34, 59, -66, 75, -327, 2, -237, -14, 181, -175, -19, -14, -139, -15, -61, -34, 37, -84, -129, -6, 251, 51, 100, -238, 145, -47, 12, 61, -71, -139, -96, 266, 68, -1, -22, 105, 87, 41, 282, -78, -179, 16, -7, 71, 59, 114, 106, 128, -138, 202, -230, 103, 377, -264, -176, 84, -13, -7, 22, -93, -96, -149, 179, 23, -205, 165, 33, -71, 397, -49, -263, 115, -113, -35, 47, -38, 260, 134, -149, 557, -195, -65, 159, -329, 146, 231, -385, -123, -50, -93, -110, -374, -139, -17, -95, -19, 111, -245, 155, 7, -90, 274, -116, 4, 189, 122, -141, -113, -320, 77, -127, -27, 44, 4, -187, 341, -64, -173, 111, -10, 187, 150, 99]
4832I9J91n52L14K62o64K91K71j14R4o8k21N6MO5J16l98M16Qm65N58m51J00J72
4855H4r7m8J62j15j7j43K50r3m11L52K03o50K29L14r6K07j89j53J71L52k90k1
4877Ak03K03M0k51M63k25l68K61K02k58K96k03%K79o5j27j99K74J37k57r0J11
4899B1p7K15J18j90j82R8o9mQ6J22M0k83K78l8j71k46K68n3N6R3j82M8J55J79
4923B82m53l4K42k8j35M2J95m72N59j82k71J70O6j1R2L20l41m0mO2j36k4J20k52
4947b33K85j16j36K64l67L55pj41On1J40l4l4pK07j14k48L33oj86r7Q2J52j11
4971f4l3N4m7j34Q3J76J53k21R9K9J16k47l0K90k13K56n09N93l44O2q5J74j62
4994do7J34q5k29J10N72k48n0L4j8j66K16J53k93p9L60m98Q3J52k6k75K89J05
$$ y = [99, 290, -262, 52, 314, -350, -59, 212, 98, 192, 124, -97, -41, -37, 28, 144, -254, 162, 170, -295, 263, -188, -88, 84, -13, -61, 101, -14, -31, -174, 76, -17, -428, -76, 127, -523, -294, 20, -76, 131, -58, -211, -40, 312, 22, 1, -202, 1, 41, -210, 253, 28, -340, -79, 123, -135, 161, -42, -42, 237, 172, 45, -154, 120, 257, 0, -90, 21, -56, 159, 277, 87, -95, 3, -66, -70, 16, 138, 178, -105, 173, 135, -36, -282, -14, -67, -11, 82, -100, -52, 103, 282, -171, -205, 37, 9, -126, -84, 111, -361, 198, 16, -255, -85, -19, -30, 62, 382, 41, 1, -3, 59, -77, -101, 19, -233, 52, -64, -200, 64, -303, 52, 45, -96, -90, -141, -1, -35, -69, -76, 131, 17, -231, 102, 96, -90, -187, -105, 47, -64, -97, -43, -90, -224, -141, 35, 188, -33, 66, 95, 211, -36, -66, 224, 11, 267, -242, 351, 7, 69, -16, 158, -4, -71, 63, -22, -251, -141, 431, 183, 133, 167, 149, -17, 199, 352, 59, -20, 340, -158, -75, 77, 51, -224, 65, 170]
5017A70k56K24Jj63lJ37j61j22J82O5k96M37k96n5j51L41j12l5J95k31K19j43
5039e3J67l53L56J62k51j80K05j25J40J2Ol02J96K42l50K42QK6j85K66q7M4j23
5062F3O9j15L0l2J93l64L41J6m18J75j6J03l9k70L15j70J57J06l58J55K27Mj85
5085a3R3N4k35P2j15K40k74K81j37k17L85j25J8K2p9N1r9O6L3j55J12J80k86q0
5109b08M34j42j55J94J7k88J62J01k84P2J08K70l88K06%j68K34j50q8j41M45l07
5131g6K4n6K43j99o0J96j18o0M67j49l69K24k4K2j57J03m2m8P8K62j16j82Q4q6
5155c9L9j07J56O6j61J19k06L98k86n5r2K11oj62K99k46P5l0K01j34j4j4j94N6
5179a26J79j10Q7j86J64m3NJ4k6n6M6n4o0m6j47N41j51q5J9qJ14J8m3n3n1J17
$$ y = [170, -86, 138, 139, -24, -27, 110, -51, -173, 9, 74, -222, 215, -81, -136, -287, 54, -58, -93, 102, -129, 90, -53, 114, -239, 117, 279, 28, -152, 53, -72, 68, 80, 86, -216, -20, 222, -128, 114, 122, 148, -37, 229, 142, 186, 63, 132, 17, 47, 15, 208, -156, 185, 201, -217, -42, -58, 45, 6, -264, 51, -119, 38, 144, -214, -59, 168, 172, -13, 80, 134, -101, -29, -144, 96, -178, 103, -34, -251, 134, 9, 27, 49, -30, 21, -78, -12, 21, -134, -22, 158, -128, -208, 226, 84, -71, 123, 140, -148, 14, 115, -169, -97, 11, 281, -107, 99, 99, -69, 165, 15, -73, -214, 231, -76, -52, -108, 135, -64, -124, 72, -46, -106, 361, 212, -157, 67, 43, 65, -92, 11, -31, -79, -1, 261, 145, -37, 47, -39, 0, -107, 49, 115, -46, 73, -133, 265, -21, -76, -168, 43, 37, -125, 174, -72, 3, -27, 174, 40, 26, 12, -182, -126, 53, -57, 30, -156, 8, -35, -30, -16, -42, -98, -52, -106, -166, -212, -359, 182, 31, -54, -35, -43, 71, 89, 46, -7, -58, 59]
5205E9o2q8p2j5K5K97j36k45J88L13k59L9k16J23m6J96N3j76q9J08Q6j98J91k26
5229a50L1K73j33K56k51l0M5K76l53J7l24M78j77N1lk0r2J60k64L04j85n2j04
5252b47M12j29j85j01L03P4p8k75K80j11J27k4k29K66J21o7p7l17j1M36q6JN5
5275A38k85J30J33L9j5J24k28K09k13r3M9j06J69M2M1m8p5J63J61l21k28K12L08
5298C06M4m02K45L9j79J58j95j83L23k21n8J59o9l4J99j63j14K88l79K20K4l00
5320b92M75l09K2L59m21l16N98j65O5L2k59L66k22l2L02k61P4K89m05J01l6k33
5342b68L95m2j41L40m58K38j1j3Km2j66K13j36J38L0p8l4M3J39J0k78j6J12L4
5366A1n7O2L3r0L45k68O1K8j50K77j17n3N2j54j34M63m07L01m8k61J75l89N60
$$ y = [59, -3, -91, -163, -178, -153, 144, 8, -237, -49, 264, 5, 44, -172, -49, -95, 101, 154, -22, -111, -3, 83, -115, 76, -150, -119, 154, 21, 277, 26, -4, 41, 317, -36, -19, -343, 135, -42, 9, 6, -14, -106, 54, -210, 94, -91, -143, -247, 165, 36, -149, -250, 53, 127, 49, -226, 54, -57, 70, 46, -183, 83, 204, 137, 60, -257, -268, 168, 82, 83, 138, -147, -17, 116, 155, 140, 264, 36, 245, 32, -61, -12, -118, 51, 93, 134, 86, 11, 174, 335, 14, -214, -2, 306, 350, -52, 193, 232, 53, 211, 16, -167, 156, -65, -123, 36, -33, -67, 132, -31, -145, 143, -236, -16, 8, -292, 183, -126, -104, 255, -166, -482, 116, -49, 16, 48, -211, 155, -67, -99, 203, -58, 16, 305, -100, 1, -35, -268, 127, 85, -56, 284, -174, 64, 53, 40, 42, 0, -166, 47, -89, 49, 79, 1, -33, 10, 149, 159, -119, -135, -23, 11, -46, 16, 49, -41, 304, 36, 97, 125, -25, 252, 135, 82, 134, -20, -154, 309, -98, 203, 155, -106, 69, -320, 240]
5389B40n2j81P2r1j46K67k1q6K0m2j64L60k3k91M6l2R3N9J30q9k8k6J08r7l2%
5415fj04p1L44k40O8k1k7J9Q2j30R0M7K32k99k53N22k40R9r1o6K26k24J07N2j99
5440h3P1J28j35m3L3j87K47k16J71K01k81M7M16l39J93j98j10J85L3k02O8%j39
5463a40J30K40k13Ml1K27j45j80Q1K32l95J12j17J15o0K25j52J00o6r8n2J69P6
5486F2k28K25J09k58j28M68n49L44Q9k66J92l5J04J04k11M8k03m2K86J19q7l5
5508A08k81K45Q3k01J67j83J66L0N4j63P1J38J6k24k1M9N6j13j14n5K01J96m49
5531b24J10J67M9k06J71K6qJ7p2Qj04M5k27R4K87o1J4j06K9j16L3M2J0J29l38
5556b31K10J53j49j10N9K29j48j53L91k16q2k06M27j62j5J7o4Q1l60J81J60j81
$$ y = [240, 188, 7, 79, -12, -158, 109, 88, 2, 22, -20, -184, 176, 153, -138, -92, -124, -31, 28, 158, 69, 41, 15, 123, 26, -6, -6, -110, -181, 163, -77, -9, -30, -57, -38, 44, -86, 4, 51, 283, -16, -269, 253, 13, 112, 21, -45, 181, -43, 64, 116, -83, -12, 116, -19, -62, -29, -216, 31, -185, -14, 187, -94, -47, 369, 30, 223, 25, -85, 100, 133, -69, -1, -1, -140, -10, 230, 17, 21, -10, 217, 72, -108, -27, 205, -190, -78, -195, -80, -140, 85, -67, 33, -33, -131, -183, -14, 62, -166, 59, 168, -90, -218, 250, -299, 45, 134, -132, 60, 25, 129, 233, 22, 70, -133, -175, 111, 230, 143, 108, -173, 72, 155, -46, 121, -62, 104, 134, 188, 25, 96, 234, 250, 26, 5, 54, 110, -3, -117, -172, 29, 225, -224, -114, 53, 102, -104, 67, 93, 85, 102, 30, 38, -66, -21, -248, -154, 133, 72, 86, -20, 9, -107, -74, -32, -22, 107, -231, -21, 132, -17, -127, -68, 161, 13, -140, 251, 35, -47, -253, 174, 12, -3, 14, -50, 31, -329, -148, 12, -169]
5578a69K76j02o6J78j39O3p4J40j03p2J39J41j16n3K17j89j65J10j24M9L4J3N9
5601D7K1j83K52k09j51K12r1nN1J05q5j6k46K83K08k95K13K9k94J04j20K90j27
5624go1K32k02k3J72j46j89J41q8R6L4R5k16k55J87K18J0K17k32j57K48K6k52
5647a52K53k83K21j07N9P1r8J01MJ02j32J23n0j4j75J47q3k53K03M0r6L98j05
5670A74j95J9M45m21O8J7N6l9k01K04k01k8J14q5j00K56l44R3L36k23K36l84J32
5693g1L17l55q8K49k80L22Q1k07K1J51k03j88J75K5J11j91L57k53j36k4K01k6
5715a2J16o2k49J60J24p6J77j29J28j71j44K90j47N8K0L6k2n9J48l03J05J05j50
5738e7k55L69L1j06J77l5l54J88P8j61J51o4J91j77N1j2N9k51K13M4q7n8j01K08
$$ y = [-169, 107, 5, -61, 117, -22, 41, -33, 107, 4, -68, 71, 212, 96, 43, 260, 71, -94, 16, -108, -59, -25, -12, 47, 68, -115, 137, -72, -223, -11, -102, -107, -56, 49, -36, -52, -298, -15, 193, -102, 111, 140, -154, -50, -170, 120, -7, -68, 164, -38, -61, 111, -35, -224, -83, -171, -75, -41, 54, -162, -417, -230, -12, -2, 215, -17, -174, 74, 100, -152, 101, -182, 39, -68, -9, 62, -36, 65, 69, 171, 39, 162, 112, 98, -77, 70, -13, -266, -63, -23, -119, 279, 174, -21, -2, 443, 22, 90, 107, 163, 124, -77, 127, -74, -102, 12, -73, -173, 83, -261, -168, 168, -55, 181, -203, -71, 246, -109, -197, 52, -228, 94, 175, -32, -11, 140, -63, -251, -76, -51, 60, -131, 226, -27, -163, -187, 14, -12, 104, 42, -207, -47, 77, 1, 178, 49, 177, 6, -138, 152, 5, 63, 83, 119, 97, 38, 186, -117, -12, 93, -57, -312, 57, 88, -18, 159, 124, -230, -42, 36, -125, 26, -38, 153, -24, 27, 15, 74, -177, 36, 80, -7, -65, -166, 42]
5762D2k82J76P6j93K08m2P7o3j3o3k36N45l00N5j50K97j4l32L49L5q8k42l0N4
5786a34J59k02j06M28l49J33K35m14K05q4L41Pm50J47J72l32L01N7k63K77j27
5807AQ0k12j33J69K76k71K53o7r0q6J15j7j36j59K90J01o2j00M8j14L57l79Q8
5830d8J62k66Q5j21K40J65j36j54J43K2p2q1j4J82k40K08j40O3k19J98L8l65N42
5853A92j04j7K5l57J05J10J31O6k58n2K82j81R5O4l23n5J66K19j0n7J09m1j76
5876f7J96l10J6J67r8l30N39k11j37M36l18K78k79L16k50K67k69J11J05j33k6
5897CJ67l7j25K48l28J06L7j01L1O0J2P8k09J76p9j71M1o9r7J19j77R6L37k46
5921a28K37J11k52L9k18K77r0L3O2k5j48p8J07n1j33J95M5m2J2J49j58L89l15
$$ y = [42, -240, -64, 12, -181, 27, -15, 62, -1, -14, -77, -313, 232, -68, -13, -163, 134, 120, -212, 137, 172, 84, -158, -188, -134, 25, -177, -283, 145, -204, -71, 164, -250, -45, -129, 212, 219, -231, -84, 88, -244, 57, 114, -149, 128, 1, 81, -131, -264, -95, 181, -90, 163, 96, 6, -80, 35, 18, -118, -277, 13, 114, 52, -48, 0, -114, 243, -136, -48, 114, -152, -67, -188, 52, 217, 81, -73, 70, 92, 20, -61, -75, 107, -133, 75, -65, -2, -221, -23, 15, -350, 192, 88, 71, 96, -261, -156, -46, 85, 151, -107, -159, 123, -58, 37, 101, -222, -277, -111, 108, 98, 41, 150, 109, -67, 129, -181, -165, 2, -96, -426, 113, -98, -235, 201, -117, 161, -118, 198, -52, 215, -54, 57, 162, 29, 3, 170, 133, 8, 256, -72, 34, 71, -30, 1, 61, 73, 151, -58, 118, 39, -132, -91, -160, -257, -138, -315, -219, 118, -128, 109, 220, -32, 7, -211, 66, -24, 9, 71, 46, -102, -180, -73, -124, -257, -62, -17, -59, -47, 102, -56, 333, 18]
5944A8J04l41PL0K96l66L88j83J09K08m34J99j00l0K27k33m1r8L09r6k5K48l28
5967a32J38L61m87J35K31j06r2L20l50o2K92j31q2o5J39n9J3p3k4J63L7k48J19
5990C7K34l04j48l0R2J52j06k3K45l3J27k07j73L37p6k03J16J00m80M21j08K14
6012A84j51j39j04J0K57j62K04j58J1K29rm35J45J24q7mQJ7j24M20l07K9J87q2
6036F3lj83J66j73K10o9J64j05j99M3L67m34J79N6P8l07J76r3K85n6k76P9rK9
6060a2K28k76J26l0J88l73J40M3K8L7J5j64j44J6J9L24k05k06K98P6Q3l06L8J88
6084A31l0p4L5O3j21K46l03J47k33J56J2L3K7m1k8P9j33j67K40j45K03Q5j50j48
6108a16j16J99q7K0M15j78ko3K03k75q8N7J60J47k55L2K3J0j13j55J95j7l8J93
$$ y = [18, 122, -219, -212, -182, 114, -252, 136, -47, 62, 270, -164, 35, -65, -95, 132, -101, -142, -240, 69, -27, -52, 196, -132, 6, 367, -120, 15, 246, 140, 48, 368, 18, -44, 248, 117, 35, -30, 109, 50, 63, -10, -34, 129, 166, -82, 37, 271, -33, -181, -211, -119, 33, -73, -96, 149, 116, 243, 36, -137, 200, 124, -79, 37, 137, -343, 78, -30, 184, 33, -106, -210, -200, 57, -105, 99, -59, -48, 181, 172, -263, -118, 6, -81, -85, -77, -60, -184, 236, -71, -42, 145, 63, 60, -123, 43, -130, 80, 11, 175, 70, -129, -86, 281, -153, 26, 82, 160, -147, 29, -64, 221, 165, -111, -32, -41, -12, 216, -60, 66, 36, 224, -149, -9, 34, 62, 99, 114, -50, -194, -178, -159, 165, -40, -246, 52, 128, 211, -95, -57, 131, 101, 27, 62, 125, 4, 250, -53, 94, -139, 17, 29, 62, 89, 48, 20, 99, -34, -201, 39, -106, 97, 182, 32, -116, -232, -33, -120, -100, 315, 137, 135, 72, 275, 0, -88, -31, 129, 276, 21, 53, 76, 86, -27, -182, 13, -4, -42, 151]
6132A51q2J23j59M8m1k05L11j92R5L5K0J18n18L37J38j83J24j49j56J98j51L3
6154a05j1L04l32o1J33L06j59N1M4j01j99J27j57N4J65j81L39j68l01L25j2l93
6176c32L21j95M26j79q0j8j8k05J17K17p0j41N9K61j19j56J03J61j73R4l3l7J75
6199A78l41K6M40l76O1K7m4Mj68J44J12j25R2J20k14J26N1l00K78j12j89L04l94
6222c00K69k20J76K41j65j16j8J28m6j6l7J33L7o7J05k70m9K11k15L90j71R3k00
6245a07L06l59M17m39J12J65J26l01K2K0R3K38m55J02J12J1nj9M2k68K05j24J43
6268C7k38L51k30j27N02o23L80q5k09M56j2k67J02j25K14l36K3K75K11l54P3k56
6290b38L77j5k35k20L84j19K4k13L03K29j85q3KR2j87R6J61j86J00m20L03k50
$$ y = [151, 69, 192, 33, 81, 40, -165, 146, -46, 49, 84, 104, 222, -296, 41, 179, -4, 120, -29, -185, 13, -138, -105, -116, 188, -144, -205, -72, 234, 75, 126, 170, 69, -130, -3, -160, -106, 59, -122, 217, 49, -252, 73, 61, -332, -11, -206, 220, 41, -39, -57, -75, -280, -163, 54, -16, -157, -98, 163, 44, -112, -9, 152, -21, 73, 40, 3, 178, -163, -137, 303, -73, -12, 15, -29, -25, -193, -49, 63, -62, 30, 150, -64, 62, 113, -187, 91, -21, -210, 94, -300, -31, -251, -75, 166, 1, -115, -133, -5, -51, -67, -104, 29, 66, -1, 104, -166, -215, -4, -219, 171, 0, 93, -107, 199, -160, 257, -182, -70, 95, 221, -80, -58, -38, 55, 293, -162, -60, 52, 63, 58, 39, 81, -187, 18, -106, 37, -201, 150, -80, -207, 295, -328, 52, -33, -242, 214, 202, -65, 37, -88, 126, -210, -187, 88, 299, -55, 18, -238, 139, 124, -111, -331, 53, -66, -42, -255, 48, 277, 92, 9, 11, 103, -84, 12, 173, -13, 87, -333, -30, -280]
6312b80K69J02r5j5j28J87q7P4m5J40L1l1j20P0k28O16n84J73q8O8J42j42J03
6335A32j60J4J65k38J45J91k15O8o7k8J1K1j64J55m9j39K32n5J25J02l01J50j13
6358a8j94L00j02o9K55Kk9k49l5L43j31l3j51J06m7n9J52n6J9m9M1M5k08j48K36
6383g9l8j47Q6J20N9l97M05j10J65Pj60K62j90j56M12j69m33M28r5l4K60k53J26
6406F9j15K4L45l00j59K33mj59J96R9l02J15J85j65o2J4j8k33K85L3N3l08K41
6429F7jj06L94m62Q8R8j21J04p5K79k03Q7m84K71J38k71J37K7J88k70J36k44%
6452b23K26J52k18j13L99j85jj75K25j58R2J10q7k6p7J27q6o0J83j67K4O5k9M3
6476D1J75m92K59J08k52K01p9J39n5Q3j41L17l41J65q5L1N8j91K13j32l6o8J39
$$ y = [-280, -11, 91, -4, -19, -147, 40, -47, 27, -18, 122, 153, 122, 2, 72, -156, 460, -124, 49, -39, 29, 171, 29, 132, -28, -14, 151, -87, 58, 249, 34, 102, 35, 7, 18, 39, -125, 30, -19, -158, 74, 19, 144, 246, -55, 95, -18, -212, 88, -14, -83, 172, 174, 145, -104, -139, 204, 73, 40, -111, -5, -52, -111, 41, -15, 4, -45, -4, 41, -167, -315, -79, -117, -264, -178, -58, 1, -396, 9, -101, 64, 71, -89, 173, -17, -173, 239, 70, -363, 65, -30, -64, 196, -57, 69, -46, -22, 323, 23, -136, 97, 93, -66, 130, 229, -73, 42, 227, 62, 0, 14, -4, -237, 48, 81, 134, -174, 67, 66, -40, 354, -108, -20, 78, -43, 61, -14, 265, 62, 149, -335, -64, 74, -197, -60, -33, 155, -115, 21, -223, -223, 3, 155, -63, -176, 223, 38, 37, -138, 87, -71, 21, 131, 44, 18, -59, 68, -18, -78, 105, -62, -38, 27, -2, 41, 216, -276, -17, 91, -161, 40, -39, 100, 45, 128, -13, 304, -37, 128, 43, 74, 132, -59, 154, 22, -14, -82, 57]
6499E7K20m30J97r5K24p4j9n8K84m42P9M11l51K3On6n1L34m95J44N4P4M3j28q6
6524a35M59l23P8M1o1l24J16k42K46J73O9k40L20j13q6J44m04J67k0J63N3j76
6546i5l7L22j60j98L45j37l14M20k69J95k24M45k87P3Mn4J05j4k56J07kJ22p3
6569A8j71O1J74r7L8J24r9L5r8j68Q8J41j96M52j39r9r4p8J22n8J21n0j0O7j33
6594d9J83k09j66L76k25n2K74J3q3j05K04j89o0J77l53l0K27OJ67j60O0J06o0
6617E2j63L5q9K95j12o1j19n6L19M5k22J88j56J58J84k46J25m1m31J77J31m23
6639d10K91R8J97j67J7j84J7J53p4n2J16q6j8J60Pj39P3J47j7o1J04k89J63k55
6663b09J39J76l91L82j23J87l57K34J60k48j45K12j28J26p2K58l33J70RQj0m1
$$ y = [57, 277, -153, 44, -51, 173, 99, 80, 22, 306, -136, -57, 354, 3, 26, 32, -24, -75, 259, -236, -92, -38, 36, 79, -49, -135, 324, 1, 79, 120, 59, -265, -149, -391, -145, 28, 97, -143, 177, 64, -22, 122, -282, -115, -135, 28, 81, -95, -132, 190, 30, -168, 177, 40, -274, 146, -123, 72, -152, 293, 6, 79, 83, 29, 134, 120, -136, -29, -31, 91, 18, -153, -92, 82, -15, 23, 147, 48, 83, -15, -183, -95, 46, -150, 302, 163, 64, -30, -108, 14, -44, 77, 27, 17, 84, -49, 134, -75, -241, 135, -90, -142, 132, 145, 62, -43, 161, -28, -88, 89, -264, -294, -67, -61, 106, -54, 6, 112, 52, -111, -76, -165, 130, 18, -43, -162, -218, 101, 146, -76, 112, -44, 114, 298, 52, 177, 136, -295, -118, 13, -410, -119, -21, 176, 9, 26, -158, -141, 12, -62, -114, 2, -84, -102, 58, 65, -74, -1, 146, 129, 68, 172, -117, 46, -209, -70, 106, -285, 97, -26, 161, -196, 38, 198, -50, -195, 17, -111, 15, -57, 201, -132, 38, 47, 55, 45, 4]
6685Do7j5J7J57j94N2O2J30j95O6J85k78K46l05N7O8n1J52k28K97j14J24k57R4
6709GK86l23L02m74L62K2k64K1j53l8M83k05K49l29j08K49l6PO5q5p0r9Q1N4j34
6734a30q0L10k1j12Q9n7j19J73J38k03%k3j9j33Q7P7k40K91m0k04K16j10L6p5
6758a49j10K26j23Q6N9pO3Q8k76k0J51oOL3k27J52M1q1J93n1j53J5l7K26l2j50
6784h3M9K4L7K75m04l2K72k50J87K36l18N1M8N0q9p1J95j49q9J74J08l41K38o2
6808E6j85K07j46O3j38K82j67q5N7o1L33j91r0j04L2M7J99j59j14L3J57j34J6
6831i2J51j15J25J86m02P6j3O8J28l93L26L5L8l50R8J05l0J65j13J51l1k11M3
6854e5N7k28O7j47J88Q7qJ04j72k9K09j13j62qL00N7ok51K64Q9m1k09J89j99R8
$$ y = [4, -63, -78, -61, 96, -98, -46, 16, 146, -49, 17, 202, -76, 170, -135, -78, -10, -61, 91, -137, 160, 46, 170, -87, 7, 293, -30, 272, -202, 160, 182, -82, -61, -214, -252, 231, 26, 275, -54, -162, 87, 51, 58, 123, 38, -32, -131, -50, 4, -130, -210, 100, 79, -33, 56, -1, -120, 53, 191, -12, -12, -35, -54, -187, -100, -23, -263, 28, -12, -216, 0, -110, -74, -149, -259, -33, -156, -70, -11, -18, 45, 133, -143, -163, -12, -18, -12, 21, -206, -54, -13, -94, 99, 48, -105, -90, -127, 99, 67, -83, -34, -10, 27, 302, -102, -134, 138, -112, 75, 311, -7, 44, 92, 142, 53, -18, 177, 28, -61, 113, 221, -120, 118, 56, -129, 78, -68, -5, -143, 139, -28, -113, -56, -117, 216, 25, -65, -169, -137, -90, 109, -50, -164, -131, 26, -108, -92, 59, -56, 69, 255, -147, -71, -84, -16, 112, -281, 45, 80, 118, -232, -134, -29, -59, 106, -7, 144, 113, -98, -55, 2, -226, -159, -306, -118, -31, -39, 65, -107, -136, 73, -40, -202, -210, 90, 147, 141, -110, 154, 243, 202, -7, 182, -17, 81]
6879H1q1L21l94NJ46n8r5J01j4M2M5k17J24p7R7K39j62j10K71k87p8n0m7P3K49
6904A24k71j71J46L3O8J30j10l9L42k21j02P5q1m2K66l07j74L80L0k83R4J92K3
6927A02j26J09k47J60N8j64K65R3j39k6kr1J64j20J38j49J81k25m6rJ64O5J05
6950B60j65k77J46K00K8k45J79M6k32J81j6k59M2Q6P5J72j75O2OP8l30l6J9Q5
6974g0q9J28J54n5M6j33L4j69J53On2q2J68k42K4K50Q8l49L88l06m6m2J23m8L11
6999A90l32J62j26j4J86J26l66Q9J75p3j72qK62j41k8J15o6q2q8K53J53j36k36
7022a57K00J03k91L43l28K18l7j13l5m1K5j98J90M37m10p2K48k02J23r8J00J8
7044B3J03j40j49K16K1Q8k71Q8K2J89k66K14j79j55o2J08J16n8J97j9q2JJ01j48
$$ y = [81, 0, 321, -73, -68, 78, 20, -75, 26, 12, 54, 99, -118, 6, -71, 26, 265, 103, -7, 264, -23, -101, -151, -198, -125, 124, -147, -318, -172, -139, -71, 59, -51, -90, 252, 31, -71, 4, -77, -119, 147, -160, -334, 46, 76, -207, -113, 79, 102, -24, 85, -162, -2, 56, -108, 157, 250, 111, 85, 83, -8, 156, 36, 174, 25, 206, -19, -65, -74, 90, 155, 260, 95, -182, -36, 164, 192, -53, 126, 172, -60, 121, 105, -154, -112, -26, 49, 221, 46, 108, 114, 192, -138, -174, -155, -70, -159, -31, 123, 68, 114, -19, 15, -154, -1, 5, -47, -129, 39, -203, -179, 71, 159, -190, 198, -108, -154, -196, -73, -121, 190, -142, 20, -106, -120, 66, 192, -174, -85, 90, 17, -155, -163, 99, -42, -70, 45, -21, -103, -191, 62, 215, 79, -157, 43, 146, -145, 198, -130, 88, 51, -62, -97, -138, -113, -311, -121, 316, -94, -166, 82, -120, 3, -95, 5, 23, 126, -14, -163, 53, 74, 162, -109, -21, 1, 190, -76, 138, -41, -196, -258, -150, -34, -92, 105, 86, 4, 5, 106, -42]
7068d2P1J41k12q2Q7J05j30K97j01r9jN1j62L19l68J21j00p6L32j25J84j38l69
7091b97K03j71J33M82m10j9K73j81J0J34r7K12j75j83n1J95N7j62J97j44K75k87
7113fJ64j72j68M17j29r7J30j00k04J58j09j1M82k64k43J53r8J42j44j27K95o2
7135Gn6K62j32j08P1q6K77k75ln8R1Q6j21j81L8L5J25J95k00r8J23K16k53K38
7159A93j55J26k39O8J07qk1J64j67qk8j99K82Oj01j44R8QJ39j44J10j92PJ60k5
7184C7n7L66m96L38k3l47J73J29k98K52M2k31K00j42j04K52j89J52k6j6k9M0k80
7207b57Q7J96l0J03l09J60n7J38P8k88K47J79m32K80l08Q8J60j58P9k6J20k01
7229a51K36j60M2j6J65J63k75l32M67p2J3m0o6L04m3k35r0K90kj41j17Q4p8J6
$$ y = [-42, 29, 170, -42, -124, -37, 68, -62, 235, 134, 35, 34, 85, -77, 242, -126, -5, -105, -181, 151, 26, 210, 72, -297, -94, -265, -132, 350, -60, -79, 194, 13, 23, 157, 60, 272, 97, -86, -137, 58, 115, -47, 150, 6, 281, -6, 158, -14, -182, 235, 106, 9, 139, 39, -165, -7, -116, -127, 355, 91, -152, 1, -97, 45, -99, -226, 69, 7, -49, 213, 81, -27, 44, -42, 235, -40, -43, -101, -10, 76, -45, -226, -188, -153, -28, 167, -33, -131, -8, 208, -45, 193, 38, 164, -75, -7, 100, 92, 71, 235, 68, 60, 32, -167, 115, 121, 20, -124, -26, -18, 121, -23, 87, -105, -98, 62, 37, -20, 346, -150, 188, 165, -182, -9, 120, -178, 74, 116, -115, 85, -57, -161, 91, -98, 54, 28, 12, -17, 23, -257, -170, 26, -4, 99, -210, -50, -107, 31, 109, -179, 68, 247, -185, 95, -213, -125, 35, -123, -44, -70, 50, -151, 85, -75, -33, -49, 116, 279, 4, -328, 139, 67, 80, 40, -26, 278, 235, 0, -90, 200, 198, 57, -60, 24, -54, -38]
7253c8J06j74K83k06J47J47l51L55k76K82j44j41K30l76P5NrJ78j99m6J58rK64
7276B61l27k35K80k4j41L88l84N9j08M01L4j86J09j65L07k54m2r8J42J58J60m66
7298a31N35l95l7M4j17J6k75j8L66J76r1o7j96L86l38J0j7K57k15K18j69J80K9
7321A51j67j04Q1J12n5k19K89K7n91M31J32J46j64j35J59n9P2k07j6K34N5l62
7343a90K61j99J86p2r2O9R0k28l6K83q9k8J35K8k26K01j39j31P1p4J31J5Q4j09
7367e9J33o2R4K2j56J60j42P6n9J71j94j53j49J55K70j97j8m3J27J34k50J31j85
7390a94O0K96l19J12o7J97q7n0J80j25o1j54L08j4j20J30j57L17O7n56K30j01
7412a08J48M5%j25j38K22m7k3K35k98J25j31J58N6j78L7j22K32l26Q8N3J65O3
$$ y = [-38, 68, -106, 177, -29, 118, 265, -86, 269, -7, 275, 131, -10, 220, -156, -81, -76, -85, 93, -106, -152, 6, -3, 261, -66, -301, -21, -45, -186, 202, -182, -123, -231, 170, 204, 18, 127, -38, 269, 15, -27, -125, 17, 175, 335, -131, 404, 9, -28, 16, -101, -85, -360, -378, -12, 164, 73, 6, -190, 196, -142, -132, -149, 108, -107, 111, -58, 122, 151, -16, -120, -39, 73, 18, -201, 88, 115, -476, -45, 87, 233, 69, -66, 93, 34, 106, -101, -117, 117, 172, -190, 71, -128, 58, -14, -106, -37, 53, -175, -211, 72, -17, -45, 90, 118, -108, 93, -46, -177, -106, -180, -49, -34, 50, -59, 74, 12, 106, 128, -28, 132, -10, 66, 7, 178, -16, -169, -318, -163, 107, -90, -108, -151, -24, 110, -140, -9, -194, -134, 162, -157, -45, -112, 85, -2, -52, 128, 3, -58, -212, 96, 82, -38, 92, -65, 252, 319, -237, -7, -108, 40, 85, 85, -40, -178, 44, -3, -26, 209, -89, 36, -95, 63, 119, -59, -22, -144, 88, -238, -150, -97, 68, 131]
7435A31l5j16K07k59M1K12j40j80R1R5J6n9J30l62L23q2K0J13j25k28L66j73k3
7458c7J76k63K28q3J83l63K28P6j48J1r8j04M61k22j88J15L36k73M7j35J78k8
7480I7j6J86j86M7K32n26P8K30R8k03j29M8k4J18j71K71k05R5J9J90j93M1n1K43
7504B89k62J6L1k01P9OK13q7j7J22J23l27J14q3J48q0j07J49k61O8L6M1k09K07
7528HJ28r3q0K30j26R7k26J45k0p5j94K41l17L30j41Q2J86k31M1J7J7j5J93j90
7552Gj29Qj63J41J73R5j50J20j34LR2l2j8J5p2j70P5N6J20k04K46m64M79K4k33
7577a15O9P3mK23k60mJ40j55j21J04jM2nr3J05j48L04k07L4J57l98L19Pp1J57
7602A52j06k34M62k53Jq6k9N7J76j4k51K21q7J4p1J13j44Q1J26o6k00K71j54M3
$$ y = [131, 96, -20, 187, -72, -31, 181, 41, -139, -48, 47, 63, 4, 134, -228, 95, 13, 33, 146, 21, -207, 159, -14, -37, 139, -124, 104, 21, 204, -159, 69, 145, -3, 8, -90, -194, 267, 45, -143, -28, 308, 35, 82, -53, 125, 97, 81, 267, 81, 128, 360, -166, -88, 142, 240, 37, -92, -44, -68, 50, -121, 150, -55, 40, 59, 249, 56, 97, 46, 289, 27, 43, 74, -127, -48, -42, 171, 84, 67, 189, 312, -15, 99, 16, 164, 84, -23, 126, -135, -67, -31, 10, -199, 8, 136, 43, -37, 193, 67, 164, -62, 83, 63, -12, -206, 35, -282, 48, -93, -11, 175, -56, -15, 2, 19, 4, 197, 7, -122, -114, -277, -136, 37, 132, -18, 102, -32, -29, 63, 31, 13, 28, -44, -214, -139, -83, 37, -167, 79, -385, 94, 118, -115, -46, 27, 23, 246, -14, -18, 122, -33, -154, -50, -51, -9, -14, -107, -2, -150, 154, -53, -19, 138, -260, 59, 66, -5, 152, 46, -188, 274, 21, 22, -64, -93, -36, 140, 126, -125, 96, 9, 23, -48, 65, -79, 2, 128, 62, -138, 133, -21, 22]
7626B2J15r2j47m6J31N0j52K24r5k04J45k22K81j23p4L73j36J96l84J92J26m45
7648b65K88j30j38L59r3P3j22j66K73j32P7k18K31p6m1m6p6K31l85L73j67j4L82
7671B18m03J68N9k13K90k70R8j13J25J63J06l05o6L32k77J27p6J21j49O9j86L84
7693B02l39J04K8l22L48J01l4l82K67J08J32l71K75q5k61L01Jl4O6j29k64J35
7715a53R2J05K5P2l37K97j19J3n2r1J54L2j01J66j93r7P1l6K22Q8r5K70l96J27
7739F4j16Q2k71L29k16J63j99J01K80k83r8J82j44R0J74n42M31m2L4J03j29m3
7761e0O6m3k36M48k49j8M7n6J9o4J69K32n11M47j55lj21L05k52O7J11j50R5j76
7785g8L39l80J94o1m5J13N3k47j0jJ24m1qK98k57jj51oK84J23l06R5k02N8K93
$$ y = [22, 137, 45, -102, -148, -17, 33, -119, 105, 10, -194, -49, -271, 10, -113, -187, 186, 50, 246, -138, 54, 180, -265, 23, -107, -245, 114, 21, 94, -28, -194, 79, -53, 24, -194, 37, -39, -80, -126, -202, 29, -356, 17, -150, -164, 218, -185, -17, 42, -171, 119, -151, -53, -166, -41, 122, 228, -77, -143, 189, -88, 39, -37, 84, -65, 4, -182, 202, -137, -33, -5, -327, 21, 122, 88, -294, -27, 81, 213, -158, 117, 32, -229, 72, 73, 39, 105, -24, -288, -153, -61, 44, 69, 141, -196, 101, -18, -5, -57, -148, 6, 38, -63, 103, -90, -187, -116, -152, 70, 158, 63, 333, -63, 64, -52, 30, -241, 88, -128, 35, -164, -63, 217, -66, -164, 18, -126, -36, 138, -404, 27, -15, 19, 122, -7, -50, 16, -27, -263, 185, -64, -82, -35, -91, -72, -136, 33, 265, -246, 201, 46, 43, -78, 227, -25, 42, 153, 3, 98, -78, 261, -119, 75, 14, -31, 82, 135, -112, -122, -123, 1, -40, -48, 250, -7, -8, -159, -165, 119, 242, -64, 31, -171, -113, 180]
7810A80j01j96j11M69l50P1L24l76r2P2R7p9P0J10j33M4J71R8m75K94Oj87n7K96
7834A45J2j26j59k7J4O7J91j15J52j83R8Q7p2j67J81l08K06L5j05Q0k13P8J50
7857B1J45l93L08K3j44J91l09J02K38p3K1j44J71l62L93k52J04K03j19m57L04
7878b9j52K81m4k8l2k21L19k4r3Q4j05r4J06R3j53o3K43j23pK40j82l72L00p4
7902a30K49n3J25l16J70q5j29L81k34K29j45j39j3j11J20l4J80O9j64k6K76k27
7924gj61L02J15k65m5J47L0j86j14K66k4Q3L5l15J94k26K21l8j44J56L3k56K28
7947B9m7J44l11K21j52K28nj50K17j03O4l6j8Rj08k15K60O8p3q7J25J5k85J86
7971b4P6J09k8q6J30j39J62J32l41R2q5j19p7K79l9n5Pj8k24K95j80J72j04L17
$$ y = [180, 79, -117, -228, 241, -109, -38, 286, -90, -182, -110, -13, -92, -22, 88, -45, -1, 170, 268, -207, 87, 93, -94, -151, 145, 157, 31, -128, -155, -141, -74, 117, 2, 154, -29, 69, 156, 84, -83, 98, -210, -4, 31, -74, 6, -207, -129, 21, 166, -227, 81, 104, -40, 151, -158, -56, 182, 109, 130, -14, 157, -205, 188, -64, 40, 243, 124, -333, -29, -181, 100, 56, 28, -4, -225, 94, 70, -23, 61, -44, -138, -32, 61, -92, -155, 88, -35, -42, 198, 16, -356, -56, -130, 119, 66, 191, -125, 45, -40, -169, 212, -22, 207, 62, -77, -90, -201, -81, -115, 65, 134, -30, -56, 220, -7, -168, 134, 249, -16, -61, 86, 116, -70, -184, 82, 58, 141, 176, -139, 55, -171, 50, 12, -132, 24, 57, -199, 29, -18, 126, -185, 36, -116, 112, 107, -43, 174, 71, 135, 99, 81, 90, -18, -233, 27, 95, 22, -65, 60, 75, -210, -24, 52, 161, 133, 47, 177, 38, 200, 332, -9, 83, -2, -121, -198, 81, 42, -13, -6, -24, -248, 47, -133, 39, -65, 252]
7995B52l30O3Qj1J41k26K34j33J9l51L80k07J20QQ1k89L90j03J39j61L94k29j09
8018H0k55kJ86j19L36j87R6O0j50k10K3P9J70p1P9j3l09R1M33n74M48k15M6J55
8042A77P5j33k44K13M0r4N6p2J0L36m72J83k29K41k9n6J1k58L93oj83l8j53J69
8066f3R7j13J3O6P0j83P3L6J7L6l19M46l79J33K39L2j72q4o9N20o40K60J52k75
8090a07lJ49J96l14l2j3%J07J85k94J22J32Q8m75K56n4P9j83K52k73R1N2m9Q7
8114ar1K21q0j14K6l3k5Q8O8q9R6r2Jr8K95k43j28R0J58j56M5L81j17j45k98J42
8140i9K32j08n5J49l48K59j45J28L8J01q1k07L55k12J6j36r3l0J21J26p9K05k49
8163a12J69k8j03Q0J11j62j00M31l63K12j20k25K33j71L8K03r3K0J35k11Np2%
$$ y = [252, -78, -15, -7, -18, 123, -103, 131, -2, 17, -334, 46, -161, -41, -33, 48, -241, 149, 46, 185, 24, 418, 189, 80, -175, -177, 9, -110, 226, 39, 135, 195, 45, -165, -142, -63, 107, 36, 115, 102, -207, -116, 317, -257, 191, -24, 22, 177, 252, 119, -125, 88, 128, 34, 90, 18, 28, 364, -108, 75, -154, 87, 58, 2, 13, -245, 148, 142, -41, -79, -232, -63, 34, -79, -66, 0, 70, -113, -40, -4, 13, 49, -270, 176, -203, -70, 169, 201, 29, -55, -124, 396, -244, 16, 168, -107, -110, 39, 235, -79, -111, -124, -124, -17, 168, -126, -4, 128, 216, -259, -3, -57, 22, -161, 91, -182, -91, -39, -88, -1, -92, 129, 49, -65, -39, -72, -97, -9, 59, -30, 66, -26, -25, -123, 172, -71, -199, -109, 49, -107, -62, 319, 202, 57, -241, -99, 133, 25, -30, 119, -229, 30, -115, 13, 51, 152, 71, -136, 219, 7, 23, -113, -206, -236, -115, 11, -68, 137, -112, 57, 29, -74, 6, 117, -45, -145, 286, -77, 135, 15, -210, 23, -148, -110, 93, 0, 20, 155, -56, -51, -123, -123]
8186a23K66Kj07L1O5
$$ y = [-123, 143, 145, 38, 69, 134]
8191A34
$$ Imaginary data points
##PAGE= N=2
##DATA TABLE= (X++(I..I)), XYDATA
0@%%%%%%%%%%%Qj6J6j6J7k5L2m0N1n9P2q8J04j23J47j71J97k28K66l06L48l97
33b11M53n15N80o53P33q21R20j027J140j265J404j556J724j905K101k318K554
50A338k812L098l413L761m148M581n069N623o256O991p855Q886j0143J1717j3753
65g454J6503k0456K6709l8648J03266k45742J09274J21777j72566K71134j69073
76e276o4558J29688j26081J68675k9074k55742K64050m8215j03111J88417j86573
87f7800n074J91568j40109N2026l5118j13109K00074o0002o7734J18361j78796
98a05713R7882J48199k23121O9727K5563j03757J74764o4224o5515P3490j06587
109g9292J23217K0099j73726J54651l8267q3233J67648j15442l9371J13241o4626
$$ y = [0, 0, 0, 0, 0, 0, 0, 0, 0, 0, 0, 0, 8, -8, 8, -8, 9, -16, 16, -24, 27, -32, 40, -48, 56, -67, 80, -91, 106, -122, 144, -162, 186, -211, 242, -273, 307, -346, 387, -434, 486, -541, 599, -666, 738, -818, 906, -999, 1102, -1216, 1338, -1474, 1624, -1789, 1972, -2176, 2405, -2664, 2959, -3297, 3694, -4161, 4725, -5418, 6299, -7454, 9049, -11407, 15302, -23346, 79920, -165822, -56548, 65229, -107337, 163797, -5276, -69834, 59854, -66227, 102448, 73374, -182368, 81682, 33467, -69644, 118773, -67800, -72874, 118694, -21415, 30611, -4507, -117616, 82458, 22456, -45278, 73083, -105713, -7831, 140368, -82753, -13026, 12537, -91220, 83544, 19320, -46195, 27295, -79292, 43925, 64024, -109702, 44949, 6682, -76551, 91097, -24345, -63716, 49525, -15101]
120a5101M4631l6289o5387J21130n8259n594Q7057j38374L4636R8979r4732L3662
132F359M508n0374O6404k5584K148K3821q0029O8326K5041q6400P6159j5069n7391
145d2081P5997l7595j2868M1168l2960K8812k6790k5074O8673m9365L214N4898
157D6029p9330J9426M3465m6516K3412l42j2174J4692k5900K9067k869m1364N4741
170B2337r632m1462M5465j4921k1803K8458r738K949j908o985K0371k8744K836
183a2777L5982l6785O940K8164l6518Q567J1597j4044J4439o508O509j031k7858
196b3323L1523N72k3814L4804j7809k4107L0963n526k942L966p625R578j3642
209g382O861J7681l2500J3151K2554l1794J0348J3180k0361Q794M726k793k221
$$ y = [-15101, 29530, -6759, -72146, 48984, -9275, -14869, 72188, -66186, -31550, 67429, -27303, 6359, 10867, -39507, 26897, 1313, 3461, 27282, -52747, 15579, 40620, -45780, 30379, 15310, -42081, 33916, -3679, -16547, 24621, -8339, 20473, -6317, -31391, 37282, -12083, -8869, 46029, -33301, -13875, 29590, -16926, 6486, 6144, -6030, 8662, -17238, 11829, 8960, -32404, 22337, 12705, -28757, 16708, 1787, -20016, 8442, -1296, 1653, -255, -7240, 13131, -15613, -12777, 23205, -13580, -6640, 21524, -14994, -6427, 5170, -8874, 5565, -943, 5566, 4535, -23323, 8200, 8772, -15042, 19762, 1953, -22154, 8809, 3283, 341, 4307, -3318, 6260, -7382, -521, 17160, -15340, -2189, 20365, -11429, -1081, 12099, -8262, 532, 5258, 2465, 244]
222B44p301J7245p466j6652K6728j0669j4727K7481j4521j3447J8239l191J6k152
236a73j784P400j6841J0834J4888k8726J3013J4985k6293J0756P793j3417O622
249i43K057L216p084q948K0823j0843j1478K7680j6025j3585K5462j0549r179
262i396J2642j635j497n575O939O495k1010J4241J3334k8428J3764J3267k3623
275a0482Q984R590r249r3p2Q642q107q842K3182j1913j4919K7746j0911j5639
289a2083K1096m759q998N447L385R13j2681R206J1686k5924J1913J7774k8394
302a1419P774J6846j8853P30R994j446p492k505J6863j1602j2673K7893j1870
315B240j9498K7109n924j6534J5816K171q614l934R255L908j9180J2697J4957
$$ y = [244, -7057, 10188, 2722, -13930, 12798, 2129, -12598, 14883, 362, -13085, 5154, 1963, 1979, -173, -1957, 5443, -11398, -564, 14324, -14402, -1389, 13596, -12697, -1941, 5852, -7565, -943, 1114, 4330, -2754, -11702, 9121, -1722, -13200, 14480, -1545, -15130, 10332, -217, -9396, 3246, 1611, 114, -5461, 1478, 7973, -13037, 1204, 14538, -13890, -126, 13141, -10482, -1498, 8092, -1157, -1250, -1322, 7320, -787, -9629, 13553, 1640, -13279, 14467, 3556, -12083, 9013, 4254, -4744, 703, 4088, 5001, -7680, 1526, 13212, -12712, -799, 16975, -11419, -3645, 13201, -5652, -4922, 5072, 3626, -3866, -6371, 10492, -1110, -13783, 14110, 2240, -17258, 9851, 3927, -12607, 3209, 5380, -3234, -7168, 2087, 5995, -13185, -488, 14469]
328A4469k8603Q940J8810k3987L555J5862r911n144L981Q386r797q065K4439j0629
342B306j8435K7705p514j9210K1708k15j1894M463M966P33j4330J0239J3545k6326
356a2259J0210J9855k8501N552J8082j6314j69Q231L50o742n545J8264p768j7439
370a4193K7685p214k2212K5500l429j6505J4029J757m379o283L929J1542j9991
383i764O333K1461k9201L547K2968k3500J354J4602q480p61j778P187l903j4810
397a4745K5143k866k5545K6083k578k0985K0930o33j1763N488K969L978j3292
410g816R85J8395j9871M086K1526k8114k29K2456j3852K09N415l666O89n513J1802
425F502k279j9916K3836K941k2538J7735k510j5052J6279J696n371m485p06J3644
$$ y = [14469, -14134, -5194, 13616, -10371, -6816, 9046, -865, -6009, -2028, 6358, -3439, -11504, 12935, 2306, -16129, 11576, 4062, -15148, 6560, 6345, -5549, -1086, 3880, 4613, -9717, 522, 14067, -12259, -2049, 17806, -10695, -5143, 12939, -3375, -3544, 4687, 5037, -1705, -7250, 11014, 3246, -14193, 13492, 6278, -15934, 9566, 6137, -10368, 3661, 5418, 1039, -5244, -1315, 10227, -9764, -3431, 18030, -11171, -7624, 15344, -8156, -6802, 7800, -680, -1441, -3219, 3968, 65, -14745, 10398, 7532, -18013, 8070, 5492, -15493, 5437, 4804, -6959, -1471, 1498, 5476, -7816, -6831, 11564, -8307, -4221, 17305, -10809, -11038, 11418, -2434, -2225, 3190, -476, 213, -5300, 6502, 4223, -15693, 8143, 11084, -11454, 6281, 3771, -11281, 4998, 6694, 1323, -3162, -3868, 9776]
439I776j2753k775J8642j9367J147K1525k0143m456J3333l871J824j179m5j958
453c00j0146J8193J848k1910J5181L417j4929J3426q64j2335P308N289J587r464
467c699m189J2482q401R89J5575j9176m858J8066o729k818M363m247L38J025O229
482D950m399j3198J3952O437j2757P314q10j1980R470Q261o362m817K868K888
496A817m849L636M572j0813K175J2957p386q396N706K004k479O080P12j1667J341
511d590J1369m655m482M789j471k399M370J024p418k181J2272M36j0475M311k131
526a231m922J3894q31j1978J763L744M027m002m997P036o238L287J3489j9894
540f853l381J5966p631L986L383j2811L324K922N634M33j7095J2524P156j5538
$$ y = [9776, -2977, -5752, 12890, -6477, -5330, 16195, -3948, -8404, 4929, 1058, 2882, 1703, 1658, -300, -10446, 7747, 9595, -12315, 2866, 6283, -8646, 4780, 3916, -8419, -1111, 4178, 5765, -3699, -7888, 4594, -3807, -2818, 12757, -6419, -11277, 6789, 60, -2758, 1605, -2642, -2304, -1279, 4950, 551, -12647, 1305, 7742, -5015, 2299, 1489, -10491, -1021, 7240, 878, -3939, -1071, 1817, -3032, 604, 5176, -5637, -3462, 9495, 2109, -6287, -581, 1423, -1056, 5024, 5736, -5931, -4590, 6779, 2124, -2358, 2431, 960, -1439, 2931, 3955, -3463, -5644, 6628, 7064, -3411, 900, -1231, -6153, 7741, 6910, -5068, -3305, 439, 4466, 464, -4533, 2503, -3735, -448, 13041, -6853, -10234, 5732, -1899, 2087, 5470, -7341, -4017, -1095, 4539, 4972, -12123, 401, 7557, -7981]
554g981J3260m514j5992K1862R71j2506L974m913N983L366o229Q891j2776k028
568h632K3560j7676p825J8167j2107N224R832j7087J749K859N671P756k0530N828
582c211J1206j7004J6463K040k5078J7464P517j0718M683q237K776N819l550J1469
596A1639j5451j1501K7182p321j0788J5701j4198k327J6842p942l645k472K261
609b020J1818j2917R88Q896j9322J2666J4519k2452M283P323q050O304j852j390
623a206P75n231J3652n652j6274J8792j314j1708J5222n772j1054J0156K288j334
637A340m631O61P431r958K839J2069j7911J987J7920j3851l507R792o173j35M215
652B088J910m212p410J2221P78j3853J2936N91j3985J2768K732j1228L172L754
$$ y = [-7981, 5279, 765, -15227, 6635, 7606, -4900, -926, -5839, 144, 3510, -2719, 6172, -6604, -8632, 14928, -2748, -10573, 7594, -4513, 711, 10543, -6544, -4795, -1936, 3735, 11491, -9039, -3211, 7995, -9009, 7454, 9494, -15584, 1880, 9397, -1321, 3362, -4875, -2099, 3720, 170, 11639, -3812, -15313, 11869, 4548, -6240, 9461, -4737, -7064, 9778, 1836, -1809, -4281, -2020, 9798, -3119, -2131, 6765, -12557, 109, 14628, -7824, -3541, 3782, -4268, 2036, 184, -1206, -431, -5662, 7990, 2338, -13936, 4856, 3542, -8166, 7056, 1284, -9770, 386, 2674, 1340, -3291, -2630, 4801, -5157, -2318, 9751, -8160, -6173, 11747, -2104, -5611, 4181, -1992, -2127, 2088, 3998, -214, -7624, 4597, 5375, -8478, 4458, 5049, -8936, 3832, 6564, -4664, -1492, 2262]
666B262O35l925P90O221j0635N32J3760j0883l882J1842o838m500P676r9m829
681a873k29O075j898q498Q915K843j2701Q812N236j2811M375O289o448j305M401
696A183J952o645j1R631r112l202J3062p425n841R865k842m719L682K756k768
711d34m607P319O45r798P670M417j0866N107N609q038j0N584q01m760K413M990
727D440o695j723J0280o510n472J0616l247o091O662Q67m990J61M955r12o422
742d081O459K276r922O207M869r282K871M447m524r50L108J630n121L15O479o183
758a402k047Q243m598m473O790j045l832K303J872j913l124M706O77o378M556
773C35K876p541L402M008n612O53L325j128k408J038L317m511r01O969m708l146
$$ y = [2262, 2897, -1028, -238, 5983, -4652, -4120, 9640, -1243, -5125, 6717, -121, -4621, 3055, 2956, -1873, -2102, 3973, 2075, -6423, 2492, 5335, -7366, 1446, 6682, -6129, -1754, 4535, -1913, -3218, 1183, 3135, -3510, -3521, 6110, -3002, -6204, 6858, -567, -6408, 3457, 615, -4104, -422, 2334, -434, -5041, 2278, 2923, -6875, 795, 5212, -5654, -547, 5062, -2976, -2986, 2598, 1797, -2963, -550, 4440, -2255, -3978, 6302, -208, -5680, 4936, 1689, -4402, 2260, 3127, -1863, -1702, 3253, 2341, -4081, 2378, 4654, -5268, 939, 5808, -3474, -603, 3844, -680, -1630, 1478, 3108, -2013, -1698, 4781, -1402, -3449, 4794, 196, -4277, 2513, 1468, -2364, -61, 1811, -102, -3226, 1480, 2157, -4221, 335, 3211, -4330, -928, 3080, -2532, -1879, 1446, 318, -2090, -1052, 2265, -2246, -3147, 3822, -886, -4032]
789d032P538l812l644N426m48l017J003K566j579l334M937P25o304N105K242o709
805c337K887L408m208L11K878l74l467J557L615m317o40O098m318k792N875k097
821A079l145L495Q97l028l51L551j820l324N294K00o047M117J879n419K178L739
837C295l136k624L359P19m795K846L900n991M93N542m998j853M700q56k623J521
853e01K797m228j759O517k638m249O169j003m614L688J211k975m59L562M24n810
869c868L132L629o693K960N440p169J06N456l203j546J834K265k766j795O320
884D102l887n749R749j327p328P530j061n765M751J560j906k714K692M106p901
899c148J951O918r525K467P943q723o83N305k162n75K48K488k464m755Q501j289
$$ y = [-4032, 3506, -306, -3950, 1476, 1028, -1989, -986, 1580, 1, -3333, 1604, 2329, -3975, 1130, 3372, -3337, -450, 2958, -1250, -939, 1939, 1565, -1902, -345, 3270, -1047, -1687, 4411, 93, -2699, 3176, 1079, -2066, 1429, 2326, -702, -1053, 2498, 678, -2646, 2648, 2848, -3199, 918, 2797, -2622, -444, 3295, 159, -2465, 894, 1613, -3182, -336, 3564, -2427, -1934, 3608, -1390, -3243, 1457, 601, -2022, -501, 2296, -1932, -3691, 2826, 188, -4061, 2108, 1105, -3509, 179, 1390, -1585, -2044, 1518, 1942, -3868, -736, 2893, -3800, -840, 4600, -2569, -2463, 2993, -210, -1756, 78, 2343, -423, -2218, 4102, 215, -5534, 4215, 2888, -4440, 3090, 2029, -3736, 1015, 2575, 669, -2045, 647, 4753, -3148, -1197, 5721, -3804, -1337, 6606, -2117, -2800, 2505, 343, -232, 16, 2504, 40, -4715, 3786, 2497]
915B497r109R448M79q249O881n92n137L230J975R28n325Q8P240p396k49R315r494
932c470j16Q679o301j915K896k03Q95j836K888p19q069J0072K294j1217P132J479
948B489p007O194N39m062j3J287N256n391l459Q176o316n96J1235r364m559Q534
964B943j832q57J49o29J473l830N439J765j2103P639O321j0070N389J216q263
979e250N385L327j239l432k834P418k044m802Q372p640l313J3573n720o980N428
994B49j600J886J495j766R7o072N448P212j0978J420O061q230N875M263j0080
1009d720J627L013K281P80p370M065P43m703J0179m099j0196J0763j14m667N198
1024B780m484k90K990k00L227p743j227J1036o453j042O190r620K519Q340o152
$$ y = [2497, -6612, 2836, 3315, -4934, 1947, 1355, -3782, -552, 1423, 2351, -2974, -2886, 4354, -3042, -3291, 6024, -3470, -3586, 5093, -1208, -3123, -227, -430, 465, -1371, 1517, 798, -7271, 2801, 5095, -6122, 1010, 2489, -4518, 1676, 2215, -1847, -1860, -573, 4683, -708, -4167, 4009, -2307, -2903, 8332, -1032, -5591, 2943, 1111, 254, 403, -226, 1247, -2583, 2856, 4621, -7482, 157, 6478, -3592, 1797, 3013, -5250, 135, 3462, 2223, -1209, -4043, 3375, 1331, -3471, 4901, -2739, -6052, 7521, 1801, -5179, 249, -1351, 535, 2030, 264, 361, -5711, -263, 6949, -4029, -2609, 3452, -4778, 1097, 5360, -4720, -3093, -80, 2201, 2981, -4389, -324, 419, -4284, 5895, 1796, -8400, 2363, 2249, -2418, 2780, -1704, -1994, 996, 796, 4023, -3720, -4947, 6089, -364, -1406, 4784, -4836, -2317, 6023, -129]
1039a29q63P06k06L582l951J192J532o907Q104K861j0814N300J227m538O740k231
1055A605l910K215p19M290k483n463P497l078k502Q095p155l104P893k766l56
1070E9J113l265J709m94J604K196p184L265N011p197L202K285o583M863K283m941
1086b074J229o30J287J314k653K626j095l847O833k150m639N435j404j420L017
1101A829k476j54P98m76K569l486J06L809l586M50L755n304P58M616k931j358
1117a081J714l21k72NJ247q75l198M768R24m826K620J107l549K549J751l581M46
1134e72J893k21k496J173J836k813N8L804k719k366L900j105k358K849q3k744
1150a964J497J958j821k088L006Q28l483J718K397m311N99M022k886j528K975
$$ y = [-129, -992, -286, -492, 3090, -861, 331, 1863, -5044, 3060, 5921, -4893, 407, 1634, -2904, 3836, 1605, -2305, -90, -809, 3481, 998, -4465, 3032, -46, -2548, 5547, -1608, -4712, 3181, 415, 59, 1172, -2093, -384, -878, 726, 2922, -4262, -997, 4014, -3183, 19, 2304, -4279, 584, 2867, -2074, -845, -1475, -188, 1126, -1527, 1099, 4, -3843, 2990, 840, -3799, 1636, 232, -1188, 1829, -647, -801, -3, -479, 2090, -1396, -1290, 2519, -1067, -617, 3138, -2166, -1408, 3208, 277, -1081, 633, 312, 40, 45, 1292, 417, -2781, 1987, 2911, -1915, 705, 1812, -1737, 812, 2563, -1018, -572, 1321, 1100, -1396, -223, 1613, -1200, -1142, 2662, -57, -2423, 1477, 372, -1986, 863, 780, -1964, -467, 1491, -330, -2418, 588, 1416, -2067, -349, 2048, -2263, -1664, 2358, -528, -2056, 919]
1165I19n21j938J311J651k585j046M329j314m027M227L21l767K896J487l694L90
1181a361L168j545k049K434J485l851J118L546l630j408M786j831k606L164P5
1196A495k800J185K597j909k634L422O25m415L137K072m942J533L110k925j193
1211a642K926R2l338J545L072l692j164N089l095k884M837j75l808K290K035l170
1227a082j050L470n58l889L643J627n385K360L422m166l74L764j459k759K659
1242B23J524l462K15M110l098k320M824j105l561L169J226k961J83K991j645k678
1258b365L355J185m632K350L226m484j15L917k231j747K606P41l138Q34L074l028
1274d52j450M446j540l462L918M57l740J695K399k324j563K929L66l901K088K914
$$ y = [919, 398, -1540, -229, 1422, -1163, -2209, 2120, 806, -3221, 1006, 1327, -2440, 456, 1943, -1751, -1361, 1807, 262, -1787, 647, 2132, -1719, -601, 2945, -685, -2093, 2693, 862, -1744, 1420, 1495, -1305, -120, 2477, 568, -2066, 1356, 1981, -2434, 703, 2775, -2167, -634, 2476, -449, -1642, 1284, 1376, -1962, -417, 2655, -1037, -2201, 2888, -207, -3091, 1746, 1571, -2237, 53, 2088, -1082, -2132, 1338, 780, -3109, 534, 2161, -3224, -864, 2558, -1608, -1982, 1782, 323, -2436, 223, 1747, -1715, -1500, 2610, -488, -2808, 2016, 911, -2650, 519, 1745, -1216, -1033, 1958, 313, -2365, 990, 2175, -2457, -107, 3119, -1365, -1480, 2437, 206, -1541, 1065, 1806, -1332, -498, 2576, -452, -1902, 2544, 1004, -2458, 1460, 1917, -1823, -128, 2271, -53, -1616, 1313, 1679, -2222, -134, 2780]
1290B780m461P17L231l161r34L247m37k651J326K204k808j162M057j699k966M159
1306A442j83m018K529J755k692k63K495p24k476K063J664l504R69L642l926n37
1322a764L413k254j144K541J32j928P5K058p85k145L077ql270K845Q19l350J525
1339a63J570j518k77J119j15j751J160K146k439j051L283j760j585K914j025j908
1355a400K288N66j817k75J195R2j526J420O58k816R36K829l078k1K205j800OJ804
1373A266j501r41M02J916r28j699J894p55j366K838o1l536K476J059j956Q65j99
1390b26m52L53M26J217k472p53L347j418p38K447k797o63L350j244j082N17J09
1407g9P97r06K23L98k611K966K135m502J548Q38j923K221N40j969m23Q89J624
$$ y = [2780, -1681, -964, 2267, -894, -1828, 1419, 982, -1669, -343, 1861, -947, -2109, 1948, 249, -2717, 1442, 1259, -2759, -230, 1525, -1167, -1430, 1065, 341, -2135, -72, 1592, -1912, -943, 2699, -1227, -1764, 1649, -605, -1749, 792, 924, -1004, -929, 1129, 344, -1801, 1276, 1268, -2002, 843, 1662, -1688, -163, 1407, -111, -388, 731, 616, -1135, 25, 2171, -268, -1319, 1964, 204, -1381, 1533, 508, -1400, 888, 1454, -363, -638, 557, 649, -877, 543, 1201, -1615, -679, 2150, -928, -949, 1256, -544, -538, 1266, -235, -1176, -774, 1142, 214, -1485, 409, -346, -1712, 1126, 1065, -2471, 5, 1064, -892, -27, -226, -678, -325, 101, 1318, -1154, -1907, 1440, 22, -716, 1731, -1066, -1729, 1621, 377, -705, -188, -79, 718, -188, 35, 433, -2178, 788, 2923, -1579, -31, 807, -1116, 1105, 1645, -324, -747, 142, 1766]
1424A766j183j811K263r17q75L589l152j984L436l91q48Q79j109J93o14J977M56
1441A675m037K042K615l214J269N30l149K228J848j589j334m5K177n81j351K158
1457A242k021j386M539j640l081K517q1n40J029n28q19j264K719J677m259Q62
1473a034K726l246J905J369l750R01K303K3j400j244K003m06j292L728k584l290
1489c288N097L0k803J281l47m82J472K30n90k918K118L694m160k57L150l817J083
1506e07L646l517j293J501J022Oj840J279o8k192M458m55n852L725K020l216K206
1523I23n95k009J293Q23J360k941j234M488k368j451M401m487j175N594j566k342
1539a286P07P3J219j044P60M84m244L103L708n985J646K541l645K238J591k264
$$ y = [1766, 583, -1228, 1035, 118, -757, 2832, -320, -2304, 1132, 741, -107, 772, -337, -144, -758, 1219, 1675, -2362, -320, 2295, -919, 350, 880, -2269, -41, 1807, 218, -1116, -1161, 1016, 435, -916, 1242, -779, -2165, 2374, 734, -2347, 170, 89, -451, 578, 50, -769, -2033, 686, 2363, -1896, -1034, 1692, -1554, 351, 1720, -2030, -1129, 1174, 1197, -203, -1447, 556, 150, -1142, 2586, 2, -3288, 1809, 1839, -964, 317, -30, -512, 960, 1190, 600, -2318, -200, 3494, -666, -923, 2227, -1590, -507, 3139, -378, -1671, -170, 852, 858, -982, 297, 229, -1963, 2495, 2040, -3812, -87, 1933, -1283, 923, 328, -1681, -388, 435, 1795, -1146, -2380, 2108, -260, -1711, 2690, -1797, -2972, 2622, 1056, -1286, -579, -506, 713, -331, 429, 913, -3331, -228, 3480, -2505, -859, 1682, -1963, 275, 1866, -398]
1555c98l13k42K501p40k856L525j544k533N659j972m517M672m8j771J395o61J44
1572C01q43O28K612m177KM441m044N63L173l941n7K983j157n56p65J154J230k742
1590a195K202K85m247L832J190m258K362M89j964J611L1K43j724r2K990k125j772
1607b142M140k809r19L895k215j726K044l35j95o02R16O01k364K073J122l375
1623a891J404J935k574J056J063j780L58P98L66j339l64K291j288j336K661q73
1639D87k143K719k81j530Q19P68q48k95J099k03j460J199J232k480N12J676j477
1656b06j12J284q24r28J084O53j410R3J060q32o45J613j56j379J112O47j682L46
1674b82J021p20n27Q48L3j362Q21P34j086k56J348o00r49R07K81q69N84P74j388
$$ y = [-398, -711, -953, 1548, 808, -2048, 1477, -67, -2600, 3059, 1087, -3430, 1242, 1194, -577, 818, 157, 301, -542, 86, 2698, -1479, -1477, 2964, -1080, -517, 2656, -1285, -1342, 1641, 484, -72, -837, 317, 1547, -1195, 1007, 1292, -2955, 877, 2067, -2191, 171, 660, -1304, 307, 338, 581, -1143, -1235, 1755, -370, -2142, 1998, -811, -1730, 2165, -50, -1776, 268, -67, -262, -864, 52, 653, -1711, 362, 1484, -1891, -487, 1448, -1126, -70, 993, -787, -429, 369, 735, -604, -968, 1323, 35, -1301, 1360, 487, -1656, 1063, 782, -748, 71, 839, -9, -304, 795, 592, -868, 331, 1563, -917, -405, 1271, -206, -318, 966, 142, -786, 298, 951, -459, -366, 694, -138, -783, 830, 674, -705, 407, 1054, -628, -282, 739, 19, -508, 340, 373, -989, -168, 566, -520, -776, 572, -28, -977, -70, 211, -658, -74, 700, -688]
1693f88K06J259j247j94J066K3j177O19P91j025k61J262p68o70J571m37j216J047
1711A61N05p00l27J103o21r05J316K22j290Q39Q10j897M06J272j001l21J325k83
1729F14j114O00O28q13n50J836r22r51J562n59j118Q36R30j355J87P54l96r45
1747g76J335P4j502M25J503j666O3J304p12o66P07K08j095K96J255r48p42J698
1765G61o68j412J358K41q69K56J049q56p64J380j7j832J629P96k013M76J513j000
1783B8p37J381m24r57M79J366j975K03J687r71j161K112l68j493P48J253j400
1800b29m41J629o18j701K166O44k494J145J443j990O6J235q21m63N95J244j785
1817c75n67K316j530j243K770j140j642K366m70j225K46J051l33j172R53R98k534
$$ y = [-688, -482, 777, -470, -664, 402, 425, -752, -133, 658, -367, -628, 634, -134, -804, 767, 330, -886, 161, 666, -34, -361, 742, 121, -784, 532, 754, -536, 303, 1113, -784, -378, 894, -107, -428, 897, 614, -500, 100, 728, -85, -635, 1201, 279, -672, 890, 331, -787, 49, 979, -376, -189, 565, 169, -776, 559, 633, -869, -444, 1059, -607, -544, 760, 48, -618, 89, 297, -798, -502, 753, -195, -937, 761, 93, -1319, 39, 280, -589, -333, 716, -140, -904, 476, 459, -1373, 256, 1052, -961, -485, 1028, 28, -709, 672, 248, -709, -230, 1136, -839, -636, 1051, 80, -1081, 1031, 663, -830, -82, 1171, -229, -670, 959, 341, -1360, 806, 1450, -1044, 101, 1544, -446, -380, 855, 34, -429, 166, 1410, -375, -942, 1374, -156, -1399, 1371, 231, -1411, 955, 485, -740, -494, 557, 224, -948, 5, 1003, -1531]
1834a531J243K034l004N21K074j972m26J666o38q23M01J163n56j710K526n60k195
1851a787K778k32k622K212O41j452m5N95N46j005J29J732k437J6L055k725m70
1868a071K287j131j116J893k40p59n12J215P55k550J604J082l356K698R98l356
1884a559J330J292j406O96n47L48m79k67K544k165j766L425j167j584K790k127
1900f42n22J829q0n42j088M14J696k261J014J155l175K057J958k894Q10M77r80
1917g74J016n8q4l97j384L066p32k337K283o73j039K636j224j605J001J61J220
1934A076j477l48J631j417L71K214l370O0K400j533O97J56j097O17J70J303q91
1951E62k234K445L03j887K132j354j504K473L7j321M17q21J163j63l06Q27j961
$$ y = [-1531, -288, 1746, -1258, -737, 1337, -635, -1061, 605, -33, -856, -455, 708, 152, -1558, 968, 408, -1787, 991, 759, -1863, 349, 990, -462, -507, 88, 634, -371, -242, 1490, -947, -931, 2124, -601, -1071, 1216, 85, -1031, 862, 622, -137, -649, 566, 1321, -1229, 375, 1457, -1899, 799, 1797, -1559, -229, 1063, -343, 353, -194, 154, -325, -592, 1952, -213, -1979, 1446, 279, -1305, 1485, -642, -1164, 665, 585, 43, -1045, -631, 1065, -1196, -182, 973, -2202, -145, 1813, -1081, -271, 206, -774, 242, 184, 100, -297, -1681, 1385, 653, -1684, 599, -74, -1113, 1523, 299, -1306, -305, -144, 1076, -401, -749, 882, -535, -164, 2050, -1320, -1260, 1140, -393, 304, 460, -637, -20, 150, 1453, 562, -1672, 773, 1076, -811, 1321, -33, -1537, 936, 973, -348, 69, -752, 411, 248, -58, 769, -1192]
1968a192L92K881k559j15J023j514J486N04j036k34n27J593N63k477J362L59j958
1985a449K655p49j786J781m85N3M04j167J50P0K62J579k010n16K107j159j68J505
2003A077j931L92R60n64Q6q55O57J130j768J189L50k207K214M33j926R00K06q38
2021d95J149l89k76J35n71J567p71j508K384j105r00K201j311j126J700n57R4
2038B21r6l49M93o94P71O66k431J230J584k160M41Q88j424R30O27q06l07L5R70
2057E89q2j367J570o33j851K461k14j659J490j24o69Q21n79J94o65K88J728k118
2075h20j17K251k163L77J896j938l07J248l92k96PJ53N19j297J493j5k089K163
2093F73O85k372J066M08r52N77M42o6q22RJ465j239p83K313j334j229K405j191
$$ y = [-1192, -800, 2081, -478, -593, 430, -1084, 402, 906, -130, -364, -891, 702, 1265, -1212, 150, 509, -1449, 1206, 457, -1329, 452, -33, 20, 424, -743, -593, -523, -261, 1318, -692, -1208, 899, -260, -428, 1077, -854, -462, 498, -66, 20, -835, -178, 952, -816, 373, 723, -1484, 730, 1163, -763, 137, 343, -495, 654, 265, -11, 124, -447, 1120, 349, -1159, 1225, 120, -780, 1421, 110, -1016, 684, 127, 221, 125, -224, 269, -425, 346, 1012, -1419, -189, 1395, -765, -324, 564, -860, 70, 697, -109, -416, -381, 589, 507, -860, 710, 77, -1774, 687, 473, -1186, 304, 180, -489, 332, -247, -53, -718, -430, 1298, -820, -937, 1314, -849, -472, 1424, -514, -821, 427, 35, -261, -254, -101, 418, -879, 614, 599, -1490, 673, 1358, -1014, 52, 460, -492, 85, 527, 461, -361, -352, 1113, -126, -909, 1404, 70, -1159, 1246, 55]
2111E5j073J266L20o15J20K85J02j446J297P86k211P27J555j726L08R86j016k22
2129e02R03L53j153m39J592r40q82J994o74j527J773j5j204M81Q03o66p60J327
2147D64k7j504P44J115j561J64J464j250m87J521m45q22O32P40r57m65J424n41
2165B09r11J108K73j311N61R32j168K5J156n09j025R65O08j672L41J491j209n91
2183g27J459n78q98Q61P15j070j03P08m60n13J180r7j183Q29M07j072P1J177q20
2202a14o13J135M6j152N28Q41j103J33P88q37n18J153J99j142K45J090j178k23
2220g22J168l36j032J114K32r53J15Q50r73m2J170n11n67N04J95q15N32M67m53
2239e7n47J247n17n79P74J96o28L3L73k50o06R91r9m87K84M14p65K50P76q16l34
$$ y = [55, -1018, 248, 568, -47, 73, 358, 460, -986, 311, 1097, -1114, -387, 1168, -558, -250, 736, -280, -502, 401, 754, -399, -838, 754, -186, -1068, 926, 252, -1275, 498, 483, -721, -240, 563, -103, -863, 464, 437, -1067, -323, 792, -769, -605, 859, -391, -878, 643, 198, -624, 8, 748, -209, -674, 750, 209, -702, 406, 679, -632, -71, 861, -307, -282, 874, 365, -660, 305, 913, -759, -418, 1073, -136, -727, 732, 154, -744, 117, 832, -238, -341, 367, -93, -606, 574, 477, -706, 123, 530, -542, -471, 706, -114, -727, 408, 454, -698, -170, 671, -432, -299, 489, -348, -866, 287, 486, -656, -411, 679, -499, -722, 446, 110, -922, 192, 424, -529, -414, 436, -537, -579, 591, 80, -487, 17, 212, -603, -71, 396, -57, -604, 643, 126, -453, 321, 517, -111, -78, 295, 45, -561, 430, 331, -156, 128, 542, -223, 27, 803, -13, -347]
2260c47N25j2l06l8N09k79k03P63o25n55Q84k3q14Q03j12o98L72N01l22o67M78
2281a66K56n14J92Q37j042N7O81j89n35O68r6o18N54J05o13o9O82j1j064Q67L00
2302B82j069Q86N08j154Q6R56l58l10P5K31n65N55N79j132l34J488n24o88R76
2321D88o56k38Q44J44n11j83J65J59p77R77N8j146N24J069j152L6O08o28m9Q21
2341E53l11l32l61J206o87p99J077k56q09J373j50j290Q42J69l00J56k10O0k44
2360c13J54J043j360j82J502j105k52J141j046j65R00k9j76q45P68M45j233R61
2378B08L17j880J570R37j970O57K05J6J87k48M51r48J3J835j267r88J772p57o55
2397e45J160l67o95O94K45j87o72M68M40j103R58N71j926Q53J480j512K36L25
$$ y = [-347, 178, 166, -140, -178, 331, 52, -151, 612, -13, -568, 316, 293, -521, 282, 170, -528, -156, 345, 23, -644, -166, 90, -424, -232, 605, -437, -380, 301, 112, -423, 245, 149, -469, 85, 190, -423, -492, 190, 179, -885, -18, 282, -787, 99, 607, -547, -461, 495, 137, -173, -98, 133, -432, 123, 702, -430, -764, 724, 200, -488, 488, -168, -406, 438, 582, 71, -112, 53, 212, -565, 412, 470, -676, -152, 917, -235, -199, 409, -219, -268, 553, 242, -90, -451, 755, 68, -731, 346, 90, -719, 654, 504, -786, 56, 225, -75, 81, -129, -69, -313, -159, 884, -476, -658, 844, -261, -513, 628, -418, -583, 317, 288, 112, -733, 35, 480, -753, 208, 525, -1355, 215, 1152, -818, -161, 44, 60, 247, -1, 450, -498, -485, 1350, 83, -905, 867, 110, -545, 615, 248, -447, 247, 492, 305, -367, 101, 541, -562, 396, 967, -959, -106, 1374, -138, 98, 423]
2415D23o20K71J27L33n32j151J919m08j141J283m67j305J962k44j016M18K35M62
2433E49n50l68J114j684P33J530j860l36J436o97q6O28o76r9k8J025l13j473J141
2452a4L05j419J625l48j417J424O40r87k95M3O96n63N21Q65j666j82J770p09o45
2471c56Q89p82j9M68L00o31n36J049O45j729R34J92j481J576L90j672L56O44N4
2490B91k45P5j19m30m8J584r64r91J151k68l11P70n02m18L09M94k46o31M21L61
2510B83q72N14O21j655M91J430j009o3J65k31K00K20N74j106l31J179k19p63P48
2529A76j82o64R60%p29K12K56K41k80J7M81r29K67J103j359j56J113n65P1M88
2549E21l84l81M99j24L15r02P23J24j073J241qj284Q33N69j177O85l8k18J70J03
$$ y = [423, -197, 74, 201, 534, 2, -1149, 770, 362, -779, 504, 37, -1268, 694, 450, -566, -148, 87, 549, -1, -369, 745, -939, -206, 1324, -536, -872, 564, -133, -219, 409, -267, -366, -394, 631, 318, -1155, -14, 291, -1128, 497, 149, -1268, 156, 796, -191, -486, -443, 253, -310, 211, 1076, -590, -772, 998, 289, -356, 533, -249, -268, 200, 500, -131, -667, 382, 1027, -702, 232, 424, -1057, 519, 909, -763, -407, 237, 291, 46, 121, 2, -428, -476, 1108, 144, -847, 304, 36, -275, 495, -7, -425, -116, 378, 132, -499, -78, 283, -589, -75, 546, -1109, -618, 812, -197, -260, -95, -326, -126, 94, 668, -438, -769, 410, 191, -572, 176, -6, -670, 290, 290, -439, -227, 29, 270, -10, 7, 488, -441, -174, 929, -430, -586, 527, -38, 33, 521, 137, -244, 255, 131, 446, -456, 267, 391, -682, 559, 551, -733, 100, 669, -508, 177, 139, -79, 91, 194]
2569A94k5m96J05P03n15m48Q38m40m79R24j72p98O37K06m0k58o0J06n00J79N05
2590A66r55N94N98p01R7M40m74j02J82J55j56k73N21j38k68P56j74j055R05p9
2610C9l67L57K16j27k98K84J52o67M40P25j232L06Q03q52j4P00m81j92L95K83
2630D70p36J61N49k56n22O72n8m07K95M61r45J00O56n13r0M14J06o39L28J99o19
2651c74J5P05j29p15Q27o6p21L24L86m37p8N35k91o07N23M49o14M12K02n53q5
2672b92Q89r79j99M47L38m42J10M49m06n21R49k49m15M61Q7o82L14N76n39k56
2692c60N41J37p04L27P62r41j4O82l95n25O83k7l91J76M78m54l53Q09j39p70Q33
2713C55J20r58M75M34p75J45M45k9n73O03J76q35J28J011j012P6N70m21m35M42
$$ y = [194, 169, -327, -222, 481, -34, -482, 356, -84, -563, 361, 189, -609, 28, 234, 194, -64, -124, -18, -518, -339, 166, -789, -195, 403, -298, -201, 239, -235, -337, -155, 0, -156, -429, 92, -46, -314, 442, 268, -787, 118, 39, -328, 29, 245, 118, -180, 104, 256, -411, 29, 754, -478, -172, 631, -221, -235, 465, -16, -208, 187, 470, -266, -105, 444, 188, -334, 338, 280, -127, 168, 629, -316, -216, 440, -73, -163, 251, 357, -282, 46, 245, -374, -359, 346, 217, -498, 329, 263, -458, -134, 252, -185, -263, 272, -19, -626, -103, 346, -268, 144, 346, -207, -292, 597, -382, -581, -134, 204, -238, -128, 321, -85, -606, 343, 94, -321, 140, 227, -455, -141, 435, -104, -360, 181, 318, -386, -59, 703, -238, -252, 430, 35, -490, 193, 166, -225, -49, 429, -25, -378, 431, 292, -478, 355, 475, -483, -8, 426, -349, -204, 241, 212, -361, 242, 418, -417, -289, 722, -290, -214, 356, -65, -500, -58]
2733e8L87p73M43O04p89l74P77K73q52J95M08q06L72O23l88m50J93M39n41J51
2753a66N69p72k44J213m22o28M76K91n57J32M70m40l88Q43p3r12Q90J55p19K76
$$ y = [-58, 329, -444, -1, 603, -186, -560, 217, 490, -362, -167, 241, -565, -193, 430, 42, -408, -215, 224, -317, -166, 403, -369, -613, 600, 178, -450, 26, 317, -240, -108, 362, -78, -466, 377, 304, -608, 282, 437, -282, -6]
$$ [...]
8191C4
##END NTUPLES=NMR FID
##END=
