##TITLE=1H_SR55_W
 D2O, 8 sc, 
 14.05.2021
##JCAMPDX= 6.0         $$ Bruker NMR JCAMP-DX V2.0
##DATA TYPE= NMR FID
##DATA CLASS= NTUPLES
##ORIGIN= UXNMR, Bruker Analytische Messtechnik GmbH
##OWNER= root
$$ XWIN-NMR		Version 3.5
$$ Fri May 14 09:59:29 2021 Russian Standard Time (UT+4h)  she@DPX200
##.OBSERVE FREQUENCY= 200.131506
##.OBSERVE NUCLEUS= ^1H
##.DELAY= (6, 6)
##.ACQUISITION MODE= SIMULTANEOUS
##.ACQUISITION SCHEME= undefined
##.AVERAGES= 8
##.DIGITISER RES= 18
##SPECTROMETER/DATA SYSTEM= spect
##.PULSE SEQUENCE= zg30
##.SOLVENT NAME= CDCl3
##.SHIFT REFERENCE= (INTERNAL, CDCl3, 0, 15.7039)
##AUDIT TRAIL= $$ (NUMBER, WHEN, WHO, WHERE, WHAT)
$$ ##TITLE= Audit trail, XWIN-NMR		Version 3.5
$$ ##JCAMPDX= 5.01
$$ ##ORIGIN= Bruker BioSpin GmbH
$$ ##OWNER= she
$$ F:/spectra/data/she/nmr/H-F/1/audita.txt
$$ ##AUDIT TRAIL=  $$ (NUMBER, WHEN, WHO, WHERE, WHAT)
(   1,<2021-05-14 09:57:57.45 +0400>,<she>,<DPX200>,
      <created by zg, POWCHK disabled, PULCHK disabled
       configuration hash MD5:
       00 E9 B6 7A A2 85 ED C7 34 08 36 98 17 FE 4E 26
       data hash MD5: 16K
       55 9E F4 C5 23 20 06 BE 91 B8 4C 2E 72 E3 7C 9C>)
$$ ##END=
$$ 
$$ hash MD5
$$ 94 9B 82 D6 3F 06 1C AD 33 2C D7 69 B5 1B 19 C3
##$RELAX= 
##$RELAX= 
##$RELAX= 
##$RELAX= 
##$RELAX= 
##$RELAX= 
$$ Bruker specific parameters
$$ --------------------------
##$DU= <F:/spectra>
##$EXPNO= 1
##$NAME= <H-F>
##$PROCNO= 1
##$TYPE= <nmr>
##$USER= <she>
##$AMP= (0..31)
100 100 100 100 100 100 100 100 100 100 100 100 100 100 100 100 100 100 
100 100 100 100 100 100 100 100 100 100 100 100 100 100 
##$AQSEQ= 0
##$AQ_mod= 1
##$AUNM= <au_zg>
##$AUTOPOS= <>
##$BF1= 200.13
##$BF2= 200.13
##$BF3= 200.13
##$BF4= 200.13
##$BF5= 200.13
##$BF6= 200.13
##$BF7= 200.13
##$BF8= 200.13
##$BYTORDA= 1
##$CFDGTYP= 0
##$CFRGTYP= 5
##$CHEMSTR= <none>
##$CNST= (0..31)
1 1 145 1 1 1 1 1 1 1 1 1 1 1 1 1 1 1 1 1 1 1 1 1 1 1 1 1 1 1 1 1 
##$CPDPRG= <>
##$CPDPRG1= <>
##$CPDPRG2= <>
##$CPDPRG3= <>
##$CPDPRG4= <mlev>
##$CPDPRG5= <mlev>
##$CPDPRG6= <mlev>
##$CPDPRG7= <mlev>
##$CPDPRG8= <mlev>
##$CPDPRGB= <>
##$CPDPRGT= <>
##$D= (0..31)
0 1.2 0 0 0 0 0 0 0 0.06 0 0.03 0 0 0 0 0.0002 0 0 0 0 0 0 0 0 0 0 0 0 
0 0 0 
##$DATE= 1620971876
##$DBL= (0..7)
120 120 120 120 120 120 120 120 
##$DBP= (0..7)
150 150 150 150 150 150 150 150 
##$DBP07= 0
##$DBPNAM0= <>
##$DBPNAM1= <>
##$DBPNAM2= <>
##$DBPNAM3= <>
##$DBPNAM4= <>
##$DBPNAM5= <>
##$DBPNAM6= <>
##$DBPNAM7= <>
##$DBPOAL= (0..7)
0.5 0.5 0.5 0.5 0.5 0.5 0.5 0.5 
##$DBPOFFS= (0..7)
0 0 0 0 0 0 0 0 
##$DE= 6
##$DECBNUC= <off>
##$DECIM= 32
##$DECNUC= <off>
##$DECSTAT= 4
##$DIGMOD= 1
##$DIGTYP= 9
##$DL= (0..7)
0 120 120 120 120 120 120 120 
##$DP= (0..7)
150 150 150 150 150 150 150 150 
##$DP07= 0
##$DPNAME0= <>
##$DPNAME1= <>
##$DPNAME2= <>
##$DPNAME3= <>
##$DPNAME4= <>
##$DPNAME5= <>
##$DPNAME6= <>
##$DPNAME7= <>
##$DPOAL= (0..7)
0.5 0.5 0.5 0.5 0.5 0.5 0.5 0.5 
##$DPOFFS= (0..7)
0 0 0 0 0 0 0 0 
##$DQDMODE= 0
##$DR= 18
##$DS= 0
##$DSLIST= <SSSSSSSSSSSSSSS>
$$ [...]
##$SUBNAM2= <"">
##$SUBNAM3= <"">
##$SUBNAM4= <"">
##$SUBNAM5= <"">
##$SUBNAM6= <"">
##$SUBNAM7= <"">
##$SUBNAM8= <"">
##$SUBNAM9= <"">
##$SW= 16.9725357007746
##$SWIBOX= (0..15)
0 0 2 0 0 0 0 0 0 0 0 0 0 0 0 0 
##$SW_h= 3396.73913043478
##$TD= 16384
##$TD0= 1
##$TE= 0
##$TE2= 300
##$TE3= 300
##$TEG= 300
##$TL= (0..7)
0 120 120 120 120 120 120 120 
##$TP= (0..7)
150 150 150 150 150 150 150 150 
##$TP07= 0
##$TPNAME0= <>
##$TPNAME1= <>
##$TPNAME2= <>
##$TPNAME3= <>
##$TPNAME4= <>
##$TPNAME5= <>
##$TPNAME6= <>
##$TPNAME7= <>
##$TPOAL= (0..7)
0.5 0.5 0.5 0.5 0.5 0.5 0.5 0.5 
##$TPOFFS= (0..7)
0 0 0 0 0 0 0 0 
##$TUNHIN= 0
##$TUNHOUT= 0
##$TUNXOUT= 0
##$USERA1= <user>
##$USERA2= <user>
##$USERA3= <user>
##$USERA4= <user>
##$USERA5= <user>
##$V9= 5
##$VALIST= <valist>
##$VCLIST= <CCCCCCCCCCCCCCC>
##$VD= 0
##$VDLIST= <DDDDDDDDDDDDDDD>
##$VPLIST= <PPPPPPPPPPPPPPP>
##$VTLIST= <TTTTTTTTTTTTTTT>
##$WBST= 1024
##$WBSW= 4
##$XGAIN= (0..3)
0 0 0 0 
##$XL= 0
##$YL= 0
##$YMAX_a= 350902
##$YMIN_a= -286107
##$ZGOPTNS= <>
##$ZL1= 120
##$ZL2= 120
##$ZL3= 120
##$ZL4= 120
##$ABSF1= 10
##$ABSF2= 0
##$ABSG= 5
##$ABSL= 3
##$ALPHA= 0
##$AQORDER= 0
##$ASSFAC= 0
##$ASSFACI= 0
##$ASSFACX= 0
##$ASSWID= 0
##$AUNMP= <proc_1d>
##$AZFE= 0.1
##$AZFW= 0.1
##$BCFW= 1
##$BC_mod= 2
##$BYTORDP= 1
##$COROFFS= 0
##$CY= 11.3945322036743
##$DATMOD= 1
##$DC= 2
##$DFILT= <>
##$DTYPP= 0
##$F1P= 15.9154993809931
##$F2P= -4.1035820241983
##$FCOR= 0.5
##$FTSIZE= 0
##$FT_mod= 4
##$GAMMA= 1
##$GB= 0.15
##$INTBC= 1
##$INTSCL= 1
##$ISEN= 128
##$LB= 0.24
##$LEV0= 0
##$LPBIN= 0
##$MAXI= 10000
##$MC2= 0
##$MEAN= 0
##$ME_mod= 0
##$MI= 1.114404
##$NCOEF= 0
##$NC_proc= 0
##$NLEV= 6
##$NOISF1= 3.799351
##$NOISF2= 2.8
##$NSP= 1
##$NTH_PI= 0
##$NZP= 0
##$OFFSET= 15.70392
##$PC= 1
##$PHC0= -11132.97
##$PHC1= 14.601
##$PH_mod= 1
##$PKNL= yes
##$PPARMOD= 0
##$PSCAL= 0
##$PSIGN= 0
##$REVERSE= no
##$SF= 200.130013532006
##$SI= 16384
##$SIGF1= 3
##$SIGF2= 2
##$SINO= 400
##$SIOLD= 16384
##$SREGLST= <1H.CDCl3>
##$SSB= 0
##$STSI= 0
##$STSR= 0
##$SW_p= 3612.71676300578
##$SYMM= 0
##$S_DEV= 0
##$TDeff= 0
##$TDoff= 0
##$TI= <>
##$TILT= no
##$TM1= 0
##$TM2= 0
##$TOPLEV= 0
##$USERP1= <user>
##$USERP2= <user>
##$USERP3= <user>
##$USERP4= <user>
##$USERP5= <user>
##$WDW= 1
##$XDIM= 8192
##$YMAX_p= 0
##$YMIN_p= 0
$$ End of Bruker specific parameters
$$ ---------------------------------
##NTUPLES= NMR FID
##VAR_NAME=  TIME,          FID/REAL,        FID/IMAG
##SYMBOL=    X,             R,               I
##VAR_TYPE=  INDEPENDENT,   DEPENDENT,       DEPENDENT
##VAR_FORM=  AFFN,          ASDF,            ASDF
##VAR_DIM=   8192,          8192,            8192
##UNITS=     SECONDS,       ARBITRARY UNITS, ARBITRARY UNITS
##FACTOR=    0.0002944,     1,               1
##FIRST=     0,             0,               0
##LAST=      2.4114304,     0,               0
##MIN=       0,             -286107,         0
##MAX=       2.4114304,     350902,          0
$$ Real data points
##PAGE= N=1
##DATA TABLE= (X++(R..R)), XYDATA
0 0 0 0 0 0 0 0 0 0 0 8 -8 8 -8 16 -16 24 -24 32 -40 48 -56 64 -78 89 -105 123 -144 167 -190 217 -249 285
32 285 -322 365 -410 462 -519 581 -646 722 -801 890 -988 1093 -1206 1334 -1470 1621 -1786
49 -1786 1966 -2166 2387 -2630 2904 -3211 3555 -3953 4409 -4939 5572 -6334 7275 -8471
63 -8471 10041 -12210 15402 -20554 30227 -54513 241054 348875 -171997 -83358 -268242 -42313
75 -42313 288451 131448 -1498 -151406 -161633 24069 23128 216994 89121 -178099 -85475
86 -85475 -141621 58056 304099 14031 -73525 -193910 -189256 229878 198905 30198 -74398
97 -74398 -286107 -8905 183889 96747 89188 -141346 -157106 4109 26304 178375 58784
108 58784 -103614 -62970 -158503 49616 235700 35199 -38720 -169363 -144786 134640 151759
119 151759 101006 -88748 -226494 12813 63421 91899 145957 -118118 -142637 -21681 279
130 279 149050 98057 -56065 -118770 -126113 66896 133259 73861 21162 -180548 -123900 84651
142 84651 96827 132774 -13166 -195161 -74362 34959 124341 124705 -52563 -114200 -102352
153 -102352 1719 148489 90660 -6817 -107717 -141773 30319 115967 102966 25245 -150754
164 -150754 -111619 26098 84698 135598 8445 -139154 -101103 -5441 109715 118953 3339
175 3339 -98995 -135916 -1807 125648 88269 26232 -96918 -141494 10207 99744 95924
186 95924 32919 -96753 -119932 -23367 93562 124288 16737 -85701 -119514 -42236 113263
197 113263 118181 10205 -76164 -123632 -33545 102419 111332 25181 -84573 -115502 -28034 81299
209 81299 116698 27188 -80802 -98880 -44904 69500 120126 33587 -63453 -107676 -59165 72660
221 72660 120112 41485 -61560 -112930 -55401 65546 118165 45596 -63640 -101782 -56602
232 -56602 51364 119622 47310 -59484 -92850 -61514 41341 118179 53103 -54770 -93754
243 -93754 -59509 34588 110744 62801 -52143 -95265 -55334 26864 103083 71504 -46735 -97127
255 -97127 -54848 22573 96453 75765 -36710 -97411 -59111 19201 91102 80561 -26833 -99465
267 -99465 -65314 17567 89363 83207 -21090 -99824 -67875 15151 86743 84884 -16188 -98312
279 -98312 -68688 11425 81896 87441 -10622 -97009 -70011 9271 75904 87333 -2146 -95196
291 -95196 -73105 8208 70275 84635 8349 -91215 -79772 7094 68262 81310 15466 -85235
303 -85235 -85968 3691 69472 78253 19285 -77444 -90424 -2578 71955 77139 18986 -70676 -90730
316 -90730 -8249 70824 77297 19242 -65089 -89064 -14028 67342 77619 21492 -60676 -86475
328 -86475 -17981 62352 75769 25188 -53381 -86443 -23541 59252 73966 28686 -45900 -87223
340 -87223 -29395 56454 72897 31192 -39230 -84437 -37871 51899 77356 31072 -35535 -79563
352 -79563 -46173 47126 81974 30910 -32036 -75778 -50618 41255 82422 36733 -32383 -74321
364 -74321 -48772 32047 80985 43078 -32819 -70341 -48750 23091 81187 45487 -28613 -67279
376 -67279 -53036 21170 77007 47257 -19920 -69201 -55376 18697 72693 54641 -18854 -71097
388 -71097 -52936 11154 74816 59118 -22645 -65403 -55246 5568 78071 58100 -19113 -65140
400 -65140 -57636 8801 70321 60206 -11564 -71808 -51701 6580 59516 69447 -9692 -72687
412 -72687 -49463 -39 60009 69170 -6769 -65368 -58422 889 60997 61212 5957 -65859 -64618
425 -64618 6522 51349 61890 13238 -66815 -59097 -2342 46062 69124 10763 -58106 -61237
437 -61237 -12741 53204 64370 13715 -50855 -70939 -6861 51452 57436 24001 -56236 -68916
449 -68916 -119 39780 59246 22982 -53691 -58054 -11593 38441 58730 20414 -35627 -66392
461 -66392 -22747 46677 51673 29330 -29513 -79914 -18265 44445 52659 34458 -38686 -70648
473 -70648 -19875 37249 62195 22674 -33455 -55681 -35028 38575 59868 18757 -16255 -62804
485 -62804 -39017 37739 52006 34912 -18911 -69069 -31351 24864 59218 41025 -31268 -57324
497 -57324 -36265 20547 68211 26721 -21571 -49457 -47474 27593 56744 26681 -4725 -57691
509 -57691 -45425 21351 49398 43353 -11368 -55665 -40521 4037 62372 45184 -21156 -41900
521 -41900 -49606 1758 69831 35452 -12981 -43234 -53053 10493 55814 41012 -6050 -54181
533 -54181 -38392 2995 44508 54712 -12536 -48598 -34616 -10499 51743 51348 -9991 -38357
545 -38357 -49560 -5874 53141 43385 4662 -45311 -53439 2454 42677 50609 5183 -52373 -40883
558 -40883 -6321 39815 57246 -3699 -41586 -39546 -16332 43950 51305 3661 -35289 -50487
570 -50487 -10917 38149 48891 18061 -45024 -50792 -4586 29055 54012 16967 -46809 -42991
582 -42991 -9996 29256 49642 13519 -30707 -47139 -16504 32301 40394 22389 -23308 -56457
594 -56457 -15883 28519 43174 28898 -29293 -53561 -18230 25918 51113 21498 -29568 -46766
606 -46766 -23121 29164 46969 18170 -20054 -48524 -23254 26213 39315 27382 -16421 -51795
618 -51795 -23603 19396 42385 31928 -17625 -49420 -29934 20235 47602 25900 -13484 -46977
630 -46977 -34787 23020 44736 23490 -8201 -46002 -34607 18610 42557 28140 -9159 -41727
642 -41727 -34937 9719 46745 30382 -10766 -37514 -38692 7536 48862 29757 -8764 -38189
654 -38189 -38230 8006 43873 31508 -7047 -38532 -33912 3876 40308 34352 -6640 -34679 -34074
667 -34074 -1874 40449 34941 -4363 -31328 -37408 -3932 39784 35943 -1245 -32348 -37071 -5320
680 -5320 37142 39549 -853 -33775 -34233 -7994 34497 41352 -738 -32108 -32943 -10079 31844
693 31844 41552 3113 -31227 -34234 -10297 28121 41827 7292 -31752 -34411 -10555 24902 42274
706 42274 10335 -31109 -34565 -11445 22702 41804 12857 -29184 -35914 -12693 21372 40114
718 40114 16528 -26684 -37693 -13495 19684 39267 18711 -25137 -38321 -14420 18324 38419
730 38419 20092 -23172 -38231 -15126 17229 36901 20954 -20422 -37822 -16162 15945 34938
742 34938 22672 -17284 -38368 -17452 14910 33669 23754 -14677 -38367 -19448 13910 32679
754 32679 24599 -11900 -38304 -21731 13574 32912 24541 -9417 -37760 -24288 13053 32846
766 32846 24280 -7149 -36343 -26574 11458 33317 24330 -5922 -34363 -27868 9245 33348 24676
779 24676 -4691 -32177 -28693 6587 32672 25158 -3310 -30598 -29205 4184 31697 25853 -1340
792 -1340 -28916 -30246 2100 31194 26588 -333 -27539 -30798 -299 30519 27258 71 -25619
805 -25619 -30772 -2621 30268 28132 233 -24495 -29720 -4545 28726 29325 778 -23817 -28201
818 -28201 -6535 26283 31019 2349 -23593 -27461 -7859 23827 31176 4330 -22650 -27787 -9029
831 -9029 21781 31246 6966 -22149 -27929 -9837 19459 31764 9357 -21350 -27828 -11676 17988
844 17988 32938 10298 -20339 -28109 -12669 16954 32610 11861 -19824 -28325 -12210 14782
856 14782 31365 14615 -19539 -28149 -11230 11773 30254 16990 -18067 -28345 -12508 11165
868 11165 29218 18098 -14582 -30639 -13809 12400 26685 19365 -12150 -31611 -13820 11413
880 11413 25357 20318 -11469 -29895 -14963 8974 26362 19627 -9284 -28062 -18325 9011 26007
893 26007 19701 -6069 -29919 -18661 10001 23795 21521 -5940 -30544 -17052 8037 23000
905 23000 21452 -5385 -27742 -18995 6495 23501 18584 -1022 -24807 -23418 6633 22161 18969
918 18969 3138 -26098 -24755 5310 22046 21976 1146 -25035 -23859 1154 24817 21464 -1009
931 -1009 -20320 -25223 24 25197 18355 1747 -18760 -25728 281 20578 20370 5287 -20285
944 -20285 -23881 -3283 19100 24944 3162 -18998 -23720 -6667 22545 23289 1813 -15827 -25792
957 -25792 -4939 22072 19658 5022 -15706 -24279 -4879 15935 22720 7101 -16271 -21025 -10704
970 -10704 15058 27807 5477 -14414 -22894 -13325 18726 25669 5781 -14303 -24798 -8351 16081
983 16081 22839 9072 -16290 -20923 -7286 8875 24500 10717 -14259 -18008 -13277 8364 25885
996 25885 11134 -10106 -22467 -14766 11246 23055 14056 -10668 -25760 -9955 9401 21745
1008 21745 15486 -12919 -21463 -10024 5544 22748 13696 -9459 -18693 -15296 6300 21490 14297
1021 14297 -4548 -22986 -15209 7233 18732 18465 -5886 -25017 -12082 4792 19801 18015 -7669
1034 -7669 -20670 -13390 4295 19764 14453 -3059 -19236 -17122 5748 16519 15095 1855 -21666
1047 -21666 -17382 4357 16042 18566 618 -21269 -17436 1682 19329 17384 -1490 -17755 -19197
1060 -19197 2124 19950 13757 804 -16077 -19509 2336 15998 14713 3734 -16150 -18485 -1477
1073 -1477 14514 18247 3613 -14828 -19370 -4296 17465 17917 2814 -13188 -21453 -3276 17803
1086 17803 15444 3937 -12337 -20352 -3541 14691 16325 4647 -11279 -18006 -7491 13475 18725
1099 18725 4333 -9929 -18360 -9904 14552 19889 4426 -10526 -19053 -8320 13739 18766 5238
1112 5238 -10967 -17084 -7406 10563 18600 6486 -10061 -15806 -9554 8486 19402 7684 -8495
1125 -8495 -16759 -11623 8975 19620 8918 -8471 -17741 -10702 8303 19346 9385 -8896 -16481
1138 -16481 -10114 6119 19084 9871 -8388 -15144 -10633 4304 18485 10887 -7094 -15502 -11246
1151 -11246 3836 17283 12583 -6023 -16521 -10470 3106 16069 13499 -5121 -16580 -10422 2521
1164 2521 15464 13626 -4151 -15758 -11590 2365 15056 13652 -2333 -15902 -12385 2104 14335
1177 14335 14214 -1330 -15809 -12758 1392 13768 14350 -812 -15343 -13045 974 13601 14127
1190 14127 55 -14680 -13697 355 12847 13562 1474 -14055 -14358 74 11928 13762 2717
1203 2717 -13305 -14595 -815 12077 13708 3244 -12000 -15252 -1662 12166 13698 3682 -11048
1216 -11048 -15863 -2758 11848 13317 3853 -10134 -15627 -3630 11481 13989 3916 -9378 -15158
1229 -15158 -5074 11028 14210 4299 -8562 -14686 -5964 10226 14170 4575 -7891 -14369 -6538
1242 -6538 9066 14456 5349 -7506 -13994 -7178 8251 14726 5791 -6989 -13841 -8003 7719 15023
1256 15023 6179 -6369 -13569 -8519 6877 14936 6686 -6650 -13079 -8787 5637 15320 7355 -6256
1270 -6256 -12720 -8900 4752 15135 8085 -6118 -12297 -8868 3525 14562 8962 -5592 -12355
1283 -12355 -8783 2543 13719 9924 -4673 -12576 -8844 1862 12930 10711 -4056 -12307 -9015
1296 -9015 1681 12646 10924 -3193 -12226 -9237 1436 12109 10960 -2307 -12118 -9099 929
1309 929 11034 11377 -1663 -12336 -9247 215 10545 11937 -1207 -11706 -9718 -74 9841 11646
1323 11646 400 -11649 -10314 229 8887 11630 1842 -11860 -10857 -200 8485 11689 2152
1336 2152 -11089 -11258 -1017 8859 11292 2712 -9621 -11904 -1529 9108 10741 3585 -9108 -12603
1350 -12603 -1442 8284 10752 3813 -9407 -11752 -2215 7728 11312 3578 -8053 -11288 -3412 8038
1364 8038 10419 3943 -6489 -12586 -3684 7704 10154 5498 -6290 -12771 -4318 6880 10824 5491
1378 5491 -6524 -11770 -5229 7042 11343 4045 -5002 -11157 -6240 6849 10315 4334 -3933 -10949
1392 -10949 -6220 5457 10279 6246 -4540 -10470 -6731 3902 11796 6077 -4839 -9944 -7496 4383
1406 4383 11673 5341 -3547 -10141 -7575 4170 9879 6486 -3031 -10071 -6785 2184 10090 7888 -3069
1421 -3069 -9113 -7657 890 11397 7794 -2875 -8900 -8620 1723 10696 7538 -2007 -9966 -7748
1435 -7748 1831 8923 8586 -2009 -9583 -6407 -126 8561 9289 -1698 -8479 -7309 -561 8849 8666
1450 8666 -312 -8275 -8588 240 7727 8941 1082 -9811 -8082 557 6948 9713 446 -9463 -7323
1465 -7323 -863 7311 9134 599 -7641 -8207 -1296 6964 8165 2383 -7140 -9533 -790 6292 8629
1480 8629 3531 -8246 -9217 -895 5896 9369 2631 -7567 -8769 -1922 6415 8277 2669 -5361 -9246
1495 -9246 -2396 5942 7032 4529 -4594 -10294 -2723 5256 8138 5266 -5701 -10171 -3190 5572 9141
1510 9141 3496 -5061 -8889 -3984 6068 7847 2612 -2924 -8850 -4318 5154 6892 4388 -2779 -9144
1525 -9144 -4656 4129 7980 5479 -3397 -8643 -5266 3921 9438 4096 -3227 -8076 -5928 4380 8434
1540 8434 3594 -1902 -7817 -5877 3679 7309 4836 -1474 -7698 -5735 1874 8072 5715 -2310 -6979
1555 -6979 -6585 1104 9184 5167 -2319 -6294 -7234 1809 8441 5362 -1524 -7035 -6156 1048 7325 6335
1571 6335 -1421 -6773 -5854 -253 7035 6777 -1074 -6242 -6513 -633 7251 6731 -243 -6341 -7067 -421
1587 -421 6951 6825 -105 -6771 -6377 -370 6203 7128 -4 -6166 -5973 -1226 6028 7241 88 -5781
1603 -5781 -6135 -1531 5490 7003 1418 -6006 -6644 -1211 4817 7154 1898 -6246 -6520 -1378 4483 7312
1619 7312 1939 -5540 -6547 -1626 4691 6679 2307 -4460 -7133 -1975 4312 6478 3000 -4626 -7218
1634 -7218 -2046 4276 6864 3076 -4402 -7028 -2622 4115 6592 2999 -3604 -6979 -2974 4132 6021
1649 6021 3337 -2921 -7203 -3116 3496 5961 3756 -2754 -6910 -3646 3164 6397 3601 -2533 -6863
1664 -6863 -3964 3159 6433 3510 -1940 -6863 -4521 3323 6214 3702 -1796 -6397 -4731 2329 6433
1679 6433 3833 -1759 -5857 -4659 2127 6458 3685 -1512 -5518 -5104 1594 6191 4092 -1249 -5551
1694 -5551 -4965 1234 6155 4245 -1145 -5199 -4838 787 6360 4617 -1045 -5232 -5253 233 5855 4754
1710 4754 -886 -4914 -5029 -174 5687 5133 -503 -5029 -4813 -253 5486 5279 -412 -4658 -4624 -538
1726 -538 5110 5594 -276 -4531 -4810 -974 4797 5653 280 -4629 -4632 -999 4176 5818 669 -4820 -4879
1743 -4879 -1204 3904 5816 1050 -4528 -5011 -1244 3780 5705 1144 -4237 -5176 -1470 3756 5818
1758 5818 1755 -4148 -5089 -1331 3277 5426 1950 -4016 -5123 -1605 3074 5380 2129 -3681 -5190
1773 -5190 -1716 2859 5284 2451 -3327 -5538 -1974 2801 5073 2993 -2842 -5456 -2100 2689 4983
1788 4983 3242 -2867 -5288 -2325 2572 4913 2789 -2191 -5461 -2798 2628 4887 3008 -1884 -5285
1803 -5285 -2840 2197 4597 3290 -1628 -5252 -2877 1755 4769 2998 -1745 -4795 -3392 1741 4833
1818 4833 3189 -1155 -4674 -3972 1693 4700 3285 -1009 -4798 -3649 1346 4624 3707 -962 -4598
1833 -4598 -3774 931 5035 3190 -1047 -3959 -4368 676 4716 3083 -632 -3875 -3911 640 4199 3680
1849 3680 -365 -3919 -3757 -404 4337 4388 -586 -3618 -3941 -388 4389 4214 -98 -3741 -4056 -21
1865 -21 3943 3837 164 -3886 -3793 -201 3227 4454 393 -3690 -3411 -1269 3242 4804 220 -3190
1881 -3190 -4275 -1201 3623 4391 831 -3494 -4350 -565 3073 4267 1272 -3722 -3562 -793 2178 4563
1897 4563 1498 -3262 -3488 -1597 2232 4525 1504 -2732 -4406 -1442 2348 4011 2424 -3140 -4580
1912 -4580 -947 2057 4013 2293 -3183 -3830 -1264 1603 3984 1987 -2207 -3995 -2344 2144 3717
1927 3717 2057 -1442 -4985 -2124 2309 3739 3035 -1911 -4753 -1458 1678 3833 2723 -1966 -4068
1942 -4068 -1966 1685 3713 2202 -981 -3887 -3011 1615 3318 2469 -313 -4750 -2760 1462 3171
1957 3171 3037 -909 -4411 -2809 1124 4005 2799 -1215 -3385 -3175 1264 4029 2185 -474 -3155
1972 -3155 -3290 976 3368 2315 56 -3600 -3471 687 3099 3288 -156 -3547 -3349 -31 3830 3399
1988 3399 -385 -2874 -3583 0 3900 2781 21 -2880 -3624 273 3224 2709 653 -2831 -3315 -225
2004 -225 2775 3691 220 -2871 -3069 -1202 3252 3533 -27 -2618 -3371 -817 3206 3238 361 -2591 -3538
2021 -3538 -426 2375 3316 616 -2818 -3092 -978 1884 3652 1126 -2372 -2842 -1395 2274 3808 1093
2037 1093 -2124 -3633 -1252 2282 3549 1516 -2436 -3461 -803 1925 3038 1623 -2396 -3020 -1217
2052 -1217 1596 3510 1488 -1873 -3186 -1952 1625 3370 1923 -1762 -3679 -1447 1721 2986 2358
2067 2358 -1818 -3504 -1405 1197 3103 2209 -1334 -3371 -1828 1304 3080 1943 -1060 -3608 -2372
2082 -2372 1583 2961 2308 -636 -3657 -2066 1377 2790 2378 -948 -3408 -2146 1099 3200 2182
2097 2182 -873 -3039 -2533 828 3004 2006 -309 -2808 -2719 929 2929 2371 -79 -3027 -2635 556
2113 556 2792 2397 130 -2690 -2637 369 3150 2286 30 -2331 -3110 246 3091 2308 203 -2452 -3157
2130 -3157 -82 2949 2440 178 -2326 -2705 -479 2909 2772 43 -2140 -2939 -741 2758 2769 176
2146 176 -2073 -2812 -642 2521 2845 331 -2102 -2641 -981 2284 2939 428 -2002 -2579 -871 2338
2162 2338 2949 583 -1839 -2590 -1145 2172 3014 705 -2120 -2689 -1134 1691 2981 874 -2073 -2670
2178 -2670 -1323 1582 3142 1171 -1930 -2577 -1431 1527 3134 1253 -1696 -2829 -1285 1341 2948
2193 2948 1495 -1507 -2794 -1281 993 2788 1628 -1480 -2762 -1214 1316 2729 1874 -1255 -2880
2208 -2880 -1422 1050 2621 1791 -1247 -2855 -1799 821 2681 1853 -868 -2740 -1498 784 2503
2223 2503 2021 -899 -2588 -1731 806 2511 2152 -380 -2665 -1962 779 2441 2128 -562 -2892 -2017
2239 -2017 752 2259 2036 -160 -2531 -2050 417 2573 2029 16 -2392 -2239 272 2318 2013 -68
2255 -68 -2203 -2324 259 2194 2018 -7 -2247 -2453 -20 2356 2198 86 -1995 -2043 -298 2292 2249
2272 2249 286 -1819 -2484 -398 2062 2411 594 -1970 -2472 -633 1930 2480 404 -1593 -2152 -726
2288 -726 2057 2540 384 -1853 -2341 -928 2006 2294 365 -1669 -2337 -791 1374 2349 614 -1820
2304 -1820 -2136 -1038 1373 2938 681 -1508 -2192 -1255 1294 2603 763 -1475 -2377 -1285 1271 2414
2320 2414 1310 -1321 -2334 -1298 1009 2477 1321 -1192 -2192 -1365 635 2605 1307 -1323 -2234
2335 -2234 -1253 859 2445 1346 -1024 -2469 -1355 1023 2175 1669 -1008 -2578 -1487 693 2106
2350 2106 1885 -1017 -2139 -1373 592 2170 1730 -575 -2513 -1638 522 2121 1816 -344 -2385 -1413
2366 -1413 463 1910 2069 -337 -2315 -1203 237 1868 1962 -516 -1936 -1803 -149 1981 1718 -100
2382 -100 -2099 -2157 403 2113 1918 213 -2240 -1971 421 1889 1955 -11 -2302 -1737 -43 1808 1886
2399 1886 214 -1608 -2214 -341 1738 1689 692 -1528 -2359 -167 1567 1809 799 -2037 -2469 -391 1706
2416 1706 2252 262 -1859 -1977 -596 1619 1900 190 -1026 -2372 -509 1392 1730 879 -1089 -2290
2432 -2290 -895 1365 2092 864 -1561 -2255 -935 1167 2683 841 -1454 -1936 -1052 1624 2075 616
2448 616 -894 -2181 -1198 1354 1927 1090 -902 -2327 -1031 743 2021 1336 -1250 -1912 -1145 798 2546
2465 2546 1036 -1071 -1955 -1443 842 2343 1028 -847 -2248 -1177 734 1771 1784 -782 -2283 -1142
2481 -1142 91 2120 1907 -744 -2028 -1489 372 2109 1729 -515 -2159 -1764 514 1870 1623 -301
2497 -301 -2520 -1184 394 1723 1970 -400 -2182 -1359 -25 1917 1860 -95 -1831 -1670 66 2071
2513 2071 1602 183 -2044 -1837 90 1530 1869 293 -2102 -1698 119 1398 1921 -1 -1994 -1609
2529 -1609 -74 1617 1801 248 -1552 -2184 -292 1650 1536 929 -1523 -2254 -217 1384 1917 589
2545 589 -1615 -2050 -404 1514 1939 298 -1242 -2002 -590 1505 1890 576 -1023 -2168 -436 1451
2561 1451 1684 851 -1109 -2167 -749 1309 1991 874 -1210 -2127 -978 1230 2160 563 -913 -2035
2577 -2035 -1111 1449 1934 866 -902 -2189 -1188 1164 1970 935 -831 -1816 -1181 888 2211 786
2593 786 -788 -1784 -1617 636 2251 1028 -631 -1879 -1296 702 1865 993 -690 -1699 -1270 610
2609 610 2028 1220 -672 -1683 -1187 365 2106 1416 -348 -1711 -1405 463 2017 1443 -396 -1972
2625 -1972 -1524 141 1744 1569 -204 -1950 -1483 142 1775 1548 -252 -1719 -1774 267 1648 1787 -53
2642 -53 -1656 -1488 -123 1544 1787 126 -1572 -1641 -212 1544 1771 66 -1587 -1631 -93 1263 1503
2659 1503 145 -1332 -1691 -196 1444 1634 470 -1476 -1673 -377 1193 1513 672 -1271 -1937 -398
2675 -398 1381 1689 490 -1204 -1811 -417 1245 1716 767 -1128 -1989 -429 1343 1748 728 -980 -1855
2692 -1855 -672 1194 1803 752 -876 -2049 -844 1077 1665 980 -767 -1917 -799 1007 1731 1039
2708 1039 -756 -1835 -1058 1035 1656 877 -414 -1835 -1060 762 1888 837 -606 -1456 -1246 861
2724 861 1887 1064 -716 -1672 -1235 805 1729 1147 -303 -1504 -1265 724 1827 1054 -586 -1706 -1296
2741 -1296 423 1907 1215 -368 -1410 -1509 325 1925 1220 -322 -1443 -1495 -137 1616 1203 -491 -1627
2758 -1627 -1378 -77 1709 1689 -313 -1384 -1538 -172 1539 1585 -43 -1530 -1459 -206 1488 1616 -159
2775 -159 -1190 -1439 -309 1271 1660 260 -1475 -1512 -567 1291 1780 202 -1372 -1546 -552 1361 1751
2792 1751 445 -1401 -1668 -563 1139 1707 375 -1232 -1258 -614 961 1764 600 -1242 -1622 -345 847
2809 847 1777 675 -1152 -1848 -798 1195 1869 858 -1040 -1828 -608 797 1251 993 -933 -1589 -449
2826 -449 809 1372 874 -803 -1669 -1009 659 1689 1092 -478 -1997 -854 645 1558 1141 -621 -1882
2843 -1882 -962 808 1662 860 -440 -1712 -1253 402 1472 1180 -414 -1556 -1444 711 1664 1205 -327
2860 -327 -1826 -1317 413 1372 1176 -298 -1625 -1211 77 1572 1144 -67 -1260 -1261 162 1718 1004
2877 1004 -62 -1304 -1446 65 1522 1130 -39 -1440 -1373 109 1285 1566 50 -1378 -1479 -227
2893 -227 1617 1661 -114 -1257 -1520 -76 1474 1360 -83 -940 -1481 -131 1138 1585 207 -1147 -1127
2910 -1127 -514 1092 1585 222 -1204 -1291 -699 1171 1746 254 -1127 -1347 -511 1081 1588 284 -1065
2927 -1065 -1389 -291 802 1617 503 -1263 -1183 -697 491 1673 473 -831 -1344 -718 695 1729 886
2944 886 -879 -1809 -395 878 1678 993 -955 -1430 -430 505 1540 877 -892 -1424 -798 491 1624
2961 1624 924 -780 -1448 -1056 487 1632 1054 -443 -1976 -938 404 1432 1169 -712 -1621 -584
2977 -584 199 1377 1181 -313 -1436 -894 456 1085 1043 -80 -1463 -1300 435 1338 1012 -122 -1667
2994 -1667 -1171 425 1068 1173 -195 -1490 -1177 249 1415 1178 -74 -1108 -1428 64 1329 1102 241
3011 241 -1344 -1595 -6 1153 1105 141 -1374 -1333 -73 1096 1387 -64 -1194 -1654 -43 1361 1314 202
3029 202 -958 -1296 -136 1294 1215 328 -939 -1371 -251 1247 1634 292 -1137 -1305 -720 1092 1412
3046 1412 455 -765 -1313 -467 1241 1339 367 -898 -1397 -574 844 1449 660 -932 -1292 -911 580 1424
3064 1424 485 -713 -1151 -390 1005 1216 663 -715 -1258 -502 498 1431 866 -653 -1197 -687 627 1409
3082 1409 684 -914 -1178 -787 536 1242 739 -450 -1196 -600 435 1347 829 -571 -1287 -698 419 1183
3100 1183 1050 -533 -1328 -971 340 1204 1141 -467 -1191 -869 432 1182 987 -145 -1228 -1049 354 1130
3118 1130 904 -86 -1256 -945 178 1118 939 -74 -1146 -1073 279 1086 1095 -42 -1342 -1276 93 1177
3136 1177 1269 193 -1118 -1294 34 1072 1233 151 -1233 -1369 -108 851 1256 423 -995 -1375 -220
3153 -220 960 970 392 -1018 -1300 -107 908 1278 357 -882 -1395 -391 968 1250 202 -1070 -1431
3170 -1431 -486 888 1278 405 -759 -1313 -676 865 1182 376 -639 -1524 -420 770 958 591 -528
3187 -528 -1405 -415 786 1247 531 -648 -1172 -773 646 1223 563 -417 -1102 -840 731 1416 698 -501
3205 -501 -1172 -824 558 1343 918 -678 -1387 -809 297 1180 695 -502 -1197 -590 189 1343 771 -321
3223 -321 -1039 -857 159 1276 808 -403 -1389 -807 288 1104 973 -345 -948 -925 136 1264 919 -60
3241 -60 -1112 -1215 293 1234 883 -232 -967 -814 106 925 914 -179 -1037 -1089 -68 969 1236 88 -1003
3260 -1003 -1112 -56 1104 1132 143 -941 -1138 -146 868 977 169 -1047 -1123 65 958 1126 110 -987
3278 -987 -1096 -327 988 1001 264 -891 -1203 -411 717 1074 197 -862 -1185 -450 708 1230 394 -815
3296 -815 -1169 -341 912 1309 476 -839 -1057 -319 908 1055 449 -532 -1136 -532 743 1183 476 -518 -1098
3315 -1098 -488 527 1056 762 -614 -1018 -600 550 1207 362 -279 -1224 -776 687 1176 467 -399 -1029
3333 -1029 -765 534 1123 537 -377 -1003 -840 332 1187 715 -269 -1024 -758 282 1224 745 -533 -937
3351 -937 -842 581 1270 614 -216 -1101 -641 203 1027 867 -308 -957 -798 1 1198 936 -70 -730 -938
3370 -938 -49 1406 996 -170 -885 -805 82 951 761 -85 -818 -543 -39 648 1130 -46 -1031 -707 -382
3389 -382 817 1223 -70 -769 -773 -35 1041 964 64 -922 -1011 -47 759 799 99 -824 -858 -113 734 1379 257
3410 257 -704 -661 -281 645 1025 49 -407 -1049 -269 563 897 280 -857 -962 -152 717 1079 489 -731 -957
3430 -957 -472 612 1013 270 -447 -1008 -333 651 745 481 -297 -1157 -542 598 905 563 -362 -1198 -416 299
3450 299 1162 554 -548 -933 -620 588 1249 503 -231 -996 -574 453 844 498 -38 -993 -526 238 817
3469 817 880 -474 -730 -498 237 1030 696 -313 -761 -899 145 844 665 -10 -710 -774 312 726 666 -81
3489 -81 -919 -621 -8 827 830 -268 -591 -678 96 941 751 -77 -1046 -790 74 818 714 -10 -794 -520 -260
3510 -260 858 894 31 -470 -787 -82 684 912 40 -1027 -980 -213 766 837 131 -609 -852 -56 530 791
3530 791 229 -737 -935 -244 391 1119 154 -590 -725 -400 418 879 363 -621 -847 -99 498 780 411 -377
3550 -377 -804 -358 511 600 369 -625 -792 -143 464 764 336 -600 -927 -359 271 781 493 -395 -1003 -459
3570 -459 370 558 512 -376 -940 -381 288 709 626 -307 -850 -422 99 834 368 -464 -681 -413 431 934 596
3591 596 -193 -890 -640 423 693 342 -206 -853 -700 400 683 595 66 -799 -530 108 669 700 -168 -804
3611 -804 -700 256 768 538 -22 -891 -666 148 597 590 -77 -713 -345 3 616 475 -183 -701 -735 -190 637
3632 637 489 214 -437 -749 -26 660 823 206 -675 -625 -90 704 821 -215 -636 -632 -118 722 779 72 -438
3653 -438 -674 -80 505 794 272 -470 -787 -104 632 676 244 -599 -712 -178 435 757 190 -336 -710 -296
3673 -296 614 609 254 -563 -727 -62 512 736 223 -486 -700 -363 188 688 298 -490 -725 -204 395 680 138
3694 138 -288 -652 -359 410 712 369 -168 -684 -427 241 766 396 -383 -647 -412 540 503 275 -190 -572
3714 -572 -393 153 744 325 -303 -688 -499 88 701 456 -237 -704 -400 268 728 305 -59 -475 -616 295
3734 295 555 440 -230 -420 -632 75 534 332 58 -676 -493 -100 610 739 -11 -652 -740 53 633 694 10
3755 10 -512 -784 106 455 416 149 -266 -723 -30 589 534 210 -813 -555 45 513 745 -31 -539 -491 -95
3776 -95 454 708 -65 -226 -970 -35 508 581 94 -305 -848 -65 257 815 123 -327 -581 -213 452 694 199
3797 199 -499 -518 -256 357 426 235 -464 -680 -313 472 391 195 -405 -620 -307 414 685 266 -209 -497 -416
3818 -416 187 493 296 -201 -593 -234 326 573 368 -512 -892 -199 378 573 362 -231 -616 -247 239 531
3838 531 562 -509 -400 -587 59 582 469 -214 -437 -453 157 663 260 92 -783 -448 273 697 428 -368
3858 -368 -311 -141 48 571 520 -71 -490 -295 -20 581 233 144 -514 -451 42 349 350 -41 -564 -533 54 348
3880 348 580 16 -582 -255 -105 575 358 63 -416 -477 -216 304 304 40 -452 -637 -81 210 413 154 -472
3901 -472 -427 29 424 504 -96 -269 -609 70 467 474 7 -272 -614 -157 513 447 92 -226 -508 -154 285 491
3923 491 119 -352 -524 -295 228 646 161 -438 -333 -79 482 402 257 -348 -397 -108 202 572 134 -31 -601
3944 -601 -162 244 561 170 -244 -358 -427 269 657 145 -317 -515 -271 192 379 306 -303 -694 -368 289 371
3965 371 156 -433 -360 -362 6 362 280 50 -598 -366 -21 488 329 -106 -613 -278 138 529 429 -186 -596
3986 -596 -63 -135 351 341 -283 -439 -422 30 416 441 -177 -543 -406 -3 293 281 54 -678 -223 -43 400 431
4008 431 -87 -261 -437 -241 282 417 51 -673 -456 -28 462 466 -37 -450 -498 -159 401 86 -57 -464 -459 -66
4030 -66 328 352 90 -525 -578 -284 124 224 318 -309 -500 -81 221 246 275 -95 -309 -106 362 409 103 -269
4052 -269 -572 -410 258 417 73 -327 -530 -149 166 376 -4 -380 -336 -110 235 329 165 -144 -324 -48 234
4073 234 441 452 -219 -349 -383 368 281 73 -128 -343 -157 143 397 335 -150 -292 -277 67 485 278 -34 -540
4095 -540 -143 -60 297 328 119 -303 -231 255 255 362 -25 -321 -538 31 555 126 -278 -537 -258 -125 450 314
4117 314 -124 -284 -109 -78 561 181 -4 -301 -121 111 287 448 -239 -408 -300 89 459 597 -121 -349
4137 -349 -80 96 216 301 -121 -396 -229 86 229 283 -86 -292 -337 -163 18 503 -80 -156 -395 -140 44
4158 44 51 27 -222 -416 -59 241 423 195 -212 -248 -99 387 427 265 -233 -615 -1 182 180 174 -379 -356 -81 379
4182 379 425 157 -188 -514 -231 190 394 187 -266 -618 -304 195 265 -83 -242 -350 -303 143 353 307 -100
4203 -100 -273 -162 126 241 403 -224 -484 -327 134 313 177 -170 -400 -78 132 281 256 -52 -205 -200 11
4224 11 330 388 -32 -237 -16 182 424 243 -223 -217 -204 -54 399 -47 -119 -166 -107 143 290 193 -9 -142 -285
4247 -285 30 147 108 -17 -248 -385 143 321 199 -111 -202 -385 90 323 284 103 -273 -153 -32 245 187
4268 187 41 -304 -261 -171 370 162 -29 -302 -359 -21 250 249 95 -66 -269 44 185 168 -22 -201 -106 -10 230
4291 230 199 104 -236 -318 -309 249 280 111 -134 -290 -182 303 233 -34 -382 -279 127 262 342 390 -96 -364 -82
4314 -82 127 485 200 -227 -271 -223 267 435 56 -217 -476 -103 50 68 108 -142 -468 -204 96 337 151 -302
4336 -302 -149 -37 165 381 64 -50 -357 -164 169 319 36 -171 -393 -295 12 348 277 102 -345 -190 268
4357 268 243 64 -15 -354 -243 -67 175 160 -34 -234 -268 103 212 197 -135 -92 -291 -38 252 305 -7 -218
4379 -218 -139 26 199 383 -52 -141 -237 -80 266 45 166 -184 -187 195 286 411 -74 -170 -19 24 319 368 46
4402 46 -111 -421 13 164 58 139 -53 -367 17 99 7 -22 -171 -141 -33 317 367 -52 -240 -36 1 4 203
4425 203 127 -83 -161 -181 -91 119 49 61 -225 -61 251 157 -59 -290 -149 -143 160 317 32 -115 -161 23 -2 89
4449 89 -55 -231 -111 -42 79 62 26 -298 -305 -141 128 245 146 34 -172 -21 184 224 201 -300 -171 -372 78
4472 78 276 118 -55 -262 -188 140 346 123 22 -251 -292 -52 290 101 -74 -130 -114 17 211 189 -28 -294
4494 -294 -155 48 128 54 -8 -264 -239 89 29 73 -125 -311 -124 -39 59 222 -206 -79 -247 257 -22 222 -241
4517 -241 -362 77 136 262 222 67 -368 -162 188 155 63 -61 -226 -49 -127 -5 222 -1 -295 -142 125 203
4539 203 360 158 -51 -143 -14 65 158 -38 -126 -316 47 171 15 13 -86 -247 -157 112 117 152 -138 -232 -84 175
4563 175 264 125 -163 -85 253 182 235 74 -230 -199 -52 128 269 42 -97 -111 -213 321 229 39 -126 -254
4585 -254 71 -97 142 109 72 -170 -152 -15 297 32 -196 -216 -89 41 198 101 -181 -350 -108 278 412 362
4607 362 23 -420 1 40 175 51 -262 -321 -165 122 86 85 -134 -164 -268 128 176 43 -41 -317 -76 8 269
4630 269 114 -130 -144 -89 230 150 144 89 -158 -228 10 42 226 -65 -160 -155 -51 410 94 106 -245 -178 -64 35 103
4655 103 5 -316 -299 244 142 18 -6 -27 -151 -67 178 359 -148 -71 -213 -55 197 211 58 -151 -234 -211 122
4678 122 59 31 -112 -357 106 26 360 -23 -186 -278 -36 4 -2 -43 -253 -285 -34 302 -9 147 -52 -351 -173
4701 -173 225 263 188 -76 -158 -254 337 182 -15 -120 -227 -29 62 312 234 -239 -37 -113 -106 62 7 -98 -190 170
4725 170 76 -22 -117 -169 -482 -136 10 -17 -20 83 -272 -110 189 143 -184 -26 -286 -32 54 163 -80 -94 -85 -348
4749 -348 -9 280 -3 -167 -215 -56 -48 210 169 -26 -61 -154 248 485 134 72 68 -105 -163 23 140 -47 -155
4772 -155 -22 61 241 163 30 113 -156 -34 53 65 -86 -188 -51 96 418 357 -18 -99 -123 324 188 15 -65
4795 -65 -309 -239 125 122 147 20 -257 -123 128 159 143 198 -227 -31 119 139 -20 40 -89 -194 115 -51 275
4818 275 -118 155 -243 -128 338 351 41 -133 -126 -44 255 215 -171 -68 -10 2 289 362 40 -64 -32 -55 359
4841 359 305 100 -319 -152 -125 89 258 36 -26 -59 -224 64 321 -188 -16 -90 33 22 179 196 -319 -211
4863 -211 52 49 185 -55 -344 -243 4 105 95 311 -209 -245 -239 218 304 121 -77 -162 -156 -102 203 118 -250 -342
4887 -342 80 76 341 261 57 -45 -14 -86 209 231 -111 -289 38 -6 163 415 -61 -241 -238 -79 370 196 -23
4910 -23 -155 28 10 225 78 -195 -330 -58 30 103 182 -3 -191 -360 -34 268 177 11 -211 -129 -144 389 54
4933 54 -247 -91 -188 -20 184 58 -48 -362 -50 19 129 205 110 -74 -224 -4 -7 -6 124 -306 -239 -152 334 83
4957 83 -172 -112 -165 54 119 230 4 -77 -137 -99 255 275 -61 56 -178 -205 115 323 -117 -75 -60 -352 164 154
4981 154 13 -1 -41 -270 -91 282 217 -13 -331 -2 97 128 -96 -99 -196 -197 29 275 149 -122 -217 63 -14 82
5005 82 -8 -31 -88 -137 79 259 -5 61 -364 15 -38 291 141 139 -41 74 -71 263 283 -79 -140 -191 208 241
5029 241 189 -45 -92 -77 -105 90 323 -100 -310 -162 143 168 179 52 -123 -112 -62 163 72 107 36 19 -32 77
5053 77 99 -14 -207 -222 -62 197 -34 -22 -187 -208 109 123 20 -139 -405 -138 -124 298 226 195 -105 -135 -211 127
5077 127 282 -121 -288 -231 30 235 97 -7 -153 -249 -11 208 98 184 -242 -239 -3 -36 135 148 -42 -191
5099 -191 -40 166 92 -50 -32 -110 -28 5 325 34 -164 -265 28 62 265 132 22 -153 -157 205 248 128 -107
5122 -107 -108 -240 295 160 268 -199 -121 -61 -188 169 277 -88 -109 56 152 316 4 -22 -278 -30 55 62 120 38
5146 38 24 -96 45 214 96 -36 -8 -110 -32 368 68 -201 19 95 56 62 211 -102 -111 -152 45 249 119 146
5170 146 -147 -46 -121 250 206 -2 -93 -27 -50 210 84 -15 -143 53 -14 208 112 -19 -300 -195 102 110 186 100
5194 100 -266 2 85 199 311 -54 -185 -117 196 -21 110 -137 -206 -236 -9 35 4 -58 -218 -83 63 73 262
5217 262 -45 -197 -192 131 18 173 -22 -4 -380 -80 20 72 107 -9 -264 -124 -3 35 269 -26 -54 1 361
5240 361 300 99 -129 -368 58 202 115 9 137 23 -144 182 225 38 61 -162 -26 137 274 0 -164
5261 -164 -72 -101 226 128 162 328 -126 -357 -42 210 261 -57 -317 38 141 125 144 -274 -205 -203 -102 378 207
5284 207 -52 -113 -224 -204 5 105 -106 -238 -210 -14 242 131 130 -83 -274 39 254 -47 -5 -151 -48 34
5306 34 275 265 118 5 -74 111 177 60 -140 -92 -224 244 150 9 162 -69 -4 28 154 160 -70 -186 -177 -97
5330 -97 173 -12 -87 -244 -283 -170 131 126 -11 -326 -108 -36 78 159 171 -257 -23 -36 197 251 -130 -7 -279
5353 -279 -214 236 181 -18 155 -253 -97 -8 109 181 -164 -158 -67 -89 -18 -34 -77 -246 -124 86 60 -71 -238 -62
5377 -62 -237 -40 -18 152 149 -266 -14 60 425 121 -168 -246 -97 16 179 130 -49 -176 -403 80 152 -30 -93
5400 -93 -110 -74 92 279 310 -108 -87 -53 74 186 85 -93 -121 -299 138 200 125 -11 -186 -75 167 99 123 20
5424 20 -162 -313 68 229 49 -63 95 -13 154 341 -98 49 -100 165 60 26 80 99 -284 -251 174 247
5446 247 119 55 -127 -146 -83 147 257 -2 -72 -52 -105 296 201 -216 47 -266 -105 59 347 37 -15 -191 -89
5469 -89 144 89 196 -138 -229 -81 278 216 161 -255 44 -287 -37 286 19 -147 -309 -195 28 255 70 -269
5491 -269 -239 -38 94 148 231 -84 61 -148 129 190 88 -173 -372 -33 1 265 338 101 -193 -141 -20 56 202
5514 202 -49 -426 -118 -18 25 250 -144 -163 -288 -81 253 329 -101 -244 -157 -247 197 -21 49 -452 108 193
5536 193 132 89 -177 -192 -113 174 235 117 -112 -266 -154 -132 136 144 65 -181 -444 60 276 124 27 -180 -287
5559 -287 -60 -44 245 52 -165 -244 157 219 269 -27 -282 -43 11 92 70 54 -170 -94 -102 178 109 -156 -174 -293
5583 -293 128 167 127 18 -163 -83 -106 197 259 37 -351 -258 51 238 200 179 -95 -173 -224 150 186 110 -50 -403
5607 -403 -13 274 141 237 -161 -311 -125 -41 242 -37 47 -30 87 78 341 -24 -63 -178 -269 153 253 -94 -161
5630 -161 -61 -156 -171 334 170 51 -184 -75 3 263 276 -308 -138 -47 52 316 191 -104 -214 -258 276 276 80
5653 80 -284 -110 -284 18 93 144 -122 -180 -52 86 -22 42 133 -285 -281 109 358 353 84 -65 -86 8 198 424
5677 424 -89 -270 -292 -2 335 207 -62 -275 -36 -53 129 64 -85 -238 -17 -57 -7 351 131 40 -176 17
5699 17 360 181 -65 -231 -236 10 -157 315 -212 -37 -181 -238 113 405 35 -117 -2 -55 36 371 109 -212
5721 -212 -184 -98 36 182 -114 76 -385 -127 216 69 50 10 -97 -140 297 284 -187 -122 -329 -151 164 258 244
5744 244 -96 -112 -12 77 17 56 35 -425 -240 -94 253 25 -256 -171 -263 55 204 173 142 -235 -144 -36 146
5767 146 7 -153 -280 -251 140 190 283 105 -312 -150 261 42 150 -207 -333 -141 123 183 144 -37 -306 -368
5789 -368 -51 49 342 -166 -291 -179 -2 102 194 -183 -396 -383 -92 249 116 83 -160 -380 13 320 -7
5810 -7 -46 -154 -203 5 101 328 152 -113 -227 -63 75 111 -59 -176 -282 50 204 175 -16 -266 -272 68 339
5833 339 164 21 -73 -362 -157 143 131 212 -239 -150 -186 227 240 137 -287 -74 -23 79 351 102 -190 -362
5855 -362 -167 144 280 24 -133 -391 -61 421 424 103 46 -94 -171 1 116 300 -129 -321 -247 281 -5 228
5877 228 -29 -191 -261 112 155 -41 -77 -226 0 -64 257 256 94 -285 -213 85 394 43 170 -47 -193 -77
5899 -77 406 165 43 -67 -385 98 235 206 -193 -79 -104 -124 151 440 14 -253 -117 14 245 -107 -22 -524
5921 -524 -235 -55 243 620 55 192 -265 -275 265 374 -26 -104 -345 53 281 194 -185 -248 -110 -228 301
5942 301 124 32 -242 -177 231 118 200 2 -232 -82 -157 163 265 -128 31 -155 166 211 193 80 -297 -300 -191
5965 -191 -4 354 108 126 -352 -98 262 294 196 -4 -184 -45 -66 147 -2 -205 -196 -304 215 126 277 80
5987 80 -240 -140 154 160 251 -36 -331 -169 64 150 24 45 -230 -389 273 109 147 -61 -194 -454 45 82 280
6010 280 1 -169 -207 -170 198 32 83 -201 -451 64 159 132 35 -68 -208 -50 273 114 153 5 96 98 21 263
6034 263 277 35 -269 -201 57 174 101 -146 -183 -241 187 -44 -108 -238 -178 -272 78 169 -120 -261 -146 19 -451
6057 -451 204 86 56 -229 63 272 176 -32 -19 -688 -773 996 463 -334 -142 -331 -200 276 677 557 -293
6078 -293 4 -78 282 153 259 -340 -216 4 79 156 145 -80 -232 -138 -109 229 158 -205 -280 -202 6 363 93
6101 93 -105 -198 -137 9 185 206 -79 -213 -191 74 418 174 -41 -407 -208 -51 321 139 -29 -255 -195 97
6123 97 70 295 -123 -276 -110 70 125 210 122 -68 -169 147 248 121 30 -41 -252 8 333 339 33 -259 -376
6146 -376 70 66 241 192 38 -300 -138 101 274 202 -370 -18 115 247 -15 43 -299 -155 34 199 174 -159
6168 -159 -198 -92 -57 215 149 1 -202 -282 -220 108 288 76 -109 -331 75 185 56 95 -340 -297 -66 273
6190 273 335 172 -62 -261 -85 91 204 208 -215 -300 -224 132 286 22 48 -28 -289 172 233 151 32 -277 -85
6213 -85 33 400 223 -103 -209 -56 -7 133 199 -17 -264 -162 172 341 275 67 -235 -209 315 183 280 -91
6235 -91 -69 -234 3 170 93 98 -229 -122 115 221 309 -108 -330 -303 97 47 307 -1 -165 -189 -77 -30 135
6258 135 70 -318 -24 -102 110 15 79 -270 -198 81 -82 96 70 -343 -234 196 98 231 90 -217 -315 -5 134
6281 134 388 138 -278 -91 30 152 257 118 -160 -259 -115 171 231 -100 -232 -162 -78 175 338 127 -158
6302 -158 -387 -260 -34 150 62 -159 -300 -47 541 -7 134 -80 -183 -138 198 148 95 -159 5 -4 302 217
6324 217 307 9 -44 -91 -29 350 91 62 -98 -300 140 362 188 -166 -322 -63 59 197 200 -180 -110 -117 56
6347 56 265 23 -3 -259 -21 55 209 94 -73 -91 -71 11 106 145 -218 -383 -11 77 260 260 98 -185 -313 -6
6371 -6 157 324 -78 -77 -246 42 197 238 -90 -195 -139 -41 304 91 208 -391 -196 -18 277 298 91 -153 -269
6394 -269 132 250 73 -75 -241 -248 -220 260 298 75 -127 -275 7 169 59 277 -130 -199 -56 83 126 141
6416 141 -337 -237 19 87 357 70 -9 -249 -255 222 315 105 -151 -136 -118 -13 44 -38 51 -126 -200 170 182 -23
6440 -23 -317 -51 24 10 202 44 -15 -170 -214 142 186 76 -20 -171 -206 114 236 220 -69 -201 -154 -9 120
6463 120 116 -137 -275 -269 137 246 187 222 -232 -282 154 185 168 -240 83 -85 88 249 258 -111 -187 -208 -82 268
6487 268 244 -51 -137 -8 44 310 151 -187 -246 -208 69 362 163 -57 -251 -175 -35 168 253 -116 -64 -275 94
6510 94 7 131 124 -321 -67 -246 155 -26 -42 -110 -72 -220 25 350 -136 -150 -25 -143 159 235 14 -73 -172 -128
6534 -128 392 -76 64 -58 -158 -192 100 176 20 -76 -153 -48 181 195 119 -35 -203 -188 158 102 106 -80 -133 -211
6558 -211 110 323 -20 -131 -178 0 263 125 209 -45 -108 -151 25 230 206 14 -272 -117 -11 101 78 -37
6580 -37 -188 -325 147 191 131 58 -213 -323 199 78 141 -32 -433 -145 64 362 225 35 -324 -245 -6 253
6602 253 115 4 -135 -118 196 191 217 109 3 -227 -67 211 334 102 -304 -134 75 247 306 -42 -242 -245
6624 -245 -97 196 158 -49 -407 84 -83 227 157 -27 -242 -81 -211 122 190 -31 -157 -294 -11 112 116 -34
6646 -34 -144 -318 -22 6 163 -98 -158 -284 -188 16 257 109 -38 -192 71 84 158 138 -41 -149 -30 14 233
6669 233 270 265 -171 40 174 255 -48 -92 -258 -172 -91 120 9 12 -131 -374 42 365 74 -143 -379 -88 143
6692 143 276 24 -16 -168 -15 10 43 21 -112 -101 -191 61 37 263 -5 -278 -316 12 291 89 -20 -160 -128
6715 -128 -12 283 390 106 -267 -150 -12 231 226 -30 -190 -85 -40 214 118 66 -165 -35 -141 119 182 -109
6737 -109 -194 -110 71 142 370 202 -31 -267 -259 165 180 113 -125 -168 -91 221 327 -53 1 -96 -125 100 153 -54
6761 -54 -150 -227 -181 138 326 79 -17 -245 -266 161 292 7 37 -276 -151 113 216 93 74 -147 -361 118 174
6784 174 105 -298 -80 54 217 318 200 -204 -157 -95 -80 296 71 -126 -325 -73 -51 597 292 -105 -310 -184
6806 -184 100 359 201 74 -340 -143 -52 261 91 -193 -143 -361 158 215 71 -40 -153 -59 132 147 162 -10
6828 -10 -171 -29 17 367 169 66 -149 -126 -142 51 220 -71 -57 -302 -95 127 -44 -134 -125 -49 -204 28 105
6851 105 73 -232 -146 -199 189 267 155 2 -353 -154 139 213 183 -303 -99 192 67 382 178 -194 -242 -141
6873 -141 46 279 114 -291 -314 -54 85 44 8 -1 -85 34 59 206 181 -140 -230 2 171 93 232 -108 -117 100
6897 100 153 211 229 -141 -154 -347 122 73 231 -102 -295 -88 -76 160 265 -177 -281 -42 74 19 -175 -45
6919 -45 -146 -66 23 412 248 178 -299 -150 -11 38 248 -83 -318 -163 -49 261 279 -85 3 -238 138 74 117
6942 117 46 -194 -39 316 188 27 -93 -199 -211 45 62 170 -5 -110 -108 -51 433 214 88 -233 43 112
6964 112 199 243 -145 -70 -115 -61 -30 137 47 -73 -189 70 218 108 -21 -199 -135 -40 96 320 88 -227 -59
6987 -59 22 -22 141 14 -277 -190 -103 167 90 251 -34 -458 -33 228 40 39 -217 -81 -70 80 226 -80 -185
7010 -185 -100 -193 -91 241 234 49 -137 -279 -24 108 172 -366 -304 -66 120 171 242 -237 -350 -155 149 229 106
7033 106 -120 -12 -264 14 81 168 169 -133 -11 31 64 -85 44 -253 -243 116 266 244 -194 -333 -227 308 117
7056 117 114 -282 -141 -25 137 304 90 -73 -202 -327 -71 133 279 -11 -408 -148 182 323 152 90 -63
7077 -63 -405 -184 371 163 116 -190 -152 -83 240 187 93 -198 -140 -26 92 116 124 -107 -183 -132 126 232 -48 -28
7101 -28 -174 -201 139 285 -184 -97 -286 -261 142 129 121 -405 -395 33 155 294 201 -52 -66 -133 52 365 199 18
7125 18 -306 -224 -2 308 161 -228 -223 -71 301 227 78 -380 -283 -88 8 250 105 52 -150 -350 3 354 58
7148 58 -149 -225 -71 4 154 48 -208 -230 -264 91 256 125 -163 -127 91 51 298 250 54 -55 -219 194 85
7171 85 103 -259 -165 47 -78 250 88 -259 32 65 -3 85 92 130 -229 -215 156 185 135 -163 -272 -148 71 171
7195 171 95 -92 -382 -120 -158 183 -97 -101 57 -92 12 325 52 25 -170 -235 -112 26 50 99 -103 -287 -31
7218 -31 404 72 -83 -154 -219 -214 240 70 29 -240 -132 -7 120 253 -102 -103 -289 76 -264 388 -137 -2 -212
7241 -212 -57 57 150 -32 -278 -304 -133 57 253 58 14 -76 -39 109 173 17 -377 -91 -93 100 177 110 -123
7264 -123 -309 -382 175 178 50 -155 -315 -248 249 162 65 -205 -95 -183 84 -47 131 -139 -158 -14 -19 361 133
7287 133 -74 -336 -191 138 180 -66 -188 -289 -97 -163 240 86 -111 -116 -83 74 156 246 -139 -74 -301 -2 57
7310 57 67 -10 -5 -361 -154 207 123 48 -181 -18 -46 159 -152 -91 -314 -246 -84 240 165 164 -110 -161 -215 229 216
7335 216 1 -178 -159 153 45 249 -68 -174 -307 -90 97 338 124 -311 -289 36 256 249 16 -207 -281 -203
7357 -203 293 168 0 -110 -233 -255 214 98 57 -91 -178 14 125 300 31 -101 -225 -287 123 227 -109
7378 -109 -83 -29 96 109 175 111 -125 -102 -182 134 300 -69 -24 -312 -174 -136 252 238 -160 -155 -175 149 307 72
7402 72 -84 -282 -251 -66 152 171 -131 -235 -208 45 -126 -86 -72 -275 -49 32 224 -36 -48 -213 -187 -10 119
7425 119 155 -58 -220 -293 46 123 281 -41 -93 -195 -32 85 254 -78 -79 -108 149 119 137 -89 -395 -84 94
7448 94 48 247 -2 -396 -118 31 36 66 145 -414 -147 24 220 275 99 -13 -97 -43 174 225 -73 -109 -258 -118
7472 -118 168 141 134 -300 -302 -24 246 199 -127 -391 -135 143 137 115 188 -269 -102 -93 314 155 0 -168 -233 119
7496 119 190 70 79 -250 -60 7 -215 313 60 -174 -94 -52 206 -62 150 -180 -32 30 -42 34 122 -64 -48 -185
7520 -185 79 233 144 -181 -116 -290 91 280 108 -140 -123 -406 -90 141 -5 -117 -209 -149 53 250 161 -8
7542 -8 -193 -56 136 155 37 -3 -181 -16 -19 89 139 -145 -212 -134 -17 347 205 49 -294 -63 73 215 252
7565 252 -16 -105 -240 84 239 141 -273 -260 -99 143 272 279 -39 -391 -94 -120 73 137 -51 -57 -116 -12 373
7588 373 68 81 -226 -286 45 245 222 30 -256 -169 -65 455 145 96 188 -226 28 341 248 106 -213 -335
7610 -335 -157 195 202 13 -292 -290 -10 18 255 45 -156 -337 192 253 97 -6 -28 -79 -219 -66 188 198 -45
7633 -45 -71 82 -153 196 40 43 -9 17 26 148 300 -123 -350 -210 136 76 38 -43 50 -94 -48 299 145 -135
7657 -135 -322 -184 182 432 89 -122 -450 -280 87 -102 38 -39 -261 -180 73 200 315 12 -268 -231 101
7678 101 373 174 173 -25 -166 28 116 -45 31 -172 -117 -82 44 211 -105 -255 -228 -50 26 88 -53 12 -109
7701 -109 -88 -100 121 89 -14 -252 -210 159 154 153 -364 -167 64 153 115 -14 -271 -186 -74 191 99 102 -181 -194 23
7726 23 117 253 19 -69 15 97 212 447 4 -19 -144 -47 171 553 -123 -135 -233 -7 298 -99 -138 -86 -180 71
7750 71 213 156 293 -214 -394 -67 206 117 138 -164 -417 -13 20 99 -28 -171 -214 -189 335 -39 91 -123 -328
7773 -328 -42 -87 123 72 -70 -92 -58 79 196 51 138 -29 -109 -24 123 5 -265 -137 -118 108 92 14 71 -93
7797 -93 -39 247 95 113 -26 -214 -154 135 170 182 -27 -306 -182 0 288 213 -200 -394 -181 32 -95 135
7819 135 -324 -112 -33 149 76 173 114 -339 -24 22 321 82 -60 -330 -265 -54 159 161 132 -49 -65 19 203 154
7843 154 -90 -123 -4 32 195 222 -70 -267 -267 18 154 274 -49 -145 -110 -88 138 44 -49 -38 -245 35 145 84
7867 84 233 -206 -96 -33 21 81 123 -225 -119 -80 -20 176 412 -150 -167 -263 170 176 -80 60 -208 -189 133 125 157
7892 157 -405 -154 -59 -51 429 95 -67 -257 12 197 145 116 -145 -315 -17 -56 173 99 80 -95 41 150 281
7915 281 49 -187 -197 -170 104 312 322 -128 -150 -147 65 264 55 -115 -110 -78 102 192 87 46 -180 -295 -195 203
7939 203 44 158 -245 -237 10 76 133 -144 -184 54 187 -27 -185 10 -139 -84 -81 99 231 11 -381 -197 53
7962 53 90 248 -158 -193 -134 -20 306 183 97 -191 -127 -114 227 245 -53 -206 -102 181 134 192 82 -281 -257 82
7986 82 54 121 -22 -269 -93 -48 362 205 381 -140 -120 -109 142 180 27 -278 -262 60 47 44 -201 -176 -105 -48 441
8011 441 98 -17 -142 -468 -66 88 452 87 -381 -243 82 143 267 108 -319 -134 -132 42 213 40 -74
8032 -74 -383 -103 234 180 76 -37 -229 11 10 151 -18 -24 -83 69 29 164 94 -141 -271 -174 234 76 140 -178
8056 -178 -217 -242 27 284 160 -84 -388 -292 0 106 54 -132 -375 -228 87 262 4 -173 -175 -2 33 111 107
8079 107 1 -77 -118 105 231 282 58 -324 -32 81 178 160 1 -26 -104 36 236 185 -160 -375 -202 69 357
8102 357 -22 -10 -266 -163 111 225 298 185 -259 -249 116 105 -60 166 8 -238 -26 162 158 176 -325 -480
8124 -480 217 14 241 -3 -43 -434 -91 154 222 13 -35 -221 -116 -5 170 -125 -353 -132 -197 87 339
8145 339 55 -146 -134 -56 136 -40 -199 -242 -381 -228 66 385 46 -281 -445 -111 268 501 200 -210 -140
8166 -140 -77 150 347 87 -100 1 -447 108 182 -6 113 40 -60 333 -43 148 229 -772 -466 155 513
8187 513 547 101 -282 -178
8191a78
$$ Imaginary data points
##PAGE= N=2
##DATA TABLE= (X++(I..I)), XYDATA
0 0 0 0 0 0 0 0 0 0 0 0 -8 8 -8 8 -8 16 -16 24 -24 32 -40 48 -56 64 -77 89 -105 121 -142 161 -186 213 -240
33 -240 273 -312 350 -395 445 -493 555 -619 687 -764 847 -938 1038 -1146 1262 -1393 1533
50 1533 -1690 1861 -2050 2259 -2495 2757 -3051 3389 -3776 4227 -4760 5401 -6188 7184 -8489
65 -8489 10284 -12921 17244 -25991 86420 -274291 -242590 -50969 -7089 350902 82322
76 82322 -151184 -158878 -117301 110173 116102 102386 54066 -250642 -93798 28504 72161 270410
88 270410 -35761 -225181 -98658 -83339 250114 225136 -127276 -138061 -188777 26903 281896
99 281896 48754 -40047 -135737 -159756 95693 99995 102716 30756 -181389 -64899 -26919 59269
111 59269 238212 -20003 -156997 -107741 -73214 185332 166677 -26784 -121313 -198621 54808
122 54808 173625 39092 58233 -124939 -173921 63845 74878 105269 60470 -130344 -116037
133 -116037 -43321 104261 159356 -4225 -62840 -144395 -89505 161032 123227 25957 -57318
144 -57318 -196299 -31388 132687 109450 61051 -106526 -140912 -25083 61831 150036 51679
155 51679 -94172 -110267 -82209 81068 152721 36320 -48288 -147213 -82529 106648 110433
166 110433 64715 -42693 -162675 -59576 74978 120609 76439 -65851 -125081 -78271 52686
177 52686 154115 51704 -57810 -105053 -99966 63468 139904 49070 -35590 -114821 -88834
188 -88834 45637 121086 86644 -44328 -123715 -76161 23900 134145 93823 -60700 -110785
199 -110785 -78259 23833 132663 82474 -43643 -112215 -83520 33705 113907 83845 -29414
210 -29414 -116222 -73624 20787 97484 97356 -21687 -107257 -81279 2019 104729 103982 -18699
222 -18699 -104461 -90002 3589 103651 99654 -10032 -105077 -86466 4120 88419 102043 -1423
234 -1423 -103950 -81831 -1452 77730 104374 6708 -99613 -85483 -3496 75174 98391 16041
246 16041 -93697 -91804 -2540 71457 91858 25539 -86758 -97852 -4991 69199 88231 30483
258 30483 -77326 -100243 -13420 68037 87746 35320 -68492 -103887 -22437 68016 90169 37558
270 37558 -63806 -105836 -26752 66441 89896 40346 -59889 -105981 -30728 63650 87545 44112
282 44112 -53651 -106654 -35091 61407 85278 45066 -45196 -105746 -41568 59626 83755 44407
294 44407 -36481 -101709 -51147 56553 85940 43593 -30974 -96597 -58587 50916 90031 43636
306 43636 -29388 -90277 -62993 43330 93715 46759 -30394 -85886 -63574 36079 93585 50182
318 50182 -29722 -82663 -62973 29519 90784 53176 -26220 -80427 -62796 24340 86405 55009
330 55009 -21548 -75047 -65035 16956 84219 57224 -17634 -69727 -67011 9519 83295 59482
342 59482 -14246 -65619 -67199 1352 78623 66740 -11628 -66133 -64227 -5746 73118 74446 -8940
355 -8940 -66279 -62294 -10901 68168 77060 -2535 -66093 -65005 -9831 61887 74533 6788 -65637
368 -65637 -66514 -9078 54093 75472 13337 -63963 -65171 -14592 51407 76023 14670 -56001 -67293
381 -67293 -20889 51702 74102 20387 -52181 -73404 -19524 47815 73253 28646 -56578 -72274
393 -72274 -18499 40564 77535 30370 -56375 -70553 -23089 42930 74889 28775 -46421 -76552
405 -76552 -24424 46359 64093 36185 -39520 -82750 -22530 41749 63066 40991 -39598 -77686
417 -77686 -29579 37062 70300 34823 -32425 -72617 -41754 41876 67666 31731 -21462 -75356
429 -75356 -42278 38147 60260 42160 -20314 -74848 -40533 25639 66347 45491 -24038 -65820
441 -65820 -49180 24340 71766 36421 -15570 -64720 -55127 32757 62474 34333 -8138 -66825
453 -66825 -46625 24389 55059 42842 -11125 -55588 -49059 6358 66318 43715 -11517 -45936
465 -45936 -63687 6632 72613 39868 -4669 -52781 -61872 12196 60816 47624 -6696 -57293
477 -57293 -44958 -1097 53951 56926 -12643 -44420 -46893 -14315 59957 52230 -2478 -39828 -61632
490 -61632 -6229 55057 50907 10926 -52904 -57398 -1673 43406 61438 4357 -53192 -42760
502 -42760 -16122 44300 61907 -1665 -34973 -48932 -24376 47521 53744 13005 -34236 -59602
514 -59602 -15311 34634 58336 25431 -49479 -50345 -15629 23793 70480 19315 -48417 -44104 -24991
527 -24991 31607 63648 16250 -33816 -55737 -19871 34616 46772 30502 -32466 -61518 -11786
539 -11786 21415 49953 37294 -37540 -51104 -22407 17490 61186 27281 -28225 -50316 -35218
551 -35218 28475 55794 26880 -19955 -60569 -26931 27256 45352 38290 -25240 -58182 -19928
563 -19928 13653 48888 39710 -24486 -49180 -31734 13630 52853 33460 -11702 -53678 -40965
575 -40965 24487 46063 33504 -5958 -58873 -34384 20806 41122 35962 -9558 -47106 -34429
587 -34429 7027 46942 33493 -6841 -36454 -46065 4515 49848 33330 666 -42077 -48031
599 -48031 7361 45194 40446 -1868 -47468 -39049 3248 43361 41402 -6922 -38516 -38666 -2745
612 -2745 44219 36314 358 -31673 -46364 -3814 41675 38079 7630 -35687 -46960 -6227 39275
625 39275 45104 3692 -35911 -41431 -12791 40154 46401 70 -30479 -40624 -15532 37789 44248
638 44248 6211 -29699 -41239 -14207 29700 46933 12444 -33533 -39503 -15801 25630 50691
650 50691 12992 -33142 -39076 -17420 26978 47480 13337 -28926 -40817 -15882 24786 42841
662 42841 18196 -26993 -40473 -15604 18979 43287 21506 -26278 -38404 -19144 15968 44735
674 44735 22761 -23594 -39656 -21102 16204 43017 25459 -21679 -42916 -19603 15285 39772
686 39772 28747 -20453 -42738 -18897 12849 37801 29957 -16861 -41848 -21748 11957 36523
698 36523 30145 -11957 -42641 -24459 12486 34577 30409 -8420 -42536 -26127 11321 33414
710 33414 31079 -5696 -41062 -28239 9054 33145 30780 -2927 -38769 -31295 7444 33473 30595
723 30595 -739 -37257 -33383 6336 32886 30771 707 -35953 -33962 4253 32123 30511 2294
736 2294 -33097 -34271 1979 31017 29922 3806 -30283 -34861 -347 30786 29672 5044 -28075
749 -28075 -35913 -2749 30249 30240 6047 -26038 -36401 -5620 29875 31691 6389 -24598 -36299
762 -36299 -8401 29311 33010 6796 -23149 -35269 -11355 27748 34533 7572 -22901 -34079
774 -34079 -12795 25133 35348 9054 -21832 -33275 -13842 22574 35373 10980 -20815 -32393
786 -32393 -15171 19910 35428 12645 -19237 -31891 -16603 17897 35388 14329 -18413 -31490
798 -31490 -17539 15916 35445 16130 -17847 -30790 -17749 13288 35413 18023 -17173 -30574
810 -30574 -17565 11353 33488 19564 -15864 -31016 -17076 10020 31544 21770 -13593 -31750
822 -31750 -17165 9089 29679 22555 -11202 -31179 -18595 7836 28980 23229 -8628 -30636
834 -30636 -20467 7091 27769 23925 -5962 -30613 -21604 5469 26587 25864 -4541 -31137 -22400
847 -22400 4498 26317 26157 -3024 -30100 -23642 4245 25127 25314 102 -29187 -25427 4832
860 4832 23204 24103 3321 -28124 -26630 3323 22823 24538 3919 -25578 -28083 152 24719
873 24719 23872 3772 -22434 -29422 -1285 25034 22549 5410 -21316 -29330 -1942 22502 24059
886 24059 6190 -20944 -27574 -5440 21400 26225 5903 -18787 -28603 -7442 23353 24678 6346
899 6346 -16813 -30405 -6698 22377 22871 8176 -16566 -28666 -7761 19434 24957 7362 -14840
912 -14840 -25233 -13156 18396 26990 6763 -11045 -26156 -16324 18343 26579 9560 -11740 -27541
925 -27541 -14187 15053 27843 12204 -15134 -24083 -13846 11299 29541 10829 -13564 -21398
937 -21398 -16352 11008 27161 11414 -8434 -24030 -16931 10569 24568 16603 -9306 -25626 -15045
950 -15045 6970 26485 17674 -12501 -22479 -15935 5468 28202 14029 -9767 -20087 -17601 6579
963 6579 23303 15903 -4440 -23231 -16409 3714 20498 22469 -5916 -24609 -15696 153 24036
976 24036 22614 -7759 -22555 -18105 3139 24139 17658 -3501 -22512 -18033 5499 16974 18345
989 18345 1373 -22982 -16574 781 14939 23120 998 -20887 -19204 -3192 19985 21608 1166
1002 1166 -18906 -23359 410 20547 18033 3985 -20071 -21758 2040 15324 19327 5010 -18995
1015 -18995 -18358 -3469 14333 21832 3878 -14910 -21378 -6557 18028 19685 6191 -13874 -25318
1028 -25318 -3597 17148 18246 8081 -16253 -22568 -3206 14234 19843 6128 -13621 -19019 -8357
1041 -8357 14633 19712 4901 -8512 -21487 -11263 15579 18987 8400 -8750 -23378 -10125
1053 -10125 12980 20981 9427 -12414 -20135 -10319 10966 23188 7015 -10946 -17320 -12171 10765
1066 10765 20734 7293 -6742 -18250 -13043 8980 18758 11527 -6365 -19696 -13032 6124 21324
1079 21324 12999 -8701 -17800 -13830 5516 22806 10856 -8006 -16008 -14368 5122 20344 11235
1092 11235 -5569 -16254 -13245 2405 17974 15273 -5347 -17056 -13242 90 19023 17180 -6043
1105 -6043 -17470 -13804 1247 19009 15520 -4650 -17206 -13172 2208 16066 15263 -2113 -16807
1118 -16807 -12985 255 14126 16882 -668 -16324 -14239 -1722 14897 18042 -90 -16159 -15434
1131 -15434 -1543 15107 17378 710 -16284 -15200 -591 12996 16666 2515 -15892 -14751 -1142
1144 -1142 11495 16977 3953 -14756 -15385 -2562 11232 16373 4654 -13296 -16911 -2752 11585
1157 11585 15531 5892 -12348 -17700 -2967 10895 15084 6347 -11399 -16901 -4339 10509 15333
1170 15333 6538 -10002 -17106 -5879 10419 15594 6902 -8826 -17328 -6679 10154 15149 7499
1183 7499 -8528 -17336 -7062 9331 15222 7654 -7882 -16350 -7946 8690 15341 7559 -6619
1196 -6619 -15761 -8876 8118 15387 8099 -5621 -15670 -9919 7056 15220 8442 -5102 -15409
1209 -15409 -10435 6032 15890 8984 -5033 -14326 -10966 4700 16094 9359 -4660 -13692 -11250
1222 -11250 3767 15491 10092 -4178 -13566 -11301 2513 15217 10958 -3870 -13075 -11001 1500
1235 1500 14541 11720 -3143 -12839 -11062 537 13712 12083 -2115 -12747 -11031 175 12932
1248 12932 13126 -1279 -12790 -11497 -538 12347 13136 -697 -12498 -11486 -1149 11997 13504
1261 13504 -193 -12403 -11585 -1467 10754 13987 875 -12489 -11526 -1686 10062 13977 2095
1274 2095 -12285 -11764 -1648 8972 13577 3049 -11567 -12458 -1844 8822 13056 4349 -10748
1287 -10748 -13216 -2349 8334 12783 5013 -9920 -13546 -2903 8059 12690 5527 -9261 -13381
1300 -13381 -3490 8048 12496 5468 -8375 -13730 -4126 7723 11657 5883 -7559 -13829 -4395 7244
1314 7244 11490 6965 -6679 -13671 -4960 6484 11280 6769 -5599 -13444 -6323 6912 11252 6538
1328 6538 -4117 -13268 -7305 6843 11023 6645 -3521 -13429 -7408 5915 11518 7207 -3708 -12132
1342 -12132 -8504 4800 12074 7006 -3204 -11342 -9316 4628 12071 7041 -2272 -11885 -8986 4084
1356 4084 11395 7799 -2443 -11175 -8781 2682 11393 8156 -2370 -9778 -9640 1355 11763 8044
1370 8044 -1221 -9189 -10619 1274 11426 8527 -776 -10105 -9764 470 10638 9905 -1539 -9813
1384 -9813 -8699 -926 10453 9652 -1487 -8084 -9158 -1518 9759 9629 527 -8781 -9790 -930 8470
1399 8470 10567 1191 -9580 -9134 -1474 8015 11408 382 -8930 -8968 -2379 8388 10134 1309 -7327
1414 -7327 -10129 -2248 7255 9641 3387 -7665 -9997 -2432 5618 10988 4039 -8343 -9569 -3626
1428 -3626 6061 11490 3149 -7050 -10213 -3456 6670 9282 3982 -6212 -10762 -2482 5676 8671
1442 8671 5467 -6130 -9910 -3091 4489 9470 5693 -5580 -9575 -4632 4851 9824 4879 -3980
1456 -3980 -10840 -5546 5861 8669 5514 -3365 -11087 -4387 4959 8336 5834 -3892 -9516 -4911 3446
1471 3446 9024 5472 -2769 -8697 -7115 3727 9174 5147 -1545 -9981 -7543 4337 8519 6058
1485 6058 -1760 -10261 -6348 3052 8563 6013 -2149 -7822 -6724 1367 8833 5459 -1192 -6710 -8721
1500 -8721 985 8992 6175 158 -7967 -8890 1447 8917 7163 -1069 -8343 -7122 409 8532 7023
1515 7023 -1879 -6339 -6836 -644 8312 6237 -461 -5565 -8063 -1379 7504 7572 1009 -6753 -8416 -1037
1531 -1037 7290 8606 306 -7438 -6962 -1725 7281 8408 -671 -5815 -6718 -2211 6981 7804 774 -5188
1547 -5188 -7449 -2344 5659 8088 2091 -6160 -7298 -2479 4951 9018 2399 -6484 -6835 -2833 4794
1562 4794 8858 2073 -5496 -7409 -2877 4752 7483 3121 -4693 -7657 -2507 3875 7464 4307 -4658
1577 -4658 -7691 -3161 3163 7978 4441 -4582 -7331 -3965 3545 8021 3857 -3796 -7847 -3922 3644
1592 3644 7218 4473 -3270 -7845 -3563 2986 6937 4880 -3301 -7463 -3931 2394 6899 4888 -2546
1607 -2546 -7437 -4829 2847 6841 5049 -1528 -7946 -4927 2769 6504 4788 -1426 -7327 -4775 2127
1622 2127 6749 4824 -1398 -6546 -5777 1677 6788 5071 -928 -6540 -5969 1384 6803 5261 -726
1637 -726 -6489 -5857 997 6419 5365 -973 -6021 -5989 419 6490 5385 -449 -5204 -5769 -48 6186
1653 6186 5169 74 -5225 -6361 -322 5771 5779 334 -5150 -5787 -988 5679 5954 225 -4716 -5754
1669 -5754 -1398 5592 6276 328 -4697 -5884 -1643 5162 6398 778 -4627 -5581 -1515 4757 6497
1684 6497 1051 -4762 -5598 -2051 4315 6763 1451 -4386 -5529 -2291 3972 6426 1736 -4371 -5717
1699 -5717 -2279 3598 6622 2116 -4334 -5768 -2378 3032 6710 2767 -4244 -5718 -2369 2678 6380
1714 6380 3086 -3541 -5791 -2442 2453 5949 3418 -3309 -5714 -2657 2391 5742 3748 -3204 -6017
1729 -6017 -2751 2044 5522 3811 -2555 -5838 -2891 1998 5232 4154 -2135 -6173 -2910 2072 5062
1744 5062 4184 -1782 -6167 -3362 1823 5152 4109 -1505 -5808 -3958 1475 4987 4056 -1109 -5785
1759 -5785 -3919 1568 4689 3987 -718 -5700 -4070 1532 4746 4016 -533 -5353 -4320 1176 4659
1774 4659 4289 -425 -5166 -4771 954 4567 4048 180 -4723 -4863 526 4738 4018 304 -4495 -4810
1790 -4810 163 4591 4372 377 -4227 -4857 -595 4557 4567 341 -3823 -4828 -795 4505 4285 555
1806 555 -3852 -4731 -550 3915 4554 581 -3696 -4732 -1006 3680 4870 705 -3329 -4425 -1519 3714
1822 3714 4977 939 -3010 -4743 -1617 3541 4873 1280 -3289 -4788 -1613 3187 5121 1444 -3616
1837 -3616 -4349 -1875 2663 5378 1352 -3130 -4155 -2241 2498 4690 1996 -2811 -4814 -1990 2287
1852 2287 4744 2890 -2759 -4517 -1895 2022 4880 2615 -2882 -4737 -2388 2075 4645 2487 -2134
1867 -2134 -4603 -2373 2313 4131 2910 -1851 -4785 -2273 1360 3924 3430 -1699 -4560 -2340 1042
1882 1042 4540 3183 -1672 -4640 -2827 1625 4378 2886 -1014 -4820 -2774 1827 3086 3416 -490
1897 -490 -4561 -2622 684 3576 3598 -583 -4022 -3506 442 4133 3310 -324 -3862 -4174 1252 3864
1913 3864 2592 189 -4203 -3625 1193 3426 3330 63 -3734 -3207 74 3459 3534 -56 -3135 -4333
1929 -4333 -418 4013 3272 541 -3300 -4536 408 3605 3001 549 -3472 -3841 -28 3046 3396 269
1945 269 -2629 -3402 -1069 3371 3655 348 -2164 -4076 -1407 3548 3738 828 -2429 -4461 -1028 3140
1961 3140 3831 957 -2932 -3671 -998 2377 4036 724 -2695 -3105 -1747 2480 3923 642 -1796 -3541
1977 -3541 -1966 2401 3673 1467 -2171 -3928 -1870 1943 4050 1813 -2795 -3684 -1960 1568 4201
1992 4201 1361 -2212 -3273 -2157 1909 4202 1499 -1509 -3384 -2088 1479 3314 2309 -1489 -3638
2007 -3638 -1851 1223 3776 2844 -1833 -3593 -1975 967 3804 2194 -1716 -3377 -2384 1494 3442
2022 3442 2061 -801 -3549 -2196 1085 2800 2751 -674 -3652 -2463 586 3067 3219 -922 -3537 -2703
2038 -2703 485 3533 2494 -546 -3106 -2885 839 3076 2543 -187 -3508 -2540 596 2477 2928 143
2054 143 -3130 -2639 94 3006 3260 226 -2769 -3337 -125 3181 2900 322 -2834 -3651 121 2815
2070 2815 2426 485 -2645 -3093 -208 2743 2887 411 -2213 -3217 -695 2900 3221 307 -2259 -3521
2086 -3521 -814 2996 2840 758 -2166 -3185 -725 2508 3074 868 -2075 -3163 -1105 2241 3155 483
2102 483 -1921 -2840 -1307 2466 3139 852 -1719 -3036 -1634 2106 3170 1204 -1711 -2860 -1532 1632
2118 1632 3298 1147 -1853 -2763 -1553 1424 3633 1299 -1580 -2709 -1730 1480 3189 1463 -1598
2133 -1598 -2834 -1857 1101 3345 1688 -1588 -3005 -1640 945 3244 1967 -1375 -2601 -1762 1005
2148 1005 2959 1911 -1234 -2674 -2144 616 2807 2335 -1128 -2821 -1780 617 2880 2287 -943 -2822
2164 -2822 -2138 425 2813 2354 -794 -2858 -2041 368 2586 2288 -400 -2882 -2076 318 2301 2596
2180 2596 -219 -2999 -2085 196 2317 2594 -144 -2873 -2310 151 2143 2428 189 -2607 -2669 227
2196 227 2148 2433 459 -2334 -2736 -30 2229 2383 459 -2300 -2719 -215 2196 2553 521 -2290
2212 -2290 -2766 -322 2161 2512 374 -2154 -2783 -454 1925 2450 775 -1995 -2719 -600 1997 2356
2228 2356 714 -1700 -2896 -784 1878 2457 872 -1636 -2832 -1120 1992 2459 670 -1418 -2659
2243 -2659 -1270 1614 2606 950 -1486 -2711 -1140 1661 2575 998 -1484 -2474 -1516 1514 2777 1095
2259 1095 -1368 -2503 -1364 1369 2786 1322 -1326 -2435 -1381 1103 2656 1306 -1266 -2335 -1682
2274 -1682 795 2985 1479 -1231 -2452 -1693 765 2558 1622 -1002 -2576 -1666 555 2611 1935 -853
2290 -853 -2256 -1636 556 2388 1879 -932 -2367 -1660 272 2491 2106 -462 -2464 -1654 402 2242
2306 2242 2272 -243 -2511 -1690 107 2100 2348 -307 -2373 -1827 28 2046 2086 54 -2050 -1917 232
2323 232 1937 2001 251 -2301 -1851 98 1625 2314 265 -2414 -2181 154 1915 2414 408 -1947 -2253
2340 -2253 -30 1882 2144 535 -1828 -2391 -228 1457 2045 942 -1765 -2359 -156 1468 2216 884
2356 884 -1698 -2389 -735 1702 2228 711 -1451 -2477 -841 1867 1965 763 -1263 -2648 -701 1640
2372 1640 1958 1164 -1409 -2370 -944 1268 2182 992 -1227 -2382 -1192 1175 2325 830 -896 -2494
2388 -2494 -1481 1410 2273 937 -926 -2368 -1271 1126 2256 1264 -1020 -1957 -1331 958 2401 1163
2404 1163 -827 -2051 -1720 699 2498 1462 -687 -2266 -1901 787 2252 1585 -679 -2347 -1354 712
2420 712 2118 1566 -845 -1862 -1376 247 2338 1478 -813 -1632 -1709 272 2107 1538 -36 -1985 -1973
2437 -1973 399 2087 1939 -419 -2351 -1658 121 2131 2106 -520 -1932 -1356 -162 1882 1650 80
2453 80 -1595 -1981 -187 1652 1895 406 -2035 -2015 80 1592 2366 344 -2147 -1711 -265 1692 2130
2470 2130 -4 -1793 -1744 -228 1781 1984 331 -1205 -2253 -297 1418 1833 913 -2050 -2121 -432 1137
2487 1137 2254 903 -1624 -2173 -542 1537 2288 419 -1293 -2370 -697 1672 1717 872 -1237 -2393
2503 -2393 -455 1189 2037 1188 -1314 -1914 -778 1054 2144 930 -1010 -2187 -1349 1283 2239 878
2519 878 -561 -2485 -975 1297 1855 1060 -883 -2219 -880 859 2067 1150 -747 -1904 -1314 899
2535 899 2107 906 -705 -1984 -1698 753 2141 1200 -353 -1880 -1607 850 2140 1309 -642 -1917
2551 -1917 -1414 460 2139 1356 -514 -1422 -1772 174 2220 1237 -284 -1720 -1770 261 1711 1709 -162
2568 -162 -1717 -1648 71 2057 1958 -388 -1604 -1578 -82 1953 1814 -242 -1431 -1377 -200 1810 1813 216
2586 216 -1822 -1841 -98 1630 1939 87 -1831 -1586 -362 1482 2128 24 -1586 -1698 -398 1423 1920
2603 1920 111 -1657 -1843 -393 1340 1830 591 -1756 -1905 -464 1307 1914 418 -1355 -1644 -749
2619 -749 1189 1935 746 -1446 -1900 -577 1077 1756 823 -1306 -2016 -585 942 1881 728 -1191 -1795
2636 -1795 -788 792 1732 943 -1015 -1960 -915 958 1678 878 -798 -1872 -617 727 1856 1180
2652 1180 -766 -2015 -1085 839 1690 1010 -663 -1839 -1081 876 1829 1225 -405 -1690 -1109 819 1822
2669 1822 1298 -634 -1724 -1453 573 1835 1203 -361 -1843 -1439 456 1864 1224 -506 -1643 -1448
2685 -1448 291 1780 1291 -199 -1732 -1607 343 1858 1485 -284 -1496 -1752 60 1764 1533 -164
2701 -164 -1614 -1427 -119 1779 1521 -281 -1361 -1406 -262 1893 1588 -98 -1284 -1580 -296 1590 1739
2718 1739 95 -1249 -1496 -334 1332 1795 275 -1414 -1740 -420 1257 1854 483 -1085 -1373 -479
2734 -479 1114 1875 510 -1440 -1633 -695 1130 1816 596 -1262 -1451 -571 984 1879 553 -1047 -1565
2751 -1565 -568 974 2034 502 -1213 -1777 -804 826 1560 876 -1006 -1608 -637 615 1879 973 -1176
2768 -1176 -1817 -897 767 1779 952 -1014 -1748 -904 697 1685 1215 -794 -1861 -1047 582 1389 1224
2785 1224 -616 -1824 -1279 647 1684 1206 -529 -1796 -1040 533 1626 1252 -476 -1852 -994 409
2801 409 1412 1171 -230 -1855 -1101 296 1394 1328 -135 -1728 -1404 190 1529 1376 -140 -1624 -1577
2818 -1577 99 1536 1327 24 -1345 -1432 254 1386 1330 -65 -1466 -1396 -111 1485 1516 10 -1206
2835 -1206 -1784 -312 1456 1680 211 -1419 -1748 -289 1398 1523 209 -1106 -1398 -185 1208 1626
2851 1626 282 -1204 -1579 -428 900 1477 417 -1136 -1572 -677 1083 1756 256 -845 -1747 -560
2867 -560 1030 1586 562 -1197 -1608 -431 871 1791 519 -1041 -1335 -764 670 1724 634 -866
2883 -866 -1464 -1046 923 1514 747 -844 -1680 -814 642 1586 939 -924 -1548 -701 522 1718 913 -764
2901 -764 -1522 -877 508 1427 874 -586 -1426 -876 603 1524 1306 -401 -1525 -678 545 1518 1563 -654
2919 -654 -1754 -930 282 1739 1107 -470 -1562 -1128 440 1143 1151 -239 -1667 -1256 299 931 1197 -24
2937 -24 -1454 -1098 145 1272 1349 50 -1333 -1275 299 1499 1212 45 -1356 -1581 372 1271 1048 133
2955 133 -1370 -1398 -130 1108 1193 271 -1215 -1522 -367 1255 1578 392 -971 -1715 -308 1419 1090
2972 1090 217 -1230 -1973 -72 1258 1284 281 -1093 -1448 -436 1008 1467 625 -587 -1362 -830 1188
2989 1188 1563 450 -727 -1895 -514 1278 1410 587 -755 -1488 -457 787 1339 561 -972 -1354 -678
3006 -678 771 1616 444 -667 -1344 -971 881 1497 524 -405 -1458 -980 743 1420 729 -553 -1398 -906
3024 -906 649 1539 941 -656 -1292 -937 528 1478 984 -716 -1306 -1071 429 1405 932 -232 -1369 -908
3042 -908 319 1375 1148 -452 -1183 -1164 142 1474 1185 -237 -1220 -1175 457 1324 823 -292 -1394 -1070
3060 -1070 248 1272 1137 -61 -1474 -1172 212 1133 1427 35 -1251 -1135 -30 1212 1356 149
3076 149 -1154 -1331 21 1202 1258 25 -1271 -1367 -53 904 1136 218 -1273 -1165 4 1103 1212 468
3094 468 -967 -1194 -304 924 1155 475 -823 -1383 -118 1058 1274 527 -1112 -1317 -241 833 1206
3111 1206 535 -884 -1479 -521 988 1170 511 -661 -1343 -572 889 1386 572 -484 -1296 -799 815 1314
3129 1314 640 -575 -1118 -553 605 1460 491 -512 -1140 -856 512 1291 570 -513 -1317 -821 618 1511
3147 1511 812 -433 -1193 -841 791 1361 773 -323 -994 -974 451 1387 749 -400 -1076 -1154 429 1349
3165 1349 629 -471 -963 -835 96 1521 889 -215 -1276 -829 115 1072 1147 -527 -1065 -992 110 1333
3183 1333 1011 -346 -1072 -933 119 1296 1040 -30 -1063 -989 -51 1185 1109 -168 -1129 -1065 13 1086
3201 1086 1388 -108 -1044 -997 19 1048 1185 -52 -936 -1033 -160 843 1154 266 -1245 -995 -466 940
3219 940 1275 259 -1079 -1182 12 901 1263 553 -868 -1182 -333 536 1100 461 -860 -1220 -242 680
3237 680 1351 626 -849 -1234 -623 754 1160 419 -724 -1260 -578 754 1189 439 -648 -1235 -497 586
3255 586 1079 831 -542 -1131 -594 454 932 552 -383 -1280 -723 442 1282 655 -394 -1182 -750 593
3273 593 1076 696 -422 -1174 -644 359 868 689 -263 -1082 -733 461 1197 710 -302 -1203 -863 199
3291 199 1278 716 -306 -1058 -862 288 1026 646 -83 -823 -801 295 1034 935 -38 -962 -847 -8 1178
3310 1178 760 -240 -845 -1005 93 1152 1097 168 -890 -961 -11 1108 1237 -113 -1070 -856 -70 955
3328 955 1244 -165 -605 -942 -120 1020 1110 168 -802 -1070 -153 953 966 94 -940 -1007 -297 731 1119
3347 1119 394 -924 -999 -167 737 1128 257 -843 -756 -252 896 735 245 -517 -989 -345 447 1008 545
3366 545 -740 -994 -285 398 994 424 -871 -1023 -195 663 1068 346 -557 -1189 -416 444 865 786 -528
3385 -528 -1338 -485 248 943 724 -502 -1152 -776 364 991 658 -561 -1039 -816 466 943 475 -382 -1168
3404 -1168 -628 409 844 858 -495 -1029 -418 82 611 840 -127 -989 -851 332 936 579 -40 -861 -918
3423 -918 402 789 647 87 -1134 -849 203 654 837 -78 -1003 -691 -40 958 615 -40 -679 -918 104
3442 104 867 619 185 -565 -1031 140 804 756 196 -828 -865 -8 817 930 219 -795 -645 -214 836
3461 836 862 149 -518 -877 -123 740 685 426 -612 -873 -181 802 741 331 -809 -828 -242 586 1002 351 -496
3482 -496 -1037 -382 659 785 -21 -418 -794 -429 389 960 612 -579 -889 -465 226 990 283 -849 -863
3501 -863 -281 535 856 179 -647 -783 -410 601 771 346 -353 -1030 -484 354 817 553 -253 -736 -575 258
3521 258 861 533 -397 -925 -261 627 1070 530 -236 -846 -773 471 970 553 -184 -759 -299 206 581 707
3541 707 62 -732 -586 238 879 629 78 -668 -734 250 636 691 -42 -788 -728 355 650 683 59 -662 -692
3562 -692 -103 809 504 -13 -886 -706 -52 780 675 173 -514 -741 338 688 753 29 -653 -707 73 622
3582 622 670 278 -686 -586 -66 693 750 93 -501 -866 -80 692 669 178 -535 -740 -185 661 698 211 -777
3603 -777 -942 -98 484 685 46 -472 -917 -315 551 704 128 -443 -906 -267 547 748 341 -202 -826 -311
3623 -311 223 609 411 -339 -710 -409 56 941 425 -547 -709 -542 206 829 337 -522 -846 -319 209 812
3643 812 324 -303 -607 -346 187 751 461 -154 -636 -597 322 844 551 -38 -899 -461 111 637 597 -299 -930
3664 -930 -445 127 626 632 -241 -707 -502 125 530 408 -238 -736 -577 185 856 531 114 -559 -666 18 800
3685 800 473 79 -451 -690 31 657 854 31 -740 -829 -21 387 634 -94 -656 -593 -96 476 631 139 -504
3706 -504 -681 -24 619 599 212 -498 -652 -50 457 700 143 -488 -715 -209 513 772 148 -604 -803 119
3726 119 703 569 315 -426 -756 -176 543 833 206 -332 -670 -228 480 584 47 -384 -587 -352 445 955
3746 955 317 -291 -557 -274 500 504 386 -382 -504 -377 288 855 370 -320 -788 -360 362 758 549 -276 -669
3767 -669 -411 178 706 348 -263 -476 -351 114 662 249 -318 -519 -401 271 693 566 -315 -511 -531 174
3787 174 705 545 -96 -436 -354 -33 662 550 -340 -714 -321 2 560 516 -255 -630 -649 71 626 596 -116
3808 -116 -512 -363 82 548 368 -84 -369 -686 9 691 466 37 -660 -426 2 530 795 -262 -622 -293
3828 -293 -122 534 379 90 -413 -227 -91 502 487 176 -767 -540 69 259 577 243 -395 -425 -190 443 573
3849 573 334 -545 -775 -240 559 469 25 -433 -883 -19 421 461 1 -338 -531 -214 364 592 268 -295 -428
3870 -428 -238 441 495 136 -167 -827 -266 407 381 183 -353 -658 -3 286 418 68 -433 -416 -145 -33 597
3891 597 284 -49 -553 -322 299 367 322 -48 -618 -414 220 463 249 -170 -462 -188 225 606 594 -341 -376
3912 -376 -375 -30 522 157 -194 -397 -476 35 547 274 -115 -667 -632 -114 439 595 -193 -373 -322 92 382 477
3934 477 -224 -411 -107 89 344 422 -70 -512 -448 30 447 303 179 -566 -383 -100 509 448 224 -593 -555
3955 -555 33 338 537 193 -448 -349 -103 328 317 -21 -221 -404 34 117 414 -152 -347 -436 -104 150 242 257
3977 257 -300 -258 -79 601 426 286 -335 -466 -20 288 238 238 -257 -573 -102 299 384 294 -249 -501 -73 279
3999 279 494 358 -180 -672 -379 114 240 183 -59 -625 -34 114 443 269 -148 -323 19 248 670 260
4019 260 -134 -457 -253 247 588 332 -168 -444 -249 320 487 176 -160 -492 -594 436 605 453 11 -375
4039 -375 -392 107 474 57 -34 -446 -597 196 290 225 2 -429 -379 178 507 302 -121 -477 -230 242 436 271
4061 271 122 -381 -492 -63 502 471 64 -283 -437 -53 400 306 -43 -442 -426 -43 393 262 133 -402 -477
4082 -477 -300 455 441 129 -212 -280 -136 541 366 62 -319 -437 35 221 488 296 -467 -423 -76 259 406
4103 406 10 -202 -371 -79 200 523 203 -151 -368 54 210 481 108 -284 -460 -111 386 302 154 -208
4123 -208 -318 -190 96 254 150 -272 -321 -160 -23 507 152 -34 -279 -122 20 208 53 -132 -289 -21
4143 -21 130 367 87 -40 -390 -285 222 332 275 -7 -470 -438 284 341 12 125 -353 -184 24 292 166
4164 166 -133 -309 -305 39 265 316 160 -345 -317 137 523 173 54 -233 -259 -59 268 96 69 -174 -424 -8
4186 -8 102 406 136 -437 -267 -65 358 391 -34 -175 -355 138 222 272 198 -38 -183 44 316 371 -5 -268
4208 -268 -399 70 155 121 1 -400 -235 -84 31 471 -69 -265 -301 -53 161 281 110 -348 -105 -215 245
4229 245 247 150 -218 -321 -61 278 505 -38 -343 -533 -116 230 370 -27 -171 -390 67 134 418 215 -234
4250 -234 -142 -186 221 329 154 -131 -250 -227 147 196 154 -149 -396 -129 215 204 4 -159 -240 -202 26 39 188
4273 188 3 -246 -227 154 435 95 -114 -329 -196 74 342 162 -340 -369 -266 126 267 123 -86 -366 -333
4294 -333 -75 153 247 97 -262 -301 109 447 422 -36 22 -512 16 385 217 -110 -424 -137 -12 358 261 5
4316 5 -275 -291 -30 121 192 68 -91 -446 -136 269 134 47 -125 -140 -62 137 143 -47 -395 -217 101 281 222
4339 222 45 -151 -285 204 550 173 4 -56 -389 69 129 153 67 -354 -83 122 313 514 53 -101 -315
4360 -315 -133 225 0 -71 -119 -71 -143 176 219 33 -94 -216 63 87 415 234 -280 -261 -25 175 90 103 -94
4383 -94 -262 -153 42 234 -184 -330 -211 -87 243 179 166 -55 -328 -195 251 263 130 -226 -178 1 56 37
4405 37 181 -37 -488 -310 5 -45 111 -302 -373 -203 119 211 191 7 -247 -77 93 206 307 -118 -327 -26
4427 -26 22 90 71 -157 -134 -331 100 384 223 -120 -303 -166 121 164 112 -101 -179 -233 -49 301 164 -91 18
4450 18 -240 -238 140 -10 -87 -258 -95 -28 285 245 10 -46 -178 -76 -7 -11 61 -218 -184 149 61 170 -282 32
4474 32 -134 -157 292 66 -171 -164 -194 -198 166 90 26 -161 -295 -14 99 383 197 -61 -162 8 325 169 274
4497 274 42 -224 7 318 54 114 -169 -420 -43 1 375 18 -258 -167 -62 76 318 100 -260 -490 -109
4518 -109 174 119 91 -17 -117 -274 84 265 -15 -42 -289 56 212 189 199 -137 -421 -91 15 300 91 57
4540 57 -60 -17 111 209 93 -118 -197 -110 120 106 437 -299 -75 -140 15 172 285 -160 -292 -242 -148 439 65
4563 65 80 -118 -283 113 379 273 69 -178 -116 -89 128 178 -8 -136 -195 5 156 281 16 -219 -118 -147
4585 -147 360 178 151 -212 -159 -61 108 282 -53 -268 -63 87 178 178 -103 -119 -304 102 88 119 -138 -119 -53 -207
4609 -207 246 265 -105 -172 -235 -87 1 175 92 -175 -98 -129 146 165 405 -21 -262 -33 181 76 34 -70 -361
4632 -361 -17 173 196 21 -133 -148 -77 46 -25 -88 -122 -265 -68 267 133 55 -178 -183 27 240 260 133 -271
4655 -271 -178 15 320 77 135 -5 -312 -28 21 85 34 -4 -140 -77 125 323 67 -128 -47 -113 130 192 85
4678 85 -29 -190 1 271 -15 177 -14 -48 -72 53 265 182 25 -114 -90 110 285 120 -49 -159 -66 -87
4700 -87 27 302 -123 -175 -172 55 199 221 -78 -63 -42 37 274 176 -97 -196 -105 -12 138 363 59 -360 -261 -93
4724 -93 79 245 15 -141 -303 -204 239 205 25 -232 -230 -9 229 -8 -119 -278 -174 180 29 261 154 -217
4746 -217 -272 84 -47 279 44 -142 -113 184 169 222 -13 -244 -230 29 247 416 38 -174 -176 -67 235 212 62
4769 62 -84 -337 -211 254 285 111 -104 -330 -97 259 81 75 -230 -232 -78 173 314 33 -398 -126 110 77
4791 77 133 146 -87 21 -139 164 344 33 -238 -244 -21 214 114 189 151 -247 42 196 330 90 -80 -102 -90
4814 -90 -40 299 -66 -227 -24 -21 244 198 20 37 -117 -125 126 255 151 -111 -207 -120 9 129 14 -26 -171 -25
4838 -25 86 152 157 -125 -166 -158 -30 161 233 49 -65 -119 -29 225 425 -174 -153 -138 110 1 118 69 83 -61 -213
4863 -213 377 105 129 -146 -275 -2 37 210 -12 -263 -358 -46 107 106 4 -337 -244 -118 266 -7 75 -226
4885 -226 -53 -19 37 209 316 -287 -176 171 160 161 -179 -36 -167 -37 85 213 66 -119 -6 43 99 211
4907 211 22 -152 -215 -62 21 282 22 -59 -320 -93 121 397 -23 27 -96 26 55 76 123 -24 -189 -275 267
4930 267 187 85 -329 -152 -54 -5 211 210 -122 -185 -104 63 31 38 146 -292 -88 -18 146 229 -198 -91 -231 72
4954 72 369 239 -87 -154 171 68 143 -31 189 -366 -289 105 288 184 15 -107 -58 -62 338 145 -98 49
4976 49 -131 -2 55 182 -58 -187 -248 -93 156 157 134 -297 -112 -114 74 135 31 -66 -18 31 41 109 -14 -122 -66
5001 -66 26 40 218 136 -37 -68 -14 186 151 87 -251 -303 -4 154 57 -194 -42 -356 -187 -26 299 195 -164
5024 -164 -211 39 52 -41 4 -282 -171 -343 55 410 61 -58 -175 -162 -68 177 7 -250 -222 -45 76 409
5046 409 156 -108 -250 -77 135 238 181 -42 -483 -56 -17 375 24 -287 -241 -14 154 -35 114 -29 59
5067 59 -207 125 298 111 -214 -345 -69 -67 261 -240 -131 -143 -58 292 1 81 -11 -331 -375 324 116 10 -31
5090 -31 -218 -185 -132 154 198 -160 -165 -308 193 312 292 -19 25 -195 78 94 134 148 -176 -271 166 223 18 -9 -71
5115 -71 -105 -118 164 -4 -177 27 -6 120 94 -51 17 -88 -71 28 299 211 -7 -331 -210 79 -60 191 -83
5138 -83 -282 -135 -129 261 92 98 49 -250 -29 141 60 46 25 -280 -42 113 104 136 -347 -175 -119 89 256 42
5162 42 -192 -137 -30 -133 163 -24 -78 -151 7 99 144 168 -270 -205 -119 31 257 60 -223 -119 -65 342 328 -124
5186 -124 -123 -301 127 77 206 100 -72 -428 270 8 69 97 -168 21 -119 126 8 164 -142 -314 1 187
5208 187 169 181 -86 -232 -49 -19 194 -2 156 -18 -227 96 -126 91 24 22 -159 6 249 114 -15 11
5230 11 -117 25 162 208 -71 -286 7 24 0 113 27 -241 -58 -27 263 246 47 -34 -81 110 199 183 -38 -190
5254 -190 -271 -162 156 38 70 -35 -133 111 217 73 -49 -50 -101 63 94 213 -17 -84 -119 -121 118 267 76 -76
5278 -76 -351 -131 275 63 98 -14 -143 -100 127 117 25 -253 -92 168 20 257 237 -393 -240 119 129 346
5300 346 80 -270 -326 13 140 139 53 -211 -271 -132 9 238 209 -146 -120 -117 15 80 103 107 55 -121 319 157 -19
5325 -19 8 -136 -145 -13 117 331 -200 -166 -62 226 130 210 -16 -189 -92 342 434 83 65 -437 -163 53 240
5348 240 180 -91 -122 -48 151 277 -49 -110 -169 -252 65 329 147 -57 -173 -280 22 93 192 92 -273 -291 46
5371 46 313 208 -39 -121 3 61 58 244 -30 -268 -153 -49 154 43 -90 -155 -161 45 439 100 -58 -137 -67
5394 -67 -179 103 5 36 -213 -279 -100 197 -24 191 -107 -192 -21 156 211 19 -50 -270 -31 -73 -29 75 -279
5417 -279 -93 -107 146 413 31 36 -158 -58 180 280 84 21 -465 -217 151 220 -2 -129 -177 -89 15 336
5439 336 104 -152 -249 -33 -14 131 164 -162 28 29 56 251 148 24 -245 -116 133 224 160 -89 -307 -277 -114
5462 -114 83 211 -116 -181 49 -40 37 203 -134 -83 130 110 114 147 11 -220 -78 81 292 235 -114 -314 -210
5485 -210 -13 289 169 47 -201 -179 -124 108 234 -59 -35 -193 -60 91 96 -36 -91 -186 -175 439 216 -27 -124
5508 -124 -284 -99 127 78 12 -223 -3 -56 218 220 0 -179 -88 -263 -27 340 155 -18 -52 -26 75 198 203
5531 203 -372 -65 -133 34 231 -98 175 -164 23 111 447 -8 -84 -388 -223 154 214 162 -245 -110 -175 197
5553 197 304 280 -100 -122 -69 -209 390 56 -71 -102 -158 136 219 234 -69 -110 -81 48 131 145 -134 -158 1 140
5577 140 122 -54 -67 -387 -181 113 19 62 76 -242 -157 114 192 204 -74 -170 -214 -263 196 176 -105 -155 -90 75 166
5602 166 254 -64 -345 -314 21 307 338 -125 -233 7 -2 -173 103 -207 -241 -81 -175 92 276 -130 -261 -85
5624 -85 -122 207 450 -65 -219 -225 -20 254 360 54 -129 -247 -32 104 406 259 -194 -264 -141 101 237 246
5646 246 -168 -122 -105 208 204 58 -115 -180 112 125 135 114 -109 -100 -166 146 194 160 -80 -112 63 312 88 183 -198
5671 -198 -98 27 167 86 215 -132 -157 -50 50 -39 152 -113 -146 -223 -213 89 244 -171 -124 -159 -116 147 27
5694 27 -357 -390 -43 150 277 17 -95 -226 -85 -5 247 116 -122 -287 -274 -180 132 -73 129 -346 -191 168
5716 168 153 -18 -53 -226 -46 79 456 -35 -120 -251 -113 42 69 46 -38 -88 -86 -17 121 127 143 -160 -9 139
5740 139 206 478 -73 -391 6 60 252 61 81 19 -135 110 124 131 33 -167 -194 -13 108 178 55 -246 -147 -29
5764 -29 200 348 33 37 -340 -64 143 133 -68 -3 -222 -81 99 108 35 -211 -305 -13 200 195 50 -180 -371 -39
5788 -39 180 406 168 -46 -177 -138 71 188 167 -33 -484 -199 80 259 -86 30 -158 -315 330 441 166
5809 166 -117 -63 -31 -99 286 256 -6 28 -288 124 169 3 303 -281 -53 98 133 161 -59 -136 -44 -64 166 133
5833 133 162 -146 -87 99 86 40 151 -209 -155 97 208 387 -31 -131 -169 47 58 380 -142 -2 -320 -183
5855 -183 22 -11 139 -136 -146 13 206 3 -17 -431 -485 -48 99 199 -187 -99 -290 -155 421 318 -17 -211
5877 -211 -28 5 84 186 222 -116 -356 90 183 494 197 -35 -78 -324 339 351 -85 -195 -22 -97 251 328 165
5900 165 -23 -159 47 86 123 -11 108 -427 -35 124 163 255 -325 -367 -321 -168 226 96 -132 -381 -493 107
5922 107 483 31 -183 -238 -119 -28 -98 370 -134 -186 -135 241 138 392 98 -78 -72 -82 220 108 -128 -321 -112
5945 -112 -26 130 -46 39 -196 -85 31 35 74 -114 -6 -163 -55 -27 241 -314 -80 -251 86 337 287 -35
5967 -35 5 -241 11 336 322 -294 -93 -279 34 86 207 126 -226 -201 -54 491 256 93 -15 -127 -69 352
5989 352 67 -16 -2 -122 56 -11 -18 -48 -201 -139 -146 185 185 153 -217 -244 -111 181 349 55 115 -65 -104 176 199
6014 199 169 -417 -342 -38 317 442 55 -143 -353 -40 -53 227 119 -108 -501 -109 74 588 128 -162 -85
6035 -85 -146 -52 73 205 -199 -69 -269 -169 300 327 -247 -353 -392 367 238 75 -174 -200 -65 169 589 -72
6057 -72 -751 -817 -331 -644 -67 223 -224 39 -554 -265 63 161 -27 -847 -723 292 786 411 147 130 -314
6078 -314 42 79 180 -86 -110 -209 165 83 74 163 -337 -65 -154 280 319 -26 -102 -163 -65 420 145 -46 -229 -275
6102 -275 -130 137 173 98 -219 -322 -24 150 188 -16 -69 -349 -182 -181 279 188 -291 -332 -20 96 200 1 -130
6125 -130 -118 -128 205 326 30 2 -240 -23 124 101 139 -148 -281 46 123 166 -21 -273 -460 -56 153 262
6147 262 346 -215 -129 -213 189 369 125 -228 -269 14 15 281 161 62 -214 -333 346 193 261 -94 -379 3 -23
6170 -23 221 166 -72 -304 -208 -92 248 49 12 5 6 76 226 169 -160 5 -290 -223 92 327 -47 -366 -180 -43
6194 -43 384 11 104 -271 -436 43 186 212 29 -204 -210 68 159 253 56 -210 -249 173 277 97 -32 -220 -478
6217 -478 -309 149 150 41 -399 -162 -115 244 228 235 -288 -277 -81 -34 437 199 -176 -114 -82 -1 330 18 -34 -158
6241 -158 -236 -14 226 -104 -161 -279 -88 75 57 201 -273 -122 102 217 126 128 -18 -437 -240 130 297 269
6263 269 -5 -225 -385 271 260 201 -50 -284 -258 39 -25 81 -125 -345 -58 58 470 122 -120 -116 -124 85 245
6286 245 -2 15 -73 -138 136 278 169 -92 -266 -209 222 255 124 117 -443 -29 149 458 185 -68 -239 -220 -142
6309 -142 46 166 37 -93 -116 140 311 203 -122 -275 -185 -221 331 189 -246 -405 -251 105 225 262 42
6330 42 -310 -283 277 422 218 63 -42 -193 -220 5 165 64 -79 -269 -2 173 138 79 -91 -360 -72 187
6352 187 140 -84 -188 -210 -155 202 346 8 -155 -232 -83 151 346 -16 -300 36 19 74 254 296 32 -131
6374 -131 37 -8 324 295 -85 -475 -130 206 117 207 -127 -258 78 220 242 13 -151 -152 10 191 134 165 191
6397 191 -166 -130 84 119 27 -114 -250 -94 142 139 133 -247 -107 -242 -67 191 209 102 -409 -348 74 211 -76
6420 -76 55 -272 -92 -61 152 20 9 -388 -307 313 221 116 -110 -361 -278 -147 136 369 -6 28 -287 -6
6442 -6 235 249 91 -109 -60 -83 66 151 -41 -264 -228 -107 243 284 175 -205 -132 -187 210 202 65 -51 -270 -68
6466 -68 243 348 76 -86 -132 120 54 158 138 -305 -435 -100 91 296 2 -161 -430 -228 47 351 132
6487 132 103 -375 -150 43 255 116 -79 -78 210 -98 105 106 -165 -154 -116 12 76 105 -176 -233 8 178 39
6510 39 319 -152 -240 1 213 219 393 169 -192 -344 30 237 236 -111 -202 -182 -151 234 232 -72 -139 -154 -145 354 228
6535 228 154 -254 -187 114 113 157 -104 -132 -237 -85 237 172 -47 -218 -159 -80 152 88 -160 -141 -106 146 79 224
6559 224 -131 -223 -378 -16 325 154 78 -112 -34 72 -42 220 54 -221 -193 -106 126 135 -143 5 -145 -35
6581 -35 291 299 57 -187 -139 -170 331 165 120 -194 -342 -35 268 119 3 -226 -177 -126 262 425 0 -217 -28
6604 -28 -91 66 229 188 -44 -92 -172 -94 367 -82 -163 -186 -120 92 217 -71 -33 -395 -103 42 400 217 -76
6627 -76 -289 -39 -24 299 374 -185 -56 -126 -90 286 137 -58 -121 -152 -96 150 404 -76 -197 2 -187 248 117
6650 117 117 -100 -105 55 151 279 -211 -381 -124 119 49 57 -133 -198 -142 17 -83 232 41 28 -194 101 203 214
6674 214 150 -53 -151 -22 224 140 102 -264 -120 43 2 450 45 -413 -357 -176 32 301 205 -182 -294 -114
6696 -114 218 349 50 -18 -148 -99 227 189 146 -157 -307 -152 20 173 182 -192 -248 -190 209 268 15 73 -159
6719 -159 -144 96 170 151 -161 -326 -143 196 168 258 -125 -277 34 38 363 160 -146 -243 -226 248 238 260 56 -254
6743 -254 -228 189 120 180 -173 -422 -87 66 216 56 -108 -89 -182 113 344 95 -223 -57 -193 -23 320 4
6765 4 44 -315 -298 9 81 114 27 -208 -218 -122 161 348 -162 -230 -172 -16 -98 156 -113 -192 -289 -15 -201 336 27
6790 27 -249 -130 11 201 324 62 -215 -350 -199 170 170 -51 -136 -390 -177 297 47 -115 -281 -172 101
6811 101 42 194 80 -398 -199 -91 34 103 -61 -295 -105 -169 203 253 79 -105 -202 -35 112 138 132 -271 -212
6834 -212 -50 110 308 30 -197 -318 -177 -227 283 326 -9 -110 -69 9 156 151 -298 -268 287 -122 34 301
6856 301 -5 -332 -201 -18 316 260 -25 -115 78 310 182 -14 -90 -240 -2 157 36 138 -6 -238 -172
6877 -172 144 19 198 -72 -57 -166 59 162 119 233 -119 -223 -37 302 54 -59 -246 -293 44 -58 157
6898 157 147 -315 -378 292 320 180 -82 -177 -166 70 290 228 -210 -270 -87 -176 241 287 113 -337 -206 -124 65
6921 65 262 5 -147 -199 28 428 336 305 -62 -55 8 179 326 -55 -158 -380 3 115 143 110 -292 -146 -174
6944 -174 -15 337 -18 -192 -281 -191 83 92 196 -241 -195 -40 186 206 29 -217 -252 -11 41 193 198 -184 -135 -54
6968 -54 116 325 214 -29 -241 -3 -8 73 179 -282 -204 -174 -101 466 172 -154 -71 -189 159 61 98 -70 -96 -18
6992 -18 227 412 306 -19 -142 -200 -2 298 225 109 -306 -116 169 -66 252 -173 -53 -218 152 311 172
7013 172 16 -16 -197 -159 226 42 -9 -56 -127 -178 286 15 -68 -127 -320 -25 243 229 -35 -188 -21 -64 137
7036 137 203 27 -392 36 -70 111 108 -8 -229 -8 -103 150 196 21 -53 -225 51 266 38 -156 -160 -92 -95 208
7060 208 177 -177 46 -162 120 37 312 16 -313 -306 -55 199 428 20 -119 -183 -42 201 12 -32 -45 -332
7082 -332 -15 41 188 -51 -63 -88 -169 30 326 164 -34 -237 30 83 206 86 -163 -219 -161 158 322 195
7104 195 -29 -166 -249 -41 250 178 -35 -289 -63 -70 289 73 82 -81 -401 -52 115 146 82 -145 -151 -1 277
7127 277 161 88 -259 -66 -89 52 292 -37 -288 -69 -21 41 157 -77 44 -101 -96 176 200 13 -14 -120 -12
7150 -12 130 280 24 -137 -297 0 56 213 55 -145 -198 -31 286 337 204 -174 -163 -32 248 234 -204 -345
7172 -345 -209 -105 326 277 184 -161 -180 -233 141 169 91 -107 -249 41 142 280 71 -148 -273 8 153 226
7194 226 93 -181 -243 -14 85 172 -25 -196 -185 27 51 385 81 -42 -240 -93 327 106 54 -63 -174 -219
7216 -219 -23 130 4 -247 -304 -175 297 249 123 -150 -101 -92 97 212 343 -179 -5 -143 146 10 168 -113
7238 -113 -388 -223 -36 200 230 -44 -97 -104 -148 328 206 -214 -235 -270 -203 184 -213 79 -330 -26 66 116 72 -67
7262 -67 -297 -116 -92 63 137 221 -259 -270 4 47 73 112 -269 -327 -30 257 265 44 -264 -317 -13 303 56 68
7286 68 -185 -147 -68 264 229 70 -30 -63 -86 -122 282 -27 31 -443 79 -12 132 116 -249 -112 -59 90 397 163
7310 163 -68 -241 37 118 10 157 -248 -206 -215 146 252 -50 -83 -284 -102 346 307 51 75 -136 -235 203 238
7333 238 48 -76 -242 -74 -31 241 188 -98 -76 -79 102 223 93 -292 -212 -158 -128 59 -108 34 -167 -142 93
7356 93 -68 148 -56 -296 -220 -2 229 246 -56 -240 -161 308 301 43 -122 -176 -327 222 67 132 -58 -230 15
7379 15 -11 198 157 -188 -197 -103 -51 120 -25 242 -139 -158 -62 300 126 -84 -303 32 150 314 279 -75 -131 -205
7403 -205 129 435 264 100 -112 -149 176 103 374 27 -117 -237 -64 237 -98 159 -301 -66 8 180 50
7424 50 124 46 -291 -118 94 177 -75 -218 -266 -47 72 117 -72 -147 -83 -46 -44 62 53 -248 -267 215 133 92 -25
7449 -25 -203 -350 -122 104 96 81 -89 -90 -189 136 301 42 -63 -228 -225 0 88 412 26 -197 33 46 197 61
7473 61 -139 -216 3 154 80 104 34 -395 -260 265 305 102 -189 -192 -267 -20 261 186 29 -180 -187 60 333 -60
7497 -60 -49 -324 -165 32 257 481 -236 -223 -321 133 263 226 -93 -281 -351 79 171 179 -209 -58 -46 -109 -47 248
7521 248 127 -175 83 81 166 15 85 -212 -142 5 109 220 -125 -256 -127 136 264 311 133 -154 -404 -79
7543 -79 255 276 99 -275 -211 -71 237 207 71 -32 -307 -283 38 246 49 -141 -110 -247 190 185 -54 -44 -168
7566 -168 -6 92 152 -2 -157 -240 -36 -9 282 120 -263 66 -251 269 184 4 -157 -52 -67 76 385 171
7588 171 -175 -228 -161 -114 228 201 -77 -465 -295 151 79 70 -54 -353 -117 191 291 123 179 -441 -201 39 157
7611 157 213 67 -299 -97 154 -38 60 -181 -204 -179 126 252 267 -158 -209 -305 92 321 154 -106 -149 -186 -47
7634 -47 173 326 42 -100 -75 1 208 36 13 -91 -180 -39 133 28 267 -257 -78 23 265 57 160 -252
7656 -252 -230 -91 34 170 -167 -187 -182 -214 102 238 -64 -177 -313 106 -114 337 -32 -125 -86 -3 7 266 -1
7679 -1 -182 -362 -205 85 243 155 -202 -107 -37 195 36 89 -314 -183 -15 265 63 59 130 -103 -92 216 11
7702 11 16 -305 -52 -60 152 135 -108 -90 -129 -125 93 308 161 -132 -140 -102 -102 140 158 -110 -339 -15 76 309 58 -140
7728 -140 -51 -221 -27 175 335 118 -339 -21 86 305 308 -13 -293 -177 -121 33 -89 -71 -137 -50 -135 84 76
7751 76 53 -158 -349 -190 225 258 -169 -375 -246 15 283 304 -154 -369 -317 94 -15 315 8 -159 -165 -44
7773 -44 -42 80 -55 223 -112 93 67 244 -52 -57 -184 -118 234 194 231 -30 -149 113 223 144 -39 -85 -166 -119
7797 -119 168 127 156 -151 -172 42 138 47 212 -252 -90 -100 237 50 -89 -44 88 -42 24 393 104 -73 -102
7820 -102 -60 44 394 86 -130 -312 3 77 345 242 -149 -299 -133 53 148 110 37 -250 -73 -20 137 -6
7842 -6 -77 -158 -212 84 158 54 -129 -198 250 192 251 263 109 -144 -237 -64 109 142 142 -120 27 23 162 156 5 -202
7868 -202 -60 59 217 78 -12 -295 -385 -50 185 65 -22 -29 -219 -10 -77 45 59 -379 -188 67 315 162
7890 162 25 -191 -91 94 291 311 101 -294 -185 -101 93 226 -6 -131 -390 44 31 179 64 -212 -165
7911 -165 225 -30 121 -83 -232 -132 -136 421 162 137 -350 -258 -130 15 278 159 -67 -258 26 22 64 -26 -148
7934 -148 -273 -11 138 214 26 -82 -201 76 104 131 142 59 -54 153 81 289 205 -137 -359 -40 228 184 -142
7957 -142 -56 -311 -43 194 163 -88 152 -73 -48 148 94 69 -64 -139 -126 91 261 191 -276 -266 127 -1 166
7980 166 55 -97 -333 -269 36 95 107 -21 -421 -179 71 264 207 -134 -187 51 -22 187 189 -97 -292 -111 90
8003 90 127 170 -107 -188 51 83 274 92 -191 -56 68 158 124 166 -25 -112 -219 128 85 148 -226 -301 -126 -92
8027 -92 272 185 159 -119 -27 158 287 203 -113 -221 -74 238 79 218 11 -251 -164 -150 215 231 134 91 -224
8050 -224 -100 139 97 27 -264 -286 -42 251 102 -18 -343 -328 -70 220 -88 95 -132 -249 -39 69 167 32
8072 32 -31 -175 70 -125 418 110 -159 -54 -76 312 309 178 -106 -118 322 -86 284 80 -227 -91 -152 -46
8094 -46 -16 -51 -40 -157 -346 183 222 178 43 -268 45 -57 280 165 -58 -86 71 -60 316 312 -20 -59 -109 123
8118 123 140 56 58 -256 -27 82 182 248 -15 -215 -102 95 267 161 -129 -106 -465 -126 387 8 -230 -275
8140 -275 -48 145 127 15 116 -410 89 262 121 170 10 -24 -9 63 310 -66 -138 48 65 96 287 -124 -207
8163 -207 -327 -95 0 203 101 -32 -325 -509 55 -212 26 50 -265 301 -42 209 216 97 -187 -291 243
8184 243 -112 181 -194 -30 -459 -180 18
8191A8
##END NTUPLES=NMR FID
##END=
