##TITLE=1H_SR52_oil
 CDCl3, 8 sc, 
 9.04.2021
##JCAMPDX= 6.0         $$ Bruker NMR JCAMP-DX V2.0
##DATA TYPE= NMR FID
##DATA CLASS= NTUPLES
##ORIGIN= UXNMR, Bruker Analytische Messtechnik GmbH
##OWNER= root
$$ XWIN-NMR		Version 3.5
$$ Fri Apr  9 13:39:15 2021 Russian Standard Time (UT+4h)  she@DPX200
##.OBSERVE FREQUENCY= 200.131506
##.OBSERVE NUCLEUS= ^1H
##.DELAY= (6, 6)
##.ACQUISITION MODE= SIMULTANEOUS
##.ACQUISITION SCHEME= undefined
##.AVERAGES= 8
##.DIGITISER RES= 18
##SPECTROMETER/DATA SYSTEM= spect
##.PULSE SEQUENCE= zg30
##.SOLVENT NAME= CDCl3
##.SHIFT REFERENCE= (INTERNAL, CDCl3, 0, 15.7039)
##AUDIT TRAIL= $$ (NUMBER, WHEN, WHO, WHERE, WHAT)
$$ ##TITLE= Audit trail, XWIN-NMR		Version 3.5
$$ ##JCAMPDX= 5.01
$$ ##ORIGIN= Bruker BioSpin GmbH
$$ ##OWNER= she
$$ F:/spectra/data/she/nmr/H-F/1/audita.txt
$$ ##AUDIT TRAIL=  $$ (NUMBER, WHEN, WHO, WHERE, WHAT)
(   1,<2021-04-09 13:37:23.92 +0400>,<she>,<DPX200>,
      <created by zg, POWCHK disabled, PULCHK disabled
       configuration hash MD5:
       00 E9 B6 7A A2 85 ED C7 34 08 36 98 17 FE 4E 26
       data hash MD5: 16K
       7B C6 66 FB 2B E0 AA A7 C7 A6 18 FB 7F 38 59 62>)
$$ ##END=
$$ 
$$ hash MD5
$$ 9F 02 51 48 42 31 25 7F 84 BE 72 43 F2 39 AC A5
##$RELAX= 
##$RELAX= 
##$RELAX= 
##$RELAX= 
##$RELAX= 
##$RELAX= 
$$ Bruker specific parameters
$$ --------------------------
##$DU= <F:/spectra>
##$EXPNO= 1
##$NAME= <H-F>
##$PROCNO= 1
##$TYPE= <nmr>
##$USER= <she>
##$AMP= (0..31)
100 100 100 100 100 100 100 100 100 100 100 100 100 100 100 100 100 100 
100 100 100 100 100 100 100 100 100 100 100 100 100 100 
##$AQSEQ= 0
##$AQ_mod= 1
##$AUNM= <au_zg>
##$AUTOPOS= <>
##$BF1= 200.13
##$BF2= 200.13
##$BF3= 200.13
##$BF4= 200.13
##$BF5= 200.13
##$BF6= 200.13
##$BF7= 200.13
##$BF8= 200.13
##$BYTORDA= 1
##$CFDGTYP= 0
##$CFRGTYP= 5
##$CHEMSTR= <none>
##$CNST= (0..31)
1 1 145 1 1 1 1 1 1 1 1 1 1 1 1 1 1 1 1 1 1 1 1 1 1 1 1 1 1 1 1 1 
##$CPDPRG= <>
##$CPDPRG1= <>
##$CPDPRG2= <>
##$CPDPRG3= <>
##$CPDPRG4= <mlev>
##$CPDPRG5= <mlev>
##$CPDPRG6= <mlev>
##$CPDPRG7= <mlev>
##$CPDPRG8= <mlev>
##$CPDPRGB= <>
##$CPDPRGT= <>
##$D= (0..31)
0 1.2 0 0 0 0 0 0 0 0.06 0 0.03 0 0 0 0 0.0002 0 0 0 0 0 0 0 0 0 0 0 0 
0 0 0 
##$DATE= 1617961043
##$DBL= (0..7)
120 120 120 120 120 120 120 120 
##$DBP= (0..7)
150 150 150 150 150 150 150 150 
##$DBP07= 0
##$DBPNAM0= <>
##$DBPNAM1= <>
##$DBPNAM2= <>
##$DBPNAM3= <>
##$DBPNAM4= <>
##$DBPNAM5= <>
##$DBPNAM6= <>
##$DBPNAM7= <>
##$DBPOAL= (0..7)
0.5 0.5 0.5 0.5 0.5 0.5 0.5 0.5 
##$DBPOFFS= (0..7)
0 0 0 0 0 0 0 0 
##$DE= 6
##$DECBNUC= <off>
##$DECIM= 32
##$DECNUC= <off>
##$DECSTAT= 4
##$DIGMOD= 1
##$DIGTYP= 9
##$DL= (0..7)
0 120 120 120 120 120 120 120 
##$DP= (0..7)
150 150 150 150 150 150 150 150 
##$DP07= 0
##$DPNAME0= <>
##$DPNAME1= <>
##$DPNAME2= <>
##$DPNAME3= <>
##$DPNAME4= <>
##$DPNAME5= <>
##$DPNAME6= <>
##$DPNAME7= <>
##$DPOAL= (0..7)
0.5 0.5 0.5 0.5 0.5 0.5 0.5 0.5 
##$DPOFFS= (0..7)
0 0 0 0 0 0 0 0 
##$DQDMODE= 0
##$DR= 18
##$DS= 0
##$DSLIST= <SSSSSSSSSSSSSSS>
$$ [...]
##$SUBNAM2= <"">
##$SUBNAM3= <"">
##$SUBNAM4= <"">
##$SUBNAM5= <"">
##$SUBNAM6= <"">
##$SUBNAM7= <"">
##$SUBNAM8= <"">
##$SUBNAM9= <"">
##$SW= 16.9725357007746
##$SWIBOX= (0..15)
0 0 2 0 0 0 0 0 0 0 0 0 0 0 0 0 
##$SW_h= 3396.73913043478
##$TD= 16384
##$TD0= 1
##$TE= 0
##$TE2= 300
##$TE3= 300
##$TEG= 300
##$TL= (0..7)
0 120 120 120 120 120 120 120 
##$TP= (0..7)
150 150 150 150 150 150 150 150 
##$TP07= 0
##$TPNAME0= <>
##$TPNAME1= <>
##$TPNAME2= <>
##$TPNAME3= <>
##$TPNAME4= <>
##$TPNAME5= <>
##$TPNAME6= <>
##$TPNAME7= <>
##$TPOAL= (0..7)
0.5 0.5 0.5 0.5 0.5 0.5 0.5 0.5 
##$TPOFFS= (0..7)
0 0 0 0 0 0 0 0 
##$TUNHIN= 0
##$TUNHOUT= 0
##$TUNXOUT= 0
##$USERA1= <user>
##$USERA2= <user>
##$USERA3= <user>
##$USERA4= <user>
##$USERA5= <user>
##$V9= 5
##$VALIST= <valist>
##$VCLIST= <CCCCCCCCCCCCCCC>
##$VD= 0
##$VDLIST= <DDDDDDDDDDDDDDD>
##$VPLIST= <PPPPPPPPPPPPPPP>
##$VTLIST= <TTTTTTTTTTTTTTT>
##$WBST= 1024
##$WBSW= 4
##$XGAIN= (0..3)
0 0 0 0 
##$XL= 0
##$YL= 0
##$YMAX_a= 346369
##$YMIN_a= -265466
##$ZGOPTNS= <>
##$ZL1= 120
##$ZL2= 120
##$ZL3= 120
##$ZL4= 120
##$ABSF1= 10
##$ABSF2= 0
##$ABSG= 5
##$ABSL= 3
##$ALPHA= 0
##$AQORDER= 0
##$ASSFAC= 0
##$ASSFACI= 0
##$ASSFACX= 0
##$ASSWID= 0
##$AUNMP= <proc_1d>
##$AZFE= 0.1
##$AZFW= 0.1
##$BCFW= 1
##$BC_mod= 2
##$BYTORDP= 1
##$COROFFS= 0
##$CY= 11.3945322036743
##$DATMOD= 1
##$DC= 2
##$DFILT= <>
##$DTYPP= 0
##$F1P= 15.9154993809931
##$F2P= -4.1035820241983
##$FCOR= 0.5
##$FTSIZE= 0
##$FT_mod= 4
##$GAMMA= 1
##$GB= 0.15
##$INTBC= 1
##$INTSCL= 1
##$ISEN= 128
##$LB= 0.24
##$LEV0= 0
##$LPBIN= 0
##$MAXI= 10000
##$MC2= 0
##$MEAN= 0
##$ME_mod= 0
##$MI= 1.114404
##$NCOEF= 0
##$NC_proc= 0
##$NLEV= 6
##$NOISF1= 3.799351
##$NOISF2= 2.8
##$NSP= 1
##$NTH_PI= 0
##$NZP= 0
##$OFFSET= 15.70392
##$PC= 1
##$PHC0= -11126.27
##$PHC1= 14.00095
##$PH_mod= 1
##$PKNL= yes
##$PPARMOD= 0
##$PSCAL= 0
##$PSIGN= 0
##$REVERSE= no
##$SF= 200.130013532006
##$SI= 16384
##$SIGF1= 3
##$SIGF2= 2
##$SINO= 400
##$SIOLD= 16384
##$SREGLST= <1H.CDCl3>
##$SSB= 0
##$STSI= 0
##$STSR= 0
##$SW_p= 3612.71676300578
##$SYMM= 0
##$S_DEV= 0
##$TDeff= 0
##$TDoff= 0
##$TI= <>
##$TILT= no
##$TM1= 0
##$TM2= 0
##$TOPLEV= 0
##$USERP1= <user>
##$USERP2= <user>
##$USERP3= <user>
##$USERP4= <user>
##$USERP5= <user>
##$WDW= 1
##$XDIM= 8192
##$YMAX_p= 0
##$YMIN_p= 0
$$ End of Bruker specific parameters
$$ ---------------------------------
##NTUPLES= NMR FID
##VAR_NAME=  TIME,          FID/REAL,        FID/IMAG
##SYMBOL=    X,             R,               I
##VAR_TYPE=  INDEPENDENT,   DEPENDENT,       DEPENDENT
##VAR_FORM=  AFFN,          ASDF,            ASDF
##VAR_DIM=   8192,          8192,            8192
##UNITS=     SECONDS,       ARBITRARY UNITS, ARBITRARY UNITS
##FACTOR=    0.0002944,     1,               1
##FIRST=     0,             0,               0
##LAST=      2.4114304,     0,               0
##MIN=       0,             -265466,         0
##MAX=       2.4114304,     346369,          0
$$ Real data points
##PAGE= N=1
##DATA TABLE= (X++(R..R)), XYDATA
$$ [...]
2326a585K58J397J616m47j346j352K40J390J259j0j699j165O0J149J558L33j609
2343D7j562R0J451J382K59j713j322k70J680J343O1j398j289j80J088J472M64
2360A603j315j412l55J235J245L91p30j516q46J197J471P31r52j609o57P40J925
2377A146K34n86j699p33P59J733N78p97j555p23M79K020P20p44j530p97N91J452
2395E48J018n67j559j168O31J728J112m23j666j220M73J553Q80r6j689j213O62
2412i96J398J013k96j363j259M86Q61J786m18j310j439j15J681J406m8j330j233
2429a176l11J385J462o9j092j655K1J212J338L53j460j157m80J396J459O01j341
2446D86j887j92J280J727J46j210j397m04O36J551P30j097j434n38Q27J630P56
$$ plain form
2326 -1585 -1327 70 1686 1239 -107 -1459 -1219 171 1430 1420 -279 -1444 -1384 -235 1323 1656 47
2343 47 -1515 -1425 26 1408 1667 -46 -1368 -1638 42 1385 1446 48 -1241 -1421 -333 1139 1603
2360 1603 288 -1124 -1479 -244 1001 1392 662 -854 -1700 -503 968 1699 747 -862 -1519 -779 1146
2377 1146 1380 794 -905 -1638 -879 854 1432 635 -920 -1643 -1164 856 1576 832 -698 -1495 -904 548
2395 548 1566 999 -560 -1728 -1097 631 1743 1320 -346 -1566 -1093 460 1340 1244 -445 -1658 -996
2412 -996 402 1415 1119 -244 -1503 -1017 -156 1630 1212 -98 -1537 -1652 29 1435 1387 57 -1176
2429 -1176 -1487 -102 1360 1291 199 -1456 -1435 -223 1115 1468 8 -1149 -1629 -233 1226 1827 486
2446 486 -1401 -1593 -313 1414 1560 350 -1047 -1451 -815 736 1466 369 -1065 -1603 -776 854 1610
2463A610r59j586p30Q55J403J026q58j690p15R25J471J094q27j638j016N03J659
2480E27J166n82j557j433Q79J722P45l07j627j294M93J738R96p0j788j041J2J625
2498B04J068Rj557j328J02J854R16l1j502j094n2J518J291K8j385j337j92J255
2516b33J513J08j197j514j58J170J632K42j472j457m21J610J336M51j244j499
2532a133k07Q01J697L76j089j423n95Q87J840M36j071j537m61P61J603J042j596
2549C31j253l98O35J525Q07q20j667p58Q07J763Q42q19j760o39M86J566J149p49
2567A048j536j127L55J831J136o28j642j307N98J691J028l35j336j216K21J542
2583C23J103j07j395j325k1J534J323J31j622j330l3J643J151j03j412j285j41
$$ plain form
2463 1610 651 -935 -1665 -810 593 1619 761 -929 -1644 -719 752 1846 1019 -619 -1635 -1132 527
2480 527 1693 1111 -446 -1879 -1000 722 1467 1160 -467 -1761 -1268 470 1466 1396 -392 -1433 -1421 204
2498 204 1272 1281 -276 -1604 -1502 352 1268 1237 -265 -1359 -1411 107 1398 1426 41 -1296 -1488 -233
2516 -233 1280 1388 191 -1323 -1481 -311 1321 1563 91 -1366 -1787 -177 1159 1610 366 -1133
2532 -1133 -1340 -539 1158 1534 445 -978 -1573 -686 1154 1590 519 -1018 -1479 -718 885 1927 331
2549 331 -922 -1320 -685 840 1647 827 -840 -1598 -791 972 1814 995 -765 -1404 -918 648 1797 1048
2567 1048 -488 -1615 -1260 571 1707 1079 -563 -1870 -1272 419 1447 1112 -224 -1440 -1219 323
2583 323 1426 1319 -76 -1401 -1422 112 1435 1566 -56 -1386 -1419 224 1375 1272 -140 -1425 -1566
2600a566J269J593p2j138j328l82J162J864J80j144j803j17J028J738L86j216
2616D54j364o13J261J430N78j234j715l65J069J690M18r58j678n90J111J300Q08
2633A602o79j913p42J061J503Q53j072j385o38O55J387R83p54j397j033Q53J345
2650F29J031r81j584n92K13J945R78l56j855r68M17J630J220o42j354j308M95
2667a082J463J007o1j565j240J31J476J111p0j270j425J79J509J242j5j539r65
2684a114k92J183J644o3j230j452k98J456J603Q7j233j537r8R27J600L05j244
2701B44j395k08J187J280M82j135j660m41J158J558N41r73j475n66Q27J578M77
2718A479r74j301o52R47J458O53p73j675p96O67K006O24r06j204j135N30J471
$$ plain form
2600 -1566 -297 1296 1224 86 -1242 -1624 -462 1402 1582 438 -1365 -1482 -454 1284 1670 454
2616 454 -910 -1523 -262 1168 1746 512 -1203 -1568 -499 1191 1609 651 -1027 -1617 -506 794 1602
2633 1602 923 -990 -1732 -671 832 1685 613 -772 -1410 -755 632 1615 861 -536 -1569 -716 629
2650 629 1660 679 -905 -1497 -1284 661 1639 1283 -572 -1540 -1123 507 1727 1085 -269 -1577 -1082
2667 -1082 381 1388 1327 -238 -1478 -1347 129 1240 1170 -100 -1525 -1346 163 1405 1390 -149 -1114
2684 -1114 -1406 -223 1421 1358 128 -1324 -1622 -166 1437 1524 291 -1246 -1344 -417 1183 1488 244
2701 244 -1151 -1359 -172 1108 1590 455 -1205 -1646 -488 1070 1611 638 -837 -1403 -576 1002 1479
2718 1479 505 -796 -1448 -501 957 1610 837 -838 -1634 -967 1039 1663 757 -447 -1582 -1052 419
2735D19R28n33j236j120O78J568P06l42j520j101L53J676J270n18j481j165J85
2752a233J397J226q6j537j292L61J392J103J90j686j025k72J484J364j60j216
2768A0j485K02J321J235L49j159j713l81J558J264L41j135j403n76J340J842j22
2785A488j148j517m37J066J562M30q62j502n45R04J564M53q54j408o46P20J723
2802I91O52j144j305r03J150J234O75o47j267j078P33J773O29n08j690o50M77
2819h78J398J095n84j489j077O59J297Q99j39j679j156N59J552Q06j17j496p80
2836a130p6J144J499m01j248j422N19J271J092J10j379j334K8J383J314J53j638
2853a15j217k1J235J351K97j495j215l96J415J271L05j134j449l45J258J367M58
$$ plain form
2735 419 1347 814 -422 -1542 -864 704 1410 1068 -452 -1553 -1200 476 1746 1228 -253 -1418 -1233
2752 -1233 164 1390 1304 -233 -1525 -1164 228 1331 1521 -165 -1190 -1462 22 1386 1226 10
2768 10 -1475 -1273 48 1283 1632 473 -1240 -1621 -63 1201 1542 407 -996 -1572 -232 1610 1488
2785 1488 340 -1177 -1614 -548 1014 1444 582 -920 -1465 -561 1003 1456 602 -806 -1452 -732 991
2802 991 1643 499 -806 -1709 -559 675 1350 703 -564 -1642 -909 864 1493 985 -705 -1355 -878
2819 -878 520 1615 1031 -458 -1535 -876 421 1320 1181 -498 -1654 -1095 457 1263 1146 -350 -1130
2836 -1130 -1206 -62 1437 1036 -212 -1634 -1115 156 1248 1358 -21 -1355 -1327 56 1370 1523 -115
2853 -115 -1332 -1353 -118 1233 1530 35 -1180 -1576 -161 1110 1415 281 -1168 -1513 -255 1112 1570
2870A570j396j457j82J170J298M83r18j420n75R24J283O42j032j337n94P55J545
2887G59P46p92j429q92P46J507P91m65j620p88L53J635J049r69j343q50O14J490
2905E42Q29l85j476r29L87J489J130l81j511j583N19J719J037j72j630q83J5J464
2923A81J081O4j613j028P9J418J146j02j172j313q8J407J376lj393j541K30R88
2941b83J364L12j041j565K30R09J081L81j095j283k85J047J145M66j088j512k55
2958a472J223J215L95j015j356k18P85J428M55p94j357m68N23J408O71q21j495
2975h93l48L98J475R27o43j372q48M97J336Q77o32j397o71K02J496R68k64j682
2993e74p94M14J215J186n24j252r22L19J268R70l62j102j217L49J118J076J7j392
$$ plain form
2870 1570 174 -1283 -1465 -295 1003 1486 568 -852 -1427 -503 780 1422 390 -947 -1541 -786 759
2887 759 1505 713 -716 -1608 -862 645 1436 971 -649 -1437 -1084 551 1600 631 -712 -1562 -948 542
2905 542 1371 986 -490 -1419 -1032 457 1587 1206 -305 -1888 -1369 350 1387 1215 -415 -1298 -1283 181
2923 181 1262 1326 -287 -1315 -1236 182 1328 1226 54 -1259 -1347 60 1436 1433 40 -1501 -1271 -283
2941 -283 1081 1393 352 -1213 -983 -74 1007 1388 293 -990 -1275 -228 917 1383 295 -1217 -1472
2958 -1472 -249 966 1361 346 -1010 -1228 -443 985 1440 646 -711 -1179 -656 752 1423 602 -893
2975 -893 -1241 -843 632 1559 916 -456 -1304 -807 529 1406 774 -623 -1294 -1092 404 1372 1108 -574
2993 -574 -1368 -954 261 1447 923 -329 -1251 -932 336 1306 944 -158 -1375 -1026 92 1168 1185 -207
3011b07j138K65J161J301l08j015j291P9J080J273K82j298j457L1J494J052m4
3028A260j079j414k25J283J424R3j077j355k74J097J241M45j004j384k64O51J704
3045A122M48j342j235l94P85J324O27j003j026r25P58J556R13j036j293p87Q00
3062g08J309N92k97j378p26N73J435K55Nj824p01O74J222P20j97j137j265O68
3080g80J121Q76j70j522q56L11J365Q33j98j160j053oJ471J110l40j128j292J13
3098a305J519J058j12j168j121K6Q53J230K79j361r47j56J104J253j08r00j289
3115a145R3Q31J420q0o61j348m04J067J046M07o68j405n20J117J085L57o33j328
3133g69o76J136J145L79o00j227n99N35J249Q16n46j605n67P55J394M23p69j202
$$ plain form
3011 -207 -1345 -1080 81 1382 1074 59 -1232 -1153 -73 1200 1482 184 -1273 -1242 252 1304 1260
3028 1260 181 -1233 -1458 -175 1249 1342 265 -1090 -1364 -267 974 1419 415 -969 -1233 -582 1122
3045 1122 1570 228 -1007 -1401 -616 708 1335 332 -694 -1619 -861 695 1608 572 -721 -1508 -708
3062 -708 601 1193 896 -482 -1208 -635 800 1055 1060 -764 -1465 -791 431 1151 954 -183 -1448 -780
3080 -780 341 1217 1047 -475 -1331 -1020 345 1178 980 -180 -1233 -1239 232 1342 1002 -126 -1418 -1305
3098 -1305 214 1272 1160 -8 -1129 -1103 -250 980 1259 -102 -1049 -1205 -101 1152 1044 144 -1145
3115 -1145 -1052 -221 1199 1119 458 -890 -1294 -227 819 1226 558 -847 -1367 -250 835 1192 559 -769
3133 -769 -1445 -309 836 1215 615 -612 -1211 -676 573 1389 843 -762 -1329 -574 820 1243 474 -728
3151g28p07R05J130O75l95j309p49L59J230P97k80j194r24N59R46J126m24j337
3169c20j004K45J433J100k57j509q06J60J009J181k89j006j042J23J076J070q9
3186A075r45j224k40J407R72J23r07j365j43J141Q63K47q39j219l9Q85J172L00
3204A264j040j096k62Q68J194L51q27j185l01N24J291O32q21j162p23Q54J102
3221F63P61q72j234o41J008P65P61o54j106p54N25J252P58n38j166p58O15J245
3239F30N01k92j393p72N19J235P11l70j258p35K04J385J031o15j205r40L01J248
3257A85J099l77r23j234K23J084Q69L2j029j098J64J096R62n7r55r36J67O94J129
3276A095j13j039j027J11Q05J105K10r45j159j14P78J298K66q42j332m87J256
$$ plain form
3151 -728 -1435 -530 600 1275 880 -429 -1178 -819 411 1208 928 -266 -1190 -631 315 1441 1017 -320
3169 -320 -1324 -1079 354 1454 1197 -312 -1118 -958 51 1232 943 -63 -1105 -982 94 1164 1075
3186 1075 130 -1094 -1334 73 1045 1168 261 -1104 -1247 -106 757 1004 165 -1054 -1093 -208 964 1264
3204 1264 224 -872 -1134 -266 928 1279 452 -733 -1034 -510 781 1413 592 -570 -1293 -439 663
3221 663 1424 552 -682 -1323 -315 450 1211 557 -549 -1303 -778 474 1232 694 -472 -1230 -615 630
3239 630 1131 839 -554 -1326 -807 428 1139 769 -489 -1224 -1020 365 1396 781 -424 -1364 -1063 185
3257 185 1284 907 -16 -1250 -1027 57 926 958 -71 -1169 -1005 91 1053 996 41 -895 -728 -34 1095
3276 1095 982 -57 -1084 -973 -168 937 1147 202 -957 -1071 -293 1005 1271 429 -903 -1390 -134
3293a34J091N71j116j355K11N78O55O46n97j200n28N01J610M16o57j290p01Q57
3311d42J162N45q34r56o89N06J534M28n05j507m71M49J290O15m83j143n51P9J282
3330C09P69m19q60r14O93P16P98j58j227p72M50R36Q08j29j115q01J10R70Q00
3349I64k1j002r81PR39R57J66j223q34Q6J081Q08n0q42j197N9J099O27L32r86
3369a1q89k42R99J068N3q12r70k84Q91R74M08q10j249k98P15J378M4n74j094l94
3389a097O46J187L55o19j209l58P44R24N37n36j249m92O85J094N79l88j295m54
3407i46O3J057R91m32j078q09L16J368O63m46j165q15K39J327Q59l03j034q19
3425i64K27J091Q04l95r60p55M8O42J293p6j120p86k65J420Q55p0r16r76n8J139
$$ plain form
3293 -134 957 1528 412 -943 -732 -154 501 1147 550 -650 -1178 -677 933 1349 692 -598 -1299 -442
3311 -442 720 1265 431 -525 -1214 -708 826 1254 749 -758 -1229 -780 510 1125 642 -501 -1052 -973 309
3330 309 1078 659 -201 -1115 -422 294 1092 934 -293 -1065 -615 321 1129 1000 -115 -916 -806 164 964
3349 964 943 -59 -1040 -1033 -94 863 1029 -194 -1028 -942 139 947 897 55 -1142 -1083 16 643 975 -11
3369 -11 -900 -1142 -143 925 978 166 -804 -1088 -197 777 1185 375 -874 -1172 -457 921 965 391 -703 -1097
3389 -1097 -451 736 1091 472 -737 -1095 -351 573 1110 574 -675 -1167 -482 612 1191 803 -492 -946
3407 -946 -883 174 1165 733 -345 -1154 -838 530 1193 747 -418 -1233 -994 333 1192 889 -145 -964
3425 -964 -737 354 1158 763 -197 -952 -904 -262 1031 955 -165 -951 -1216 204 1059 989 73 -903 -961 178
3445A78J153l73j302m29q3J064P41K76j203o13o35N25J699L46q16j555k66J009
3463b84J558j92r71o53n98M62R77Q20j181o41p61K75K134K63q81q10p45J76J923
3482H71K44r45j330l2N33N72J444o44j022p64K69J308O65n40j135o62O45J136
3500F13L12k43r23j148P28J112J254o98j198n06P6P34R95k83j519l92M10O83R39
3519I46M85j567r21O8R61J137q9j283o62P9R52J078k67q42p43m48J118Q83K38
3538A123q85j111k77R08J046L13q11j152l22R66P87L38p35j138L9P39J103L87
3556A318q95q03o60M92J174N31p37j133m91P71J033O17o63j293k44M60Q92Q33
3574A202l97j442n34P65P70R34n88r62o51L28J098O05m72q48o17m2Q58J012l20
$$ plain form
3445 178 1331 958 -344 -773 -856 208 949 1225 22 -591 -1226 -701 998 1344 528 -1027 -1293 -284
3463 -284 1274 1082 111 -542 -1140 -678 299 1119 -62 -703 -1464 -1189 945 1208 327 -483 -1228 -1052 871
3482 871 1115 170 -1160 -1192 -659 -87 1357 713 -309 -1073 -804 504 1169 629 -506 -1168 -523 613
3500 613 925 682 -241 -1389 -661 451 1705 1007 -191 -697 -621 113 1108 825 -694 -1086 -676 7 946
3519 946 1431 -136 -1057 -989 -28 1109 1020 -263 -925 -846 106 1184 917 75 -668 -1116 2 885 1123
3538 1123 238 -873 -1150 -242 804 1117 306 -846 -1168 -202 585 923 188 -950 -911 -172 931 1318
3556 1318 423 -380 -1040 -548 626 1157 420 -713 -1204 -433 600 1217 554 -739 -983 -523 369 1202
3574 1202 805 -637 -1171 -406 364 1298 710 -252 -903 -575 523 1128 656 -192 -809 -851 7 1019 699
3593F99j219l29J78J113O99m12q46j172M74Q93Q68k0j126p84p0J188Q10J6r10
3612E0j020K52P58R23m3r88j025NR32J110r4n44j021l90P92J134J81o18j180m30
3632a216Q74J026M90o96j313O8L58J192L84q71r91l85P17J164K94o72j042n43
3650a162R75P99N10l46j302m95M20R94N34k79r81p71N69Q36N91l52o84q29L58
3669f15J001Q78o83q74p17K85J000P97j06j166q41J82Q90P56l1r29o78k23J161
3688H7J083k40p65j105q5J009R40j55q34j033K12P40Q01L17o42j266J09O37Q69
3707F79K21o65j029l41R55P54N53o90j108m65O74J076N20p93j008l15P10Q31L12
3726H71l85j187k90N57Q42N53m16j220m54N30J017O32k58j178o46M68J187M35
$$ plain form
3593 699 -520 -849 -671 442 1141 729 -117 -1289 -815 78 946 926 -200 -984 -1054 134 944 960 50
3612 50 -970 -718 40 963 920 -68 -1093 -1088 -156 954 860 316 -705 -1095 -303 831 1012 394 -786 -1216
3632 -1216 -342 684 1174 478 -835 -767 -409 783 1167 296 -695 -1080 -363 801 1095 423 -619 -1162
3650 -1162 -187 612 1122 776 -526 -1021 -601 393 927 648 -333 -1104 -535 301 892 540 -144 -973 -615
3669 -615 386 1264 581 -293 -1010 -725 275 1072 966 -200 -1041 -859 31 787 756 -173 -851 -1074 87
3688 87 1170 930 165 -940 -1025 -16 924 769 -65 -1098 -886 -146 655 972 330 -936 -827 -190 679
3707 679 900 235 -794 -1135 -180 574 1127 437 -671 -1136 -462 614 1134 341 -667 -982 -272 559 871
3726 871 486 -701 -991 -434 408 961 545 -675 -1129 -599 418 1050 792 -386 -1032 -564 623 1058
3744A058l47j220m33M27Q79N67k32r62q81N51Q49Q43o46o59q24K16O85R37j13
3763F95j040n67LR47J031p6j058q34Q1Q10J198j49r74r49J10P47P97L79j072p70
3783f91k86P05J411k49p90r45j26R78M91M41q19j104J1P96Q06K65m94j093l67
3802a060Q20R44M28r18q11j58L88J214N9l71r62p48P48R49M16l07q14q61P00P32
3822C88O68l94j156n43Q50K33J088p22j110l92M51J083O92l99j089n60K28P87
3840A03Q37k49r43o03J27P41R56k76o64p43j43R04Q83J71j123p86j01R29O39J21
3860G80q85o24l08J013O48K26o65j034m21J102J150Q3j010p83l53O19J263j5l51
3879D35j202j84N49J221K02q15o04q02Q34J046K31m98j111j31M37R39N63n71j314
$$ plain form
3744 1058 711 -509 -942 -515 364 931 699 -263 -1144 -593 256 1099 453 -206 -1030 -814 -129 808 695
3763 695 -345 -912 -909 38 1069 993 -65 -899 -818 -8 1190 1041 67 -882 -772 -25 772 1151 79 -691
3783 -691 -977 -272 1139 890 100 -845 -971 7 498 939 120 -984 -973 -177 629 894 400 -693 -1060
3802 -1060 -240 704 1132 214 -597 -755 -367 847 906 535 -427 -1175 -427 522 938 631 -183 -1044 -344 388
3822 388 1056 662 -494 -1037 -187 46 1134 412 -698 -1090 -639 444 1136 737 -352 -912 -684 103
3840 103 940 691 -252 -855 -728 13 969 693 29 -714 -857 47 930 1101 -22 -808 -909 20 659 780
3860 780 -105 -729 -1037 -24 624 850 185 -849 -1270 -168 982 1065 55 -728 -1081 -462 801 786 435
3879 435 -767 -951 -402 819 1021 206 -398 -1200 -366 680 911 413 -698 -829 -392 547 1110 539 -775
3898g75j94N02Q35P34n42r24l11J75R81K69k51p56n61J30J014N25O9r05o70K6
3918f29Q32P26j88q59q30L06Q16P82j76r12q39K59R69O88j00r58q59O0J091N95
3938G74l5p28p15n5O71R48k95n62p50k99Q66R01P1n26q71l32P34Q52J20n23j061
3959h15J4P88P22K39n58p74l85J03J283o3j85p90l32L32J129K51l53j010o71O01
3979d74R48K76l28q54o07O58O75M57l87p38l43L44O74N44j58j054m69L88O13O97
3999H62m13m76o35n8Q76O33j44j004m82Q9Q94P70l04o85o49p3Q06Q75k35p57q23
4020i33K03P66R26r7q56o16m80J052P08o9m32r45K41K95R50J3k94j019k27N08
4040c06Q23M02n30q71m32N20J115J29n80p33n82N55J146J42m46o92o69O19P90
$$ plain form
3898 -775 -969 -467 368 1102 560 -364 -675 -500 481 750 499 -257 -818 -688 326 851 920 15 -655 -629
3918 -629 203 929 741 -118 -948 -642 174 956 780 -132 -971 -712 257 945 845 -113 -972 -912 179 774
3938 774 739 11 -704 -759 -88 860 565 3 -747 -1046 -180 721 792 266 -605 -937 -203 649 769 246 -815
3959 -815 -801 -13 709 948 390 -384 -769 -666 617 554 369 -421 -753 -421 708 959 606 -404 -1075 -474
3979 -474 474 750 422 -432 -1039 -381 294 751 364 -374 -717 -373 301 845 687 -367 -836 -448 165 862
3999 862 449 -27 -662 -720 156 789 645 -359 -841 -752 142 912 608 -77 -726 -799 7 882 647 -110 -933
4020 -933 -730 36 962 865 9 -607 -1087 -35 673 604 172 -773 -532 -237 713 726 432 -587 -814 -306
4040 -306 517 919 389 -482 -914 -394 721 850 270 -463 -1045 -490 656 798 352 -340 -1009 -390 400
4059D00O18o62o51p27M42R68L14k43p44o23M11O31N45p9q98o46J92J022M08K49
4079I27j225l96P3Q50M00J07p13j202N89O47Q94p2r81n61qN69O40J92p86o29K48
4100d37M95Q16k35o89p71k8J012M28J12p84q78L03K45R57K12p70m71j36O87N22
4120E90L06m51j262j86Q68P57J67p02n39l40M75P50N71q85p99q4M63O84M41n52
4140B72p24k99L69O44P45m77r50k44Q4Q88N09n44p45n01M25J017M64o73n09n09
4160g58K78P28M97l02n18l79o7O17P55k10n86q66K78M62P15J27q93n30j88P18
4180a22P21J64p92n15nP01M90M8n64n55l48N70P63K58p95o94o6M82J003K92o04
4201D32j270M7N41P65M80q06n69j50L80P26J16m22o02l76J71J165J90l73j077
$$ plain form
4059 400 1018 356 -295 -1022 -580 388 702 459 -285 -908 -497 134 679 600 -298 -944 -752 270 678 927
4079 927 -298 -694 -621 229 629 736 23 -1179 -590 57 951 879 -102 -663 -671 -102 538 730 -56 -685 -437
4100 -437 58 874 639 -50 -821 -849 163 591 703 -81 -959 -656 -411 546 758 -12 -483 -619 68 590
4120 590 896 445 -817 -1003 -135 622 789 87 -452 -792 -317 433 1004 119 -680 -764 -301 383 824 272
4140 272 -452 -751 -382 262 1007 530 -420 -664 -580 308 817 273 -472 -973 -548 469 933 260 -249 -758
4160 -758 -480 248 745 443 -75 -454 -521 96 851 641 55 -811 -533 -71 644 771 -122 -652 -840 -122
4180 -122 599 763 -29 -544 -549 152 642 690 126 -429 -777 -207 556 814 19 -675 -741 -259 744 1036 432
4201 432 -838 -791 -250 515 995 189 -380 -530 -150 576 692 270 -332 -708 -537 628 818 445 -632
4220f32J8K52Q43J19k38q63n19O65N05O06k91o50n23K15R29K92k20r29l43M83
4240b81M75M99n94l17m10K5Q46N10p5o15p43J60O29O24k17o18p57L11O08O57k62
4261D55o63m34L9P70M57k38l31q33J24N86O51J00m31r49r6N47Q34K66p78n12k17
4282f53K61J048N4o23n07j35K19O54N80p50m37m76N09R08J13l81p70k09L69M73
4302B47L21j85n44n58OJ099K90l86n53m37K55O98L06k53m19n37o0Q48N54l37m30
4323g5o42K95O53L72p6p16m37K1O54O33l99n22m07Q9L76J087l06o65m64NM82M59
4345D17L2m17q07K13O92M09j73k99o09J71L68M65K15n14o80j35L51O93L63o33
4365A22m01m28P26L01K71o73n13Q2L05N39M68m37r39K18J9M72N42k50o77m46L17
$$ plain form
4220 -632 -614 -362 481 600 362 -501 -1020 -355 150 756 465 -185 -708 -493 436 728 508 -421 -764 -281
4240 -281 194 693 99 -218 -628 -603 243 753 678 63 -680 -520 109 733 516 -102 -859 -548 60 717 455
4261 455 -208 -642 -603 167 624 386 55 -778 -654 -68 583 683 252 -697 -793 -246 588 854 76 -436 -653
4282 -653 -392 656 710 87 -420 -555 -336 318 898 148 -289 -765 -256 652 765 384 -386 -595 -226 247
4302 247 568 383 -161 -719 -713 386 676 290 -263 -700 -445 253 559 306 -113 -650 -710 138 692 355 -75
4323 -75 -717 -422 231 603 527 -189 -626 -605 49 682 283 -239 -646 -557 -181 906 600 -65 -529 -524 -42 417
4345 417 449 32 -775 -562 130 539 366 67 -542 -371 -3 462 677 163 -517 -652 -301 392 755 122
4365 122 -279 -707 19 320 591 -82 -595 -513 -208 331 799 362 -577 -359 -340 132 674 424 -253 -699 -382
4386c82R24J79k73n91n85M61M93J76m5m20o95L57M48M33J15q28m16J93O94L34
4406E72o3o88l46N1L66O24j52l94n26m5O94L30j28k18n42m40R02O08j98l54o60
4427f07N3O79M60j64m36n17j24O00M55L30n35o76J2O87M51l70rp00r5M00N02L92
4449G88n72n28l59L38Q33k6k73m79l85M13Q60k4k02n22l50J17Q26qp6m75m11J82
4471c33N31L16j81m98l42J75M33N88p38j8o51L18N11J88K02l93p97O41L44K74
4491E70k15m58n15P1O20M50j68m09n48J19N34N72o6p77k73Q5K94M97K26m75m04
4512b70k03J50P08rr7o83j15N54K95J90m01m06l25M87N13Q7l51l83l35M50L51
4533B07K85k87n61N7J04M41K39l19m65k10K23N28M55l09q27j71J81N39L84k0p96
$$ plain form
4386 -382 542 721 448 -143 -728 -267 226 402 357 -63 -758 -401 47 480 595 -233 -649 -456 238 572
4406 572 509 -179 -525 -474 -108 516 364 -30 -556 -601 93 423 295 77 -465 -905 -3 605 407 53 -607
4427 -607 -554 125 585 421 -15 -532 -656 -56 399 729 194 -482 -470 217 668 298 289 -411 -506 -106 396 788
4449 788 216 -312 -671 -333 500 474 201 -278 -663 -250 610 586 384 -138 -488 -371 455 447 371 -104 -515 -333
4471 -333 198 514 333 -165 -507 -332 101 689 -49 -67 -718 -400 111 299 501 108 -689 -48 296 570
4491 570 355 -103 -618 -547 73 523 355 -54 -602 -483 51 623 557 -220 -493 -408 -114 383 609 134 -270
4512 -270 -473 -323 385 376 279 -404 -519 35 330 520 119 -287 -612 -125 388 475 124 -259 -594 -144 207
4533 207 492 205 -356 -299 -195 246 485 166 -299 -509 -286 242 697 388 -439 -610 -429 110 494 474 -322
4554c22k71M05R7N19Ll85n94K46N97J67O7n33n50J40N32N17j15o00k75J35M58
4575B38J43j4m15m67j1O43J86J49n31l32N4L21M50J56o29o17K88K21N02J24l43
4596A16o06J38K85N21O5n29k92k48M12N62l5j84n23j54k6J130o40k52rj17M69
4617H3O5K02j63n75m7N30K18K61k45m62k41M1M31K87k00q4m72n7M62K15J86l77
4639E8n91J18O90L01l6n10k59l7L91K96j5o30m32K30N06K21k07J43n60r4L14N57
4661D54j69l25o27J03N00L12K17l29n06r7M75K57K92n75k00j05L25K48K11m35
4681B6n92N0L41M13K5%l84j98L9P53J24j93n97k81J28O09K49m16j75m98L28N64
4703C15J20k74j27n74L88K26L80j56k01l00j40N38L75l77m07j18K71L37L5o9m13
$$ plain form
4554 -322 -593 -188 -91 428 431 46 -548 -302 295 462 529 -4 -554 -414 118 635 520 -80 -355 -220 238
4575 238 381 367 -48 -515 -526 117 303 452 -79 -411 -357 -36 414 570 -59 -676 -388 -167 335 459 116
4596 116 -490 -352 -67 454 519 -10 -302 -550 -138 424 389 205 -318 -472 -498 632 -8 -260 -269 -386 83
4617 83 148 350 187 -388 -435 95 313 574 329 -133 -374 -333 98 385 185 101 -371 -428 34 249 435 58
4639 58 -533 -415 275 576 540 30 -229 -266 125 421 406 -224 -656 -426 80 301 94 237 -323 -417 -103 454
4661 454 285 -40 -667 -564 -64 248 465 136 -370 -467 8 265 557 -18 -218 -323 2 250 461 26
4681 26 -566 -516 -175 238 263 263 -121 -319 -280 473 597 404 -193 -474 -346 263 512 96 -79 -577 -249 315
4703 315 435 161 34 -540 -152 74 454 298 97 -203 -343 195 570 193 -214 -332 -61 276 311 242 -171
4724a71n2n1M77l1J8j64k20m17O20M88k40J5m24j02J05M21J23l40m60J07J15K62
4746G9K97l91l14J50R1L05J25l50k53m24M35M69M03m54m91p6L76K81K5l21l18
4767c56NK57L53k34L60m30RJ11kL33j18n92j3J88L06J97j54m05j63J14K01K14
4789A81k4k00l08j9L45M12J16n74k77K49L20J59k92m7m40Q6K35L03J00n33q2O7
4811b23M22J60j18l16j1k53K78M91j68j95k16l28O97K3J15k96l97l9K26N38k67
4832A23m8m64j12L27N78K0n34j78j61L65J09l9N4j80l08L68M96l9j02l52k10K41
4854d6L70Q9j43p02K20J6J97K72l52k1k84K40K90J43J68l74l36J19K08K14n9l8
4876A91n49J08N94O7k14k27j39K21Q7J30q1j38j81r8K21K21j15j88r7K13Q7K15
$$ plain form
4724 -171 -223 -274 203 172 190 26 -194 -611 9 497 257 272 -152 -254 -149 272 395 55 -405 -298 -183 79
4746 79 376 -15 -329 -179 -88 217 342 -8 -261 -685 -250 219 622 168 -323 -399 -23 258 283 -38 -356
4767 -356 -351 -94 259 25 385 -45 -36 75 73 406 288 -304 -317 -129 177 374 220 -185 -348 -234 -33 181
4789 181 157 -43 -351 -370 -25 387 503 -71 -348 -99 221 380 88 41 -399 -313 -78 225 325 -208 -290 -223
4811 -223 199 359 241 -75 -86 -339 -61 430 262 67 -149 -477 220 243 358 62 -335 -374 -148 390 123
4832 123 75 -389 -501 -174 404 424 -110 -288 -449 -84 25 -14 40 -140 -448 -80 416 377 275 -77 -287 -46
4854 -46 324 413 270 -432 -212 -196 1 273 -79 -100 -384 -144 146 289 457 83 -253 -134 74 288 229 191
4876 191 -358 -250 344 411 197 -30 -169 52 139 269 188 50 -131 -229 -8 213 98 -90 -187 26 113 328
4898C28k5k60k47k18N24L19l10j96k85J22K93J77M8L8n63R7K06J74j7l40N2k32
4920c15J85K02J27l86q2J06p4L40J99l21k7l42K74K62K9k05r0J72j54L46J53j90
4942B09j8l10J54J07K26k98j04k65L79l1J91J08l41k25Q1M87qn4l10j45j83L54
4964DL49j45j38j45k03K08L59j31j19k03j76L01M67j48m00M8l4J77Q9k15K11l58
4986b02j64J21M27R6k55m02J91K56n5K25m7m22J13m4M54j84o8j57J02O6K50k2
5008B79l60n0P2j28M14r4j98J2j25j3K51L57k13l99j21J45L73K32l99k99J69Q7
5030hJ14K12l82n7N6O9J8K17j19l55k3K10Q3L70k84j19j66J61j73N13l89L3j24
5053a43J65k4j3J50k00k19K31L0J29J02j35p7n8J32N9K48m80J20l99J57M71K59
$$ plain form
4898 328 303 43 -204 -422 102 421 111 -85 -370 -248 45 222 270 308 -255 -158 48 222 205 -135 -83 -315
4920 -315 -130 72 199 -187 -269 -163 -237 103 302 -19 -46 -388 -114 148 177 -28 -118 54 -100 246 399 209
4942 209 191 -119 35 142 368 70 -34 -299 80 49 240 348 7 -218 -137 350 342 288 -22 -167 -350 4
4964 4 353 208 70 -75 -278 -70 289 158 39 -164 -340 -39 428 280 -120 -72 -106 71 160 -55 156 -202
4986 -202 -366 -245 182 278 23 -379 -188 68 13 238 191 -231 -118 -162 292 108 40 -117 -15 51 301 279
5008 279 -81 -131 -59 -187 227 133 -65 -53 -178 -191 60 417 204 -195 -316 -171 202 434 35 -264 -95 -8
5030 -8 106 318 -64 -121 -65 4 22 239 120 -235 -258 -48 35 405 121 2 -164 -3 -176 337 -52 -19 -143
5053 -143 22 -2 -15 135 -65 -284 -53 -23 106 208 73 -4 -62 70 129 377 -103 17 -382 -225 246 505
5075E05n42j20j6L52M2J5j69k52r9J93J94p8J04j96oQ6M00k58j59J37j77j33L82
5098B05P1k20m3m9k06K81K27o8j41m86M65j04O4J91r2j39J4J02Q9J55n61J15j33
5121b63L79pK57n29M6r1J36M41j72k04l58K74J32j0j7k86k7L06J19J43n3j90q9
5144f3j35K16J28j40o9o7l4K42j38L29k20l28M8K08Q2J70L4n26k1J79J95L0l27
5167b07J09j64R5L28k82J18J18j88k2J92P1n6j10O2j92M8P2n6J67l63k5L57L8
5190A10K2m35J77%J41K05l85Q8k07K48J56k9Knk53L6J80n2J46j41j35N3O2J01
5214H5k2N3o6k45J92J59k38J48j01j92K43l6J31k70J31j67J17J89P1L4m98J43
5236a39M5J97J31k53j37K39J26Qj24j70n5K25j83K05Q7M8l72j65J22L43K5k45
$$ plain form
5075 505 -37 -157 -173 179 221 236 67 -185 -284 -91 103 25 129 -67 -73 13 413 155 -4 133 -44 -177 205
5098 205 276 56 13 -36 -242 39 266 198 57 -429 36 -68 -4 187 95 -44 -30 72 161 316 -245 -130 -263
5121 -263 116 109 366 -163 -117 -208 -72 369 197 -7 -365 -91 41 31 14 -272 -299 7 126 269 216 26 -63
5144 -63 -198 18 146 6 -63 -130 -164 78 -60 269 49 -279 -231 -23 59 229 263 -263 -284 -105 90 120 -207
5167 -207 -98 -262 -167 161 -121 -3 115 -73 -95 97 168 112 2 64 -128 -80 -8 -64 103 -260 -285 72 110
5190 110 132 -303 -126 -126 15 220 -165 -77 -284 -36 120 91 93 88 -165 -129 51 -1 145 4 -131 -78 -16 85
5214 85 63 116 50 -195 -3 156 -82 66 -35 -227 16 -20 111 -159 -28 -195 -78 111 182 216 -282 -139
5236 -139 -94 103 234 -19 -156 83 209 217 93 -77 -132 93 -90 115 202 250 -122 -287 -165 178 203 -42
5258d2nN4j0m5K17p9j35j31mK86q6j52J08J52j54p5J77j00p2qk14L18J01jk14
5283a14j48Q6J20K86k02j67k21J70O2L96j07k72k18K16K11J00lk8l36K5J46J69
5305A71J90k25o0J59k65k3N0K48l13J72k57K32KK06l64L7J58k69m8J35L93k94
5327C5M23p13L64M5J15m66J82mK79k20o18M33L32l75J05K79n41j4L47j54m20j28
5349g14P63M5L04p6l24r44P10j28L65P50r34j11K33k13n32M55M12N8q2j91j22
5370b76N40j12J3j23J13q4j27K06k75M3j36K17Q6j43M1J73J12l22P0Ro0J8N2j42
5394a07L62k96R0j58k4Q8J21p4k09L39k02jO5J44R6Rm36P3J0K72l08L25j57j27
5418a05K04K5k8k52J50o9J84k95qL00j14p9J31j63N3K46l08J08R5j10J9K67j62
$$ plain form
5258 -42 -47 7 -3 -48 169 90 -45 -176 -180 106 20 -132 -24 128 -26 -101 76 -24 -96 -104 -318 0 101 100 -114
5283 -114 -262 -176 -56 230 28 -139 -360 -190 -128 268 161 -111 -329 -113 98 198 195 167 -169 -144 2 171
5305 171 361 136 76 235 -30 -53 -3 245 -68 104 -153 79 81 287 -77 -40 118 -151 -199 -64 329 35
5327 35 458 -255 109 154 269 -197 -15 -19 260 40 -578 -145 187 -188 -83 196 -345 -359 -12 -166 -586 -714
5349 -714 49 94 398 322 -2 -946 -236 -364 1 751 -183 -294 -61 -274 -806 -351 61 119 37 -154 -276
5370 -276 264 152 165 42 155 71 -56 150 -125 -82 -218 -1 85 -58 -17 156 268 -54 16 25 -35 -17 35 -107
5394 -107 255 -41 49 -109 -133 -45 76 2 -207 132 -70 -71 -6 138 234 243 -193 -120 -110 162 -146 179 22 -105
5418 -105 99 124 96 -156 -6 -75 109 -186 -194 106 -8 -87 44 -119 -66 180 -128 -20 75 -35 -16 251 89
5441H9k93K04j24K73j63j11K7Q3J20j59K75k24Q9R5k36J65J06m17L6J50J13k82
5463a84R5K01k6q6R6n9j03J09q6J1p5N7k12J83J50l8j80J19J80K0k20K4pJ64j53
5488b0R4l2j26N4J20l6J5n1j99L65j00k23J37R6l15L20j03k5J61o3M3j85P6K87
5512B90l44J13J61l00K19k5n2k72J74J23J3r7k6J09k3j10J05k66P6J70n8j79m9
5535b48K51k1j2J53l2J67k14J4O1J4k17L51l06J83j07o0j36K30k86J19Q6q4J31
5558C7q6K73k68j87Q9M2P7P4l8J33k69J97J15k04j2o4O0j03K33k45J80j42R7J2
5582Am5m7j7K5r8J82J04k35m7J48k57L76L01l95rk29J29P3M9J3k70J42M34k65
5606F3r0j32J64p6J09mj58K2J87k9N0q6K66k34J48l00MK91j83j9N0q1k9J17k6
$$ plain form
5441 89 -204 0 -124 149 -14 -125 -98 -15 105 -54 221 -3 86 181 -55 110 216 -201 -165 -15 98 -184
5463 -184 -89 112 86 0 96 37 -66 43 -43 -32 -107 -50 -262 -79 71 33 -147 -28 152 172 -48 -24 -31 133 -20
5488 -20 74 42 -84 -30 90 54 69 18 -181 184 84 -139 -2 94 -221 99 -4 -29 132 69 112 -73 3 290
5512 290 -54 59 220 -80 139 114 62 -210 -36 87 100 3 -23 86 63 -47 58 -208 -132 38 -20 -199 -248
5535 -248 3 -18 -30 123 91 258 44 58 119 133 -84 267 -39 144 37 -23 -159 71 -215 -96 -10 -94 37
5558 37 -49 224 -44 -231 -142 -100 -23 51 13 146 -123 74 189 -15 -27 -91 -31 -134 99 -146 34 -108 -11 1
5582 1 -44 -91 -108 -83 -181 1 105 -130 -177 -29 -286 90 391 -4 -13 -242 -113 -40 9 22 -248 -106 328 63
5606 63 -27 -159 5 -71 38 34 -124 -102 85 56 106 20 286 52 200 -100 -96 195 12 -7 43 -38 -67 50 24
5631B4jJ02J3k04K30l68J71pj66K85j19J16q2J82qo1Jm4O5J43l42L8j69K02J0
5656A1k89K29K10k09Q7j45N5q2J20J78j71L23m59J05k9Q6l3Q3k60J82q8J6K13
5679A33j62j8j06l7K67j29k53L65k39R3P2l2K32o18L64j08L60j74J62q5j38J45
5701I4LP2o1k24QK57j38R0j92K24m00K80j62R5J06L1m1n6m0n2K30j37K67j02j08
5726D4N9k19K99j18l10M16k40L2l4J44k1k42M51k03j69K86j74J19j60J45m2l3
5748C0O3j14o2J79j45L7M5k19J23J4j32L17k85j80L02K25j61j63L12j07j22K36
5770A93n9j07O9M4J3Jk70J51o9J08j39K81qm29J12J62J04j84L2O8j09qj21K8K85
5795A48j42j19j46L91j32K05k44O9J9k39L06J0J32k76o0j3O8R1k4K3k30L21q0
$$ plain form
5631 24 23 125 138 -66 164 -204 -33 -40 -206 79 -40 76 -6 176 168 107 108 64 129 272 -70 -32 -201 1 11
5656 11 -278 -49 161 -48 39 -106 -51 -133 -13 165 -6 317 -142 -37 -66 20 -13 70 -190 -8 -96 -80 133
5679 133 -29 -47 -153 -190 77 -52 -305 60 -179 -86 -14 -46 186 -432 -68 -176 184 10 172 87 -51 94
5701 94 97 169 108 -116 -108 149 11 101 -91 133 -267 13 -149 -54 52 83 42 -14 -54 -106 124 -13 254 152 44
5726 44 103 -116 183 65 -245 171 -69 -37 -71 73 52 -190 261 58 -111 175 1 120 -40 105 63 30
5748 30 93 -21 -83 96 -49 -12 33 -186 -63 -49 -181 136 -149 -329 -27 198 37 -126 186 79 -43 193
5770 193 134 27 96 140 153 154 -116 35 -34 74 -65 216 208 -221 -109 53 157 -27 5 73 -36 -44 -165 -137 148
5795 148 6 -113 -259 132 0 205 -39 30 49 -190 116 126 258 -18 -78 -91 -23 68 44 67 -163 158 78
5818G8p8R8j25J7l2RJ09K43o56L52j40J19N9J44n8pk8l0k81K40Q0j83RkL82m11
5844i2J0K65l97k0J36J6J67j40r5L08l5j44o7j15L4J22j62K17m2k9J45l48L55
5867H9J09q4j11k7Q2j77k0O9q8l4J57J39j3P9Q1j48k33J71J98k05k08L21k14K0
5891d7p1J90o2k77PL10K64k03P4m54J22R7K77NO7k90q7L48j94j9Q4l17L8J0K3
5916a05L32k17k19J82J10R6k35n9J43j15R9oJ61l64l0K18J43k0j96J38l9QJ12
5939A37MJ89n80M36l11j26M51J10j35j01j88K15k94K65j7k87J62J91p1l8J16j85
5961e7j65j03L59J78r7j60j90K3M17K9j81m4K7n2P8N2J59m69J31K94k72J63j16
5984Dn0J86J02m0Kn4l42J30N5k9J60k45J86j71N3j1O7j81K15l12K30P9J50j19
$$ plain form
5818 78 0 98 -27 -10 -42 -33 76 319 -337 15 -125 -6 53 197 139 132 104 74 -207 33 113 -70 -61 -63 319 -92
5844 -92 -82 183 -214 -234 -98 -82 85 -55 -150 158 123 -21 -88 -203 -169 -47 -209 8 -34 -63 82 -266 89
5867 89 198 114 3 -24 58 -119 -139 -70 -158 -192 -35 104 91 170 251 103 -130 41 239 34 -174 147 -67 -47
5891 -47 -118 72 10 -267 -260 50 314 111 185 -269 -147 -50 227 232 299 9 -78 270 76 57 141 -176 -138 -128 -105
5916 -105 227 10 -209 -27 83 179 -56 -115 28 -87 12 6 167 -197 -227 -9 134 114 -82 56 17 25 137
5939 137 141 330 -250 186 -125 -251 200 310 175 74 -114 101 -193 72 55 -232 -70 121 50 12 128 -57
5961 -57 -222 -325 34 212 115 -45 -235 -212 205 234 53 9 36 -16 62 114 273 -196 -65 229 -43 120 4
5984 4 -46 140 242 202 204 150 -192 -62 -7 -36 124 -121 65 -106 -53 -64 3 -178 37 -275 -45 34 184 65
6008F5l8O2k11N8M4J75o5j63k10mM61o1q8Q2k33K73J6n0q0l8N5P5J0J8q0k34J75
6035A4J26j71K77k22k94L01r8n5K79j81Q8j52J77K35l80J44k18k30L75J04j83
6056f4Q5j03LR5K0J57k81p0j28R5K07J50k80L53m50j4K03K4K45k84N5m8m0L58
6080B88j46l31K3J22L1J03p1N6j60j46N1K68Rn3p1k04K66K91j55j95l28M30r7
6103a9J11k1L5k26k4m4M65Lj22k66J68j42K59Rj48Qk42Q9K58L0j20k70J68J91
6127A50J59j83k67J07k48K38o9K60j32n2j65K25p4J24L36n89P0j80M37M9j46j36
6149h6m3K5K74j75J00o3j43l0J41J09k4p4l03K12M3J14R2J01m69R5r3M54j62l97
6173c02J77l28N00k6J76k39j71M1R7J70J6j31j66P4O6R9n1J06k58q9K20J19nJ75
$$ plain form
6008 65 27 89 -122 -64 -20 155 90 -73 -283 -287 174 113 25 107 -126 147 163 113 33 -5 50 125 135 153 73 -161 14
6035 14 140 -31 246 24 -270 31 -67 -122 157 -24 64 -88 89 324 -56 88 -130 -360 15 119 -64
6056 -64 21 -82 -79 16 36 193 -88 -158 -286 -191 16 166 -114 239 -211 -225 -22 2 247 -37 18 -30 -70 288
6080 288 142 -189 -166 -44 -13 90 19 75 -85 -231 -180 88 97 44 -27 -231 35 326 171 -24 -352 78 -19
6103 -19 92 71 106 -120 -144 -188 277 280 158 -108 60 -82 177 186 38 46 -196 -107 151 181 61 -209 -41 150
6127 150 309 126 -141 -34 -282 -44 -113 147 15 -37 -202 23 -51 73 409 -180 -110 -290 147 196 50 -86
6149 -86 -129 -104 170 -5 95 32 -111 -141 0 109 85 11 -292 -80 -37 77 169 270 -199 -104 -197 257 95 -302
6173 -302 -125 -453 47 21 197 -42 -213 -172 -75 95 111 -20 -186 -112 -46 53 2 108 -150 -239 -19 100 95 270
6197B70m07j0J21q8K40j70k25k7K59LJ13q7j22J24k89N28L9n8m56J03K72l7k4
6220G2j7K3k42m2K81n8N2l37O2K2Q5K74l3k77K45l61K33K93m17J25J82m27J16
6243a46J32K39l26J24k13J75Q8k5J2k75lM4K71m1l18K9L01J2J1P8k43m7L6J18
6267C3O0K3r6o0J43l00L79K03k43k45j53L49k07L92j0j96l49K59P7K5q3J53k95
6290a41p5M20O4j83l74K00J08j05L29k57j8J7p3J10L03k26m29L68k2J83l68J1
6312a58J52K39k33R6j66J68j58N3j37J53r6Nj9J34P8j41K33j04m21L42j05L0K99
6335B44j79J99o21M74l11K74l1J69l76K62m04N10O2j69j92r5P8J68L37m58J19
6356F0k9Q3n6N8J6n8o17M90j08L31j8j23j12m5K31J26k8m29L2n2K31K76l10K25
$$ plain form
6197 270 -137 -147 -26 -114 126 -44 -269 -296 -37 -34 79 -8 -130 -6 -295 233 272 214 -242 -139 133 96 72
6220 72 55 78 -164 -206 75 17 69 -268 -206 -184 -99 175 142 -135 110 -251 -18 275 -142 -17 165 -262 -146
6243 -146 -14 225 -101 23 -190 -15 73 48 60 -215 -218 -174 97 56 -262 -233 68 80 91 169 -74 -121 -85 33
6267 33 93 116 20 -40 103 -197 182 385 142 -103 -256 93 -114 278 268 72 -277 -18 59 84 1 154 -141
6290 -141 -216 204 268 85 -289 -89 19 -86 243 -14 -32 -15 -88 22 325 99 -330 38 16 199 -169 -158
6312 -158 -6 233 0 96 -70 98 -60 -7 -144 9 -87 -82 -101 33 111 -30 203 99 -322 20 -85 -55 244
6335 244 65 264 -357 117 -194 80 49 218 -158 104 -300 210 272 103 -89 -184 -106 62 399 -59 60
6356 60 31 114 58 116 132 74 -543 -53 -161 170 152 29 -83 -128 103 229 201 -228 -196 -248 -17 259 -51 174
6380A74l03L01k20P7r9L2lJ08j3J04J70k71J70n34K70K19K0K5m3l19K60J31j97
6403E9q4k75L72j71J16Q6j44m8n3J26J34j38j42N4K85j47q5O6J3j11j91K71R1
6426H4j76J29R0j79J64j45L11l17L1J8l01J69J53j58J75k31L68L4k05p3K8r5K49
6449A23l0OL1m7Mj62j6M47l33k5J3j79L19p6J44k05j96K92J2l5k3J99n87J65L12
6474A53J25m23J62r7j21M39k12R3k81PJ46N9J5K18m51j28K88J66Q8J9k02j55p5
6497a67K05J28k12J25j22M2p6K85o2q9K4p1k2J12K28l39M3mJ17l28K90K9k56J52
6521C2P3r1J44J43j91j20r0J10J55L1k72J56k6N4k86L03q7k50K03n0J19K24k72
6544A2k51J93K10J60k89k2j79n2L35R4m7j37j33j02K09R4r4j77J66k47K51K4j13
$$ plain form
6380 174 -129 172 -48 29 -70 -38 -41 67 54 158 328 57 227 -307 -37 182 202 227 184 -135 125 256 59
6403 59 -25 -300 72 -99 17 103 -41 -89 -142 -16 118 -20 -162 -108 177 30 -55 11 24 -87 -278 -7 84
6426 84 -92 37 127 -52 112 -33 278 -39 -8 10 -291 -122 31 -127 48 -183 185 219 14 -59 -31 -126 123
6449 123 93 99 130 83 87 -75 -91 356 23 -2 11 -168 151 75 219 14 -182 110 122 87 64 263 -324 -159 153
6474 153 278 -145 17 -80 -201 238 26 119 -162 -155 -9 50 65 283 -168 -296 -8 158 246 265 63 -92 -167
6497 -167 38 166 -46 79 -43 -1 -77 208 146 57 81 10 -12 100 328 -11 32 28 145 -183 107 136 -120 32
6521 32 105 14 158 301 110 -10 -100 10 165 196 -76 80 54 108 -178 125 38 -212 -9 -59 60 284 12
6544 12 -239 -46 164 324 35 13 -166 -218 117 211 164 27 -106 -208 1 95 1 -176 -10 -257 -6 18 -95
6567i5J4j18J57p4J10L88p8l58o6j18K95n4K63l80J1kK34r1M1k94j39K87L33l22
6591e6L84k83M0P8p6K68k94r9j70J88m4K43r4Q5l22J84Q0k49NL2p8J94O3m8M9
6616H0j51k12K16K1K21N5j83j14j55L13J8n7J42k44n1k3k8K30j62r0o1M70j49
6639H6j29O1l90K89j88M21J25l99j39K26pQL49m75Q4J86k90K27j68K51o1k79J46
6662f6K17q8j31K38P4o5q5r8J26k14J48n9K33L3k00o6k48J72K10P0J82l63j8q8
6686h6J55J62j37j44k56K81J88l09K26j74Ql6K48J12j53J3k85K8M04o9o3j64J11
6709F0j05k08K59jl8m3k3J25%M5j12k25j04N54k2qm22L35j75q5L91j90q7k34J41
6734a72J71J22o1P5j01l8j29M88o3j92j51o6K29p3K9Oj64J06j68L43l7J94k70
$$ plain form
6567 -95 -81 -199 -42 -116 -6 382 304 -54 -120 -238 57 3 266 -114 -103 -105 129 38 79 -215 -354 -67 266 -56
6591 -56 328 45 85 163 87 355 61 -38 -208 -20 -64 179 85 170 -152 32 112 -137 -132 -100 -178 16 79 31 80
6616 80 -71 -283 -67 -46 175 230 47 -67 -222 91 109 52 194 -50 -101 -124 -152 78 -84 -174 -235 235 86
6639 86 -43 18 -372 -83 -271 150 275 -124 -263 -37 -44 -36 313 -162 -78 108 -182 45 -123 128 67 -212 -66
6662 -66 151 63 -68 170 244 179 94 -4 122 -92 56 -3 230 263 63 -3 -251 -79 131 201 383 20 2 -86
6686 -86 69 231 94 -50 -306 -25 163 -146 80 -94 -86 -122 126 238 85 98 -187 -159 245 176 113 -51 60
6709 60 -45 -253 6 5 -33 -76 -99 26 26 71 -41 -266 -370 184 162 154 -268 67 -108 -193 198 8 -79 -313 -172
6734 -172 -1 121 60 135 34 -4 -133 355 292 100 -51 -117 112 39 68 74 -90 16 -152 191 154 348 78
6757G8k81J6m1M40k21j45P2n5K58k00PJ66j90Q8J87j06q3j21J2K50j60K29p4j60
6781c4k17L96k53K80l86K7j50M43j2LJj32Q4j96K31J95l40J8k07j3J22M18j82
6804I6m2q3j86L41J56l60R4j12J46k16K69J42j37k35L0R4j43M25k83plr6J49J04
6828A43J41j104L01N29j33J59L7l65J82N4K08k10N8j11j76O3L54j20J63N3K2n23
6850b75L67kl3j51N4L54l63Q9j49OJ2K37j42L61k17j94j44K24J6Qm5J45k94K36
6874A00j14J06J78k77J2n6mJ23k86K33J72j79j7J52j1j64j37m3l2K61J84j64j1
6897B6m79Q87l50RM5k25Q9P5j22R7K18k65k74L33Q9j39l0j12O2o4O9L75l52j27
6921a65R5Q4k0J41l16K47j22j29J70J83j62O4j37O9j05J62qj5j24l32K24L81M9
$$ plain form
6757 78 -203 -187 -228 212 -9 -154 -82 -137 121 -79 -72 94 -96 -8 179 73 -10 -131 -119 131 -29 200 126 -34
6781 -34 -251 145 -108 172 -214 -187 -337 106 94 97 98 -34 50 -146 85 280 -60 -42 -249 -262 -140 278 96
6804 96 54 -29 -215 126 282 -78 16 -96 50 -166 103 245 108 -127 -97 -3 -146 279 -4 -11 -14 -110 39 143
6828 143 284 -820 -519 10 -123 36 73 -292 -110 -56 152 -58 0 -111 -287 -224 130 10 173 226 248 -275
6850 -275 92 90 57 -94 -40 314 -49 40 -109 -103 -91 146 4 365 148 -46 -190 34 50 58 13 158 -136 100
6874 100 -14 92 270 -7 5 -51 -55 68 -218 15 187 8 -9 143 132 -32 -169 -212 -244 17 201 37 26
6897 26 -453 434 84 93 138 -87 2 77 -45 52 270 5 -269 64 153 14 -16 -128 -66 -130 -61 314 -38 -165
6921 -165 -70 14 -6 135 -181 66 -56 -185 -15 168 6 70 -67 2 -103 59 51 36 -88 -420 -196 185 234
6944B34l97M8j86J94J09L42m77J46j14N2P6R0j20J8j80J21K37j82j92j2K20n8
6966c1PJ93j10j12L2j37J42Q2N6j21j56L1O2j11K52l12J06K17POr9p6K11j44m2
6991d7J07q7j26j02K29Q0L4j75J21M9o3k41L36Rj05Q8j24k4R7k9l5j24J24J8J
7016A1m0l89L21k6Q5K23j81L4j14M7K03m3P2P5k64J5j17L03j39j59M9q1K53Q1
7040B19l97K80k57k6O0K07Q9k40k1J29p8M2J1M8k79P4K53l5l33L48k09K70K2j36
7064D1J7o3l3j36R7Q9J89L4j87k13K86j76k3L71l74l54L38L6K50j99l0J14j71
7087i7j9L78k28k41Q8K9q4J83rm7k40K05J13J21Q4k32l14L64k47K47J7k07k4P1
7111h9N8M4R6j05q7m4J38n3M1r0J34r0R9N1J33m68P9N6K74k4J66m02q3M3k0M25
$$ plain form
6944 234 -163 -115 -301 -107 2 344 -133 13 -101 -49 27 117 -3 15 -165 -44 193 11 -181 -193 27 -31
6966 -31 -24 169 59 -53 -21 -158 -16 66 122 1 -155 -124 -62 -173 79 -233 -127 90 97 103 4 -72 139 -5 -47
6991 -47 60 -27 -153 -255 -26 54 88 -87 34 83 20 -221 115 124 19 107 -17 -41 56 27 -8 -132 -8 10 11
7016 11 -29 -418 -97 -123 -38 185 4 38 -76 -29 174 131 203 278 14 29 -88 215 76 -83 -34 -115 138 219
7040 219 -178 102 -155 -181 -121 86 175 -65 -86 43 -35 7 18 66 -213 -139 114 79 -254 94 -115 155 177 41
7064 41 58 -5 -38 -174 -77 12 201 235 48 -165 121 -55 -78 293 -81 -435 -97 -61 189 -10 -40 74 -97
7087 -97 -116 262 34 -207 -119 -90 -174 9 0 -47 -287 -82 31 152 236 4 -310 54 -193 54 71 -136 -160 -89
7111 -89 -31 13 109 4 -83 -127 11 -42 -1 -91 43 -47 52 103 236 -232 -153 -97 177 153 319 -83 -166 -123 -143 282
7137B82k57J59j39j69K44N5j13j10L9j13LK48K33n07K18k48J58Rp2R3q7k93K21
7160a46M13j39l40J18k91M09%J32k69o4j14J22L30J22l57J0j6j81M77j55j80J0
7182a09m1K8J27K42n2j41Nq2k20K78j60K36j38Q6K93j89k24j0J25j35%r3K95l57
7206b36j15N28m9lk20P8j39nJ95L34l03l8N1j62J10J73k19L76m43o4L62o5l8j35
7230b7j72K23K1J40j32l6p2L3P7k66K00OJ01j18NP9n7l16K80k11K71q4j28R9j07
7255a91R2K53j42R4p3M2j38J36J8L5O6k88pj08M99k85K61k78r9M1L0jJ63K9k45
7280i6J00r4L18j62j27k8q0J42O8K6J4k21M3J08n6K46k83N4o5N6K07J8k87K9r5
7305a65J56J07Kk42l0K0K93k37L96l03k32L04k73K22l11M29k7l58K07J74m1j76
$$ plain form
7137 282 25 184 45 -124 120 175 62 -48 -9 -122 -119 129 362 -145 73 -175 -17 -8 -80 13 -74 -367 -146
7160 -146 267 128 -212 -94 -385 24 24 156 -113 -177 -291 -169 161 283 -74 -64 -80 -261 216 61 -119 -109
7182 -109 -150 -122 5 247 195 54 59 -23 -243 35 -125 111 -27 59 352 163 -61 -71 54 -81 -81 -174 121 -236
7206 -236 -351 177 128 125 -95 -17 -156 -161 34 368 65 27 78 -84 26 199 -20 356 -87 -151 211 146 108 -27
7230 -27 -199 24 45 185 53 17 -55 -22 55 -211 -11 -5 96 -22 -17 62 5 -311 -31 -242 29 -55 -183 -84 -191
7255 -191 -99 154 12 106 33 75 -63 73 91 126 192 -96 -103 -211 288 3 264 -14 -113 -72 -42 -43 120 149 -96
7280 -96 4 -90 228 66 -61 -89 -169 -27 41 67 81 -140 -97 11 -45 201 -82 -28 -93 -37 170 188 -99 -70 -165
7305 -165 -9 98 100 -142 -172 -152 141 -96 300 -3 -235 69 -204 18 -293 136 109 -249 -42 132 91 -85
7327h5j33K75j30K54l4q2q3L44j57l14K93k5l91K57j58K71r8N6j74L9k9J08Q4
7350H8l08K28k9j57L47J11m14o9MK02M5k2L30j72k60K0M9K09L6n38L57k5j88N1
7374a05O3j01p8N5J50L30m52J64k06Q6M4L09n9j55q0r3m5K23N6m11K00j71M32
7397A56l40M01m20K69N3j33J25j54K90j66k6j1J68k17k6N3r8K35jk22J88k44n9
7420a79L68k7l2l6j61j31O3R3L16k79oJ03k23M6L80l09J13r5N4k34P4K37j30q9
7444h4k13L17j25k27K73N6Op7J94j42k52M58l27J90j71L31l42l4J22n4Q0J86k25
7467f0q5J21J64j24k14J87p9J1K71j22K36o25K48M40o5k61n19M65l8N69n13K1
7489B8j61M09k35j95J75J82j56L7m34j8J15L76j3r1r6J98j02L48j95k74J36j52
$$ plain form
7327 -85 -218 57 -73 181 147 65 -18 326 169 -145 148 123 -268 -11 -169 102 4 60 -114 -75 -104 4 88
7350 88 -220 8 -21 -178 169 280 -134 -203 -199 3 48 26 356 184 -76 -56 -7 202 238 -300 57 32 -156 -105
7374 -105 -42 -143 -221 -166 -16 314 -138 26 -180 -94 -50 259 200 45 -35 -128 -173 50 106 -305 -105 -276 156
7397 156 -184 217 -203 66 119 -14 111 -43 247 81 55 44 212 -5 -31 22 -76 159 158 -64 124 -120 -179
7420 -179 189 162 130 94 -67 -198 -135 -42 274 -5 -11 92 -131 -85 295 -14 99 4 58 -176 -102 135 5 -84
7444 -84 -297 20 -105 -332 -59 -3 3 -74 120 -22 -274 184 -143 47 -124 207 -135 -169 -47 -101 -21 165 -60
7467 -60 -145 -24 140 16 -198 -11 -90 -79 192 70 306 -319 -71 369 304 43 -476 -11 -49 520 7 28
7489 28 -133 276 41 -154 21 203 47 84 -350 -368 -253 123 110 19 -77 121 19 367 172 -102 34 -118
7511a18J30O5L0k17J38k72O7K57n0p9L7N6k13j43L37j29K02k07M3K27mp5k66M
7535a80k3K23J80o1j91K25j79p6P9O9K25k46j90R1J60M4l89J84j2J28j7q7p5o4
7559a82M98m89K81j18K04k26J34k05J72J0rr0o5J95k14J0J7J67r3J28k66J10J48
7582A17j96m4Q2K1J01j55K9p3j11L99r9J0j19J28j06O7K81m6k73r9J81k3qj79
7606a15K3J26k44J75J0Q3l18J96O6j00Q3L12k22q6n1J66j86K03j27L1j14Q1K71
7629B63k95J37l19J12J3M0J84k03l6J60p1j54R3M15l20J26P0j46n0o3j03Q0K18
7652A51n8N1k75K27J67m23J70j7J08m1j74L62k38r8j31L82k00j36K74k8k44nj28
7675c04O7K79J74j95j13J94n1l5K4K09j84j16q7J57j3j54J45R4K0o6J36j24m2
$$ plain form
7511 -118 12 77 107 -110 28 -244 -177 80 30 -49 -12 44 -169 -312 25 -104 98 -109 -66 161 157 82 -184 -180
7535 -180 -203 20 200 139 -52 173 -6 -82 -3 66 291 45 -145 -54 106 150 -239 -55 -67 61 44 -43 -118 -182
7559 -182 316 -173 108 -10 194 -32 102 -103 69 79 70 -20 -85 110 -104 -94 -77 90 -3 125 -141 -31 117
7582 117 -79 -123 -41 -20 81 -74 -45 -118 -229 170 71 81 -38 90 -16 51 332 286 13 -86 95 72 64 -115
7606 -115 -92 34 -210 -35 -25 58 -260 -64 2 -98 -15 297 75 -11 -62 104 -82 121 -6 25 -89 -8 263
7629 263 -32 105 -214 -102 -89 -49 135 -68 -104 56 -15 -169 -76 339 19 145 215 69 19 -44 -147 -67 151
7652 151 93 144 -131 96 263 -160 10 -7 101 60 -114 248 10 -88 -219 163 -37 -173 101 73 -171 -176 -304
7675 -304 -237 42 216 21 -92 102 51 16 40 249 65 -51 -138 19 6 -148 -3 91 111 45 181 57 15
7698A5Oj36M24j66k13J08j62oJ48Q3l5O6j62r2J59k93L43p6o6J79q9j35J80k20
7722a40K61n4k60L67KK40o85L2J68J99j97j48P2M5r6K27J41j60j76J76m6K06j55
7745A9J9k10o9L23j03k02J5J84J00L5M6j9j27p5R1l2L7L2J07l56J65K9j44K32
7769I7q8j46r7J82L06k10k59M52l41j3K53J20k39k19K6K27k27R3l6K30k88N1J10
7792a6j55K26j05P6j93K30nj33M26l40K4o9J22l30L24J9j37M6J43l29J88j17j34
7815b39J37j4P2j0J97j36j93J78n6j05J7qL10j70K78k98r3J18J11L1L5k35k60
7838c33M23j47M1k07KJ82j45K08J0m3J31k74K62j24J88M5k75J37j27K3o8K63K1
7861A93k35J31o5O6J4j97K9n6P3J1K24j77l29M91j36J92l76J93K1k24K57M8k22
$$ plain form
7698 15 21 -115 309 143 -70 38 -124 -130 18 101 66 132 -30 -122 37 -256 87 11 -55 124 35 -100 80 -140
7722 -140 121 67 -193 174 176 416 -269 -237 -69 130 -67 -215 -143 -98 -194 33 174 14 -162 14 -32 174 19
7745 19 38 -172 -241 82 -21 -223 -208 -24 76 111 157 138 11 -64 27 -5 32 64 171 -185 -20 9 -135 97
7769 97 9 -137 -234 -52 254 44 -215 237 -104 -117 136 256 17 -202 -176 51 -176 -83 -119 111 -177 -126 -16
7792 -16 -171 55 -50 26 -167 63 58 -75 351 11 35 -34 88 -242 82 101 -36 10 153 -176 12 -105 -239
7815 -239 -102 -116 -44 -54 143 7 -186 -8 -64 -169 -152 -160 150 -20 258 -40 -133 -15 96 127 162 -73 -333
7838 -333 90 -57 -16 -223 -221 -39 -184 24 34 -9 122 -152 110 -14 174 219 -56 81 -46 -23 -91 172 193
7861 193 -42 89 24 90 104 -93 -64 -120 -47 -36 188 11 -318 173 37 229 -147 46 67 -157 100 148 -74
7884g4J10O1j03J05J0R3l15J95j30j15J41p1J06J64r2m2J26j25j99J01r9J4n3
7907a92j66K10J71J5l6m1K20q9j30O2k68J66JJ2Q2j46K26j84J49m0j7O0k12J7
7931a30O5Q5M8q8K40k48k33L61N1k56J31K35k14r4o1KJ64k06LJ82l2J2k8p5J90
7956A04J28k21J66l53N0l4P7L7J33n51N68j28j17K10L7j30n6J12j16R8j84K78
7978A08K2Kj90J47j21l06K20M73j50j71l8j24J62m0k28K10Nk68j8K70O3J5K03
8001B46p8j92J64j76R1j25J14j80N2J73j39J33k32P4m3K63k11j06K60r8j86L19
8023A23M8p9k48Q8J21r3PK79m56L89m32N03j64r8m8j52K71j58J08J01J0l80J50
8046a10K46p8j0Q4Q9l38K38p6p8J76p9p2L1J32k43K92k06J27l26K30K16l45L25
$$ plain form
7884 -74 36 97 -6 99 109 202 -113 82 -48 -163 -22 -93 13 177 85 43 169 44 -155 -54 -153 -139 -192
7907 -192 -358 -148 23 38 2 -39 181 92 -38 24 -244 -78 -77 -65 17 -129 97 -87 62 22 5 65 -147 -130
7931 -130 -65 20 68 -20 220 -28 -261 100 151 -105 26 261 47 -47 -108 -106 58 -148 -145 37 5 17 -11 -86 104
7956 104 232 11 177 -176 -126 -160 -83 -46 87 -464 104 -24 -141 69 106 -24 -80 32 -84 14 -170 108
7978 108 130 132 -58 89 -32 -338 -118 355 205 34 -4 -128 34 -6 -234 -24 -19 -287 -305 -35 28 43 246
8001 246 168 -24 140 -36 55 -70 44 -136 -84 89 -50 83 -149 -75 -118 145 -66 -172 88 -10 -196 123
8023 123 171 92 -156 -68 53 -40 -33 246 -210 179 -253 250 86 -12 -60 -212 59 -99 9 110 120 -260 -110
8046 -110 136 58 48 132 221 -117 121 45 -33 143 64 -8 23 155 -88 204 -2 125 -201 29 245 -100 225
8069B25l88L33j19P8j85J42k44k5L44j06mk63J02j98L65J1%j89O5o3L7K58l00
8092a24J28k99j1L81L8Q0j94J5K2n7K0J09J68l08j92K97n0k93K71r1Q0P4k82N10
8116B92m85P2J19r1P8n6J09j32N6J43o8o2q0Q6q7L0J59r0J0j16K33Q0j10j21K14
8141A83m0j15j43M5J81j72q8J59K28m48K44Rk40K40q1J17J20j32k13O5j73J98
8163e6k0N0M7j0r1J89N9l0J65l58k0K02j1k80p7M0J13K01K2j37M3r3j46P4M61
8188C37k61r6J14
$$ plain form
8069 225 -163 170 51 129 -56 86 -158 -183 161 55 51 -212 -110 -308 57 68 68 -121 -56 -119 -82 176 -124
8092 -124 4 -295 -306 75 113 193 -1 14 36 -21 -1 108 276 -32 -224 73 23 -270 1 -90 -10 64 -218 292
8116 292 -193 -121 -2 -93 -15 -71 38 -94 -38 105 37 -25 -105 -19 -106 -76 83 -7 3 -113 120 200 90 -31 183
8141 183 143 28 -115 -70 111 -61 -149 10 238 -210 34 43 -197 43 -38 79 199 67 -146 -81 -254 -56
8163 -56 -76 -26 21 11 -80 109 168 138 303 -55 -75 127 116 -164 -241 -201 -88 113 135 -2 41 -52 -198 -124 337
8188 337 76 -20 94
8191I4
$$ Imaginary data points
##PAGE= N=2
##DATA TABLE= (X++(I..I)), XYDATA
0@%%%%%%%%%%nRj2J6j6K4l2M0m8N6p2Q8j04J20j41J65j92K24k60K99l42L91m45
33b37N06n74O46p28Q21r18J027j147J274j414J570j739J922k123K344k587K850
50A493l138L458l810M199m635N122n670O295p012P845q829J0012j1461J3291j5686
65h526J8968k3777L1614m7250J34018l01470k5103K62241j73330L13051J49430
76C29866m41630j28561J92634j287J90183P3148k74619j40942N4822J13114K41647
87B08375j4489k28490r8980m1585J12130K85368k6861k02659q2349r5198R9160
98h5578K84369m6455j81396m6856j12745P4282L15110j5337k19246m5360p0826
109a50038J8020K85916Q7795k12974j29164k7651L3668J69393J15446j05820j99159
$$ plain form
0 0 0 0 0 0 0 0 0 0 0 0 -5 4 -8 8 -8 16 -16 24 -24 32 -40 48 -56 64 -77 88 -104 120 -140 159 -183 208 -237
33 -237 269 -305 341 -387 434 -484 543 -604 670 -744 826 -913 1009 -1114 1230 -1357 1493
50 1493 -1645 1813 -1997 2202 -2433 2689 -2981 3314 -3698 4147 -4682 5330 -6131 7160 -8526
65 -8526 10442 -13335 18279 -28971 105047 -196423 -221526 40715 -132615 180436 329866
76 329866 -111764 -240325 -47691 -48978 141205 214353 -60266 -201208 -146386 -33272 208375
87 208375 193886 -34604 -133584 -175169 -63039 222329 195468 -7191 -89540 -184738 -85578
98 -85578 198791 152336 -29060 -75916 -188661 -114379 200731 185394 -33852 -79212 -150038
109 -150038 -132018 153898 241693 28719 -100445 -128096 -94428 74965 190411 84591 -114568
120a14568o4159J24617J30905M8839k2690j76435j45519J44264J89097J7724k3039
131A09036j21364j80789P9522K13546L4173m4764r2681j63047L6045K03569N5440
142A28686n7374q9528j38241J5841J98228R6521n8269j02779j19229j2288J59796
153B1364J32366l3687j24564j08540o047J10466J23782P592j34600j25176K4486
164a12558J09820J00956L6749j14652j57490J4691J24589R2672M1014q0123j63365
175a07697k3692J20260R2719K8316o2546j43916m2336J12950J09217K5557o6044
186D2788j29001n1556R4759J30077M3628p0989j21034n9172O0201J25861O2178
197A27740p1353j16846n0336M3443J11889P6083o4962j24131m5664M5284J08288
$$ plain form
120 -114568 -178727 -54110 76795 125634 102944 -73491 -219010 -74746 114351 132075 109036
131 109036 -12328 -193117 -113595 99951 134124 89360 -3321 -166368 -130323 73246 128686
142 128686 71312 -18216 -156457 -140616 57612 154133 95864 -6915 -126144 -138432 21364
153 21364 153730 120043 -4521 -113061 -119108 -8642 115140 122732 -11868 -137044 -112558
164 -112558 -2738 98218 134967 20315 -137175 -122484 2105 94777 135791 55668 -107697
175 -107697 -131389 -11129 81590 109906 47360 -96556 -138892 -25942 83275 108832 42788
186 42788 -86213 -137769 -43010 87067 130695 59706 -61328 -120500 -60299 65562 127740
197 127740 56387 -60459 -110795 -67352 44537 120620 55658 -68473 -114137 -68853 39435
208C9435Q9708m7598j29354o0452L6527J00711Q9966k9689j18948p3694K5708
219g7680R6271Q1927k4181j05828p8423K0377J04967Q7449j9826r7284q6220L211
231i5240J05243R6513j2626q7907q7741j4599R1828R5504p413q1765q4549j6514
243i9266Q7279R8355K060p9351r0384k0980Q4384J02404J6641p0314r6281l3324
255i8777P2942R5053K3061n9057r5777l7912O8861R1989K5831n2289r6657m2539
267a05271O8245R6883L5825m3681r7688n4395N5648R3668M2252l4855r2907n8994
279i5270M4951Q8237M4141l0823q9695n9548M1094R1114N4140k5552q8860o5169
291i1240K9022Q8010O2669j7052q4489o8260J6265P8240O4855j3310q0835o5482
$$ plain form
208 39435 129143 81545 -47809 -108261 -71734 28977 118943 89254 -29694 -103388 -77680
219 -77680 18591 100518 76337 -29491 -107914 -87537 17430 104879 85053 -12231 -98451 -95240
231 -95240 10003 106516 93890 5983 -81758 -96357 -4529 90975 83562 1797 -82752 -99266
243 -99266 -11987 86368 88428 9077 -81307 -102287 -17903 84501 101142 30828 -65453 -98777
255 -98777 -25835 69218 92279 33222 -62555 -100467 -31606 60383 86214 33925 -62732 -105271
267 -105271 -37026 59857 95682 52001 -45687 -100082 -44434 49234 91486 56631 -36276 -95270
279 -95270 -50319 37918 82059 51236 -38459 -98007 -56913 34201 88341 62789 -26071 -91240
291 -91240 -62218 25792 88461 71409 -13080 -81340 -65075 13165 78020 64710 -16125 -81607
303h1607J1770P6524P1491p820q0039o7874M499P2825P9157K102p5952p0757o363
316g2044O2032P7812Q100p0716o9180r358N6731P8427J3540o8229p0802j2571
328g6258N4852Q2079K3936o2123p5146k0923M5845P8674L0818n4231p5092k5117
340g2686M0647P3887L3289m8019p5641k8297M1179P5453L9371l9904p6929l7699
352g5349L5487P4438M3030l1196p3425m4466K7026P0511M3133k7170o9091m5527
364g2599K3237P0949M8611k1822o9350m8670J6507O9167N5809j4357o8420n1529
376f2467R555N9735N6446o662o6888n3435R708N6097N5577J465o4395n9751Q116
389e6899N6545N6257J0008n7006o6872q82N4495N3504J2677m7549o7180r350N2797
$$ plain form
303 -81607 -69837 6687 78178 70358 -9681 -77555 -73056 -231 78926 81028 5076 -65681 -72044
316 -72044 -10012 67800 75900 5184 -63996 -73354 -16623 61804 75344 7115 -63687 -76258
328 -76258 -21406 60673 84609 22486 -52660 -73583 -27738 50936 81754 27523 -47569 -72686
340 -72686 -32039 41848 75137 27118 -48523 -76820 -35641 39812 79183 39279 -37650 -75349
352 -75349 -39862 34576 77606 46410 -27015 -71481 -44455 26056 69189 42019 -27072 -72599
364 -72599 -49362 21587 70198 48376 -20974 -69644 -53137 16030 71839 57482 -10938 -62467
376 -62467 -52912 6823 63269 56607 -10281 -63716 -54008 2089 57666 59131 -5264 -65015 -56899
389 -56899 -354 55903 65911 8905 -57967 -58849 -4354 49150 61827 14278 -52902 -62252 -9455
402i455N5756J0992m3829o2846j6538M9685O3943J5593m3933n9341k2774L7761
414b4986O7614K4257m4773n7113k1641K5844O3252L3659m4094o1051j7424K3917
426c2539N8555M2309l6216o7734k1556K4810N3163M4693k3602o7619l2038K4038
438c3736N1456L8250j5374o0289m1210K0863N8852L5575j6239m9379m6884Q668
450d9447O6635M1921j9728m1996m4748p532O3319N1789k2340m2246l5959j5069
462e5401N3203O1266j7683m9154l2383j2739M3273O4987l018n3037l9210q650
474d8546L6482N6946J0115m6431n0062p748L8561M6776J3670l3977n7662j4852
486e6728M7185M5281J0730k2437n6856k9042M7902N1370O939j8016m7672l8105
$$ plain form
402 -9455 46301 57293 13464 -49382 -65920 -16235 47708 63301 19368 -39973 -62747 -24986
414 -24986 42628 66885 22112 -35001 -56642 -30798 32454 66113 22019 -39032 -56456 -32539
426 -32539 26016 68325 32109 -35625 -57181 -32371 20792 65485 41883 -25736 -57774 -33736
438 -33736 17720 55970 40596 -19693 -60903 -40040 18812 54387 38148 -11231 -58115 -49447
450 -49447 17188 59109 39381 -2615 -47363 -54895 8424 60213 37873 -4373 -40332 -55401
462 -55401 -2198 59068 41385 -7769 -40152 -52891 -9618 55369 52351 -686 -39896 -48546
474 -48546 -12064 44882 54997 8566 -41496 -49244 -10683 36093 49763 15786 -41876 -56728
486 -56728 -9543 35738 46468 24031 -32825 -61867 -13965 37405 44344 26328 -21344 -59449
498e9449L6458N8452R085k3664m0169l5510K3575O0807K1848k8940m3753k7969
510d9229J5869N3673L4934k3496n2523k4315J5379L9827M0223j1709n9741k6774
522d7882K1104L2071L7937R17o0530l7101K5933L4323L0817J0411n1859m9882
534e3741K1056M1236K5739Q798l9335n1639Q178M5292L0487K298l5034m4376k459
547d3500M1238M1634L021l8573l9320n593L0733M6547J1480m2263l9039l456K2375
560a4716M4532J9361m1998m2208j392J9742M0972K6438l7300m7872l334K1258
572a6517L6528K9411k7624n1727j0263K3558L5173K5025k0184m7018j9783K2468
584b0953M0852K1185j8950l9313k5742J4794M7189K4467k0895l4818k5756N900
$$ plain form
498 -59449 -22991 35461 44546 20882 -19287 -54797 -31222 29585 51433 22493 -21260 -49229
510 -49229 -33360 20313 55247 31751 -20772 -45087 -29708 10119 50342 38633 -21108 -47882
522 -47882 -26778 5293 43230 44147 -16383 -53484 -27551 6772 37589 48000 -3859 -53741
534 -53741 -32685 8551 34290 43088 3753 -47886 -39708 5584 36071 38369 3335 -41041 -43500
547 -43500 -2262 39372 42393 3820 -35500 -41093 -10360 36187 47667 5404 -33635 -37091 -14716
560 -14716 29816 49177 7179 -35029 -36421 -16679 24293 50731 13431 -34441 -37775 -16517
572 -16517 20011 49422 21798 -29929 -40192 -16634 18539 43564 23380 -23638 -43421 -20953
584 -20953 19899 41084 22134 -17179 -42921 -28127 19062 43529 22634 -12184 -37940 -32040
596c2040M6167L0943k1205l5227k3032J177M1422L6133j8058l7484k2748M68L7177
609C693L8319j0393l8952k6420J283L3523L6676l212l6688l1604N68L2901L3784
622C3478M72l1789l5583l334L5437L3052J582k6876l6819q619L4660L5226K663
635C3550k3721l5344j3978L1365L7312M130k2704l3370j6488K6682L9708P845
647C4987k3171l3100j6650K2113L8813J4188k1147l5735j6451J9206L5590J7534
659C6177j7315l6615j8838J8310L4286J8376j3256l5843k2569J6631L4583K0042
671C3969j0645l4707k4310J2976L3749K2009p750l3520k6144R910L2946K2647
683C1130n140l1412k8424P173L2972K4104l647k9050k9409L201L1705K6620j473
$$ plain form
596 -32040 14127 45070 23865 -11362 -34394 -33217 8205 44338 26280 -11204 -33952 -33484 3693
609 3693 42012 31619 -7333 -33753 -32470 1053 37729 34517 -2171 -33775 -33207 -306 33478
622 33478 33950 2161 -33422 -36756 -1319 31733 33315 6439 -30380 -38999 -4339 30887 33550
635 33550 9829 -25515 -39493 -8128 29184 33314 10610 -22760 -39248 -12566 27142 34987
647 34987 11816 -21284 -37934 -15821 22992 37180 16033 -19702 -36153 -16947 18643 36177
659 36177 18862 -17753 -36591 -18281 16005 34381 21125 -14718 -37287 -20656 13927 33969
671 33969 23324 -11383 -35693 -22717 11032 33041 25291 -8229 -34373 -24463 8483 31130
683 31130 25990 -5422 -33846 -26673 6299 30403 26756 -2294 -31703 -28502 3203 29823 28350
696B8350k8225k9197K45K8760K7900J056k6920k9832j720K6981K8672L614k4786
709D898l0895n212K6005K9580O051k3135l0449p777K3048L0417Q144k1314l0617
722b1256r690K0942L0264J0360j9416l0425j1897J8554L0979J2424j6964l0361
734a6486j4595J6682L0645J4147j5199k9246j6181J3657L0617J6238j3447k8865
746a2033j7634J0790L0454J8266j1895k7594j8914P894K9511K0327r859k6962
758g649j9442N531K7874K2120p434k6918k0362L558K6454K3357m784k5860k1901
771b5456K044K4838K4356j966k5031k2777K51K3000K4587P71k3782k3747j782
784b4694K2100K4727L132k1899k4968l589K0401K5559M886k0146k5380n904J9112
$$ plain form
696 28350 125 -29072 -28827 -67 27833 28889 1969 -27863 -29583 -2602 26070 29684 4898
709 4898 -25997 -31209 -5204 24376 30427 7292 -23157 -30934 -7886 22531 30675 9361 -21256
722 -21256 -30946 -10004 20260 30620 11204 -19221 -31118 -12564 18415 30839 13875 -16486
734 -16486 -31081 -14399 16246 30393 15194 -14052 -30233 -16576 14041 30279 16832 -12033
746 -12033 -29667 -18877 11577 29843 17948 -9646 -28560 -20666 8845 29172 19313 -7649
758 -7649 -27091 -21560 6314 28434 21000 -5918 -26280 -22722 3732 27089 22305 -3555 -25456
771 -25456 -23412 1426 25782 23816 -1215 -23992 -23741 -741 23846 24617 835 -22912 -24694
784 -24694 -2594 22133 25265 3366 -21602 -25191 -4790 20769 25655 5509 -19871 -25775 -6663
797f663K5482P105j8492k5566p487J7134K5458Q977j6475k5727r698J5636K5566
810A5250J0778j5035k5185j1617J3343K5954J2610j3564k4738j2797J0731K5717
822A1447J4372j1883k4826j3292Q906K4434J6442r988k4752j4961P718K3632J6744
835B3993o580k4116j6962O242K3055J7538m787k2691j8709M227K2441J8456k983
848A9124k1118k0252K084K2416J8585j279j9384k1096k35K1367K0176n46j8347
861A495k0258l315K0132K1404J111j7945j9948m045J6834K2011M785j8072k1156
874a6967l894J5098K0869P620j5922k3370m622J4610J9727Q892j2948k3755p299
887b1961J4235J9963R169j0363k3678r970J3479J9832J0472r255k2392j1997J1641
$$ plain form
797 -6663 18819 25924 7432 -18134 -25621 -8487 16971 25948 9473 -16254 -25952 -10316 15250
810 15250 26028 10993 -14192 -25809 -12466 13488 26098 12534 -12204 -25001 -14270 11447
822 11447 25819 13936 -10890 -24182 -15276 9158 25600 15612 -9140 -24101 -16383 7249 23993
835 23993 17413 -6703 -23665 -17423 5632 23170 18383 -4308 -23017 -18790 3651 22107 19124
848 19124 -1994 -22246 -20162 2254 20839 19560 176 -20920 -21155 212 20388 19842 1495
861 1495 -18763 -22078 -1946 19458 20569 2624 -17324 -21369 -4535 17476 22261 4189 -16967
874 -16967 -20861 -5763 15106 22726 6804 -16566 -21188 -6578 13149 22041 9093 -14662 -21961
887 -21961 -7726 12237 21406 11043 -12635 -22605 -9126 10706 21178 11923 -10469 -22466 -10825
900a0825K0631J0730q000k0966j3143Q328K1730J2615q327j9869j2971N530J9953
913E416J6111p299k1005j1936M004J7647J8102m488k2413j2691M198J5646J7894
926A9186j257k1567j5301L560J5855J7183Q93j9857j6740J520J5654J7598J541
939A8268j7211j7239j660J5723J8607J024j5171j6650m836J5245J9955J638j4743
952B950j5327o882J2759K1990L187j5016j4826p027R589K2339N819j4734j5361
965a0540p296Q504K0549Q484j2393j7166q158Q490J8948R426r714j7568j0391
978a8825Q872J8774Q382o886j6897j2632Q067J9534P637m804j5233j5261O405
991a2867K0226Q595m533j3941j5200L631J9835J0618m461j3456j4944J570J8394
$$ plain form
900 -10825 9806 20536 12536 -8430 -21573 -13245 8485 21100 12773 -7096 -20067 -14537 5416
913 5416 21527 14228 -6777 -18713 -14709 2938 21040 16552 -5861 -18552 -14354 1292 19186
926 19186 17929 -3638 -18939 -15379 476 17659 18552 -1305 -18045 -16525 -871 16727 18268
939 18268 1057 -16182 -17842 -2119 16488 17512 2341 -14309 -19145 -3900 16055 17693 2950
952 2950 -12377 -19259 -6500 15490 18677 3661 -11165 -18192 -8603 13736 19555 4821 -10540
965 -10540 -17836 -9332 11217 19701 7308 -9858 -18016 -9526 9422 18848 9134 -8434 -18825
978 -18825 -9953 8821 17203 10317 -6580 -19212 -11145 8389 16026 11222 -4011 -19272 -12867
991 -12867 7359 15954 11421 -2520 -17720 -14089 5746 16364 11903 -1553 -16497 -14927 3467
1004C467J2826l316j4008j4611R48J6020J3531j53j5007j5102J062J4065J3598
1017A3320K385j4185j6714J152J3182J2683L872j2058j8650k64J3570J2311N067
1030A5671j0555j8347k709J3409J2766N161r291j7665m556J1566J4502N343q889
1043F406j6321n782R230J5284O882r264j5457o051P343J5020R304r023j5611o567
1057a4607O417J3849J0513p332j6071p039N461J3308J1084n120j6382q398N045
1070i272J2722J1420l837j5416r627M062J2662J1062k139j4170j1228K525J3295
1083B059J1304j889j3010j1257O74J2884J2048p86j2636j1075p00J2092J2679
1096A2387m6j1573j1620j881J0824J3742Q23j1162j1746k700R872J3517K693j0696
$$ plain form
1004 3467 16293 12977 -1031 -15642 -14694 1326 14857 14704 -303 -15405 -14343 -278 13320
1017 13320 15705 1520 -15194 -14042 -860 11823 15695 3637 -15013 -15277 -1707 10604 15671
1030 15671 5116 -13231 -15940 -2531 10235 15396 6105 -11560 -16116 -4550 9952 15295 6406
1043 6406 -9915 -15697 -6467 8817 15699 6435 -9022 -15073 -7730 7290 16594 7571 -8040 -14607
1057 -14607 -8190 5659 16172 8840 -7231 -14270 -8809 4499 15583 10463 -5919 -14317 -9272
1070 -9272 3450 14870 11033 -4383 -14010 -9948 2714 13776 11637 -2533 -13761 -11236 2059
1083 2059 13363 11474 -1536 -12793 -12119 765 12813 12027 -609 -11684 -12384 -292 12387
1096 12387 12341 768 -10852 -12733 -1909 11833 12656 1494 -10252 -12952 -3080 10437 13130 2434
1110B434j2083l176Q909J3438L793r562j2348m149Q276J2684M903q244j2866n054
1124a3045P823J2741N268p424j2379o019O595J3347O059o486j2367o714N448J2818
1138E665O913n282j2189p587M795J2638P170m378j1651q482L898J2239Q201l845
1152H105j1198q536K420J1807R165k984j1023q654J416J0984R452j364j0897r531
1166a0838J155J0566R317j71j0072j0161K29R946R752N71r417j0440n84R313R553
1181H719K103r225j1035j237R043R777K255p788j1146k386Q468J0231K755p139
1195C395j0888l220P366J0486L199o536j0233m119O044J0724M445o037j0827m293
1209a0494N612J0290N197n195j0642n153M789J0058N865m557r881o181M442R629
$$ plain form
1110 2434 -9649 -12825 -3916 9522 13315 3753 -8595 -12744 -4468 8216 13119 4875 -7991 -13045
1124 -13045 -5222 7519 12787 5363 -7016 -13035 -6440 6907 12966 6480 -5887 -12601 -7153 5665
1138 5665 12578 7296 -4893 -12480 -7685 4953 12123 7745 -3906 -12388 -8490 3749 11950 8105
1152 8105 -3093 -11629 -9209 2598 11763 8779 -2244 -10898 -9482 1502 10954 9590 -1307 -10838
1166 -10838 -9683 883 10200 10029 -43 -10204 -9975 -29 9723 10294 877 -9563 -10147 -834 8719
1181 8719 10822 1597 -9438 -10675 -1632 8145 10400 2612 -8534 -10920 -2452 7779 10534 3395
1195 3395 -7493 -10713 -3347 7139 10338 3802 -6431 -10550 -4506 6218 10663 4626 -6201 -10494
1209 -10494 -4882 5408 10605 5410 -5232 -10385 -5596 4462 10327 5770 -4111 -10292 -5850 3779
1223C779O412l759r881o845L664R878O523k884r591p095K730R488O855k036q958
1238a720p472J938R165P029j662q316p851Q03R247P458r77q088p827k55Q652Q160
1254H284k12p602q193m73P549Q335M30o969q329j422P100Q642J174o649q466j975
1270h776O689Q631K073o491q411k264N813Q387K967n477q567l084N457Q205L267
1285H419m905q567l771M987Q422L787m151q534m336M451Q388L920l361q216m853
1300h320L686Q176M459l005p979n098L069P999M803k546p694n580K472P379N621
1315G442j371p935o240K290P225O020j499p501n796J971O298N997n79p049o273
1330g000Q93O403N889O69o661o790K51O288O301P11o273o797n42O016O411Q53
$$ plain form
1223 3779 10191 6432 -3449 -10294 -6630 3248 9771 6887 -2704 -9799 -7069 2419 9274 7238 -1720
1238 -1720 -9192 -7254 1911 8940 7278 -1038 -8889 -8086 1161 8619 7642 -446 -8273 -8528 124 8284
1254 8284 8072 470 -7723 -8196 -647 7688 8118 1149 -7180 -8602 -1502 7140 8314 1665 -6801 -8776
1270 -8776 -2087 6544 8617 2126 -6285 -8549 -2736 5651 8618 3141 -5426 -8510 -3053 5152 8419
1285 8419 3514 -5053 -8824 -3837 4585 8372 4221 -4313 -8649 -4198 4190 8110 4749 -3467 -8320
1300 -8320 -4634 3542 8001 4996 -2983 -8081 -5012 2987 7790 5244 -2450 -8030 -5558 1821 7442
1315 7442 6071 -1864 -8104 -5814 1411 7431 5932 -1569 -7365 -5394 904 6901 6322 -727 -7000
1330 -7000 -6107 296 6185 6854 193 -6597 -6346 -58 6243 6954 681 -6116 -6658 -642 5769 6622
1346F622n575o757j283N547O700J411m980o920j728M851P078J779m670o642k240
1361f807M233P092K414m321o980k374L865O595L438m138o600l173L436O395L607
1376F682k920o928l371L191O219L719k551o828l948K950O339L692k085o371m437
1391f647K411N987M365j440o213m437J657N855M457j228o039m452Q84N563M950
1406E673j060n658m487N34M924N603k37n823m734N82M249N395O38n551m839j10
1422d901M351N273P48n039n014o03M023N202J677m838n191p77L304N649J762m195
1438A431n239j219L579N281J497l765n097j621L030N573K248l889m693k274K178
1453b980N854K739l410m692k155K108N230K561k773m637k756K085M752L078k306
$$ plain form
1346 6622 1047 -5710 -6993 -1446 5254 6665 1685 -5235 -6963 -2112 4966 6745 2075 -4567 -6807
1361 -6807 -2574 4518 6932 2611 -4369 -6743 -2878 3717 7155 3017 -3583 -6756 -3320 3075 6682
1376 6682 3762 -3166 -6537 -3346 2873 6592 4041 -2787 -6735 -3785 2554 6246 4161 -2210 -6647
1391 -6647 -4236 1751 6116 4676 -1537 -5974 -4317 1538 5995 4767 -1272 -5724 -4840 723 5673
1406 5673 4613 -1045 -5532 -4998 -74 5529 5292 -531 -5265 -4683 -434 4961 5599 48 -4791 -4901
1422 -4901 -550 4723 5471 432 -4582 -5185 -1162 4040 5717 879 -4312 -5089 -1785 3864 5626 1431
1438 1431 -3808 -5027 -1448 3833 5330 1565 -3532 -5153 -2123 3450 5698 1809 -2884 -5158 -2980
1453 -2980 2874 5613 2203 -2489 -4644 -2536 2694 5255 2482 -2155 -4911 -2826 1926 5004 2698
1468B698m674k975J358N166L293j754m451l006R09M945L307j440m327l546J019
1483c478M520L568j260m060l763O91M303L512p25l507l699k5M149L950n77l546
1499E3l751j71L810L814L8l499m041l45L601L943M57l502l858p58L459L775Q23
1516C848k788l997j107L136L637J071k517m146j216L019L521J357k287m244j668
1531d381L031L336J685j748m070j822K556L502J682j739l730k260K182L652J989
1546C865j934l719k070J637L716K094j498l415k193J029L528K406j085l204k602
1561c445J257L455K067r16l119k812R52L245K550o90l121k427L18L220K435j05
1577B864l201k538L79K801K435Kk720l138J88K935K612M42l218k700J12K515K558
$$ plain form
1468 2698 -1976 -4951 -3593 1573 4866 3112 -1339 -4345 -3436 1509 4816 3376 -951 -4497 -3478
1483 -3478 1042 4610 3350 -710 -4473 -3782 521 4033 3308 -199 -3898 -3923 226 4176 3599 53
1499 53 -3698 -3869 -59 3755 3793 294 -3747 -4092 -491 3452 3909 407 -3451 -4209 -750 3025 3848
1516 3848 1060 -2937 -4044 -908 2729 3800 1283 -2863 -4079 -1060 2461 3818 1531 -2713 -4381
1531 -4381 -1350 1986 3671 1923 -2147 -3969 -1413 2089 3771 2032 -1698 -3958 -1776 1876 3865
1546 3865 1931 -1788 -3858 -2221 1495 3589 2091 -1324 -3517 -2488 1040 3446 2361 -843 -3445
1561 -3445 -2188 1267 3334 2418 -701 -3513 -2561 684 3234 2544 -577 -3004 -2686 534 2969 2864
1577 2864 -337 -2875 -2496 305 2740 2742 22 -3116 -2928 7 2619 3061 -157 -2857 -2745 -230 2328
1594B328L71k319k896j23K364K738K51k447k592n80K124K809Q86k168l112o51
1610c017J984L157R60k254k958o07J751K725J213j793l245o88J617K855R63j345
1626A318k832j640J921K437J277j093l040j347J869K058J884j311k862j365J611
1641a115K170J289q99k525j551J035K279K039j259k408j552N51K646J786r18j836
1657b68j790n7K397J891k97k238j894l2K945J779m37k734j568M51K177J891j15
1674B101k396j843M27J969J851R7k161j921r5K184J751Kj741k187j36K124J716
1691A742K67j600k050l43J660K120J16j693j581m48J616J827M10j280k076l75
1707a688Q58K327M97j396k067k55P51K247Q03j135k083o89J323J612Q13j166k022
$$ plain form
1594 2328 2699 380 -2516 -2639 -275 2463 2714 267 -2325 -2905 -781 2028 2914 746 -2366 -3017
1610 -3017 -1033 2124 3084 830 -2128 -2735 -984 1741 2954 1161 -2084 -2772 -1155 1700 2663 1318
1626 1318 -1514 -3154 -1233 1204 2481 1388 -1652 -2999 -1130 928 2812 1501 -1361 -2726 -1115
1641 -1115 1055 2344 1445 -1080 -2631 -1596 683 2722 1463 -945 -2497 -1946 700 2486 1568 -268
1657 -268 -2058 -2115 282 2173 1876 -362 -2256 -2288 657 2436 1999 -735 -2303 -1852 325 2216 2101
1674 2101 -295 -2138 -1711 258 2109 2206 45 -1876 -1971 213 1964 1966 225 -1962 -2098 26 1742
1691 1742 2009 409 -1641 -1984 -324 1796 1912 219 -1362 -1810 -194 1633 2043 763 -1313 -1688
1707 -1688 -830 1497 1994 598 -1469 -1724 -973 1274 2077 942 -1141 -1830 -507 1105 1918 752 -1270
1724a270o54J004K126Q62j082k133j012J312J619J183j019j832p88N35J842J311
1740B004j055j609j110P74J667J226o06k151j012M17J935J101o59j463j228N04
1756a265J600J142j84k045m44P4J514J282n61j470j460O34J554J121j06j699j092
1773a405J06J465J228r6j333j597L08J565J342n64p71j644L23J070J402j12j336
1790d9j389o6J259J449Rj028j292l07R17J441O41j500j275K6R96J219M53j252
1808B52j592l0J163J086N03r41j505q1P63J314M07j023j371p7O75J487J26p64
1826C92j120o40Q11J491M38p62j646k97N06J588P23q15j518m99R09J239O03q13
1844E90j247n83P47J209R66j085j250p54N86J482O85q37q58p49J62J539N72j72
$$ plain form
1724 -1270 -1924 -920 1206 2068 986 -1147 -2159 -847 772 1955 936 -896 -1684 -1149 693 2004
1740 2004 949 -660 -1770 -996 671 1897 1291 -860 -1872 -1455 480 1581 922 -541 -1769 -1265
1756 -1265 335 1477 1293 -752 -1196 -1122 392 1674 1113 -357 -1817 -1183 371 1492 1386 -313 -1405
1773 -1405 -1299 166 1394 1298 -35 -1632 -1324 241 1583 1019 248 -1396 -1073 -3 1399 1287 -49
1790 -49 -1438 -1504 -245 1204 1213 185 -1107 -1414 -497 944 1585 85 -1190 -1164 -168 1051 1504 252
1808 252 -1340 -1370 -207 879 1382 441 -1064 -1145 -382 932 1339 316 -1055 -1132 -457 1030 1156 392
1826 392 -728 -1368 -557 934 1372 610 -1036 -1333 -827 761 1484 669 -849 -1348 -439 800 1403 590
1844 590 -657 -1240 -493 716 1682 597 -653 -1407 -821 661 1346 509 -349 -1098 -936 603 1175 1003
1862A003j517p18M59J298J158o62j644n67L99J138J003l21j417j174R99Q08J126
1879A371l24j195q87K70O01J300K82j402j628O75J320L77P49j374j273K4J346
1896B32R91k74j305o91m6J264R89K7j275j059Q6J088J313m8j187j309J05J026
1914g3Q52M28j033j169q7J112R98J01q22j410k23J037J054M23q80j347k28R43
1932c24J133M19q40j220m50P67J333L45p32j298o15R70J269L85o26j153l87J98
1950h26J464Q55q73j436m48O97J259M58n79j463m59M83J469Q41p51j357j032J028
1968f70J128P50l24j518n04M19J341O66o61j222q75P44Q20J066m34j205q82N11
1986h50J477N75k71j269r69K64J672K35K9j247q91L51J260Q52j06j542o58K00
$$ plain form
1862 1003 -514 -1232 -773 525 1683 1021 -623 -1190 -791 347 1350 1029 -388 -1562 -563 245 1371
1879 1371 1047 -148 -1035 -765 -164 1136 1418 16 -1612 -937 383 760 1509 135 -1138 -1114 232
1896 232 1223 949 -356 -1047 -1093 171 1160 1187 -88 -1147 -1061 27 1340 1292 105 -1204 -1099 -73
1914 -73 779 1207 174 -995 -1082 30 1028 1129 307 -1103 -1326 -289 765 1188 308 -1039 -1267 -324
1932 -324 809 1228 388 -832 -1282 -515 818 1163 431 -867 -1482 -512 757 1142 516 -637 -1024 -826
1950 -826 638 1493 620 -816 -1264 -567 692 1150 571 -892 -1351 -868 601 1442 691 -666 -1698 -670
1968 -670 458 1208 884 -634 -1138 -719 622 1288 627 -595 -1470 -726 94 1160 726 -479 -1361 -850
1986 -850 627 1202 931 -338 -1307 -1043 629 864 893 -354 -1245 -894 366 1218 1112 -430 -1088 -888
2004h88J008J352m33j063j305J21J059J292j97j071r92K6J120J267k01j146r28
2021i79q9R39J388L32j836j000J92J035R27R8q49j028k92J078J295j69o95j287
2039i40l74R73J194O27j258q98p09R48J258N30q27j516j03O70J171M03o05j389
2057h45m65P09J496L90o49j573k13L27J722O23q78j632j75N22J262O13n31j280
2075e77q70P08J248R15o81j231p36M03J341J034o67j258r09N21J281P32l35j194
2093b75j174M49J360R35j87j430j018L18J218J161n38j009j039J90J287J281k36
2110A293j451j070K22J188Q82L10j495j088L2J413J130m0j358j217k44J385J142
2127A034L68j255j450n3Q55K004o2j237j337k44R80J423N36j066j355n69Q74J642
$$ plain form
2004 -888 120 1472 1039 -24 -1329 -1208 -149 1143 946 -125 -1117 -1091 29 1296 1095 -51 -979
2021 -979 -1068 -129 1259 1591 -245 -1245 -1053 -18 909 1007 158 -870 -1162 -84 1211 1042 347 -940
2039 -940 -1314 -341 853 1480 222 -676 -1385 -437 821 1351 524 -992 -1095 -425 746 1149 544 -845
2057 -845 -1310 -601 895 1285 636 -937 -1150 -823 899 1522 644 -988 -1163 -641 621 1234 703 -577
2075 -577 -1447 -739 509 1424 743 -488 -1224 -821 520 1554 887 -371 -1280 -759 522 1254 919 -275
2093 -275 -1449 -1000 360 1295 1108 -322 -1340 -1022 196 1357 819 -190 -1229 -1039 248 1529 1293
2110 1293 -158 -1228 -1006 182 1064 1374 -121 -1209 -1177 236 1366 1326 -32 -1249 -1493 -108 1034
2127 1034 1402 147 -1303 -1356 -501 1503 1441 204 -1133 -1377 -397 1026 1562 496 -859 -1428 -554 1088
2145A088N6n98j384o52Q42J571N41r09j401p40P91J640Q55q46j712n12Q77J308
2163H15M80m54j594q65J006J365R51o76j808o70M50J512Q18k56j685j041Q00J348
2181D96J227r93j259q97L56J721Q68l96j559j114M22J195J467k49j631j008K0
2198a334J354J372j43j507j041mJ417J146K33j647j550L73J516J117j47j056j668
2215a569M1J242J548K24j384j439k50J532J500q0r66j722l63J238J522J46o54
2232E66j556p38J214J611N05r63j991m55J204J645O02j095j358o47R23J519N56
2249A542r79j568p12J169J302P89p54j588r33O95J823P13p73j572p84Q98J253
2266E21J056p52j441j168Q67J602J089q56j278j097L16J923O16l57j278j286K99
$$ plain form
2145 1088 1144 546 -838 -1490 -648 923 1464 555 -846 -1586 -795 845 1700 854 -858 -1370 -493 815
2163 815 1295 841 -753 -1618 -612 753 1704 1028 -780 -1450 -1000 512 1330 1074 -611 -1652 -852 496
2181 496 1723 730 -529 -1426 -1070 651 1519 1123 -436 -1550 -1128 67 1534 1285 -346 -1354 -1334
2198 -1334 20 1392 1249 -258 -1299 -1303 114 1260 1493 -154 -1704 -1331 185 1302 1155 99 -1569
2215 -1569 -1528 -286 1262 1486 102 -1337 -1587 -55 1445 1365 399 -1323 -1686 -448 1074 1220 566
2232 566 -990 -1728 -514 1097 1602 639 -1352 -1807 -603 1042 1644 549 -809 -1456 -533 986 1542
2249 1542 563 -1005 -1717 -548 754 1543 789 -799 -1732 -1037 786 1499 726 -846 -1630 -732 521
2266 521 1577 825 -616 -1784 -917 685 1774 918 -360 -1457 -1141 782 1398 1041 -237 -1523 -1224
2283a224J595J324m10j572j228M58J177J368k26j598j169J23J424J259m8j215
2299C8j615K93J261J408J08j298j529j6J178J236M37r56j576k73R59J444L78r93
2317D84j545k91J105J365M74j309j357o37J239J520N48j000j604o72J141J622
2333A083N07r29j470q17Q14J698Q25r05j591j021J212J468P28o49j752n88N51
2350h36J760O30o87j217j268N09J640Q99k69j586j173L77J596J230n50j616r67
2367a528J33J624J262k79j400j232J23J518J386j23j516j366J68J124J696j95
2383A395j211j461k07J400J426Q2j486j056l69J461J355J75j336j255m98J290
2399b95J717nj068j538n16J089J918J09r80j731k91J251J476N94j060j658q99
$$ plain form
2283 -1224 371 1695 1285 -287 -1515 -1057 120 1488 1262 -336 -1505 -1382 42 1301 1253 38
2299 38 -1577 -1284 -23 1385 1493 195 -1334 -1350 -172 1064 1501 545 -1031 -1304 -345 1099 1477 484
2317 484 -1061 -1352 -247 1118 1592 283 -1074 -1711 -472 1048 1596 596 -1008 -1680 -539 1083
2333 1083 1590 661 -809 -1626 -812 886 1711 806 -785 -1806 -594 874 1602 953 -799 -1387 -836
2350 -836 924 1554 867 -350 -1618 -1109 531 1430 1161 -425 -1598 -1221 375 1605 1055 -561 -1528
2367 -1528 -1395 229 1491 1212 -188 -1420 -1297 221 1607 1484 -32 -1398 -1230 -106 1590 1395
2383 1395 184 -1277 -1484 -84 1342 1424 -62 -1118 -1487 -26 1329 1504 168 -1087 -1585 -295
2399 -295 1422 1417 349 -1189 -1705 -616 1302 1411 431 -1300 -1591 -340 1136 1730 670 -988 -1887
2416a887J093J950M74q78j599r43J146J438R02j053j536p45P00J709P07l79j820
2433g21j015O55J666R20n49j588r43N35J519J240n54j482j180M28J617Q45j49
2450A244j714r97K05J373J519o65j204j401M12J392J515l72j598j269J73J397
2466A0J413j22j346j384J48J143J564J83j608j290j06J392J556L1j599j115k94
2483a424J359J487J61j026j714n19J315J434L97j054j481o01J434J352P82j201
2499G01j808n60Q83J926M82r85j635o75R20J671O96r57j685n76O38J616O96o58
2517F90j481o87O40J327J217n84k000o60O29J537J102q16j323j299P74J292J479
2534A837q36j543j009L51J530R69j00j615q43q4J780R64n2j694j315O19J181J244
$$ plain form
2416 -1887 -794 1156 1630 752 -847 -1790 -644 794 1696 643 -893 -1638 -938 771 1478 1099 -721
2433 -721 -1736 -1081 585 1505 956 -632 -1575 -1040 479 1719 1165 -317 -1497 -1069 548 1393 1244
2450 1244 -470 -1467 -1262 111 1630 965 -239 -1640 -1228 164 1679 1307 -291 -1560 -1387 10
2466 10 1423 1301 -45 -1429 -1281 -138 1426 1609 1 -1289 -1395 -3 1553 1584 -15 -1130 -1424
2483 -1424 -65 1422 1583 557 -1157 -1676 -361 1073 1470 416 -1065 -1666 -232 1120 1902 701
2499 701 -1107 -1667 -784 1142 1624 639 -996 -1671 -751 920 1616 659 -1026 -1602 -964 652 1348 690
2517 690 -791 -1478 -838 489 1706 1122 -878 -1538 -909 628 1730 914 -409 -1708 -934 358 1837
2534 1837 1001 -542 -1551 -1200 330 1299 1199 -416 -1259 -1343 437 1401 1349 -345 -1660 -1041 140 1384
2552A384j32j285j364O2J190J447P8j342j444j07J396J308L14j301j599j00J303
2569a92J393L20j035j581n79J227J922J99j294j647k64J153J519L52r07j987k65
2586a666R83J801M68q85j637q20J064J538N39m16j680q27O71J499R81q27j403
2603f17j002O89J759P85p75j659q80Q16J183J246o87j661r38O83J457J127l79
2620A147j617r66K01J533J272o05j382r80K05J490J212l7j693j042L1J384J270
2637A423jj420j301j2J301J452L9j381j243m43J497J350J68j162j544j11R89J631
2655A232N42j544j546l53J249J757j54o84j625m33J166J433M66q21j626n39J196
2672b84J187P72j151j518n76P89J860N17q57j371j097Q61J763Q54q99j485j022
$$ plain form
2552 1384 1252 -33 -1397 -1335 -145 1302 1380 38 -1406 -1513 -117 1191 1505 204 -1395 -1495 -192
2569 -192 1201 1521 486 -1095 -1674 -447 1475 1674 380 -1267 -1531 -378 1141 1493 586 -1401 -1666
2586 -1666 -683 1118 1586 701 -936 -1756 -692 846 1385 969 -711 -1538 -867 632 1613 786 -617
2603 -617 -1619 -930 829 1614 839 -820 -1700 -884 299 1545 858 -803 -1741 -1058 399 1526 1147
2620 1147 -470 -1436 -1235 298 1570 965 -417 -1397 -1192 298 1510 1473 -220 -1262 -1231 153 1423
2637 1423 1422 2 -1299 -1311 -10 1442 1481 100 -1143 -1586 -89 1261 1429 267 -1277 -1388 -399 1232
2655 1232 1774 230 -1316 -1669 -420 1337 1183 499 -1126 -1559 -393 1040 1506 685 -941 -1480 -284
2672 -284 903 1675 524 -994 -1570 -781 1079 1596 739 -632 -1729 -868 895 1749 850 -635 -1657
2689a657P29J594J123q22j644p38M20J459J147k98j741j194O34J431J025k95j494
2706c21j472O45J579J161l69j496j399M08J468J212k95j428j197K29J414J425
2722A564j46j380j510J12J146J504K22j543j431J41J108J513L08j455j407j50
2738a404R51J557N27j279j392l15J189J166L73q00j726n63J219J553N21q40j829
2755a092n47J066J422O61p82j656p03Q14J633R59j108j430r13Q92J586N72m75
2772H99j348j022O57J503R25o26j578p90K72J718R16n80j371r71M72J206J158
2789A440n28j211j289N24J389J158l27j436q79r7J336J398m73j134j586L38J797
2806D20Q25J82j437j234j15J201J447J20j456j281k16J363J352J17r86j360k40
$$ plain form
2689 -1657 -928 666 1789 967 -677 -1415 -995 464 1611 1313 -428 -1622 -988 443 1468 1173 -321
2706 -321 -1793 -1148 431 1592 1223 -273 -1672 -1264 204 1416 1121 -307 -1504 -1275 139 1564
2722 1564 1418 38 -1472 -1360 -214 1290 1512 -31 -1462 -1321 -213 1300 1608 153 -1254 -1404
2738 -1404 -453 1104 1631 352 -1040 -1355 -166 1000 1373 573 -1153 -1716 -497 1056 1577 737 -1092
2755 -1092 -1639 -573 849 1510 728 -928 -1631 -817 816 1775 667 -763 -1676 -784 802 1374 899
2772 899 -449 -1471 -814 689 1614 988 -590 -1380 -1108 610 1526 946 -425 -1396 -924 282 1440
2789 1440 912 -299 -1588 -1064 325 1483 1156 -280 -1159 -1256 80 1478 1005 -129 -1715 -1377 420
2806 420 1245 1427 -10 -1244 -1359 -158 1289 1409 -47 -1328 -1544 -181 1171 1288 302 -1058 -1298
2823a298R63J609L66j371j284n17J208J311N88r78j583l09R75J332N39j108j490
2840a047m33Q12J519R88j173j349j074Q97J619N74l17j808q44J088J063J010n66
2857I59j437j079N56J641R91p25j560j062L37J963R57m89j322j305K58J615J331
2874A629n25j610q81J24J428J326k92j584j175M92J341Q88L22j576j361L07J251
2891A04J153j48j278j066Q1R92J420Q4j166j684%J386J114N48j391j333k22J004
2909d02J620M81j333j257l89P71J575N46j041j492q27J125J640M14o58j685n83
2926a495R19J254R11r31j589l83O40J672N64p50j584p52N69J575Q73p85j212j026
2944a530Q36J200J085n60j467r17J72J576J119k13j668r01J68J570J163n87j267
$$ plain form
2823 -1298 -335 1274 1640 269 -1015 -1532 -324 987 1575 597 -986 -1295 -320 1012 1551 443 -1047
2840 -1047 -1480 -668 851 1839 666 -683 -1757 -860 759 1333 1016 -792 -1636 -548 515 1525 959
2857 959 -478 -1557 -1001 640 1631 906 -654 -1716 -1379 584 1541 1052 -270 -1575 -1317 298 1629
2874 1629 1104 -506 -1387 -1263 165 1491 1199 -385 -1560 -1068 273 1161 1483 -93 -1454 -1147 104
2891 104 1257 1109 -169 -1235 -1154 -162 1258 1342 176 -1508 -1508 -122 992 1540 149 -1184 -1406 -402
2909 -402 1218 1699 366 -891 -1280 -509 1066 1612 571 -921 -1748 -623 1017 1431 773 -912 -1495
2926 -1495 -576 678 1589 658 -931 -1314 -674 998 1562 812 -772 -1524 -955 620 1493 708 -504 -1530
2944 -1530 -694 506 1591 1031 -436 -1353 -1181 395 1514 1301 -367 -1268 -1100 470 1633 1046 -221
2961b21j298L66J249J452k97j361j292J95J615Q40k6j054j654J95J277J220J50
2978A356j318j093j80J204J270j09j159j185l40J348J064M00r02j353k94J046
2994b45J071N14j061j439j32P74J448P31j037j511n62J129J046N66q17j427o44
3011a596P23J466Q83o54j651n69N41J625O03n64j410p48M33J531O72m56j363r45
3029a479N99J394R14m41j409r99N34J318R90o04j087j018J88J327R65j25j603
3046e36r84L95J146J242k72j136j073q7J379J188L3j550j063P1J212J418K8j519
3064a08j269M6J137J395j09q86j337k84J290J196l7p41j456j20R22J313O5o97
3082C20j072l81Q15J121L28q95j092n71R38J233O40r06j311n04P38J509M07o51
$$ plain form
2961 -221 -1519 -1153 96 1548 1251 -110 -1402 -1207 408 1248 1222 168 -1486 -1291 -14 1206 1356
2978 1356 38 -1055 -1235 -31 1239 1130 -29 -1214 -1554 -206 858 1258 356 -997 -1291 -245
2994 -245 826 1340 279 -1160 -1292 -518 930 1661 624 -887 -1449 -320 726 1292 475 -952 -1596
3011 -1596 -873 593 1476 822 -829 -1398 -857 768 1371 807 -603 -1351 -918 613 1285 829 -534 -1479
3029 -1479 -880 514 1428 987 -422 -1421 -887 431 1421 817 -270 -1288 -1100 227 1192 1067 -536
3046 -536 -1520 -1125 21 1263 991 -145 -1218 -1305 74 1262 1295 -255 -1318 -1247 -35 1383 1411 -108
3064 -108 -1377 -1331 -194 1201 1092 206 -1131 -1415 -125 1071 1034 293 -1163 -1283 -361 952 1017 320
3082 320 -752 -1133 -318 803 1131 236 -856 -1427 -489 744 1384 478 -833 -1337 -599 910 1317 666
3100F66j454n08P39J173Q08m77j519o01N42J049R34o11j301q15M14J398Q94l65
3118I66j371p13J08J435O23l11j100q21K68R71J027l6j278j053J32J074J126l7
3136A010j102j150K05R16J252pj169j201Q1J227J183N7j179j141j83J164R16L59
3154A238j003j356m3Q90J372L5q89j238m49J053J537K44r49j375o2O05J289M66
3172A365r12r37q06P10J238N39q66j121k33O12R49R14q67j145o40M85J375P21
3190A381o24j273p72O00J245P34m95j180r59M97J450P68p00j119p46M02J244Q86
3208A339l25j247q97J30J148J179m51r35j045J0J371P66k63q67j071oJ452Q64
3226A152k12r00j351K42R33J127K78q62j628K34J201P67n7p59j114q6Q03J162
$$ plain form
3100 666 -788 -1296 -557 616 1424 947 -572 -1173 -631 418 1352 741 -560 -1375 -961 437 1331 966
3118 966 -405 -1118 -1010 425 1048 737 -363 -1184 -916 55 1082 1046 -232 -1285 -1153 -79 1047 1010
3136 1010 -92 -1242 -1037 -121 1131 1124 -45 -1246 -1165 62 1245 1302 123 -1018 -1201 -37 879 1238
3154 1238 235 -1121 -1164 -274 1098 1133 244 -994 -1443 -390 1147 1391 442 -933 -995 -390 899 1365
3172 1365 453 -484 -1290 -580 658 1197 331 -790 -1023 -411 538 1452 585 -560 -1200 -715 660 1381
3190 1381 757 -516 -1288 -688 557 1291 796 -384 -1343 -846 604 1372 672 -447 -1193 -791 453 1339
3208 1339 1014 -233 -1130 -1000 148 1327 876 -59 -1104 -1094 277 1043 780 -87 -1158 -1164 288 1152
3226 1152 940 40 -1311 -1069 -136 991 1269 407 -1221 -987 214 981 924 165 -949 -1035 -232 930
3244I30N24j187j180l29R63J198J34q87j089m45J035J088L08o22j256j38N96J146
3262G89L16l03j184j047R28J165O71o42j303o44P49J021P27q69q57o44O11J250
3280G34M16m31j092q64L08J223Q79m91r67q35J45J582P60m87j124j093N01J353
3298E17P12l37j184p74K94Q47J101k21j070r44Q7J173Q24R8j024j237k0J223J328
3317A393m29r22j065oP76J102L30q40j380J04Q93P39L00r47r74k39J101J083J36
3336A155q21j138m96Q99J206K60n54j267n43R10J268K22q19r45l15N31J080N69
3354A202o37j153o53L14J710L29o02j053o43N18J296O99q29r53o23N00Q34Q23
3372A079k98j057p91K82J334N26k56j130o36J56J066O98k73q06j094L32J231N88
$$ plain form
3244 930 1454 267 -913 -1242 -279 919 1053 166 -923 -1368 -333 755 1063 441 -815 -953 -357 789
3262 789 1105 802 -382 -1429 -501 664 1335 693 -610 -1254 -505 516 1243 374 -483 -1127 -516 734
3280 734 1150 719 -373 -1237 -929 294 1173 682 -285 -1120 -975 607 1367 880 -244 -1337 -836 517
3298 517 1229 892 -292 -1066 -772 75 1176 955 -115 -1059 -972 201 1025 1123 99 -1138 -1158 65 1393
3317 1393 964 42 -1023 -1029 -253 849 1179 339 -1041 -937 -44 695 995 48 -926 -1165 -64 1019 1155
3336 1155 334 -804 -1300 -401 805 1065 511 -756 -1299 -389 879 1101 282 -663 -978 -447 633 1202
3354 1202 565 -588 -1241 -927 783 1112 510 -543 -1186 -668 628 1327 498 -455 -1078 -578 256 1079
3372 1079 781 -276 -1067 -785 549 1075 819 -311 -947 -791 275 973 700 -106 -1200 -868 363 951
3390I51j28q85j159L49R54R28K6j098j200K21J165R76j43j085n89m77R49J139
3408H94k7p69j256LJ063J021J04q13j036m8N12J316J40r37p49n99J097Q74K41
3427A031p81j032m05O43J270M62n64j336m0K40J282Q06j276q68o67R60M19J404
3445A548q51j368k38O8J365K76M70j691q53N38J025P55n95q25J14l92J045P50
3463A141o87j030q37J085R25j4O51j117j247p26J905M03R73j352q25l45J142J466
3481A511n33r15j133L06M92J380m44n33j196M60M24J053K47r68r08J13M83P27
3499E66Q69j183p67o9L95R82J33m09j438l09N92J078N68o19j310J36M07J045O18
3518A285j204n83m62M25J004O13l15j713l60O73J444K17n64q61o97M91J184M66
$$ plain form
3390 951 823 -62 -1221 -872 82 1010 1036 -62 -1262 -1041 124 1100 957 -128 -717 -1194 -245 894
3408 894 867 98 -1158 -1155 -92 929 1033 220 -816 -864 -352 964 1104 167 -582 -1181 -84 790 1031
3427 1031 250 -782 -1187 -544 726 1188 624 -712 -752 -512 770 1576 300 -568 -1235 -275 144 1548
3445 1548 697 -671 -909 -841 524 800 1270 -421 -1274 -736 289 1044 449 -376 -262 -654 391 1141
3463 1141 454 -576 -1413 -328 597 583 1234 117 -1130 -1856 49 452 1425 73 -752 -1097 45 1511
3481 1511 978 63 -1070 -764 -272 1108 664 131 -1065 -605 -181 872 1119 151 -757 -644 -161 566
3499 566 1435 252 -515 -584 -189 793 926 517 -921 -1230 -638 440 1008 389 -921 -785 -378 667 1285
3518 1285 81 -502 -964 -539 465 1078 763 -950 -1310 -637 807 1024 460 -401 -1098 -607 577 1043
3536A043l16j152p11L43J194M26k33r42q44L68J132O46j33r26j026J85J311J274
3554A639q00r96j104N42Q27R25k34j111o81P3R92J063k83j218o36m9J189N79L38
3573A055r84j016K1R65R44J35j043r96q3P59J032J95r41q63l52J194P93ko72j056
3593i15k87N48J357L47o99j166q8M40J170Lj43j295k28M63J022O90o78j172l85
3612a016J92J406M77m32r00p38L50J172N02k84j187o93N02J224L39j86j174o00
3630a046L44Q29R24j27j085j090N28O75J014l65q99o67J5J143N76M6r46p40q0
3649i51Q53R19J00p96j044J11R43N22L85o52j276k43J071J010j67m87j193L4O99
3668a62J087J47p28j410M8P73J098J41p18o69n97O83J000K19m53j180m95O22J325
$$ plain form
3536 1043 727 -425 -1136 -793 401 827 594 -348 -1192 -824 308 954 821 -105 -1131 -946 365 1639
3554 1639 839 -157 -1261 -719 108 1033 799 -312 -993 -920 72 1135 852 -366 -1002 -1051 138 717 1055
3573 1055 71 -945 -924 41 985 1120 77 -919 -1002 -243 789 984 43 -820 -1172 22 815 813 141 -915
3593 -915 -1202 -654 703 1050 351 -815 -903 -463 707 710 567 -728 -956 -493 529 1219 541 -631 -1016
3612 -1016 -824 582 1059 627 -273 -1011 -661 511 1013 729 -458 -1151 -649 575 914 728 -446 -1046
3630 -1046 -702 127 1051 924 -161 -1251 -723 -48 966 601 -298 -965 -950 193 769 815 -131 -871 -951
3649 -951 -98 821 921 125 -919 -808 135 657 1042 390 -886 -1129 -58 952 785 298 -895 -861 -162
3668 -162 925 1072 344 -1066 -1018 -245 853 994 276 -393 -990 -307 693 912 459 -721 -1216 -594 731
3687G31L98o45r85n71M42J298K61m27r89m32K69J172N15m33q28q63N16R98P39
3706A166n47r19n79K66R97O58m66p70p43M86O65P04j38r99j010O08O85Q26k97
3725E93q85p57J25R51J031l16p95n66l14Q77R24J87r32j037MQ75Q94L8n73j204
3745h80n2Q13P80K75q41j015pO20J082J88p97j091k09O18J558J16q04q20o08N84
3765d90R61K92m81q81k98K16J326L24l25j207l77L43J210N68m23j058p54N43Q41
3784C30O57k35j047o63M78M97J061l92j185n88M52Q79N54k23q92o75J75Q26Q32
3803H41m2j173n85N4J121O39M9p91j016L0R48P14j19q17o75L1P07Q46J7r20o61
3824h02j46Q90Q79j3p14q33j93O26J068K71o11j155k73Q07Q94K38p44q54j58L85
$$ plain form
3687 731 1129 484 -501 -1072 -630 668 929 502 -487 -919 -650 522 1037 604 -224 -1087 -571 427 1166
3706 1166 619 -300 -879 -613 384 1042 576 -194 -937 -451 214 918 780 -219 -1229 -621 64 890 593
3725 593 -292 -1049 -924 27 1058 742 -53 -619 -933 -56 868 1055 123 -914 -910 -35 859 897 324 -880
3745 -880 -932 -119 661 936 95 -920 -927 -307 775 963 166 -925 -1134 -516 1042 1158 354 -466 -1074 -490
3765 -490 471 763 282 -599 -897 -681 645 969 644 -563 -940 -597 613 1181 758 -300 -1054 -511 330
3784 330 987 752 -295 -958 -480 17 1078 686 -499 -1087 -635 244 798 575 -317 -992 -817 9 841
3803 841 799 -374 -959 -905 216 855 904 113 -903 -873 75 789 670 -147 -822 -791 -84 762 779 -141 -802
3824 -802 -948 -58 821 808 94 -739 -932 -306 762 1033 422 -733 -1006 -199 695 933 189 -665 -823 -438
3844d38R21L86n90j014j06N68Q23M06k97j054o43O06J190J82l84j223m44O02R58
3863D49N07l94j239rJ39R02L42k03p26o69J97J138M77k99r67p44M48Q52M22r1
3883E32o36o16J34P03P61p3o80r17o4R97N82J76r00q80J19O52P63M9m55j023o1
3904h37Q36Q07N5p58r45K5M55R94K83o06j103j43P20R74M3q24o19l11O81R51R8
3925G76n09j092j28N47R26L28l14j060n10P38P09N72k50j267k94J87J081M38k02
3944F76r42p92P46O06O17m33p96q69N34R07O89r7j216n64nJ049Q67j53j148l42
3964f66j39R77P72k14q90n01J43P71L70p2n87p68R5O11R22j2q03p81O0Q15P15
3985H18o3q71o56j70O32R22O2m79q73n4O23O58K09n51j012j68P58R43r5l31r27
$$ plain form
3844 -438 483 869 279 -735 -841 -273 550 956 659 -395 -1038 -432 758 940 556 -667 -1111 -509 449
3863 449 956 562 -677 -686 -547 355 697 494 -232 -901 -704 434 911 612 -355 -1099 -651 201 623 532
3883 532 -104 -720 -586 117 878 805 125 -792 -856 141 723 899 -1 -881 -762 -110 653 702 247 -776 -837
3904 -837 -1 806 861 103 -842 -817 -362 632 915 309 -794 -937 -217 757 800 -24 -643 -954 -273 678 776
3925 776 267 -825 -953 -406 520 848 534 -526 -1036 -298 411 983 733 -534 -828 -641 440 878 676
3944 676 -266 -1058 -312 294 911 478 -318 -1187 -653 254 943 846 -370 -934 -939 110 977 824 -324 -666
3964 -666 -805 172 944 730 -160 -661 -518 253 623 551 -36 -804 -709 -98 824 812 9 -772 -712 103 818
3985 818 755 -116 -772 -942 -310 612 674 195 -678 -732 -109 549 758 207 -805 -973 -215 728 633 302 -625
4006f25l36P01R01M39m91j218l58O91R65K43o10p60k69L30Q03K23j62r91m65N35
4026d54P88O56o85q65k44M3J121O37m69p23o87L18Q40N63l53p92l09J26O37O34
4046G82k45o82p42K53P39J028l38j169l97oP93J130k61j136m76J6N85J064l0p36
4066A72p25j59Q97P19j26n96p67j42O42P24J47o71p87k50Q84N90J52n63m84l49
4086f92O7R08M76o60p46j73M74J099J09o09o55l23K92J198J64n94p82n11O09Q48
4106D99K64l01o74n01K07R87N87q57n12o43N27O20P43k84o91j132L07R94L71o0
4126D51n77p25K09O63R32m55p16m73j19Q21P47j2j060l51l3R64O85j15p70p96
4146g30J65M87P19K6m74p29l18Q03P07K2o30p05k10O35O44J94j77j156P2N32O33
$$ plain form
4006 -625 -961 -260 641 1080 589 -629 -987 -296 669 912 302 -458 -727 -397 406 629 467 -524 -989 -454
4026 -454 334 990 305 -560 -804 -761 360 997 528 -195 -882 -564 276 839 486 -306 -615 -489 148 782
4046 782 537 -145 -887 -634 105 1133 795 -374 -771 -777 16 1146 885 -251 -727 -711 -126 938 908 172
4066 172 -553 -712 185 904 778 182 -585 -727 -85 639 786 115 -672 -922 -38 552 704 141 -343 -692
4086 -692 -625 283 759 99 -647 -820 -346 753 862 253 -402 -725 -433 765 929 335 -447 -958 -349 499
4106 499 763 462 -212 -713 -506 481 1068 211 -301 -944 -417 203 946 662 -29 -1161 -854 140 511 451
4126 451 -126 -851 -642 21 953 498 -218 -691 -810 11 758 746 -314 -665 -698 266 951 836 66 -730
4146 -730 -565 -78 641 667 193 -536 -854 -51 656 678 48 -657 -867 -232 412 606 429 -727 -655 -123 510
4167E10M9j60r58j58N35N89M12p15p79k35M65O87Q17m33j113j48O1Q52P0K2p20
4188c50n43M30O34O44l63p99l78J78Q86L73k76q10m77L95O30N32k26p34l21j99
4208g74J027L20j42m58n78j11Q09O14J5q32m94k26P47R49q7r57m34K04J43Q64
4228E99l7l77o98N0L18P22P1n16r52J45N12Q18Kk86p20j00L71M72M92q54o25j90
4250g83P02N28J09m86l93n77N73O09N98n08o61m91M12P14K89l57n97n28N56M31
4270A40P58n84q83lJ79P44K46j61o73l14Q7N72N44l16l96o94J00J029J05o9n82
4291a71l42J98M01N64J3o67q45M29N59M75J45q84n40O3O74M09J10m82q16L8Q08
4312A39M29j07l60n37j53J53Q38J60o08o32P3M22P32K41n46n36k48L76O55K26
$$ plain form
4167 510 559 399 -559 -717 -182 407 819 104 -675 -910 -445 242 1059 626 -487 -635 -574 278 348 370 -350
4188 -350 -893 -463 171 815 452 -347 -725 -547 339 712 436 -374 -851 -456 174 706 480 -254 -575 -774
4208 -774 253 573 431 -27 -605 -716 93 707 722 -110 -604 -830 -83 866 779 -178 -612 -408 -265 599
4228 599 562 185 -513 -463 -145 577 648 132 -820 -675 -163 655 657 371 -349 -449 -78 394 886 32 -593 -783
4250 -783 -81 447 556 70 -323 -900 -327 282 880 372 -289 -780 -368 346 635 278 -319 -847 -291 140
4270 140 898 314 -569 -572 -393 351 597 436 -237 -551 -464 108 652 336 -60 -754 -654 375 480 411 -171
4291 -171 -513 -315 86 650 663 -4 -849 -420 139 614 759 -125 -665 -602 72 481 591 109 -707 -669 139
4312 139 568 461 101 -436 -589 -436 402 562 -46 -678 -605 -183 549 790 244 -292 -540 -164 491 717
4332G17l07q68j38K71P95J72l26p79j3K06M60K57k5o14l11l9Q10M26n08n34l78
4353g26L06P37L24k14p51l31K82N07N42j77n42n86L13M44M64r7l84n84J9P50N92
4374H88j04o73o01M5N33M64L5n34o34J46L76O24j4k83p95k0L86R29l72l00o80
4395e84k61P54N77L31q17n72NM78M63O3k90n72k79M95P03K52l55p73m46L79P46
4416B97L00l45n40k24J46O10O03o50o32l89L45P72L59l19n30m51K04P85K21j52
4436D10n67o12K97O09K98o4m80l86j15O43P08l59l11o18K08M75L00j78n71q9j06
4457e08P41M92k49m04m82N3L87N68k79q8p75j53O84N97j24l72o44J34N23L03L06
4478G10q61l84l9K95Q00P7m85o70j00M72Q39j6k37o62k61L38N62K85m24o52j48
$$ plain form
4332 717 410 -458 -596 -325 470 642 316 -463 -476 -270 190 447 422 -192 -503 -542 268 694 186 -348 -726
4353 -726 -420 317 641 427 -324 -655 -373 134 676 499 -43 -629 -316 128 592 495 111 -473 -454 296 888
4374 888 784 111 -490 -445 88 552 587 53 -581 -435 -59 565 551 268 -527 -547 -161 768 396 96 -584
4395 -584 -845 -91 486 817 0 -572 -567 -89 374 437 147 -425 -704 -209 494 746 391 -382 -828 -449 297
4416 297 597 252 -288 -512 -366 244 847 197 -435 -824 -479 293 652 333 -197 -648 -444 341 562 410
4436 410 -157 -769 -472 137 435 371 -109 -495 -610 33 741 382 71 -547 -339 136 436 258 -313 -402 -508
4457 -508 233 725 476 72 -410 -357 30 598 319 231 -544 -697 -13 584 460 88 -556 -422 101 404 710
4478 710 -151 -535 -574 -279 521 598 113 -557 -657 -185 654 638 401 -261 -522 -184 378 663 239 -413 -561
4499e61M41K46N18m57l12l42j7P53J61k40m35l06P6N70M88l01m66n24M55M76J35
4520C58K07p39o21K31O14N28k51l86l19r8O76J78r5k67m01J64J94K87J87k87m00
4541b40l39P30K82p3o75o9k37M08R60l05m15k62k84K73P91j06l38n86k54O47O48
4562E56m4n91l24r3K57O12K37j68r25M2L43M58K47l30o48L8L07mN61j10o95j02
4584c76K25K00M68j24q38r3K62M45L20j90n40m27L93N36K59j85l31k82l33O77
4604F6K56K90r03k61L89L05L52l3o20o04O86K56K33k86r8o20N8K71Q19l03k42
4625A1n54J84L12J54L79n20l46j24N82L17L9m36l76N5L55K33P5k45l60l15O95
4646A15J2J89j81o28P9K67M40K53k42l56n31O41O6L53k60j82o37M62M23q6K24
$$ plain form
4499 -561 -120 126 644 187 -125 -467 -484 269 430 190 -245 -551 -475 95 583 282 -184 -708 -253 223 358
4520 358 565 -174 -795 -564 50 578 327 -59 -378 -476 200 378 283 16 -385 -221 -27 260 447 160 -240
4541 -240 -579 151 433 360 -315 -384 -621 -213 747 442 27 -235 -519 -246 545 439 101 -485 -739 -92 556
4562 556 512 -79 -403 -496 -239 373 610 442 -483 -441 -98 360 607 277 -371 -333 -26 -30 531 421 -274 -376
4584 -376 -151 49 517 393 -445 -538 -276 169 489 299 -241 -668 -275 261 520 335 4 -278 -611 66
4604 66 322 612 -291 -552 -163 142 494 461 -159 -763 -77 179 412 126 28 -592 -534 -263 556 253 11
4625 11 -543 -359 -47 107 486 -34 -380 -504 78 395 434 -2 -378 -323 32 265 340 95 -265 -580 115
4646 115 127 316 135 -493 -414 -147 293 546 304 -52 -583 58 124 477 217 35 -602 -140 283 197 421
4667D21n23m45M24K88K86j05p56j37K66N21J79j88n38l6J51K40M26m0l52o01J73
4688c46L29L68j35l11l78O1M49K49O0m95k25J01L01L07J21m04l49Q2j2N71J14
4709D58l39l47k33K92N86O0m17l97j11L37L73L0k47k55k2L13J52K39m81k33M9
4730a93J4L74K98m26l98l73M34N50K38m40k85r7J33J73N02k22n60o3L44J63M38
$$ plain form
4667 421 -102 -547 -123 165 451 346 -410 -547 -281 240 419 231 -307 -343 -192 48 474 434 82 -519 -346
4688 -346 -17 351 216 -95 -473 -412 37 286 346 -149 -374 -273 28 335 456 52 -297 -215 -227 344 458
4709 458 119 -228 -461 -169 417 477 60 -337 -448 -111 262 292 45 -210 -232 81 233 472 -9 -242 -193
4730 -193 -179 195 493 67 -331 -704 -270 280 518 78 -207 -304 -171 2 504 282 -278 -341 3 166 604
$$ [...]
8191g4
##END NTUPLES=NMR FID
##END=
