##TITLE=1H_SR52+5xAcCl'
 CDCl3, 8 sc, 
 31.05.2021
##JCAMPDX= 6.0         $$ Bruker NMR JCAMP-DX V2.0
##DATA TYPE= NMR FID
##DATA CLASS= NTUPLES
##ORIGIN= UXNMR, Bruker Analytische Messtechnik GmbH
##OWNER= root
$$ XWIN-NMR		Version 3.5
$$ Mon May 31 12:57:14 2021 Russian Standard Time (UT+4h)  she@DPX200
##.OBSERVE FREQUENCY= 200.131506
##.OBSERVE NUCLEUS= ^1H
##.DELAY= (6, 6)
##.ACQUISITION MODE= SIMULTANEOUS
##.ACQUISITION SCHEME= undefined
##.AVERAGES= 8
##.DIGITISER RES= 18
##SPECTROMETER/DATA SYSTEM= spect
##.PULSE SEQUENCE= zg30
##.SOLVENT NAME= CDCl3
##.SHIFT REFERENCE= (INTERNAL, CDCl3, 0, 15.7039)
##AUDIT TRAIL= $$ (NUMBER, WHEN, WHO, WHERE, WHAT)
$$ ##TITLE= Audit trail, XWIN-NMR		Version 3.5
$$ ##JCAMPDX= 5.01
$$ ##ORIGIN= Bruker BioSpin GmbH
$$ ##OWNER= she
$$ F:/spectra/data/she/nmr/H-F/1/audita.txt
$$ ##AUDIT TRAIL=  $$ (NUMBER, WHEN, WHO, WHERE, WHAT)
(   1,<2021-05-31 12:56:05.09 +0400>,<she>,<DPX200>,
      <created by zg, POWCHK disabled, PULCHK disabled
       configuration hash MD5:
       00 E9 B6 7A A2 85 ED C7 34 08 36 98 17 FE 4E 26
       data hash MD5: 16K
       C6 2B 22 61 B4 B2 FB 7B A5 6A 94 8D 3C 78 CC E6>)
$$ ##END=
$$ 
$$ hash MD5
$$ 41 33 30 56 BE F2 C4 F3 9B 00 CA 66 C2 DD 50 7A
##$RELAX= 
##$RELAX= 
##$RELAX= 
##$RELAX= 
##$RELAX= 
##$RELAX= 
$$ Bruker specific parameters
$$ --------------------------
##$DU= <F:/spectra>
##$EXPNO= 1
##$NAME= <H-F>
##$PROCNO= 1
##$TYPE= <nmr>
##$USER= <she>
##$AMP= (0..31)
100 100 100 100 100 100 100 100 100 100 100 100 100 100 100 100 100 100 
100 100 100 100 100 100 100 100 100 100 100 100 100 100 
##$AQSEQ= 0
##$AQ_mod= 1
##$AUNM= <au_zg>
##$AUTOPOS= <>
##$BF1= 200.13
##$BF2= 200.13
##$BF3= 200.13
##$BF4= 200.13
##$BF5= 200.13
##$BF6= 200.13
##$BF7= 200.13
##$BF8= 200.13
##$BYTORDA= 1
##$CFDGTYP= 0
##$CFRGTYP= 5
##$CHEMSTR= <none>
##$CNST= (0..31)
1 1 145 1 1 1 1 1 1 1 1 1 1 1 1 1 1 1 1 1 1 1 1 1 1 1 1 1 1 1 1 1 
##$CPDPRG= <>
##$CPDPRG1= <>
##$CPDPRG2= <>
##$CPDPRG3= <>
##$CPDPRG4= <mlev>
##$CPDPRG5= <mlev>
##$CPDPRG6= <mlev>
##$CPDPRG7= <mlev>
##$CPDPRG8= <mlev>
##$CPDPRGB= <>
##$CPDPRGT= <>
##$D= (0..31)
0 1.2 0 0 0 0 0 0 0 0.06 0 0.03 0 0 0 0 0.0002 0 0 0 0 0 0 0 0 0 0 0 0 
0 0 0 
##$DATE= 1622451364
##$DBL= (0..7)
120 120 120 120 120 120 120 120 
##$DBP= (0..7)
150 150 150 150 150 150 150 150 
##$DBP07= 0
##$DBPNAM0= <>
##$DBPNAM1= <>
##$DBPNAM2= <>
##$DBPNAM3= <>
##$DBPNAM4= <>
##$DBPNAM5= <>
##$DBPNAM6= <>
##$DBPNAM7= <>
##$DBPOAL= (0..7)
0.5 0.5 0.5 0.5 0.5 0.5 0.5 0.5 
##$DBPOFFS= (0..7)
0 0 0 0 0 0 0 0 
##$DE= 6
##$DECBNUC= <off>
##$DECIM= 32
##$DECNUC= <off>
##$DECSTAT= 4
##$DIGMOD= 1
##$DIGTYP= 9
##$DL= (0..7)
0 120 120 120 120 120 120 120 
##$DP= (0..7)
150 150 150 150 150 150 150 150 
##$DP07= 0
##$DPNAME0= <>
##$DPNAME1= <>
##$DPNAME2= <>
##$DPNAME3= <>
##$DPNAME4= <>
##$DPNAME5= <>
##$DPNAME6= <>
##$DPNAME7= <>
##$DPOAL= (0..7)
0.5 0.5 0.5 0.5 0.5 0.5 0.5 0.5 
##$DPOFFS= (0..7)
0 0 0 0 0 0 0 0 
##$DQDMODE= 0
##$DR= 18
##$DS= 0
##$DSLIST= <SSSSSSSSSSSSSSS>
$$ [...]
##$SUBNAM2= <"">
##$SUBNAM3= <"">
##$SUBNAM4= <"">
##$SUBNAM5= <"">
##$SUBNAM6= <"">
##$SUBNAM7= <"">
##$SUBNAM8= <"">
##$SUBNAM9= <"">
##$SW= 16.9725357007746
##$SWIBOX= (0..15)
0 0 2 0 0 0 0 0 0 0 0 0 0 0 0 0 
##$SW_h= 3396.73913043478
##$TD= 16384
##$TD0= 1
##$TE= 0
##$TE2= 300
##$TE3= 300
##$TEG= 300
##$TL= (0..7)
0 120 120 120 120 120 120 120 
##$TP= (0..7)
150 150 150 150 150 150 150 150 
##$TP07= 0
##$TPNAME0= <>
##$TPNAME1= <>
##$TPNAME2= <>
##$TPNAME3= <>
##$TPNAME4= <>
##$TPNAME5= <>
##$TPNAME6= <>
##$TPNAME7= <>
##$TPOAL= (0..7)
0.5 0.5 0.5 0.5 0.5 0.5 0.5 0.5 
##$TPOFFS= (0..7)
0 0 0 0 0 0 0 0 
##$TUNHIN= 0
##$TUNHOUT= 0
##$TUNXOUT= 0
##$USERA1= <user>
##$USERA2= <user>
##$USERA3= <user>
##$USERA4= <user>
##$USERA5= <user>
##$V9= 5
##$VALIST= <valist>
##$VCLIST= <CCCCCCCCCCCCCCC>
##$VD= 0
##$VDLIST= <DDDDDDDDDDDDDDD>
##$VPLIST= <PPPPPPPPPPPPPPP>
##$VTLIST= <TTTTTTTTTTTTTTT>
##$WBST= 1024
##$WBSW= 4
##$XGAIN= (0..3)
0 0 0 0 
##$XL= 0
##$YL= 0
##$YMAX_a= 290342
##$YMIN_a= -271973
##$ZGOPTNS= <>
##$ZL1= 120
##$ZL2= 120
##$ZL3= 120
##$ZL4= 120
##$ABSF1= 10
##$ABSF2= 0
##$ABSG= 5
##$ABSL= 3
##$ALPHA= 0
##$AQORDER= 0
##$ASSFAC= 0
##$ASSFACI= 0
##$ASSFACX= 0
##$ASSWID= 0
##$AUNMP= <proc_1d>
##$AZFE= 0.1
##$AZFW= 0.1
##$BCFW= 1
##$BC_mod= 2
##$BYTORDP= 1
##$COROFFS= 0
##$CY= 11.3945322036743
##$DATMOD= 1
##$DC= 2
##$DFILT= <>
##$DTYPP= 0
##$F1P= 15.9154993809931
##$F2P= -4.1035820241983
##$FCOR= 0.5
##$FTSIZE= 0
##$FT_mod= 4
##$GAMMA= 1
##$GB= 0.15
##$INTBC= 1
##$INTSCL= 1
##$ISEN= 128
##$LB= 0.24
##$LEV0= 0
##$LPBIN= 0
##$MAXI= 10000
##$MC2= 0
##$MEAN= 0
##$ME_mod= 0
##$MI= 1.114404
##$NCOEF= 0
##$NC_proc= 0
##$NLEV= 6
##$NOISF1= 3.799351
##$NOISF2= 2.8
##$NSP= 1
##$NTH_PI= 0
##$NZP= 0
##$OFFSET= 15.70392
##$PC= 1
##$PHC0= -11119.51
##$PHC1= 11.00099
##$PH_mod= 1
##$PKNL= yes
##$PPARMOD= 0
##$PSCAL= 0
##$PSIGN= 0
##$REVERSE= no
##$SF= 200.130013532006
##$SI= 16384
##$SIGF1= 3
##$SIGF2= 2
##$SINO= 400
##$SIOLD= 16384
##$SREGLST= <1H.CDCl3>
##$SSB= 0
##$STSI= 0
##$STSR= 0
##$SW_p= 3612.71676300578
##$SYMM= 0
##$S_DEV= 0
##$TDeff= 0
##$TDoff= 0
##$TI= <>
##$TILT= no
##$TM1= 0
##$TM2= 0
##$TOPLEV= 0
##$USERP1= <user>
##$USERP2= <user>
##$USERP3= <user>
##$USERP4= <user>
##$USERP5= <user>
##$WDW= 1
##$XDIM= 8192
##$YMAX_p= 0
##$YMIN_p= 0
$$ End of Bruker specific parameters
$$ ---------------------------------
##NTUPLES= NMR FID
##VAR_NAME=  TIME,          FID/REAL,        FID/IMAG
##SYMBOL=    X,             R,               I
##VAR_TYPE=  INDEPENDENT,   DEPENDENT,       DEPENDENT
##VAR_FORM=  AFFN,          ASDF,            ASDF
##VAR_DIM=   8192,          8192,            8192
##UNITS=     SECONDS,       ARBITRARY UNITS, ARBITRARY UNITS
##FACTOR=    0.0002944,     1,               1
##FIRST=     0,             0,               0
##LAST=      2.4114304,     0,               0
##MIN=       0,             -271973,         0
##MAX=       2.4114304,     290342,          0
$$ Real data points
##PAGE= N=1
##DATA TABLE= (X++(R..R)), XYDATA
$$ plain form
0 0 0 0 0 0 0 0 0 0 0 0 0 8 -8 8 -8 8 -16 16 -16 24 -26 32 -40 43 -52 64 -73 81 -94 108 -123 140 -156 179
34 179 -203 229 -254 285 -319 355 -393 439 -485 537 -593 654 -721 796 -875 964 -1062 1171
52 1171 -1291 1426 -1575 1747 -1942 2171 -2434 2748 -3132 3606 -4210 5018 -6137 7812 -10568
67 -10568 15872 -29601 134812 216078 -259755 -50965 285545 -44705 -252184 159915 168015
78 168015 -232817 -83921 250768 -37748 -229951 130693 182476 -186749 -80647 238828
88 238828 5614 -226394 101054 185531 -185149 -119136 224078 4757 -240000 93395
98 93395 195802 -176505 -104244 235420 14876 -225094 95596 182450 -177177 -110014 205348
109 205348 -193 -216832 74566 167747 -147094 -105300 193987 33696 -197496 58892
$$ packed form
0@%%%%%%%%%%%Qj6J6j6J6k4L2l2M0n0N8p2Q3r5J16j37J54j75K02k31K63k96L35
34A79l82M32m83N39o04O74p48Q32r24J022j130J247j375J517j671J839k026K233
52A171k462K717l001L322l689M113m605N182n880O738p816R228j1155J3949j8380
67a0568K6440m5473J64413Q1266m75833K08790L36510l30250k07479M12099Q100
78A68015m00832J48896L34689k88516j92203L60644N1783l69225J06102L19475
88B38828k33214k32008L27448Q4477l70680O6013L43214k19321k44757L33395
98I3395J02407l72307P2261L39664k20544k39970L20690Q6854l59627O7163L15362
109B05348k05541k16639K91398R3181l14841M1794K99287j60291k31192K56388
$$ plain form
119 58892 178147 -132922 -125732 175978 36617 -209262 36237 179725 -126403 -129407 184830
130 184830 51637 -196200 47870 182245 -118695 -122187 168068 40898 -190784 30200
140 30200 161664 -106966 -118682 153476 56965 -165717 24461 167968 -80862 -123211 140564
151 140564 67453 -172295 1300 166592 -81957 -137503 140815 76183 -168930 8696
161 8696 176817 -73914 -129894 141065 72243 -168003 716 158343 -76319 -130010 121967
172 121967 71835 -150221 -6607 156776 -50154 -126853 110806 86466 -145128 -26812
182 -26812 152523 -46720 -144143 99440 91903 -148553 -30477 162089 -40127 -138834 107713
193 107713 93508 -144828 -27660 150792 -45487 -136637 92700 83039 -134888 -31080 141304
$$ packed form
119E8892J19255l11069P190L01710j39361k45879K45499J43488l06128l004L14237
130A84830j33193k47837K44070J34375l00940l492K90255j27170k31682K20984
140C0200J31464k68630j1716K72158r6511k22682J90178J43507k48830m2349K63775
151A40564p3111k39748J73595J65292k48549n5546K78318o4632k45113J77626
161H696J68121k50731n5980K70959o8822k40246J68719J57627k34662n3691K51977
172A21967n0132k22056J43614J63383k06930p6699K37659k4340k31594J18316
182b6812J79335j99243r7423K43583p537k40456J18076J92566k02216r8707K46547
193A07713j4205k38336J17168J78452j96279r1150K29337r661k17927J03808J72384
$$ plain form
204 141304 -28436 -124290 83667 95323 -116477 -43366 137243 -14215 -137505 67510
214 67510 103932 -121173 -58314 145169 -5810 -141184 74955 115891 -118340 -53684 149323
225 149323 -8888 -140626 71167 103724 -117768 -53525 134626 -5834 -127024 62515
235 62515 104792 -95999 -54654 125497 9934 -124000 43341 105990 -90277 -73088 117868
246 117868 19589 -131202 37276 117505 -86468 -74161 125849 23586 -131661 37480
256 37480 113577 -89976 -77220 116169 18357 -128592 32156 108698 -78746 -72864 109806
267 109806 28992 -118115 21101 108576 -68434 -84884 98732 36361 -122323 9156 113859
278 113859 -62052 -88593 102495 46353 -119696 10622 117104 -61455 -89006 97557
$$ packed form
204A41304j69740r5854K07957J1656k11800P3111J80609j51458j23290K05015
214F7510L6422k25105O2859K03483j50979j35374K16139M0936k34231O4656K03007
225A49323j58211j31738K11793L2557k21492O4243J88151j40460j21190J89539
235F2515M2277k00791M1345J80151j15563j33934J67341O2649j96267J7189J90956
246A17868r8279j50791J68478Q0229k03973J2307K00010j02263j55247J69141
256C7480P6097k03553J2756J93389r7812j46949J60748P6542j87444N882J82670
267A09806q0814j47107J39216Q7475j77010j6450J83616o2371j58684J31479J04703
278A13859j75911k6541J91088n6142j66049J30318J06482j78559k7551J86563
$$ plain form
288 97557 40650 -117508 6739 108079 -54971 -83090 90065 46913 -103491 2406 107034
299 107034 -42153 -85241 79386 52435 -102970 -11368 106581 -35934 -93027 78239 62450
310 62450 -102627 -11101 113728 -33837 -92072 78902 59136 -103422 -12779 104488 -34692
321 -34692 -89175 72375 57966 -94266 -15153 102263 -23488 -87512 62334 62973 -87988
332 -87988 -28628 97322 -16476 -95958 53692 70444 -87140 -33678 103167 -10894 -97838
343 -97838 55988 73185 -89306 -34115 100668 -15710 -96327 52761 66187 -83858 -31269
354 -31269 93518 -8851 -87115 46585 68308 -72502 -37108 87080 -145 -89907 34506
365 34506 73736 -69065 -47108 90488 9201 -93866 35416 82957 -69368 -48861 94285
$$ packed form
288I7557n6907j58158J24247J01340j63050k8119J73155m3152j50404J05897J04628
299A07034j49187m3088J64627k6951j55405R1602J17949j42515n7093J71266j5789
310F2450j65077R1526J24829j47565n8235J70974j9766j62558R0643J17267j39180
321c4692n4483J61550j4409j52232P9113J17416j25751o4024J49846O39j50961
332h7988N9360J25950j13798p9482J49650J6752j57584N3462J36845j14061q6944
343i7838J53826J7197j62491N5191J34783j16378q0617J49088J3426j50045N2589
354c1269J24787j02369p8264J33700K1723j40810L5394J24188q7225q9762J24413
365C4506L9230j42801K1957J37596q1287j03067J29282M7541j52325K0507J43146
$$ plain form
376 94285 7957 -96986 35268 79322 -70955 -46674 90096 7549 -88296 33553 75931
387 75931 -59939 -45092 80889 14013 -83554 21210 74432 -52830 -54190 74664 22395
398 22395 -84602 15169 81336 -48064 -58268 76784 26326 -88041 13167 81209 -51447
409 -51447 -60366 74904 23430 -86469 13105 78429 -46680 -56889 70833 26367 -80620
420 -80620 6969 75314 -40422 -61072 62055 31937 -79553 -1241 78946 -33962 -65543
431 -65543 63224 38855 -79891 -2827 81092 -33915 -66907 61224 36695 -79463 -3245
442 -3245 77857 -31363 -62419 58299 38093 -70839 -5288 73689 -23853 -61954 49832
453 49832 41139 -67362 -13433 73794 -17225 -65897 47874 48193 -66951 -16360 78215 -15626
$$ packed form
376I4285q6328j04943J32254M4054j50277K4281J36770q2547r5845J21849M2378
387G5931j35870J4847J25981o6876r7567J04764N3222j27262j360J28854n2269
398B2395j06997R9771O6167j29400j0204J35052n0458j14367J01208O8042j32656
409e1447q919J35270n1474j09899R9574O5324j25109j0209J27722m4466j06987
420h0620Q7589O8345j15736k0650J23127l0118j11490P8312Q0187j12908l1581
431f5543J28767k4369j18746P7064Q3919j15007l2992J28131k4529j16158P6218
442c245Q1102j09220l1056J20718k0206j08932O5551P8977r7542l8101J11786
453D9832q693j08501N3929Q7227r1019m8672J13771L19j15144N0591R4575r3841
$$ plain form
465 -15626 -69417 48402 48476 -70070 -16816 76212 -17562 -67333 47282 46398 -64679 -15869
477 -15869 72071 -12855 -63825 39916 46452 -59087 -23036 66380 -5969 -66516 31982 52467
489 52467 -55967 -29616 69458 -598 -70159 31535 55587 -57963 -31563 69434 -2600
500 -2600 -70321 31635 52713 -56577 -27933 66599 -1225 -63902 28837 50645 -49446 -29891
512 -29891 60048 3546 -62665 20595 53142 -43575 -35702 59549 11754 -64232 17608 59782
524 59782 -43010 -40397 62214 13047 -68530 17639 60292 -44781 -38891 62095 12421 -64457
536 -64457 17995 57527 -39980 -36951 56544 13738 -59793 11647 54511 -33465 -40329 50411
548 50411 20049 -58237 5620 57720 -29124 -44550 49841 23871 -60742 2608 58833 -29996
$$ packed form
465a5626n3791J17819P4j18546N3254R3028r3774m9771J14615q84j11077M8810
477a5869Q7940q4926n0970J03741O536j05539L6051Q9416p2349o0547R8498K0485
489E2467j08434K6351R9074p0056o9561J01694K4052j13550K6400J00997p2034
500b600o7721J01956K1078j09290K8644R4532o7824o2677R2739K1808j00091J9555
512b9891Q9939n6502o6211Q3260L2547r6717P873R5251m7795p5986Q1840M2174
524E9782j02792K613J02611m9167q1577Q6169M2653j05073N890J00986m9674p6878
536f4457Q2452L9532r7507L029R3495m2806p3531P1440M2864q7976o864R0740
548E0411l0362p8286O3857N2100q6844j5426R4391k5970q4613O3350N6225q8829
$$ plain form
560 -29996 -46627 49879 23034 -60755 3570 57871 -28812 -44370 47271 22533 -57254 375
572 375 54911 -25229 -45706 42183 26024 -54737 -4562 55591 -19521 -48325 40327 30993 -54805
585 -54805 -7907 58041 -18970 -51012 40230 31477 -54849 -7446 57206 -17775 -47864 38798
597 38798 31163 -50302 -7912 53110 -14219 -46153 33127 31874 -45562 -12583 51727 -7799
609 -7799 -47550 30009 37176 -44689 -16589 53980 -5792 -51074 29429 38760 -46800 -17477 54885
622 54885 -6751 -51040 30235 37465 -45096 -16120 52296 -5706 -47617 25917 35810 -40680
634 -40680 -19281 47442 -1072 -47241 19955 38925 -36852 -24111 47032 3815 -50045 17373
646 17373 42152 -37469 -27464 48418 4002 -51765 18307 42029 -37657 -25253 47774 3451
$$ packed form
560b9996j6631R6506k6845q3789O4325N4301q6683j5558R1641k4738p9787N7629
572C75N4536q0140k0477Q7889j6159q0761N0175O0153p5112k8804Q8652r334q5798
585e4805M6898O5948p7011l2042R1242q753q6326M7403O4652p4981l0089Q6662
597C8798p635q1465M2390O1022o7329l1934P9280j253p7436L2979O4310n9526
609g799l9751P7559P167q1865K8100P0569n9772m5282Q0503R331q5560K9323P2362
622E4885o1636m4289Q1275P230q2561K8976O8416n8002m1911P3534R893p6490
634d0680K1399O6723m8514m6169O7196J8970p5777J2741P1143m3217n3860O7418
646A7373K4779p9621J0005P5882m4416n5767P0072K3722p9686J2404P3027m4323
$$ plain form
658 3451 -48578 17438 39240 -34345 -24595 42988 5441 -45140 12510 39459 -28789 -27355 41063
671 41063 11101 -45413 8882 42991 -27236 -31725 41819 13709 -48560 8170 45479 -28018
683 -28018 -31816 43418 13441 -47208 9123 43746 -27200 -30347 40107 13063 -44394 6042
695 6042 40955 -22604 -30616 35774 16570 -41033 1732 41866 -18292 -33816 33594 19896
707 19896 -42507 -1767 43431 -18400 -36080 33894 20475 -43285 -918 43348 -18385 -34890
719 -34890 32827 19438 -41691 -2223 40682 -16478 -34576 29327 20777 -38979 -5342 40389
731 40389 -12204 -36218 27130 24221 -38438 -8304 41920 -10791 -38383 27039 25537 -38941
743 -38941 -8324 42477 -10564 -37004 26973 24792 -36959 -8065 39698 -8733 -34876 23106
$$ packed form
658C451n2029O6016K1802p3585R750O7583l7547n0581N7650K6949o8248J434O8418
671D1063k9962n6514N4295L4109p0227m489P3544k8110o2269N6730L7309p3497
683b8018l798P5234k9977o0649N6331L4623p0946l147P0454k7044n7457N0436
695F042L4913o3559q012O6390j9204n7603M2765M0134o0158j5524O7410j3698
707A9896o2403M0740M5198o1831j7680O9974j3419o3760M2367M4266o1733j6505
719c4890O7717j3389o1129L9468M2905n7160j8098O3903q550n9756L3637M5731
731D0389n2593k4014O3348k909o2659L0134N0224n2711k7592O5422j502o4478
743c8941L0617N0801n3041k6440O3977k181o1751K8894M7763m8431k6143N7982
$$ plain form
755 23106 24681 -33139 -10332 37725 -4494 -34565 19861 27750 -30664 -14203 38044 -1606
767 -1606 -37713 18903 30147 -32157 -15480 39725 -2101 -38243 19912 29831 -32383 -14250
779 -14250 38573 -2648 -36406 18231 27658 -29928 -14862 35054 -37 -34725 14047 28710
791 28710 -25880 -18162 33184 3853 -35769 10668 31106 -25263 -21783 34168 5426 -37753
803 -37753 10764 32154 -26086 -20896 34469 4668 -36589 11127 30247 -24683 -19615 32006
815 32006 5095 -33583 8569 29163 -20767 -20052 29258 8557 -32578 5358 31031 -18493
827 -18493 -23064 29115 11105 -34217 4072 33370 -18568 -24470 30436 11621 -34830 4882
839 4882 33037 -18961 -23305 28961 10544 -32697 4091 30611 -16362 -22575 26170 12353 -30015
$$ packed form
755B3106J575n7820K2807M8057m2219l0071N4426P889n8414J6461N2247l9650
767a606l6107N6616J1244o2304J6677N5205m1826l6142N8155R919o2214J8133
779a4250N2823m1221l3758N4637R427n7586J5066M9916l5091l4688M8772J4663
791B8710n4590P718N1346k9331l9622M6437K0438n6369L480N5951k8742m3179
803c7753M8517K1390n8240N190N5365k9801m1257M7716J9120n4930N068N1621
815C2006k6911l8678M2152K0594m9930P15M9310k0701m1135L7936K5673m9524
827a8493m571N2179j8010m5322L8289K9298n1938n902N4906j8815m6451L9712
839D882K8155n1998m344N2266j8417m3241L6788K6520m6973o213M8745j3817m2368
$$ plain form
852 -30015 1048 30300 -13265 -24663 23785 14560 -30012 -1641 31380 -12196 -26285 23788
864 23788 15659 -31270 -1807 31735 -12483 -26091 23465 14755 -30368 -2047 29931 -11651
876 -11651 -25249 21801 15086 -28221 -3465 29343 -8964 -26034 19354 17385 -27539 -6359
888 -6359 29964 -6813 -27562 19284 19074 -28077 -7019 30935 -6903 -27684 19290 18881 -27600
901 -27600 -6344 29701 -6627 -25993 17483 18292 -24245 -7175 27604 -3342 -25035 14581
913 14581 20103 -22134 -10251 27397 -921 -26697 12929 21951 -22599 -11643 28663 -577
925 -577 -27858 13940 22397 -23591 -11367 28722 -1477 -27273 13676 20919 -22167 -10964 26323
938 26323 -614 -25628 11028 20410 -19578 -12819 24049 2231 -25743 7805 22284 -18087
$$ packed form
852c0015L1063K9252m3565j1398M8448r225m4572K8371L3021m3576j4089N0073
864B3788q129m6929K9463L3542m4218j3608M9556q710m5123K8321L1978m1582
876a1651j3598M7050o715m3307K4756L2808l8307j7070M5388j969m4924K1180
888f359L6323l6777k0749M6846k10m7151K1058L7954l7838k0781M6974m09m6481
901b7600K1256L6045l6328j9366M3476Q09m2537J7070L4779l0946k1693L9616
913A4581N522m2237J1883L7648k8318k5776L9626R022m4550J0956M0306k9240
925e77k7281M1798Q457m5988J2224M0089l0199k5796M0949P243m3086J1203L7287
938B6323k6937k5014L6656R382l9988O759L6868k1818k7974L3548J4479m0371
$$ plain form
950 -18087 -15218 24442 4534 -27251 7104 23658 -18343 -16219 25134 4503 -27350 7680
962 7680 22954 -18343 -15184 24162 3873 -25482 6947 21868 -16012 -14630 21957 5417 -24102
975 -24102 4427 21960 -13676 -16512 21080 7915 -24942 2976 24026 -13126 -18001 22041
987 22041 8788 -25395 3056 24725 -13494 -17901 21908 8498 -24918 3023 23484 -12261
999 -12261 -16997 19856 9055 -22593 1119 22614 -10156 -17905 17619 10719 -22413 -1452 22927
1012 22927 -8835 -19572 17402 12191 -22807 -1672 23651 -9085 -20005 17393 11616 -22885
1024 -22885 -1516 22713 -8937 -19250 16677 11153 -21372 -2236 21795 -6943 -19144 14746
1036 14746 12485 -20266 -4629 22105 -5485 -20488 14131 14414 -20708 -5660 23562 -5027
$$ packed form
950a8087K869L9660j9908l1785L4355J6554m2001K124M1353k0631l1853L5030
962G680J5274m1297L159L9346k0289k9355L2429J4921l7880J382L6587j6540k9519
975b4102K8529J7533l5636k836L7592j3165l2857K7918K1050l7152m875M0042
987B2041j3253l4183K8451K1669l8219m407L9809j3410l3416K7941K0461l5745
999a2261m736L6853j0801l1648K3712K1495l2770p749L5524o900l3132K0961K4379
1012B2927l1762j0737L6974n211l4998K1135K5323l2736j0920L7398n777l4501
1024b2885K1369K4229l1650j0313L5927n524l2525J9136K4031k8738j2201L3890
1036A4746k261l2751J5637K6734k7590j5003L4619K83l5122J5048K9222k8589
$$ plain form
1048 -5027 -21093 14607 14629 -20876 -4997 22978 -5136 -19986 14020 13697 -19232 -5127 21167
1061 21167 -3501 -18833 11693 14352 -17123 -7040 20162 -1541 -19455 9716 16193 -16575
1073 -16575 -8589 21472 14 -20935 9944 17249 -17557 -8945 21895 -1059 -21186 10397
1085 10397 16056 -17682 -8256 20393 -777 -19829 9263 15322 -15598 -9074 18699 793 -19235
1098 -19235 6867 16011 -13946 -11026 18414 2704 -20097 5653 17813 -13952 -12008 19204
1110 19204 3225 -20911 5773 17965 -14346 -11637 18830 2600 -19884 5633 16926 -12856
1122 -12856 -11035 17296 3495 -18750 4234 16933 -11134 -12163 16710 5320 -18658 2928
1134 2928 18156 -10444 -13300 16933 6413 -19489 2747 18974 -10744 -13511 17136 6361
$$ packed form
1048e027j6066L5700K2l5505J5879K7975k8114j4850L4006l23l2929J4105K6294
1061B1167k4668j5332L0526K659l1475J0083K7202k1703j7914K9171O477l2768
1073a6575P986L0061k1458k0949L0879P305l4806Q612L0840k2954k0127L1583
1085A0397N659l3738R426K8649k1170j9052K9092O059l0920O524K7773j7906k0028
1098a9235K6102R144k9957K920K9440j5710k2801K5750J2160l1765J944L1212
1110A9204j5979k4136K6684J2192l2311K709L0467j6230k2484K5517J1293k9782
1122a2856J821K8331j3801k2245K2984J2699k8067j029K8873j1390k3978K1586
1134B928J5228k8600k856L0233j0520k5902K2236J6227k9718k767L0647j0775
$$ plain form
1146 6361 -19468 2890 18434 -10362 -12876 16214 6376 -18134 1801 17191 -8953 -13336 14455
1159 14455 7400 -17476 -251 17489 -7371 -14484 13808 9043 -17728 -1164 18295 -7358
1171 -7358 -15206 13969 8558 -18345 -825 18050 -7555 -14797 13546 8123 -17047 -1096 17125
1184 17125 -6220 -14402 12045 8950 -16295 -2775 17216 -4825 -15666 11053 10556 -16282 -3818
1197 -3818 18022 -4313 -16419 11475 11173 -16632 -3758 18385 -4494 -15798 11542 10678 -15546
1210 -15546 -3414 17186 -3789 -15081 10249 10568 -13950 -4236 16002 -1744 -14860 8227
1222 8227 12120 -13214 -6555 16293 -453 -16311 8015 13232 -13851 -6944 17202 -756 -16752
1235 -16752 8104 13319 -14065 -6419 16676 -1166 -15954 7908 12180 -13087 -6659 15356 -427
$$ packed form
1146F361k5829K2358J5544k8796k514K9090r838k4510J9935J5390k6144m383K7791
1159A4455p055k4876J7225J7740k4860p113K8292m765k6771J6564J9459k5653
1171g358p848K9175n411k6903J7520J8875k5605p242K8343n423k5170J5951J8221
1184A7125k3345q182K6447l095k5245J3520J9991k2041j0841K6719m97k6838J2464
1197c818K1840k2335j2106K7894l02k7805J2874K2143k2879j1304K7340q64k6224
1210a5546J2132K0600k0975j1292K5330L19k4518R714K0238j7746j3116K3087
1222H227L893k5334O659K2848j6746j5858K4326N217k7083O907K4146j7958j5996
1235a6752K4856N215k7384P646K3095j7842j4788K3862M272k5267O428K2015j5783
$$ plain form
1248 -427 -15032 6088 12285 -11540 -7858 14599 1557 -15702 4580 13624 -10992 -9206 15014
1261 15014 2402 -16709 4779 14368 -11327 -9504 15328 2081 -16110 4538 13364 -10847
1273 -10847 -8775 14274 2536 -15318 3969 13403 -9025 -9188 13199 3760 -14369 2358 14032
1286 14032 -8296 -10446 13306 5049 -15259 1979 14686 -8328 -10874 13600 5316 -15501 2070
1299 2070 14617 -8432 -10678 13006 5002 -14852 1510 13763 -7272 -10643 11500 5558 -13888
1312 -13888 38 13817 -6153 -11594 10947 6853 -13887 -1013 14519 -5791 -12400 10909
1324 10909 7159 -14457 -931 14487 -5906 -11914 10763 6877 -13831 -970 13987 -5279
1336 -5279 -11743 9666 7161 -13039 -1956 13432 -3852 -12025 8790 8341 -12595 -3255 14122
$$ packed form
1248d27j4605K1120O197k3825L682K2457j3042j7259K0282R044k4616J786K4220
1261A5014j2612j9111K1488R589k5695J823K4832j3247j8191K0648Q826k4211
1273a0847K072K3049j1738j7854J9287R434k2428j63K2387r439j8129J6727J1674
1286A4032k2328k150K3752q257k0308J7238J2707k3014k546K4474q284k0817J7571
1299B070J2547k3049k246K3684q004j9854J6362J2253k1035l371K2143n942j9446
1312a3888J3926J3779j9970n441K2541m094k0740J2874J5532k0310o609K3309
1324A0909l750k1616J3526J5418k0393o008K2677l886k0708J2861J4957j9266
1336e279o464K1409k505k0200J1083J5388j7284q173K0815m49k0936R340J7377
$$ plain form
1349 14122 -2976 -12721 8727 9015 -12869 -3577 14674 -2888 -13137 8920 9239 -12866 -3114
1362 -3114 13819 -2858 -12136 8032 8885 -11157 -3731 12651 -1441 -11707 6506 9289 -10249
1375 -10249 -4946 12581 258 -12747 5565 10443 -10128 -6153 13490 352 -13413 5857
1387 5857 10944 -10787 -5974 13503 -84 -13125 6088 10131 -10732 -5760 12067 -35 -12466
1400 -12466 4716 9812 -9179 -6329 11447 1326 -12362 3799 10576 -8261 -7559 11376 2448
1413 2448 -12982 2983 11543 -8413 -8033 11775 2481 -12941 3121 11302 -8503 -7652 11315
1426 11315 2628 -12101 2752 10947 -7372 -7558 10478 3344 -11445 1608 10874 -6222 -8295
1439 -8295 9880 4665 -11866 969 11706 -6054 -8899 10432 4721 -12139 915 12051 -6211
$$ packed form
1349A4122j7098r745K1448K88k1884R292J8251j7562j0249K2057L19k2105R752
1362c114J6933j6677r278K0168Q53k0042P426J6382j4092j0266J8213K783j9538
1375a0249N303J7527j2323j3005J8312M878k0571L975J9643j3138j3765J9270
1387E857N087k1731M813J9477j3587j3041J9213M043k0863M972J7827j2102j2431
1400a2466J7182N096j8991K850J7776j0121j3688J6161O777j8837P02J8935q928
1413B448j5430J5965Q560j9956L80J9808r294j5422J6062Q181j9805Q51J8967
1426A1315q687j4729J4853Q195j8319j86J8036p134j4789J3053R266j7096k073
1439h295J8175n215j6531J2835J0737j7760k845J9331n711j6860J3054J1136j8262
$$ plain form
1452 -6211 -8881 10181 4433 -11818 888 11266 -5467 -8630 9071 4549 -11093 -270 10868
1465 10868 -4525 -9381 8416 5542 -10607 -1278 11439 -3957 -9669 8029 6181 -11293 -1437
1478 -1437 11579 -3787 -10034 8314 5778 -11072 -1057 10898 -3822 -9664 7464 5849 -10020
1491 -10020 -1686 10399 -2743 -9385 6673 6630 -9683 -2744 10681 -2060 -10268 6567 7444 -9587
1505 -9587 -3412 11415 -1752 -10686 6649 7582 -9992 -2938 11000 -1700 -10150 6283 7148 -9071
1519 -9071 -2860 10310 -1092 -9521 5326 7466 -8116 -3831 9782 140 -9884 4152 8297
1532 8297 -7665 -4844 10049 451 -10547 4314 8920 -8328 -5158 10175 256 -10687 4258
1545 4258 8401 -8242 -4478 9930 328 -9906 4033 7859 -7499 -4763 9241 1137 -9505
$$ packed form
1452f211k670J9062n748j6251J2706J0378j6733l163J7701m522j5642J0823J1138
1465A0868j5393m856J7797k874j6149R329J2717j5396n712J7698j848j7474R856
1478a437J3016j5366o247J8348k536j6850J0015J1955j4720n842J7128j615j5869
1491a0020Q334J2085j3142o642J6058m3j6313O939J3425j2741q208J6835Q77j7031
1505i587O175J4827j3167q934J7335R33j7574P054J3938j2700q450J6433Q65j6219
1519i071O211J3170j1402q429J4847K140j5582M285J3613r642j0024J4036M145
1532H297j5962K821J4893r598j0998J4861M606j7248L170J5333r919j0943J4945
1545D258M143j6643L764J4408r602j0234J3939L826j5358K736J4004q104j0642
$$ plain form
1558 -9505 2804 8381 -6628 -5848 9004 1853 -10001 2357 8854 -6171 -6412 9065 2431 -10094
1572 -10094 2355 9173 -6335 -6149 8856 2098 -9671 1916 8861 -5650 -6188 8197 2711
1585 2711 -9240 1501 8550 -4849 -6487 7843 3276 -9123 544 8981 -4627 -7059 7730
1598 7730 3841 -9455 608 9372 -4588 -7221 7907 3620 -9423 496 8982 -4233 -6994
1611 -6994 7476 3883 -9037 -123 8803 -3630 -7266 6317 4408 -8375 -930 8691 -2825
1624 -2825 -7635 6253 4978 -8273 -1314 9380 -2830 -8195 6156 5291 -8753 -1289 9021
1637 9021 -2880 -7720 6150 4927 -8073 -1302 8373 -2173 -7482 5241 5043 -7532 -2107 8384
1651 8384 -1502 -7879 4813 5795 -7299 -2854 8566 -951 -8435 5081 6328 -7635 -2743 8968
$$ packed form
1558i505J2309N577j5009P80J4852p151j1854J2358O497j5025k41J5477o634j2525
1572a0094J2449O818j5508J86J5005o758j1769J1587O945j4511n38J4385n486
1585B711j1951J0741P049j3399j638J4330m567j2399R667Q437j3608k432J4789
1598G730l889j3296J0063Q764j3960k633J5128m287j3043R919Q486j3215k761
1611f994J4470l593j2920Q914Q926j2433l636J3583j909j2783P445R621j1516
1624b825m810J3888j275j3251O959J0694j2210n365J4351q65j4044P464J0310
1637I021j1901m840J3870j223j3000O771R675j0546n309J2723j98j2575N425J0491
1651H384r886o377J2692R82j3094M445J1420r517p484J3516J247j3963M892J1711
$$ plain form
1665 8968 -1139 -8254 4902 6124 -7619 -2572 8472 -926 -7615 4358 5978 -6483 -3154
1678 -3154 7787 -42 -7676 3365 6197 -6079 -4003 7768 674 -8148 2987 6938 -6340
1691 -6340 -4418 7927 762 -8452 3192 6748 -6401 -3666 8196 241 -8074 3122 6374 -5818
1705 -5818 -3804 7420 735 -7801 2237 6502 -5339 -4555 6806 1525 -7784 1824 6985 -4875
1719 -4875 -5245 6651 1811 -8234 1412 7299 -5021 -5117 6924 2114 -8068 1467 7013 -4472
1733 -4472 -4971 6694 2224 -7322 1397 6716 -3879 -5071 5977 2862 -7142 416 7340 -3650
1747 -3650 -5481 6157 2909 -7441 276 7435 -3639 -5764 6305 3055 -7489 396 7180 -3558
1761 -3558 -5642 5838 3260 -7232 -8 7045 -2897 -5520 5338 3320 -6606 -772 6937 -2452
$$ packed form
1665H968j0107p115J3156J222j3743N047J1044r398o689J1973J620j2461L329
1678c154J0941p829p634J1041K832j2276K076J1771p094q822J1135L951j3278
1691f340J922J2345p165r214J1644L556j3149K735J1862p955q315J1196L252j2192
1705e818K014J1224o685q536J0038M265j1841P84J1361n281r309R608N161j1860
1719d875l70J1896m840j0045R646N887j2320r6J2041m810j0182R535N546j1485
1733d472m99J1665m470r546Q719N319j0595j192J1048l115j0004P558O924j0990
1747c650j831J1638l248j0350P717P159j1074k125J2069l250j0544P885O784j0738
1761c558k084J1480k578j0492P224P053r942k623J0858k018r926N834P709r389
$$ plain form
1775 -2452 -5822 4894 3862 -6742 -1096 7301 -2266 -6391 4832 4338 -6934 -999 7196 -2191
1789 -2191 -6210 4790 4059 -6553 -1143 6665 -2248 -5870 4219 3862 -5989 -1396 6567 -1327 -5745
1804 -5745 4065 4697 -5791 -2003 6670 -635 -6641 3742 4946 -5854 -2518 7044 -1016 -6647
1818 -6647 4121 5046 -5992 -1919 7029 -663 -6212 3523 4544 -5279 -1956 6264 -561 -5884 2590
1833 2590 4810 -4757 -2841 5813 63 -6107 2320 5295 -4901 -2890 6134 548 -6419 2477 5395
1848 5395 -5183 -3200 6286 122 -6530 2435 4993 -4897 -2959 6072 166 -6005 2131 5076 -4288
1863 -4288 -3285 5471 780 -6039 1486 5040 -3781 -3794 5359 1415 -6048 1040 5590 -3948 -3974 5762
1879 5762 1532 -6378 1280 5620 -3555 -3494 5267 1227 -6086 1233 5308 -3039 -3658 4726 1981 -5557
$$ packed form
1775b452l370J0716j032j0604N646Q397r567m125J1223m94j1272N935Q195r387
1789b191m019J1000p31j0612N410P808q913l622J0089l57r851M593P963p894m418
1804e745R810O32j0488L788Q673p305o006J0383J204j0800L336R562q060n631
1818f647J0768R25j1038M073Q948p692n549R735J021r823L323Q220o825n323Q474
1833B590K220r567J916Q654n750o170Q427K975j0196K011R024n586o967Q896K918
1848E395j0578J983R486o164o652Q965K558r890J938R031n906o171Q136K945r364
1863d288J003Q756m691o819P525L554q821j3R153l944p463P088M550r538k6R736
1879E762m230p910P658M340r175O1Q761m040p313P319M075q347o19Q384k745p538
$$ plain form
1895 -5557 781 5446 -2712 -4035 4861 2198 -5891 552 5825 -2910 -4574 4971 2083 -6146 523
1910 523 5756 -2903 -4443 4910 2245 -5480 -118 5338 -2503 -4506 4336 2004 -5186 -373 5646
1925 5646 -1935 -4237 3628 3014 -5499 -1013 5344 -1887 -4752 3574 2768 -4826 -832 6555 -2494
1940 -2494 -4395 4898 2831 -5308 -699 5482 -1689 -4485 3688 2892 -4878 -912 5149 -1422 -4418
1955 -4418 3214 3529 -4350 -1416 5173 -864 -4957 3127 3622 -4604 -1554 5505 -751 -5116 3041
1970 3041 3674 -4882 -1657 5328 -639 -4979 2924 3450 -4426 -1590 4905 -548 -4976 2195 3934
1985 3934 -3640 -1643 4457 430 -4670 2395 3994 -3553 -2519 5070 -241 -4902 2488 4181 -4294
2000 -4294 -2923 4813 -459 -4767 1558 3689 -3790 -2142 4776 118 -4729 2007 3810 -3819 -2219
$$ packed form
1895e557O338M665q158j323Q896k663q089O443N273q735j664R545k888q229O669
1910E23N233q659j540R353k665p725N362N456p841k003Q842k332p190M813O019
1925E646p581k302P865o14q513M486O357p231k865Q326q06p594L994P387r049
1940b494j901R293k067q139M609O181p171k796Q173p96p770L966O061o571k996
1955d418P632L15p879K934O589o037m093Q084M95q226L050P059o256m365Q157
1970C041O33q556L225O985n967m340P903N26p876K836O495n453m428P171J739
1985C934p574J997O100m027n100P065J599p547J034P589n311m661P390J693q475
2000d294J371P736n272m308O325K131p479J648O918m658m847O736J803p629J600
$$ plain form
2015 -2219 4622 277 -4762 1449 4170 -3333 -2760 4585 741 -4947 1322 4322 -3209 -2970 4384
2030 4384 930 -4996 1323 4461 -3183 -2796 4381 942 -4445 1203 4253 -2876 -2961 4049 1264 -4493
2046 -4493 684 4216 -2594 -3151 4029 1349 -4381 794 4588 -2247 -3181 3918 1505 -4818 612
2061 612 4507 -2547 -3420 3990 1425 -4634 613 4083 -2508 -3176 3850 1666 -4138 132 4097 -2021
2077 -2021 -3147 3184 1753 -4145 -119 4542 -1608 -3497 3172 2205 -4251 -218 4669 -1597 -3948
2092 -3948 3422 2248 -4299 -357 4343 -1822 -3479 3260 1975 -4133 -284 4298 -1430 -3308 2789
2107 2789 2339 -3653 -321 4103 -1166 -3468 2763 2649 -3683 -914 4550 -952 -4012 2846 2936 -3953
2123 -3953 -1010 4521 -690 -3838 2820 2548 -3784 -893 4016 -728 -3600 2711 2383 -3281 -1018
$$ packed form
2015b219O841m345n039O211K721p503N73P345l844n688O269L000p531K39P354
2030D384l454n926O319L138p644L87P177l439n387N648L050p129q5P010k785n757
2046d493N177L532o810n57P180k680n730N175L794o835r34P099k413o323N430
2061F12L895p054q73P410k565o059N247L470o591o68P026k184n804M270L965o118
2077b021j126O331j431n898M026M661o150j889O669r67o456M033M887o266k351
2092c948P370j174o547L942M700o165j657O739j285o108L849M582n728j878O097
2107B789m50n992L332M424n269k302O231j14o332K769N464n502l060O858R0o889
2123c953K943N531n211l148O658k72o332K891M909m744k872O311l28n664K263
$$ plain form
2138 -1018 3905 -364 -3747 2132 2849 -3334 -1528 4057 -456 -3789 1852 3074 -3501 -1566 4055
2153 4055 -293 -3723 1896 2690 -3391 -1715 3834 141 -3796 1765 2936 -3013 -1172 3733 -3
2168 -3 -3602 1134 2827 -2795 -1460 3409 457 -3203 941 3228 -2888 -1960 3721 380 -4132 1557
2184 1557 3064 -2266 -1971 3362 684 -4001 1482 3341 -2496 -1708 3061 343 -3383 859 2988
2199 2988 -2237 -2107 3283 793 -3418 808 3572 -1967 -2485 3259 1039 -3901 638 3501 -2296
2214 -2296 -2282 3422 1057 -3756 481 3085 -2376 -2310 3128 829 -3551 493 3136 -1970 -2415 2835
2230 2835 1179 -3454 272 3230 -1451 -2635 2546 1534 -3415 -124 3442 -1401 -2789 2937 1734
2245 1734 -3391 -62 3665 -1539 -2706 2860 1320 -3605 -6 3179 -1478 -2621 2429 1757 -3106
$$ packed form
2138a018M923m269l383N879P17o183J806N585m513l333N641J222o575J935N621
2153D055m348l430N619P94o081J676N549l693l937N561J171n949J841M905l736
2168cl599M736J693n622J335M869k952l660M144K287o116R28N681l341m512N689
2184A557J507n330K95N333k678m685N483J859n837P88M769k718l726M242K129
2199B988n225J30N390k490m211M226K764n539n18N744k220m940M539K863n797
2214b296J4N704k365m813M237K604n461O6N438k299m380M044K643n106m45N250
2230B835j656m633L726K958m681j184N181j012m949L291L566m843j388N726j203
2245A734n125L329L727n204j167N566j540m925L599L185m657j143N050o72m863
$$ plain form
2260 -3106 -26 3352 -978 -2581 2056 1856 -2812 -302 3420 -960 -2786 2082 2055 -3213 -443 3355
2276 3355 -992 -2841 2212 1773 -3129 -517 3162 -982 -2982 2169 1752 -2779 -774 3166 -654
2291 -654 -2663 1788 1886 -2557 -864 3090 -261 -3200 1686 2140 -2585 -948 3166 -544 -3033 1621
2307 1621 2231 -2743 -1119 3131 -478 -2814 1549 2194 -2689 -1041 2956 -621 -2873 1502 2176 -2123
2323 -2123 -982 2728 1 -2962 957 2396 -2275 -1403 2833 61 -3084 1050 2554 -2163 -1395
2338 -1395 2930 162 -2896 1195 2645 -1933 -1269 2698 135 -2742 1233 2321 -2116 -1443 2655
2353 2655 275 -2849 681 2646 -1755 -1644 2790 449 -2895 587 2504 -1877 -1830 2999 523 -2915
2369 -2915 544 2473 -1841 -1488 2655 598 -2933 781 2366 -1769 -1508 2409 587 -2824 544
$$ packed form
2260c106L080L378m330j603M637k00m668K510L722m380j826M868k7n268K770L798
2276C355m347j849N053m39m902K612L679m144k000N151m17m531K005L940l820
2291f54k009M451R8m443J693L954l351k939M886M54m725J637M114l710k489M654
2307A621O10m974J624M250l609k336M363O45m883J648L997l577k252M375O74m299
2323b123J141L710k727k963L919J439m671Q72M236k772l145M134J504m717P68
2338a395M325k768l058M091J450m578O64L967k563k877L975J088m437O73M098
2353B655k380l124L530J965m401J11M434k341l344L482J917m381M7M829k476l438
2369b915L459J929m314L53M143k057l531L714J585m135K61L917j822l411L368
$$ plain form
2384 544 2519 -1527 -1781 2312 673 -2463 132 2539 -1336 -2090 2333 981 -2715 367 2572 -1451
2400 -1451 -2174 2593 781 -2755 488 2441 -1426 -1969 2176 967 -2478 211 2447 -1193 -1761 2151
2416 2151 1232 -2392 8 2375 -834 -2217 1826 1531 -2667 -130 2620 -820 -2084 1958 1524 -2575
2432 -2575 -180 2608 -997 -2070 2004 1204 -2488 -194 2553 -788 -1974 1589 1516 -2022 -524 2526
2448 2526 -667 -2226 1780 1327 -2360 -676 2434 -454 -2110 1485 1606 -2477 -511 2554 -497
2463 -497 -2209 1426 1549 -2177 -668 2307 -646 -2060 1176 1851 -2288 -633 2585 -308 -2256 1453
2479 1453 1777 -1866 -736 2312 -255 -2151 1169 1715 -1684 -1135 2620 -253 -2315 1202 1774 -1903
2495 -1903 -821 2403 -22 -2106 1400 1758 -1954 -593 2114 24 -2153 892 1562 -1752 -1241 2030
$$ packed form
2384E44J975m046k54M093j639l136K595K407l875p54M423j352l696L082K205m023
2400a451p23M767j812l536L243J953l867n43M145j209l445K689K236l640n68L912
2416B151r19l624K400K367l209j383M043k95m198K537K750l440j264M042m34m099
2432b575K395K788l605j073M074q00l692K294K747l341j186L563p3l538J498L050
2448B526l193j559M006m53l687J684L110k888j656L595J21m083J966L065l051
2463d97j712L635J23l726J509K975k953j414L236O75m139J655L218k893j948L709
2479A453L24l643J130L048k567j896L320N46l399N49L755k873k062L517N72l677
2495a903J082L224k425k084L506L58l712J361K707k090k177L045O70l314N11L271
$$ plain form
2511 2030 415 -2115 849 2076 -1495 -1254 2340 266 -2613 881 1773 -1772 -1142 2055 -8 -2355
2527 -2355 987 1910 -1794 -1098 2159 388 -2175 696 1942 -1611 -1149 1837 346 -2068 381 2003
2543 2003 -1229 -1626 1969 763 -2122 390 2035 -1373 -1496 1905 158 -2431 510 2216 -1579
2558 -1579 -1386 1705 753 -2271 211 1978 -1122 -1511 1668 884 -2010 199 2054 -877 -1415 1758
2574 1758 761 -2157 72 2208 -694 -1888 1802 885 -2148 78 1819 -736 -1566 1802 778 -1873
2590 -1873 95 2112 -749 -1478 1731 990 -2152 -37 1958 -692 -1722 1360 1223 -1910 -232 1979
2606 1979 -662 -1762 1503 934 -2030 -291 2248 -629 -1692 1585 1293 -2152 -287 2022 -485
2621 -485 -1677 1412 858 -1689 -53 1936 -472 -1852 1639 1169 -1457 -227 1699 -178 -1632 1116
$$ packed form
2511B030j615k530K964J227l571K41L594k074k879L494Q92l545O30L197k063k347
2527b355L342R23l704O96L257j771k563K871J246l553M62K986j491k414K449J622
2543B003l232l97L595j206k885K512J645l408j23L401j747k589K941J706l795
2558a579J93L091r52l024K482J767l100l89L179p84k894K209J855k931n38L173
2574A758r97k918K229K136k902j194L690r17l033K226J741k555q30L368j024k651
2590a873J968K017k861p29L209p41l142K115J995k650j030L082j37l133J678K211
2606A979k641j100L265n69k964J739K539k877j063L277k92l445J865K309k507
2621d85j192L089n54k547J636J989k408j380L491m70k626J230J926j877j454K748
$$ plain form
2637 1116 1355 -1632 -351 2280 -119 -1762 924 1566 -1647 -569 1972 -138 -1461 827 1257 -1636
2653 -1636 -647 2035 -233 -1671 1092 1381 -1219 -626 1725 329 -1852 598 1383 -1347 -798 1846
2669 1846 -75 -1944 238 1094 -1698 -742 1394 -188 -2065 761 1421 -1042 -907 1694 225 -2047
2685 -2047 712 1621 -1293 -791 1042 170 -1826 117 1174 -1300 -1024 1721 525 -1876 149 1431
2701 1431 -1170 -1468 1621 266 -2034 340 1835 -1013 -684 1782 384 -2158 211 2122 -945
2716 -945 -1292 1465 517 -1243 469 1705 -1389 -1541 1356 348 -1964 41 1704 -726 -1159 1052
2732 1052 531 -1804 -316 1152 -748 -1322 1492 666 -1529 500 1539 -1114 -1229 1263 569 -1473
2748 -1473 -30 1427 -951 -1075 1259 782 -1889 161 1465 -527 -1793 1454 951 -1531 -368 1478
$$ packed form
2637A116K39k987J281K631k399j643K686O42l213J078K541k110j323K288M30k893
2653a636R89K682k268j438K763K89k600N93K351j396k181K450P85k730N49K644
2669A846j921j869K182Q56k792R56K136j582j877K826O60k463J35K601j469k272
2685b047K759R09k914N02J833q72j996J943J057k474K76K745j196k401K025J282
2701A431k601k98L089j355k300K374J495k848L29K466j398k542K369J911l067
2716i45l47K757r48j760J712J236l094j52K897j008k312K005J663k430m33K211
2732A052n21k335J488J468j900n74K814q26k195K029J039k653j15K492o94k042
2748a473J443J457k378j24K334m77k671K050J304j992j266L247n03k482J163J846
$$ plain form
2764 1478 -599 -1393 1804 1109 -1753 -302 1678 -740 -1527 1224 718 -1913 -122 1518 -569 -1250
2780 -1250 911 772 -1784 -584 1544 -747 -1367 246 826 -1472 -100 1508 -768 -1797 1298 939
2796 939 -1544 -246 1536 -86 -1124 826 1325 -1352 -442 1511 -444 -1144 1054 807 -1124 -714
2812 -714 1245 -204 -1185 126 703 -1297 -649 1371 23 -1053 821 1202 -1531 -762 1796 -78
2828 -78 -1247 585 1068 -1144 -557 1337 -200 -1375 290 1002 -1392 -289 1564 -95 -1439 719
2844 719 1181 -1385 -278 1210 486 -1435 649 1190 -968 -666 1630 54 -1182 184 511 -671
2860 -671 -1087 648 -485 -1060 444 1359 -1054 -874 1474 199 -1544 -269 1217 -391 -767 1611
2876 1611 381 -1734 32 1018 -1069 -282 1241 391 -1165 -328 803 -1180 -868 931 267 -1505
$$ packed form
2764A478k077p94L197o95k862J451J980k418p87K751n06k631J791J640k087o81
2780a250K161j39k556J200K128k291o20J613N80k298J372J608k276j029L095l59
2796I39k483J298J782j622j038J950M99k677R10J953j955p00K198k47j931M10
2812g14J959j449r81J311N77k000O48K020j348j076J874L81k733P69K558j874
2828g8j169J832M83k212N87J894j537j175J665P12k394J103J853j659j344K158
2844G19M62k566J107J488p24j921K084N41k158L02K296j576j236J366L27j182
2860f71m16J735j133n75J504R15k413J80K348j275j743J275J486j608l76K378
2876A611j230k115J766R86k087P87J523q50j556Q37J131j983L12J799o64j772
$$ plain form
2892 -1505 -137 325 -799 -786 856 533 -1283 586 838 -885 -741 1411 819 -735 -46 620 -1347
2909 -1347 -1074 1125 -97 -1063 -87 1443 -583 -948 1363 113 -1897 9 1259 -686 -925 1284
2925 1284 1016 -841 121 1067 -769 -647 929 -23 -1813 -558 1117 -187 -1395 -200 542 -718
2941 -718 -334 719 -941 -1492 704 827 -534 -672 838 -654 -402 563 89 -552 -628 1513 -189 -1273
2959 -1273 383 598 204 73 319 -324 -1183 270 1207 -716 -961 513 329 -1189 330 936 -957
2976 -957 -507 1093 -290 -1582 404 879 -866 -224 857 192 -879 570 758 -913 -279 1164 -505
2993 -505 -1242 943 695 -781 109 526 125 -1063 620 861 -989 -9 1225 410 -1008 477 645
3010 645 -921 -598 1193 2 -1126 550 1044 -1185 -133 968 -186 -1142 -156 866 -712 -87
$$ packed form
2892a505J368M62j124J3J642l23j816J869K52j723J44K152n92j554O89O66j967
2909a347K73K199j222r66R76J530k026l65K311j250k010J906J250j945k39K209
2925A284k68j857R62R46j836J22J576r52j790J255J675j304j208J195P42j260
2941g18L84J053j660n51K196J23j361j38J510j492K52R65m74o41p6K141j702j084
2959a273J656K15l94j31K46o43q59J453R37j923k45J474j84j518J519O06j893
2976i57M50J600j383j292J986M75j745O42J081o65j071J449J88j671O34J443j669
2993e05p37K185k48j476Q90M17m01j188J683K41j850R80J234q15j418J485J68
3010F45j566L23J791j191j128J676M94k229J052J101j154r56R86J022j578O25
$$ plain form
3026 -87 1032 -280 -505 266 444 -1252 -756 873 9 -1053 -99 1116 -390 -582 381 -138 -1119 485
3044 485 1078 -1065 -273 611 -491 -1012 -392 1091 -550 -1082 1341 17 -1350 120 1375 -347 -265
3061 -265 1107 315 -824 -36 896 -558 -442 613 -112 -1035 -347 956 -413 -435 869 -36 -1010 270
3079 270 801 -554 -517 750 381 -1048 256 845 -414 -570 806 166 -625 1 736 -99 -457 532
3097 532 450 -632 -114 623 -519 -597 722 294 -673 -172 653 -334 -565 522 485 -564 -16 529 -418
3116 -418 -396 519 386 -657 -218 629 -171 -729 748 307 -381 116 818 -342 -386 468 464 -858 20 508
3136 508 -482 -565 644 475 -775 -82 607 -290 -250 401 301 -466 -127 640 -259 -750 416 546 -491
3155 -491 -426 742 52 -698 282 558 -769 -118 749 -257 -565 560 554 -664 19 711 -202 -588 224
$$ packed form
3026h7J119j312k25P71J78j696M96J629q64j062R54J215j506j92R63n19r81J604
3044D85N93k143P92Q84j102n21O20J483j641n32K423j324j367J470J255j722Q2
3061b65J372p92j139P88R32j454J16J055p25r23O88J303j369k2J304r05r74J280
3079B70N31j355L7J267l69j429J304N89j259j56J376o40p91O26P35q35l58R89
3097E32q2j082N18P37j142p8J319m28r67N01Q25r87k31J087l7j049N48N45r47
3116d18K2R15j33j043M39Q47q00n58J477m41o88M97P02j160m4Q54mj322Q78M88
3136E08r90q3J209j69j250O93O89q97M0O51j00p67L39P67q99m91J166J30j037
3155d91O5J168o90p50R80K76j327O51Q67j006l08J125oj218O83O92r13l86Q12
$$ plain form
3174 224 630 -597 -96 808 106 -568 334 239 -492 -355 457 -64 -689 228 440 -486 -237 454 -35 -503
3194 -503 247 444 -585 -413 579 -46 -621 328 278 -719 -358 652 21 -495 317 529 -376 -226 376 -14
3214 -14 -742 280 518 -434 -184 554 -293 -724 173 77 -509 -406 666 -23 -760 346 414 -498 -170 766
3234 766 -104 -549 228 520 -556 -211 592 102 -230 198 298 -392 -176 556 152 -387 -152 484 -206 -155
3254 -155 465 154 -243 172 325 -260 -313 471 195 -504 94 519 -96 -93 574 -15 -491 324 414 -127 -18
3275 -18 310 22 -589 -136 533 -275 -180 147 63 -489 148 513 -281 -280 335 45 -678 168 472 -292 -408 397
3297 397 -37 -305 155 309 -195 -315 193 123 -553 29 516 -266 -593 424 411 -479 87 305 -433 -256
3317 -256 593 20 -493 57 468 -321 -339 200 222 -121 85 565 -519 -404 323 102 -182 45 365 26
$$ packed form
3174B24M06j227N01R04p02o74R02r5p31J37Q12n21o25R17K12r26K49O91m89m68
3194e03P50J97j029J72R92o25n75R49n0r97L61J010o31n16Q12K12r05J50O02l90
3214a4p28J022K38r52K50P38q47m31Q97r6n86J03J072o89p37J106O8r12L28R36
3234G66q70m45P77K92j076L45Q03m90l32M28J00o90K16P32m04n39K35O36o90N1
3254a55O20l11l97M15J53n85n3P84k76o99N98M25o15LO67n89m76Q15R0n41J09
3275a8L28k88o11M53O69q08R5L27q4n52O37L65p94JO15k90p23Q46L04p64j16Q05
3297C97m34k68M60J54n04j20N08p0o76N82M87p82l27J017j3q90N66K18p38J77
3317b56Q49n73n13N50M11p89j8N39K2l43K06M80j084J15P27k21k84K27L20l39
$$ plain form
3337 26 -350 159 128 -512 -68 258 -206 -327 305 194 -355 -35 404 -491 -573 178 244 -645 122 180 -71 -215
3359 -215 326 126 -325 136 279 -289 -386 185 305 -294 55 354 -40 -80 260 52 -421 -49 271 -303 8
3380 8 234 149 -261 -49 224 -346 -250 318 129 -183 -124 402 -58 -185 655 156 -261 27 309 -277 -509 371
3402 371 46 -271 363 187 -47 -202 490 118 -329 -54 389 -146 -473 380 70 -343 148 251 -50 -26
3422 -26 223 250 -230 -59 531 -218 -242 293 96 -239 -252 397 -50 -447 264 189 -420 91 544 -164 -282 197
3444 197 431 -466 203 412 -197 -222 357 246 -192 -170 300 -53 -328 173 326 -311 -59 488 -212 -61 30
3465 30 43 -551 3 80 -106 -410 405 161 -752 102 358 -150 -258 235 287 -220 -135 391 -172 -338 96 374
3487 374 -651 50 475 -81 -232 247 92 -249 -106 374 -214 -101 274 149 -306 -215 378 100 -233 174
$$ packed form
3337B6l76N09l1o40M44L26m64j21O32j11n49L20M39q95q2P51O6q89P67N8k51j44
3359b15N41k00m51M61J43n68r7N71J20n99L49K99l94m0L40k08m73L72L20n74L11
3380HK26q5m10K12K73n70R6N68j89l12N9N26m60j27Q40m99m17K88K82n86k32Q80
3402C71l25l17O34j76k34j55O92l72m47K75M43n35l27Q53l10m13M91J03l01K4
3422b6K49K7m80J71N90p49k4N35j97l35j3O49m47l97P11p5o09N11M53p08j18M79
3444A97K34q97O69K09o09k5N79j11m38K2M70l53k75N01J53o37K52N47p00J51R1
3465C0J3n94N54P7j86l04Q15k44r13Q54K56n08j08M93N2n07Q5N26n63j66M34K78
3487C74j025P01M25n56j51M79j55l41J43M80n88J13L75j25m55R1N93k78l33M07
$$ plain form
3507 174 202 -273 -263 357 -121 -201 477 98 -183 62 449 -97 -515 267 324 -397 -138 328 46 -220 49
3528 49 393 -496 -102 220 31 -455 197 360 -159 -80 296 -263 -158 498 135 -411 -170 308 -192 -233 64
3549 64 371 -207 20 539 75 -250 513 276 -450 -161 272 -91 -585 43 186 -158 -156 459 -37 -430 59
3570 59 -27 -302 -183 355 -87 -164 334 392 -287 -176 347 174 -515 193 348 -378 -47 550 85 -289 211
3591 211 380 -191 -70 282 -2 -360 178 444 -254 -105 283 12 -424 292 123 -218 -143 363 52 -305
3611 -305 94 -11 -151 -293 183 71 -387 47 338 -460 -57 596 28 -556 266 69 -105 45 502 -40
3631 -40 -194 -39 369 -287 -266 436 -33 -299 307 235 -240 -116 379 272 -483 265 207 -448 -260 321 108
3652 108 -416 -76 363 -63 -272 396 32 -531 125 454 -216 30 229 -68 -479 -99 523 -66 -215 573
$$ packed form
3507A74K8m75J0O20m78q0O78l79k81K45L87n46m18P82N7p21K59M66k82k66K69
3528D9L44q89L94L22j89m86O52J63n19P9L76n59J05O56l63n46K41M78n00m1K97
3549F4L07n78K27N19m64l25P63k37p26K89M33l63m94O28J43l44KO15m96l93M89
3570E9q6k75J19N38m42p7M98N8o79J11N23j73o89P08J55p26L31N97m65l74N00
3591B11J69n71J21L52k84l58N38K66o98J49L88k71m36P16j69l41P5N06l11l57
3611c05L99j05j40j42M76j12m58M34K91p98M03O53n68n84Q22j97j74J50M57n42
3631d0j54J55M08o56K1P02m69k66O06p2m75J24M95j07p55P48n8o55J88N81k13
3652A08n24L40M39m26k09O68l64n63O56L29o70K46J99k97m11L80O22n89j49P88
$$ plain form
3672 573 134 -478 15 419 -80 -290 193 -119 -438 -52 414 -405 -154 321 207 -426 385 338 -205 -321
3692 -321 349 29 -324 203 124 -47 -149 413 75 -173 137 455 -115 -339 309 -21 -365 32 467 -214
3712 -214 -271 328 90 -348 4 456 -181 -156 459 187 -479 234 319 -319 -523 351 302 -305 207 413 -248
3733 -248 -289 251 264 -422 -52 289 -91 -278 50 185 -520 -101 253 -115 -361 330 3 -94 -117 331 -341
3754 -341 -233 387 175 -352 144 311 -273 -422 439 202 -621 -138 483 -95 -385 384 -134 -354 -89 437
3774 437 -74 -657 266 316 -540 -183 277 -61 -303 216 364 -432 -16 373 -184 -468 351 253 -440 116 477
3795 477 -151 -555 398 438 -240 -229 519 126 -650 412 289 -308 -366 460 -50 -535 288 174 -501 -427 481
3816 481 -174 -429 299 341 -358 -143 600 -24 -415 228 390 -237 -169 620 73 -469 291 469 -309 -124 323
$$ packed form
3672E73m39o12M93M04m99k10M83l12l19L86M66q19K51M75j14o33Q11m7n43j16
3692c21O70l20l53N27p9j71j02N62l38k48L10L18n70k24O48l30l44L97M35o81
3712b14n7N99k38m38L52M52o37K5O15k72o66P13Q5o38k04Q74m9o07N12K06o61
3733b48m1N40J3o86L70L41l80j87L28J35p05M19L54l68k46O91l27r7k3M48o72
3754c41J08O20k12n27M96J67n84j49Q61k37q23M83O21n78k90P69n18k20K65N26
3774D37n11n83R23N0q56L57M60l38k42N19J48p96M16L89n57k84Q19r8o93N56L61
3795D77o28m04R53M0o78J1P48l93p76J062j23n97n8Q26n10m85Q23j14o75P4R08
3816D81o55k55P28M2o99K15P43o24l91O43J62o27O8P89n47n42P60J78p78J85M47
$$ plain form
3837 323 168 -530 108 642 -316 -162 513 161 -587 110 352 -301 -214 378 196 -474 57 377 -320 -70
3857 -70 623 109 -243 35 357 -145 -232 560 -205 -493 99 595 -191 -328 397 270 -659 114 473 -474 -375
3878 -375 436 143 -403 -44 620 -169 -449 518 -18 -495 410 562 -541 -363 293 290 -521 -76 515 -173
3898 -173 -535 547 36 -530 -44 362 -131 -383 352 163 -453 171 628 -168 -363 464 291 -513 92 562
3918 562 2 -206 329 213 -391 196 739 -306 -639 366 264 -824 -143 710 -71 -376 354 494 -548
3937 -548 -93 340 -153 -352 311 317 -544 -224 335 -162 -433 366 135 -529 -95 520 -1 -352 608 576 -484
3958 -484 -100 671 -122 -753 515 197 -382 -162 420 -138 -290 414 243 -247 -474 319 -76 -535 168 342
3978 342 -479 -292 425 41 -743 160 425 -337 -326 704 174 -537 93 512 -380 51 583 73 -593 266
$$ packed form
3837C23j55o98O38N34r58J54O75l52p48O97K42o53Q7N92j82o70N31L20o97K50
3857g0O93n14l52K78L22n02q7P92p65k88N92M96p86j37P25j27r29P73L59r47R9
3878c75Q11k93n46L59O64p89k80R67n36m77R05J52j103J78O56lq11M45N91o88
3898a73l62J082n11n66M86M06m93k52P35j89o16O24M57p96j95Q27j73q04O05M70
3918E62n60k08N35j16o04N87N43j045l33J005j02j088O81Q53p81l05P30J40j042
3937e48M55M33m93j99O63Oq61L20N59m97k71P99k31o64M34O15n21l51R60l2j060
3958d84L84P71p93o31J268l18n79K20N82n58j52P04j71m90k27P93l95m59P03J74
3978C42q21J87P17l84p84R03K65p62J1J030n30p11O30M19q92M31N32n10o66Q59
$$ plain form
3998 266 586 -245 -541 439 299 -334 248 227 -389 -84 558 -15 -454 26 462 -437 -443 287 -66 -519 196
4019 196 551 -96 -222 284 194 -57 9 404 -131 180 147 297 -22 789 140 -502 -120 332 471 168 278
4040 278 372 -522 -237 580 678 -360 259 389 777 -299 282 164 -311 77 515 -188 -520 511 371 -639
4060 -639 62 1029 246 -669 585 351 -319 236 675 -32 -227 387 44 -448 -228 324 -109 -648 442
4079 442 263 -379 16 474 -51 -381 305 130 -546 -80 356 13 -444 378 243 -425 4 718 -189 -393
4099 -393 179 131 -277 -88 508 150 -282 193 255 -507 17 311 -324 -222 582 194 -348 -281 612 -70 -194
4120 -194 -87 180 -449 -85 231 -342 -247 386 91 -272 -147 355 133 -260 240 380 -419 -112 524 -277
4140 -277 -451 270 329 -127 -152 335 152 -381 518 40 -382 -198 435 -111 -515 19 129 -283 -440 340 100
$$ packed form
3998B66L20q31k96R80j40o33N82k1o16L05O42n73m39M80M36q99oP30l53m53P15
4019A96L55o47j26N06r0k51O6L95n35L11l3J50l19Q11o49o42L82M52J39l03J10
4040B78R4q94K85Q17R8j038O19J30L88j076N81j18m75L88M38p03l32J031j40j010
4060f39P01R67p83r15J254k34o70N55M39p07j95O14l43m92K20N52m33n39J090
4079D42j79o42L95M58n25l30O86j75o76M66M36l43m57Q22j35o68M29P14r07k04
4099c93N72m8m08J89N96l58m32M75O2p62N24K94o35J02Q04l88n42O7Q93o82j24
4120a94J07K67o29L64L16n73R5O33k95l63J25N02k22l93N00J40p99L07O36q01
4140b77j74P21N9m56k5M87j83n33Q99m78m22J84O33n46m04N34J10m12j57P80k40
$$ plain form
4161 100 -350 228 492 -329 -445 481 -119 -433 269 433 -323 -84 179 414 -415 -61 173 -767 -177 988
4181 988 573 -208 188 291 -198 -534 423 -144 299 -92 171 -376 -637 845 -731 -108 -52 50 -333 -90
4201 -90 474 276 -701 -430 490 -75 -504 544 1050 -560 104 -132 -633 269 788 -321 -539 -699 693
4220 693 -883 -60 771 -393 -741 33 602 -170 -439 824 -88 -911 -399 580 -60 -385 590 -270 -336
4239 -336 140 483 -443 -112 407 145 -336 -103 293 -8 -219 417 105 -420 95 264 -270 -161 397 204
4259 204 -151 53 249 -143 -327 220 46 -294 87 191 -50 -115 205 395 -306 32 482 -70 -252 173
4279 173 190 -472 3 276 -292 -401 126 158 -274 -23 336 -275 -275 202 144 -359 38 323 -55 -296 265 298
4301 298 -418 183 372 -45 -242 125 225 -240 -194 470 -4 -264 412 139 -326 142 456 94 -106 400
$$ packed form
4161A00m50N78K64q21j16R26o00l14P02J64p56K39K63K35q29L54K34r40N90J165
4181I88m15p81L96J03m89l36R57n67M43l91K63n47k61J482j576O23N6J02l83K43
4201i0N64j98r77K71R20n65m29J048N06j610O64k36n01R02N19j109k18j60J392
4220F93j576Q23Q31j164l48P74N69p72k69J263r12q23N12R79o40l25R75q60o6
4239c36M76L43r26L31N19k62m81K33L96l01k11O36l12n25N15J69n34J09N58j93
4259B04l55K04J96l92j84N47j74l40L81J04k41o5L20J90p01L38M50n52j82M25
4279A73J7o62M75K73n68j09N27L2m32K51L59o11%M77n8n03L97K85l78k41N61L3
4301B98p16O01J89m17j97L67J00m65M6O64m74k60O76k73m65M68L14l62k00N06
$$ plain form
4321 400 270 -428 20 318 -103 -262 292 137 -327 20 549 -127 -170 276 351 -433 -253 309 -140 -156 352
4342 352 427 -347 -129 257 83 -359 51 100 -367 58 354 -61 -573 46 241 -206 -195 429 -150 -348 72
4363 72 438 -133 -59 252 -187 -205 -22 399 -503 -164 449 -95 -454 232 -16 -281 -140 279 33 -101 18
4384 18 295 -113 -44 281 20 -191 -20 356 -360 12 524 -179 -313 42 313 -211 -115 340 -62 -396 587
4405 587 218 -220 -138 417 -16 -372 52 104 -238 -194 483 -9 -226 53 298 -260 -122 301 273 -319 46
4426 46 77 -237 -153 378 -116 -617 46 371 -176 -9 525 -14 -58 117 177 -355 -178 122 -27 -512 94 297
4448 297 -86 -214 273 184 -222 276 353 -186 -30 240 6 -278 -26 366 -402 -136 299 111 -264 166 452
4469 452 -158 -229 504 9 -420 -23 327 -307 -392 292 169 -370 -2 251 176 -226 310 170 -564 9 368
$$ packed form
4321D00j30o98M48K98m21j59N54j55m64L47N29o76m3M46P5p84J80N62m49j6N08
4342C52P5p74K18L86j74m42M10M9m67M25K96m15n12O19J95m47J1O24n79j98M20
4363G2L66n71P4L11m39j8J83M21r02L39O13n44l59O86k48k65J41M19k46j34J19
4384A8K77m08O9L25k61k11J71L76p16L72N12p03j34L55K71n24R6M55m02l34R83
4405E87l69m38Q2N55m33l56M24N2l42M4O77m92k17K79K45n58J38M23k8n92L65
4426D6L1l14Q4N31m94n01O63L25n47J67N34n39m4J75O0n32J77L00j49m85O06K03
4448B97l83j28M87q9m06M98P7n39J56K70k34k84K52L92p68K66M35j88l75M30K86
4469D52o10p1P33m95m29L97L50o34q5O84j23n39L68K53p5m02N36j40p34N73L59
$$ plain form
4490 368 -207 -426 94 33 -313 12 409 -120 -149 416 213 -309 -42 298 46 -291 436 434 -377 -8 572
4511 572 -182 -421 186 379 -409 -86 178 95 -512 354 207 -245 145 347 -13 -354 360 185 -416 254
4531 254 361 -48 -437 117 -151 -336 -8 350 -146 -432 510 326 -432 -376 273 72 -300 188 489 -301
4551 -301 -29 366 -210 -510 -26 186 -400 -37 414 -281 -541 195 463 -284 -90 369 58 -573 104 82
4571 82 -260 -143 328 -75 -567 249 256 -259 -228 431 105 -228 -71 298 -340 -81 304 -9 -414 361 212
4592 212 -262 -362 177 -107 -218 265 177 -574 -45 629 0 -536 305 213 -483 -251 510 311 -294 244 264
4613 264 -84 -214 501 -80 -315 -86 367 -326 -255 262 159 -429 174 180 -34 1 303 105 -388 31 360
4634 360 -306 -71 441 42 -402 429 521 -220 -98 287 -54 -578 20 498 -167 -511 181 79 -606 313
$$ packed form
4490C68n75k19N20o1l46L25L97n29k9N65k03n22K67L40k52l37P27kq11L69N80
4511E72p54k39O07J93p88L23K64q3o07Q66j47m52L90K02l60l41P14j75o01O70
4531B54J07m09l89N54k68j85L28L58m96k86R42j84p58N6O49k01l72M88L01p90
4551c01K72L95n76l00M84K12n86L63M51o95k60P36K68p47J94M59l11o31O77k2
4571H2l42J17M71m03m92Q16Pn15L1O59l26l33J57L69o38K59L85l13m05P75j49
4592B12m74j00N39k84j11M83q8p51N29O74o29n36Q41r2o96K32P61j99o05N38K0
4613B64l48j30P15n81k35K29M53o93P1N17j03n88O03Ok14L5L02j98m93M19L29
4634C60o66K35N12l99m44Q31R2p41J22L85l41n24N98M78o65l44O92j02o85R19
$$ plain form
4654 313 370 -235 -368 539 245 -378 41 168 -366 -404 515 386 -385 173 324 -283 -298 336 -66 -206 211
4675 211 375 -314 23 407 123 -520 200 400 -467 -400 652 173 -442 -153 275 -78 -299 417 368 -430
4695 -430 83 516 -537 -345 370 8 -521 255 227 -611 -362 65 219 -1146 469 628 -357 177 -52
4714 -52 -335 -600 22 534 17 -238 305 195 -587 110 501 -91 -350 367 -21 -608 -135 447 -404 -324 373
4735 373 281 -586 159 529 -274 -782 489 216 -519 87 442 40 -266 415 293 -589 -184 449 -120 -458
4755 -458 580 50 -459 -124 329 -309 -358 302 -20 -449 165 574 33 -498 361 507 -571 39 316 -52
4775 -52 -571 494 340 -332 60 530 21 -529 134 344 -323 -378 667 -51 -629 168 595 -420 -225 744
4795 744 6 -316 343 529 -287 -268 483 -25 -824 181 490 -451 -361 443 188 -455 339 375 -366 -224 469
$$ packed form
4654C13N7o05j33R07k94o23M19J27n34l8R19j29p71N58J51o07j5O34m02j40M17
4675B11J64o89L37L84k84o43P20K00q67O7J052m79o15K89M28l53k21P16m9p98
4695d30N13M33j053J92P15l62n29P76k8q38K49M27J54j365J615J59r85N34k29
4714e2k83k65O22N12n17k55N43j10p82O97L91n92k59P17l88n87M73N82q51Q0O97
4735C73r2q67P45L70q03n08J271k73p35O06L55m02l06O81j22q82M05O33n69l38
4755d58J038n30n09L35M53o38m9O60l22m29O14M09n41n31Q59J46j078O10K77l68
4775e2n19J065j54o72L92M70n09n50O63K10o67n5J045p18n78P97M27j015J95R69
4795G44p38l22O59J86q16J9P51n08p99J005L09r41R0Q04k55o43P94L6p41J42O93
$$ plain form
4816 469 109 -812 75 526 -327 -209 496 99 -487 122 382 -231 -206 491 62 -585 0 433 -419 -253
4836 -253 393 175 -470 58 338 -287 -365 311 303 -615 -155 471 -271 -558 386 59 -804 -1 517 -428 -523
4857 -523 466 115 -684 -147 543 -504 -326 468 259 -305 -142 560 -94 -285 347 354 -573 8 862 -2
4877 -2 -413 425 278 -691 -135 393 -288 -571 494 606 -943 17 644 -177 -519 265 267 -563 -162 594 -326
4898 -326 -599 195 278 -550 -149 552 -190 -372 471 136 -321 -178 1097 -86 -1042 567 -136 -530 272
4917 272 795 129 -407 153 433 -281 253 661 -27 -745 10 496 -801 -622 -166 -75 -650 -26 816 -643
4937 -643 -51 872 -163 -440 618 169 -241 -541 778 144 -613 178 552 -297 0 693 -211 -736 17
4956 17 805 -638 -446 295 280 -379 599 1005 -808 -308 221 282 -444 -102 554 -375 -308 641 -147 -398 95
$$ packed form
4816D69l60r21Q87M51q53J18P05l97n86O09K60o13K5O97m29o47N85M33q52J66
4836b53O46k18o45N28K80o25p8O76qr18M60O26p42k87R44l27q63Q03N18r45r5
4857e23R89l51p99N37O90j047J78P94k09n64J63P02o54j91O32Pr27N81Q54q64
4877bm11Q38j47r69N56N28o81k83J065J12j549R60O27q21l42P84Kq30M01P56r20
4898c26k73P94Q3q28M01P01p42j82Q43l35m57J43J275j183r56J609p03l94Q02
4917B72N23o66n36N60K80p14N34M08o88p18P55M86j297J79M56R1n75O24Q42j459
4937f43N92R23j035k77J058m49m10l00J319o34p57P91L74q49K97O93r04n25P53
4956A7P88j443J92P41j5o59R78M06j813N00N29O1p26L42O56r29O7R49p88k51M93
$$ plain form
4977 95 849 -206 -694 338 351 -419 119 951 348 25 662 -172 -411 -132 781 -63 -147 443 -61 -666
4997 -666 -157 441 -790 -664 645 729 -965 158 982 54 -432 848 -188 -871 -205 620 -306 -318 331
5016 331 -246 -272 173 648 -169 -664 315 586 -527 -474 563 -113 -691 793 664 -961 162 804 -531
5035 -531 -347 769 440 -810 -375 696 -473 -474 234 112 -445 31 852 -470 -388 34 383 -755 -227
5054 -227 611 -6 -298 347 741 -264 -509 765 -420 -725 422 434 -611 -300 506 -243 -1068 507
5072 507 732 -547 5 306 -8 -535 415 525 -561 -255 630 41 -640 513 529 -478 -515 598 -41
5091 -41 -697 192 613 -520 -261 752 94 -859 273 544 -515 -410 499 123 -749 313 769 -483
5109 -483 -389 509 93 -592 505 801 -371 -543 571 236 -748 -63 786 -634 -564 618 117 -699 274
$$ packed form
4977I5P54j055m88J032J3p70N38Q32o03l23O37q34k39K79R13q44q4N90n04o05
4997f66N09N98j231J26J309Q4j694J123Q24r28m86J280j036o83O66Q25r26j2O49
5016C31n77k6M45M75q17m95R79K71j113N3J037o76n78J484j29j625J123O42j335
5035e31J84J116l29j250M35J071j169jP08j22n57M76Q21j322Q2M22L49j138N28
5054b27Q38o17k92O45L94j005k45J274j185l05J147J2j045L11Q06p49q25J575
5072E07K25j279N52L01l14n27R50J10j086L06Q85n89o81J153J6j007l7J113o39
5091d1o56Q89M21j133K59J013o58r53J132K71j059J05R09l76q72J062M56j252
5109d83R4Q98m16o85J097K96j172j72J114l35r84O85Q49j420P0J182n01q16R73
$$ plain form
5128 274 586 -249 -697 810 275 -889 251 775 -476 -831 817 -6 -764 402 705 -456 -395 305
5146 305 303 -720 -18 533 -453 -761 695 53 -985 8 847 -406 -362 596 258 -773 135 751 -488
5165 -488 -613 526 148 -899 -116 696 -509 -496 691 385 -806 62 871 -480 -518 399 221 -709 -287
5184 -287 522 -384 -723 557 547 -852 -244 815 -417 -621 449 551 -647 -299 806 -100 -705 356
5202 356 498 -644 -305 919 57 -735 410 632 -540 -349 777 -42 -602 123 753 -615 -277 875
5220 875 28 -762 272 406 -896 -435 1000 -177 -769 144 442 -584 -371 1033 -82 -668 440
5237 440 690 -595 -344 827 77 -657 309 590 -753 -507 616 6 -728 243 680 -648 -398 510
5255 510 41 -920 146 552 -718 -568 987 191 -772 253 560 -582 -618 579 204 -818 317 935
$$ packed form
5128B74L12q35m48J507n35j164J140N24j251l55J648q23p58J166L03j161O1P00
5146C05kj023P02N51r86l08J456o42j038R93Q39j253M4R58l38j031R08O16j239
5165d88j25J139l78j047P83Q12j205J3J187l06j191Q68Q09j351l8R17j78r30M22
5184b87Q09r06l39J280j0j399O08J059j232k04J070J02j198L48J105r06o05J061
5202C56J42j142L39J224q62p92J145K22j172J91J126q19n60P25O30j368L38J152
5220H75q47p90J034J34j302M61J435j177n92R13K98j026K13J404j115n86J108
5237D40K50j285K51J171p50p34R66K81j343K46J123o10p34R71M37j328K50R08
5255E10m69r61J066M06j270J50J555p96r63J025L07j142l6J197l75j022J135O18
$$ plain form
5273 935 -665 -545 573 172 -520 101 783 -595 -507 896 250 -917 156 791 -474 -560 691 237
5291 237 -1062 -29 559 -378 -544 536 419 -727 -52 667 -565 -547 739 358 -897 23 896 -483
5309 -483 -650 723 434 -618 -128 782 -464 -546 602 271 -761 -52 689 -527 -684 512 98 -690
5327 -690 -113 627 -301 -759 468 437 -708 -30 1044 -134 -952 694 296 -857 -93 605 -34 -833
5345 -833 405 710 -745 -74 728 -267 -648 548 456 -595 -150 795 -295 -623 254 385 -757 -211
5363 -211 742 -210 -836 134 631 -768 -204 626 -9 -778 177 608 -907 -352 720 -233 -650 486 515
5382 515 -525 -282 944 -26 -686 218 818 -577 -401 911 9 -800 393 828 -356 -429 807 85
5400 85 -783 441 618 -794 -142 717 4 -981 293 856 -570 -478 818 -30 -742 468 681 -490
$$ packed form
5273I35j600J20J118m01o92O21O82j378Q8J403o46j167J073O35j265q6J251m54
5291B37j299J033N88r37j66J080j17j146O75P19j232J8J286l81j255R20Q73j379
5309d83j67J373k89j052M90R10j246q2J148l31j032P09P41j216j57J196m14p88
5327f90N77P40r28m58J227l1j145O78J074j178q18J646l98j153P64O98o39p99
5345h33J238L05j455O71Q02r95l81J196r2j051M45R45j090l28Q77J31j142N46
5363b11R53r52o26R70M97j399N64Q30o35p69R55M31j515N55J072r53m17J136K9
5382E15j040K43J226r70o60R04O00j395J76J312r02q09J193M35j184p3J236p22
5400H5q68J224J77j412O52Q59p13r85J274N63j426R2J296q48p12J210K13j171
$$ plain form
5418 -490 -356 919 224 -730 137 554 -604 -763 681 298 -873 316 805 -613 -744 912 -89
5435 -89 -836 188 731 -416 -468 720 159 -582 -26 835 -469 -562 599 314 -864 -168 685 -474 -510
5454 -510 741 429 -1015 -206 714 -516 -805 694 179 -755 -75 601 -562 -511 720 372 -763 102
5472 102 834 -494 -513 805 235 -804 41 1009 -162 -563 636 618 -875 54 644 -335 -588 432
5490 432 274 -685 -109 782 -110 -572 818 410 -582 -101 798 -543 -711 572 346 -765 -197 1033
5508 1033 -155 -822 484 457 -762 -314 920 -353 -381 535 320 -833 -512 874 -194 -893 431
5525 431 442 -722 -353 648 -297 -801 660 596 -695 -267 789 -196 -792 172 727 -594 -299 856
5543 856 20 -901 468 637 -638 -267 771 124 -570 287 993 -403 -341 858 244 -770 -125 871
$$ packed form
5418d90J34J275o95r54Q67M17j158j59J444l83j171J189M89j418j31J656j001
5435h9p47J024N43j147n2J188n61p41N56Q61j304r3J161k85j178O96Q53j159l6
5454e10J251l12j444Q09R20j230k89J499n15r34O80O76j163N1J231l48j135Q65
5472A02P32j328j9J318n70j039Q45R68j171m01J199j8j493R29N90r79k53J020
5490D32j58r59N76Q91q92m62J390m08r92M81Q99j341j68J283k26j111N68J230
5508A033j188o67J306k7j219M48J234j273k8R16k15j153L21J386j068o99J324
5525D31J1j164L69J001r45n04J461o4j291M28J056r85n96R64N55j321K95J155
5543H56q36r21J369J69j275L71J038o47o94Q57P06j396O2J199o14j014O45R96
$$ plain form
5561 871 -578 -454 839 -16 -810 460 552 -494 -344 715 85 -708 113 692 -345 -488 785 -159
5579 -159 -894 323 846 -519 -664 604 159 -914 249 720 -490 -402 532 209 -847 166 544 -735
5597 -735 -798 670 485 -1021 -171 511 -359 -92 804 83 -1129 56 1261 -124 -137 717 -200 -786 526
5616 526 412 -725 -265 568 126 -519 706 635 -660 -1007 385 -6 -497 326 550 -1188 -418 315 271
5635 271 -1112 55 613 -147 -566 413 413 -727 49 1050 -217 -773 727 710 -836 -109 774 -374
5653 -374 -622 554 488 -816 -194 637 -290 -822 450 540 -589 -202 957 -234 -739 451 619 -667
5671 -667 -241 1002 -385 -733 426 531 -706 -323 801 -294 -773 456 651 -789 -301 1056 -275
5688 -275 -685 560 390 -571 -451 693 18 -835 298 436 -856 -364 817 -93 -820 399 753 -617
$$ packed form
5561H71j449J24J293q55p94J270R2j046J50J059o30p93Q21N79j037j43J273r44
5579a59p35J217N23j365j45J268m45j073J163M71j210Q8R34l23j056J013L78j279
5597g35o3J468j85j506Q50O82q70K67Q96p21j212J185J205j385j3Q54r17n86J312
5616E26j14j137M60Q33m42o45J225p1j295l47J392l91m91Q23K24j738P70P33m4
5635B71j383J167N58p60m19R79%j140P76J001j267n56J500j7j546P27Q83j148
5653c74k48J176o6j304O22Q31r27n32J272R0j129L87J159j191n05J190J68j286
5671f67M26J243j387l48J159J05j237L83J124j095m79J229J95j440M88J357j331
5688b75m10J245j70r61J20J144o75q53J133J38j292M92J181r10p27J219L54j370
$$ plain form
5706 -617 -153 489 32 -597 403 497 -231 -265 657 19 -814 403 710 -487 -492 581 -162 -948 333 715
5726 715 -538 -334 651 194 -706 212 433 -753 -409 607 129 -1055 148 629 -497 -437 780 218
5744 218 -723 171 768 -628 -554 841 266 -1105 273 560 -345 -346 707 216 -661 -461 1160 -755 -649
5763 -649 508 -355 -501 299 661 -558 -581 1017 422 -736 309 888 -421 -610 702 380 -811 -98
5781 -98 541 -374 -590 643 479 -584 5 583 -408 -691 462 348 -553 37 514 -456 -730 505 353
5800 353 -724 -197 776 -431 -781 627 430 -712 -29 890 -144 -732 654 418 -523 -18 685 -106
5818 -106 -939 370 365 -818 -41 724 -105 -655 375 675 -775 -277 828 -65 -935 536 619 -763 -105
5837 -105 705 -92 -653 531 496 -500 -209 874 68 -722 465 445 -583 -432 463 -90 -705 320 589
$$ packed form
5706f17M64O42m57o29J000R4p28l4R22o38q33J217L07j197nJ073p43p86J281L82
5726G15j253K04R85m57r00R18K21j186L44J016m78j184J203M81j126O0J217n62
5744B18r41Q94N97j396P4J395n75j371J378K87r05jJ053m91q77K00J621j915J06
5763f49J157q63j46Q00L62j219k3J598n95j158J045N79j309j89J312l22j191P13
5781i8O39r15k16J233j64j063N89N78r91k83J153j14r01N90M77r70k74J235j52
5800C53j077N27R73j207l50J408j97j142O83R19j034n88J386k36r41N05P03p91
5818a06q33J309nj183P77P65q29n50J030L00j450M98J105q93q70J471Q3j382O58
5837a05Q10p97n61J184l5r96K91J083q06p90J187k0j028J51Q95n53o15J025K69
$$ plain form
5856 589 -753 -391 809 42 -768 317 741 -450 -353 495 -114 -680 20 825 -507 -271 921 -72
5874 -72 -733 252 557 -406 -461 482 -10 -719 67 769 -683 -311 852 -47 -704 225 746 -330 -401 655
5894 655 45 -676 263 693 -515 -285 899 104 -673 482 428 -240 -558 460 23 -533 -14 538 -475
5913 -475 -547 427 85 -640 314 712 -379 -343 853 406 -723 182 453 -356 -477 866 335 -801 339
5932 339 720 -296 -442 386 315 -479 9 547 -310 -437 588 179 -924 19 751 -47 -574 524 378
5951 378 -697 178 690 -177 -434 346 75 -732 -6 498 -224 -538 524 534 -681 -610 622 -146 -1420
5970 -1420 458 409 -644 684 1023 -169 -806 671 -151 -1193 -417 1051 492 -982 -169 851 -323
5987 -323 153 260 -318 -198 10 904 -1226 110 919 -332 -858 1217 806 -1411 -804 19 -390 -533
$$ packed form
5856E89j342L62J200p67q10J085M24j191R7Q48o09n66P00Q05j332K36J192r93
5874g2o61R85L05r63n5R43m92p09P86P02j452L72J163q99o57R29N21j076p1J056
5894F55o10p21R39M30j208K30J184p95p77J155n4o68l18J018m37n56N19N52j013
5913d75p2R74l42p25R54L98j091L6J196m47j129R05K71q09j21J343n31j136J140
5932C39L81j016j46Q28p1p94M88N38q57j27J025m09j103R43P32p98n27J098j46
5951C78j075Q75N12q67k57P80k71q07P26N04p22l14J062J0j215P1J232p68j274
5970a420J878m9j053J328L39j192o37J477q22j042P76J468n59j474Q13J020j174
5987c23M76J07n78J20K08Q94k130J336Q09j251n26K075m11k217O07Q23m09j43
$$ plain form
6005 -533 219 553 -588 -379 782 -308 -1228 289 371 -673 -125 748 -167 -738 180 378 -857 -255
6023 -255 414 -23 -755 323 365 -453 -308 695 73 -551 263 513 -339 -287 525 101 -434 244 590 -652
6043 -652 -526 718 106 -677 91 533 -355 -342 565 374 -737 43 179 -940 -734 300 374 -701 183
6062 183 400 -994 -622 196 246 -955 -25 1020 -542 231 892 -29 -118 416 513 -745 -316 516 221
6081 221 -482 286 474 -382 -414 486 122 -844 40 637 -373 -480 468 183 -617 -131 655 -439 -626 597
6101 597 447 -668 75 573 -150 -671 734 223 -419 0 594 -285 -423 469 272 -449 -81 644 -598
6120 -598 -168 452 245 -563 10 566 -58 -429 582 478 -733 2 784 -230 -462 430 -68 -664 -88
6139 -88 682 -373 -509 291 473 -699 -43 650 -233 -607 302 408 -568 -38 507 -7 -390 245 271 -477
$$ packed form
6005e33P52L34j141K09J161j090r20J517Q2j044N48Q73r15n71R18J98j235O02
6023b55O69m37p32J078M2q18J45J003o22o24Q14K50q52N2Q12m24n35O78L46j242
6043f52J26J244o12p83P68M42q88J3R07j91j111P80J36j119K06J034P4j075Q84
6062A83K17j394L72Q18N0j201R30J045j562P73O61r21q9N34R7j258M29Q32k95
6081B21p03P68J88q56l2R00l64r66Q84N97j010j07R48k85q00M86P86j094j87J223
6101E97j50j115P43M98p23n21J405n11o42M19N94q79j38Q92j97p21L68P25j242
6120e98M30O20k07q08N73N56o24l71J011j04j211P35P82j014k32Q92m98n96N76
6139h8P70j055j36Q00J82j172O56O93q83l74R09J06r76N30N45n14l83O35K6p48
$$ plain form
6159 -477 -232 562 -248 -378 456 520 -798 -57 604 -182 -591 245 607 -445 -38 635 29 -247 444 444
6179 444 -436 -286 562 19 -265 441 413 -513 -114 532 -151 -538 229 511 -572 -206 600 -114 -460 97
6199 97 315 -442 -136 569 116 -475 107 511 -638 -125 456 -108 -541 346 484 -420 -57 462 -97 -569
6219 -569 223 352 -553 -372 402 62 -415 323 399 -531 -175 452 -62 -655 227 491 -161 -276 244 -379
6239 -379 -484 122 504 -401 -525 604 -8 -543 187 567 -68 -373 619 26 -636 178 625 -244 -377 548
6259 548 250 -360 -104 718 -427 -518 512 216 -702 5 436 -201 -152 195 -54 -749 552 328 -442 -212
6279 -212 621 191 -242 -132 916 110 -703 495 -570 -747 218 -129 -344 -450 444 149 -550 133 321
6298 321 -59 -517 616 -71 -441 54 361 -137 -484 755 429 -207 158 539 42 -384 255 166 -680 190
$$ packed form
6159d77K45P94q10j30Q34O4j318P41O61p86m09Q36L62j052M07O73o06k76O91%
6179D44q80J50Q48n43k84P06k8r26L99O46o83l87P67K82j083L66Q06p14l46N57
6199I7K18p57L06P05m53n91N82M04j149N13N81n64m33Q87J38r04L63N19n59m72
6219e69P92J29r05J81P74l40m77P38P6r30L56O27n14n93Q82K64o52j15N20o23
6239c79j05O06L82r05j24J129o12n35P30L80o35l05R92n93o62Q14M47q69j33R25
6259E48k98o10K56Q22j145r1J030k96r18P07M31o37M9L47k49o95J301k24p70K30
6279b12Q33m30m33J10J048q06q13J198j065j77R65l47k15j06Q94k95o99O83J88
6298C21l80m58J133o87l70M95L07m98l47J239l26o36L65L81m97m26O39q9q46Q70
$$ plain form
6318 190 367 -138 -378 590 121 -618 -108 320 -270 -386 564 271 -406 -136 670 -129 -322 186 44 -641
6338 -641 -152 512 -383 -340 325 481 -384 -204 467 -125 -373 327 362 -559 -262 771 -200 -330 351 410 -127
6359 -127 -5 424 -303 -539 387 131 -501 -308 481 -259 -475 319 502 -569 -316 535 -56 -570 480
6378 480 515 -545 -178 576 -64 -486 166 140 -601 -207 593 -223 -525 336 266 -502 91 679 29 -522 387
6399 387 280 -388 -262 283 -47 -445 121 296 -427 -255 554 13 -443 -26 392 -414 -222 579 18 -521
6419 -521 291 331 -409 -216 700 -106 -542 -38 384 -459 -100 409 55 -356 112 563 -479 -98 369 10
6439 10 -556 88 459 -439 -352 500 38 -488 258 611 -373 -295 308 -101 -611 377 368 -418 -301 605 115 -473
6461 -473 130 554 -329 -387 382 162 -359 140 504 -308 -158 406 272 -366 358 500 -58 -329 511 -31
$$ packed form
6318A90J77n05k40R68m69p39N10M28n90j16R50k93o77K70Q06p99j93N08j42o85
6338f41M89O64q95M3O65J56q65J80O71n92k48P00L5r21K97J033r71j30O81N9n37
6359a27J22M29p27k36R26k56o32J93P89p40k16P94J83j071K53Q51n91n14J050
6378D80L5j060L67P54o40m22O52k6p41L94Q00q16l02Q61p0p68N93N88o50n51R09
6399C87j07o68J26N45l30l98N66J75p23J72Q09n41m56M17M18q06J92Q01n61n39
6419e21Q12M0p40J93R16q06m36N04M22q43L59N09l54m11M68M51j042L81M67l59
6439A0n66O44L71q98Q7Q52m62n26P46L53r84P8O03m09n10R88rp86J17R06m90n88
6461d73O03M24q83n8P69k20n21M99L64q12J50N64j34o38P24J42n58k71Q40n42
$$ plain form
6481 -31 -514 208 360 -238 -249 570 -111 -427 -168 433 -179 -334 486 98 -436 218 681 -405 -240 561
6501 561 173 -618 118 546 -240 -93 306 184 -525 -11 465 -120 -458 184 397 -436 -9 574 -120 -440
6521 -440 401 261 -573 -429 501 -255 -323 370 86 -700 26 400 -5 -305 409 269 -418 59 460 -92
6541 -92 -271 413 336 -805 -306 356 -191 -413 0 541 -510 -14 529 -253 -474 349 22 -280 -128 488
6561 488 -201 -282 534 274 -628 -372 712 -80 -348 196 221 -154 72 366 -76 -397 133 318 -465 -183
6581 -183 254 -207 -403 183 268 -31 -37 701 -298 -244 -173 65 -129 -271 500 -20 -751 -201 -68 -114 -505 602
6603 602 -304 272 310 387 -107 121 138 -59 -625 108 71 -305 420 68 146 -49 338 291 -913 -692 198 433
6625 433 1 -171 490 -672 -257 577 -52 -631 -96 440 -871 239 585 127 -529 290 436 -134 -226
$$ packed form
6481c1m83P22J52n98j1Q19o81l16K59O01o12j55Q20l88n34O54M63j086J65Q01
6501E61l88p91P36M28p86J47L99j22p09N14M76n85l38O42K13q33M27N83o94l20
6521d40Q41j40q34J44R30p56o8O93k84p86P26L74m05l00P14j40o87M77M01n52
6541i2j79O84p7j141M99O62n47k22M13N41j051M96N43p82k21Q23l27l02J52O16
6561D88o89q1Q16k60r02K56J084p92k68N44K5l75K26K94m42l21N30J85p83K82
6581a83M37m61j96N86Q5k99oP38r99N4P1K38j94j42P71n20p31N50J33m6l91J107
6603F02r06N76L8P7m94K28J7j97n66P33l7l76P25l52P8j95L87m7j204K21Q90K35
6625D33m32j72O61j162M15Q34o29n79N35N36j311J110L46m58o56Q19J46n70r2
$$ plain form
6644 -226 136 -65 -898 17 595 -268 -738 635 333 -243 -21 882 -771 -438 125 233 -390 -513 446
6663 446 -357 -746 955 -671 610 777 14 -7 147 1299 160 366 22 360 -281 -1125 -96 -538
6681 -538 216 -446 131 -1105 16 36 -137 -263 363 649 -727 94 -490 600 -1123 165 105 331 -583
6700 -583 634 172 -706 -282 373 7 -116 79 0 -232 -336 -408 -72 -548 167 89 213 -3 -96 -499 -45
6721 -45 -330 -42 -763 -562 1129 -450 -834 776 488 -606 454 858 333 -1114 437 -90 -593 -276
6739 -276 1133 117 -920 197 -21 -292 608 106 -93 -1018 400 33 -894 -149 797 84 -932 554
6757 554 270 -737 -331 699 297 -365 309 343 -694 111 528 82 -317 74 385 -487 40 609 -68
6776 -68 -512 378 146 -561 -118 589 143 -444 158 549 -468 17 426 -9 -285 62 663 -580 -307 53
$$ packed form
6644b26L62k01q33R15N78q63m70J373l02n76K22R03j653L33N63J08o23j23R59
6663D46q03l89J701j626J281J67p63k1J54J152j139K06l44L38o41q44J029m42
6681e38P54o62N77j236J121K0j73j26O26K86j376Q21n84J090j723J288o0K26r14
6700e83J217m62q78M24O55l66j23J95p9k32j04p2L36m76P15p8J24k16r3m03M54
6721d5k85K88p21K01J691j579l84J610k88j094J060M04n25j447J551n27n03L17
6739b76J409j016j037J117k18k71R00n02j99r25J418l67r27P45R46p13j016J486
6757E54k84j007M06J030m02o62O74L4j037Q05M17m46l99L91L11q72N27N69o77
6776f8m44Q90k32p07M43P07m46n87O02L91j017M85M09m35k76L47O01j243K73L60
$$ plain form
6796 53 -99 -583 159 452 -221 -276 391 -228 -118 244 -42 -533 -238 827 285 -804 -211 -63 -468 -566
6816 -566 458 -643 -286 443 -252 -482 -31 -96 412 -517 -304 1174 -777 -378 569 464 -171 15 -544
6835 -544 -22 -667 35 288 -907 -369 1646 -274 -504 754 -352 -550 -258 951 -138 -706 -210 -635
6853 -635 -1243 -620 1314 499 -746 -349 -20 -846 -266 185 203 368 785 -257 1132 244 744 -249 -1110
6872 -1110 746 912 167 557 1273 -935 351 -226 349 -212 -158 110 240 -1336 -550 -176 -1336 -54
6890 -54 89 -938 -1065 280 610 -885 319 272 -383 36 987 382 -583 1015 -441 -330 -1235 717
6908 717 288 -23 1019 -31 266 -617 -698 370 91 -124 -83 272 397 286 -352 -1063 -708 170 -198 -359
6928 -359 321 350 62 415 952 -955 -235 -269 -93 -756 -697 1304 -232 -496 455 -133 -348 374 637 -400
$$ packed form
6796E3j52m84P42K93o73n5O67o19J10L62k86m91K95J065n42j089N93J48m05r8
6816e66J024j101L57P29o95k30M51o5N08r29K13J478j951L99R47j05o35J86n59
6835e44N22o45P02K53j195N38K015j920k30J258j106j98K92J209j089n68M96m25
6853f35o08O23J934q15j245L97L29q26N80M51J8J65M17j042J389q88N00r93q61
6872a110J856J66p45L90P16k208J286n77N75n61N4K68J30j576P86L74j160J282
6890e4J43j027j27J345L30j495J204m7o55M19R51o05r65J598j456J11r05J952
6908G17m29l11J042j050K97q83q1J068k79k15M1L55J25j11o38p11L55Q78l68j61
6928c59O80K9k88L53N37j907P20l4J76o63N9K001j536k64R51n88k15P22K63j037
$$ plain form
6948 -400 -1449 451 466 -262 -372 527 -232 -1047 738 304 -343 -328 1096 -83 -1289 476 1012 182
6966 182 289 -590 737 -577 -1063 1201 -615 422 591 35 -579 701 513 -422 -146 -177 104 -416
6984 -416 313 249 -230 207 700 237 -1052 418 120 -833 -711 583 660 -739 -32 300 -347 283 621
7003 621 -563 -964 -158 545 -475 -143 381 -116 -780 -83 794 -182 -461 258 301 -412 -72 -245 -614 154
7023 154 150 297 -640 -163 362 -229 -442 -73 339 -545 348 283 -267 -417 205 343 -849 144 550 -363 -519
7044 -519 724 -383 -560 -234 341 -322 -402 498 503 -440 92 503 -245 -238 469 209 -615 -52 404 -353 -406
7065 -406 213 169 -581 -26 1006 -336 155 377 406 -333 20 144 1 -465 158 524 -453 -34 360 194
7085 194 -672 117 321 -198 -76 544 -259 -344 728 -499 -529 -117 1019 -9 -613 343 343 -672 5 582
$$ packed form
6948d00j049J900J5p28j10Q99p59q15J785m34o47J5J424j179j206J765N36q30
6966A82J07q79J327j314m86K264j816J037J69n56o14J280j88r35K76l1K81n20
6984d16P29o4m79M37M93m63j289J470k98r53J22J294P7j399P07L32o47O30L38
7003F21j184m01Q06P03j020L32N24m97o64O97Q77r76k79P19M3p13L40j73l69P68
7023A54mJ47r37M77N25n91k13L69M12q84Q93o5n50j50O22J38j192R93M06r13j56
7044e19J243j107j77L26N75o63q0R00Nr43N32M11p48PP07k60q24N63M56p57n3
7065d06O19m4p50N55J032j342M91K22K9p39L53J24j43m66O23L66r77M19L94j66
7085A94q66P89K04n19J22O20q03q5J072j227l0M12J136j028o04R56%j015O77N77
$$ plain form
7105 582 37 -528 254 415 -452 -569 317 -71 -493 21 418 -495 -285 526 -1 -607 106 535 -527 -62
7125 -62 598 64 -591 272 435 -373 -194 355 4 -408 127 437 -347 -379 790 67 -478 -2 600 -515
7145 -515 -417 260 -45 -683 102 560 -422 -113 373 68 -332 1 465 -348 -331 424 212 -449 127 506 -403
7166 -403 -251 519 -166 -631 72 331 -259 -402 471 -14 -966 -28 456 -724 -353 528 65 -575 -176 484
7186 484 -290 -277 485 194 -544 100 532 -222 -556 655 180 -368 -8 541 -123 -405 378 -28 -793 198
7206 198 639 -340 -420 649 288 -494 128 815 -261 -715 322 319 -499 -58 702 -275 -505 186 355 -493
7226 -493 -248 826 -134 -422 320 228 -618 -320 644 -180 -562 519 425 -538 -156 700 -247 -532 433 223
7246 223 -573 -130 586 -103 -415 570 222 -572 -298 490 -124 -641 205 333 -404 -128 749 -27 -414 436
$$ packed form
7105E82n45n65P82J61q67j17Q86l88m22N14L97r13K10Q11n27o06P13M29j062M65
7125f2O60n34o55Q63J63q08J79N49l51m12N35L10p84l2J169p23n45M76O02j115
7145e15R8O77l05o38P85M58r82L09M86l05m00L33M64q13J7P55k12o61N76L79r09
7166d03J52P70o85m65P03K59n90j43Q73m85r52R38M84j180L71Q81m63o40L99O60
7186D84p74J3P62k91p38O44M32p54l34J211m75n48L60N49o64k82P83m06p65R91
7206A98M41r79q0J069l61p82O22O87j076m54J037lq18M41P60r77k30O91J69q48
7226d93K45J074r60k88P42r2q46K98R64q24l82J081r4r63L82Q56r47k85R65k10
7246B23p96M43P16o89l12R85l48p94K74P88o14n17Q46J28p37K76Q77p76l87Q50
$$ plain form
7266 436 256 -408 -370 634 -22 -749 325 515 -637 -137 601 -119 -578 406 580 -467 -295 639 154
7285 154 -989 252 278 -368 -375 960 -7 -530 119 630 -204 -528 759 -35 -526 40 674 -431 -538
7304 -538 460 -55 -303 165 392 -370 -472 345 130 -743 56 677 -324 -487 416 119 -638 -35 708 -197
7324 -197 -290 563 232 -616 10 830 -440 -428 526 -50 -507 11 730 -320 -667 346 262 -499 168 456
7344 456 -39 -292 344 199 -640 -296 399 -35 -358 509 411 -872 54 568 -141 -556 605 360 -427 28
7364 28 623 -566 -510 570 35 -595 -77 599 -284 -678 569 210 -559 -20 319 -211 -544 659 80
7383 80 -544 -288 611 19 -354 601 169 -580 -125 481 69 -735 439 484 -506 -157 687 -136 -345 404
7403 404 376 -719 -123 686 -157 -603 416 336 -676 -80 339 -217 -615 336 383 -271 -406 430 64 -528
$$ packed form
7266D36j80o64L8J004o56p27J074J90j152N00P38p20m59R84J74j047J72R34m85
7285A54j143J241K6o46pJ335r67n23O49N11q34l24J287p94m91N66O34j105j07
7304e38R98n15k48M68K27p62j02Q17k15q73P99O21j001j63R03k97p57O03P43r05
7324a97r3Q53l31q48O26Q20j270J2R54n76m57N18P19j050l47J013q4p61O67K88
7344D56m95k53O36j45q39L44O95m34l23Q67r8j283R26N14p09m15J161k45p87M55
7364B8N95j189N6J080n35o30N18O76q83l94J247l59p69N39L39n30l33J203n79
7383H0o24K56Q99n92l73R55m32p49M55O06m12q04J174M5r90L49Q44q23k09P49
7403D04k8j095N96Q09q43m46J019q0j012N96M19n56l98R51M7o54j35Q36l66n92
$$ plain form
7423 -528 197 386 -532 -335 662 -217 -528 56 481 -552 -199 622 22 -685 330 578 -234 31 542
7442 542 -75 -583 193 432 -325 -394 533 48 -748 207 600 -541 -198 481 -205 -1039 241 338 -366 -286
7462 -286 500 -5 -577 118 814 -424 -479 597 151 -697 312 393 -229 -692 706 260 -732 -23 432
7481 432 -562 -440 665 53 -610 70 690 -304 -433 448 176 -595 210 297 -340 -449 471 264 -565 -64
7501 -64 394 -283 -469 491 217 -707 133 575 118 -630 370 479 -713 -12 461 -254 -308 510 142 -653
7521 -653 -190 575 -257 -406 566 373 -512 -96 503 -281 -458 269 490 -496 -156 891 -94 21 12 -137
7541 -137 -752 33 570 -531 -796 578 423 -941 787 499 5 -293 227 -107 -67 -725 746 -752
7559 -752 -841 660 -241 -972 -589 934 434 -675 445 572 -307 6 80 -344 -684 338 641 -637 -227
$$ packed form
7423e28P25J89r18J97R97q79l11N84M25j033L53Q21o00p07J015K48q12K65N11
7442E42o17n08P76K39p57o9R27m85p96R55L93j141L43O79o86q34J280R7p04Q0
7462b86P86n05n72O95O96j238n5J076m46q48J009Q1o22m63J398m46r92P09M55
7481D32r94J22J105o12o63O80O20r94j29Q81k72p71Q05Q7o37j09R20k07q29N01
7501f4M58o77j86R60k74r24Q40M42m57p48J000J09j192P01M73p15n4Q18l68p95
7521f53M63P65q32j49R72j93q85M16N99p84j77P27K21r86L40J047r85J15rj49
7541a37o15P85N37j101k65J374j55j364J728k88m94k98N20l34M0o58J471j498
7559g52q9J501r01p31L83J523n00j109J120J27q79L13P4m24l40J022L03j278M10
$$ plain form
7578 -227 798 -50 -764 379 707 -548 -342 502 -239 -602 565 394 -434 -198 463 21 -573 356 542
7597 542 -577 -325 491 -12 -712 236 406 -484 -201 542 156 -618 212 564 -392 -239 628 162 -620 296
7617 296 574 -579 -265 560 124 -518 280 403 -307 -397 584 88 -646 151 459 -230 -657 615 294 -609
7637 -609 40 866 -218 -468 406 271 -560 254 651 -379 -420 579 162 -744 293 578 -258 -486 619
7656 619 139 -583 -5 582 -15 -349 214 290 -354 116 463 -143 -601 648 454 -411 -84 667 49 -493
7676 -493 739 252 -653 -220 455 -153 -670 382 -527 -779 91 350 180 27 507 370 -305 -330 525 -224
7696 -224 -936 495 238 -643 -318 549 -344 -727 -1 104 -815 457 489 -464 -828 520 263 -576 -82
7715 -82 724 259 -450 372 334 -488 -229 521 253 -526 208 246 -481 -267 614 -184 -568 521 483 -891 -249
$$ packed form
7578b27J025q48p14J143L28j255K06Q44p41l63J167j71q28K36O61m42n94R29J86
7597E42j119K52Q16n03p00R48J70q90K83P43l86p74Q30L52r56J53Q67m66p82R16
7617B96K78j153L14Q25m36o42P98J23p10r0R81m96p34P97L08o89m27J272l21r03
7637f09O49Q26j084k50Q74j35q31Q14L97j030m1R99m17r06J037K85q36k28J105
7656F19m80p22N78N87n97l34N63P6o44M70L47o06m58J249j94q65L27P51o18n42
7676d93J232m87r05M33O75o08n17J052r09k52Q70K59j70j53M80j37o75k5Q55p49
7696b24p12J431k57q81L25Q67q93l83P26J05r19J272L2r53l64J348k57q39M94
7715h2Q06m65p09Q22l8q22K59P50k68p79P34L8p27K14Q81p98l84J089l8j374O42
$$ plain form
7736 -249 304 -21 -854 370 561 -833 -151 959 -288 -811 92 -342 -176 -379 767 -163 -409 225
7754 225 403 -353 -357 676 103 -485 413 441 -444 -588 515 103 -550 156 482 -445 -351 605 82 -437 13
7775 13 520 -304 -144 515 -16 -441 25 711 -392 -397 594 353 -532 125 584 -317 -341 356 171 -631 161
7796 161 604 -437 -315 476 161 -465 55 666 -392 -474 560 232 -642 -17 505 -265 -66 387 12
7815 12 -416 53 563 -87 -433 246 408 -513 52 1046 -193 -646 423 489 -471 1 674 -167 -365 594
7835 594 -58 -248 -71 513 -83 -454 293 236 -548 -152 601 -32 -613 376 419 -410 -188 483 -235 -630 314
7856 314 407 -782 -203 542 -224 -573 537 403 -576 -168 538 -19 -350 480 355 -405 -110 760 63 -497
7876 -497 359 454 -380 -74 566 236 -516 206 423 -640 -32 722 -144 -394 288 482 -406 19 689 -93
$$ packed form
7736b49N53l25q33J224J91j394O82J110j247n23R03m34J66k03J146r30k46O34
7754B25J78p56mJ033n73n88Q98K8q85j44J103m12o53P06L26r27R4R56n23n19M50
7775A3N07q24J60O59n31m25M66O86j103nR91k41q85O57M59r01k4O97j85q02P92
7796A61M43j041J22P91l15o26N20O11j058q2J034l28q74O25N22p70J99M53l75
7815A2m28M69N10o50l46O79J62r21N65R94j239m53J069O6r60M72O73q41j98R59
7835E94o52j90J77N84n96l71P47n7p84L96P53o33n81R89M3q29K22O71p18l95R44
7856C14R3j189N79P45p66l49J110j34r79M08P06n57l31Q30j25p60K95Q70o97n60
7876d97Q56R5q34L06O40l30p52P22K17j063O08P54q66k50O82J94q88M25O70p82
$$ plain form
7896 -93 -417 156 438 -470 -294 580 222 -713 121 436 -346 -294 381 -208 -664 253 324 -631 -388 399 -99
7917 -99 -637 99 509 -582 -472 540 82 -502 314 408 -336 -510 39 40 -489 198 442 -359 -396 568 131
7938 131 -747 251 361 -597 -697 265 58 -489 -465 600 -6 -696 92 -343 55 362 -16 39 198 1112
7958 1112 -469 -1014 1013 681 15 -112 367 666 -239 -215 924 132 -330 388 978 -230 -91 428 546
7977 546 -154 322 750 -693 149 221 -597 -548 649 54 -347 -172 804 -309 -469 327 403 -529 -129 473
7997 473 -99 -508 328 252 -569 -464 703 -285 -503 202 -14 -537 -135 760 -53 -366 411 513 -452 -369
8017 -369 535 -259 -369 245 702 -635 -410 499 -204 -547 240 358 -550 -185 589 -207 -525 504 682
8036 682 -292 -136 656 -99 -538 180 387 -659 50 613 54 -153 214 343 -380 -188 594 3 -987 -5
$$ packed form
7896i3l24N73K82r08J76Q74l58r35Q34L15p82N2O75n89m56R17P1r55K43P87m98
7917i9n38P36M10j091J10J012m58n84Q16R4p44j74N49Jn29O87K44q01l7R64m37
7938A31q78R98J10r58j00R62k07n47K4J065o06o90P88m35L98L07l78N5J59R14
7958A112j581n45K027l32o66j27M79K99r05K4J139p92m62P18N90j208J39N19J18
7977E46p00M76M28j443Q42P2q18M9J197n95m01J75R76j113j60P96P6r32M00O02
7997D73n72m09Q36p6q21J05J167r88k18P05k16n23M02Q95q13l13P77J02r65Q3
8017c69R04p94j10O14M57j337K25R09p03l43P87J18r08L65P74p96l18J029J78
8036F82r74J56P92p55m39P18K07j046P09N63n59k07L67J29p23J92P82n91r90R82
$$ plain form
8056 -5 551 -682 -623 764 -50 -643 725 206 -333 -258 389 -545 -711 -595 312 -571 -303 925 213 -732
8076 -732 70 75 -477 -621 195 442 -695 649 563 -315 -250 566 113 -335 144 620 -375 -523 375 13 -721
8097 -721 102 605 -310 -267 650 324 -400 67 549 -463 -184 389 186 -534 -147 340 -362 -422 393 568
8117 568 -640 -66 400 -139 -335 190 196 -540 -236 477 -398 -588 396 242 -490 54 445 -24 -441 440
8137 440 221 -701 130 439 -298 -477 379 145 -370 132 449 -41 -591 241 495 -463 -140 493 40 -582
8157 -582 204 300 -574 -125 500 -104 -488 224 578 -503 -106 389 38 -590 175 173 -370 -13 466 -21 -508
8178 -508 415 366 -418 -493 315 -29 -553 298 320 -433 -264 659 182
$$ packed form
8056eN56j233N9J387q14n93J368n19n39P5O47r34j66J16R07q83K68J228p12r45
8076g32Q02Nn52j44Q16K47j137J344q6q78O5Q16m53m48M79M76r95j48Q98l62p34
8097g21Q23N03r15M3R17l26p24M67M82j012K79N73k03p20L87M87p02o0Q15J75
8117E68j208N74M66n39j96N25Op36L04P13q75j90R84j54p32N44L91m69m17Q81
8137D40k19r22Q31L09p37j79Q56k34n15N02L17m90n50Q32K54r58L23O33m53o22
8157e82P86R6q74M49O25o04l84P12L54j081L97M95l51o28P65kn43L57M79m87m87
8178e08R23m9p84p5Q08l44n24Q51K2p53J69R23m77
8191A82
$$ Imaginary data points
##PAGE= N=2
##DATA TABLE= (X++(I..I)), XYDATA
$$ plain form
0 0 0 0 0 0 0 0 0 0 0 0 0 1 -8 8 -8 8 -16 16 -20 24 -32 34 -41 49 -57 66 -81 91 -105 122 -139 160 -182 206
34 206 -234 265 -297 331 -371 413 -462 512 -569 629 -698 771 -851 939 -1036 1141 -1254 1383
52 1383 -1524 1682 -1858 2052 -2274 2530 -2824 3167 -3580 4073 -4693 5481 -6535 8011 -10244
67 -10244 14043 -22155 78117 -187025 -149677 290342 -9913 -271973 95556 215237 -208512
78 -208512 -125616 245629 28081 -243938 94357 212407 -157295 -133732 217861 40211
88 40211 -240965 41600 205698 -153051 -159845 205600 63492 -237982 47843 226158 -135974
99 -135974 -152826 212354 59319 -239291 37308 203886 -146582 -154283 192346 52938 -217195
110 -217195 40446 198244 -110470 -136041 176662 72453 -199920 11577 189601 -101478
$$ packed form
0@%%%%%%%%%%%JrJ6j6J6k4L2l6M4n6O6p5R0j06J23j47J72j96K27k61K99l42L88
34B06m40M99n62O28p02P84q75R74j081J198j327J469j622J790j975K177k395K637
52A383k907L206l540L910m326M804n354N991o747P653q766J0174j2016J4546j8255
67a0244K4287l6198J00272k65142L7348M40019l00255k62060L67529J19681m23749
78b08512Q2896L71245k17548k72019L38295J18050l69702K3563L51593j77650
88D0211k81176K82565J64098l58749o794L65445j42108l01474K85825J78315l62132
99a35974j6852L65180j53035k98610K76599J66578l50468p701L46629j39408k70133
110b17195K57641J57798l08714k5571L12703j04209k72373K11497J78024k91079
$$ plain form
120 -101478 -158656 154961 80860 -197467 690 201982 -79118 -154394 164294 96976 -193054
131 -193054 -73 194347 -86915 -157284 145713 81871 -184803 -4485 181773 -67810
141 -67810 -139289 137615 93499 -159472 -13852 171708 -53994 -150150 111075 95478 -161939
152 -161939 -35764 173162 -41833 -154651 116453 112246 -156771 -32730 178371 -42965
162 -42965 -158982 107844 100473 -162519 -39306 164607 -42045 -148315 101999 103189 -138135
173 -138135 -38346 157473 -22390 -145755 80108 106157 -133920 -61390 149113 -12569
183 -12569 -153470 73745 121649 -125762 -61475 161140 -3453 -153528 76158 118190 -131236
194 -131236 -63687 149600 -11279 -148181 70760 112714 -115532 -55842 144283 3735
$$ packed form
120a01478n7178L13617p4101k78327J98157K01292k81100p5276L18688o7318k90030
131a93054J92981J94420k81262p0369L02997o3842k66674J80318J86258k49583
141f7810p1479K76904m4116k52971J45620J85560k25702r6156K61225j5597k57417
152a61939J26175K08926k14995j12818K71104m207k69017J24041K11101k21336
162d2965j16017K66826p371k62992J23213K03913k06652j06270K50314J190k41324
173a38135R9789J95819j79863j23365K25863K6049k40077P2530K10503j61682
183a2569j40901K27215M7904k47411O4287K22615j64593j50075K29686M2032k49426
194a31236O7549K13287j60879j36902K18941M1954k28246N9690K00125j40548
$$ plain form
204 3735 -133170 59689 113086 -101429 -71072 128666 14527 -141314 40943 124142 -94798
215 -94798 -81554 138915 29750 -144029 44015 133847 -98388 -86705 137243 21906 -149986
226 -149986 40325 124188 -97715 -79754 130458 25479 -132217 36859 119289 -80503
236 -80503 -81428 112165 31157 -129422 14878 115361 -69876 -92915 105678 47564 -126981
247 -126981 9477 128109 -62953 -98905 108089 48846 -134477 5184 123199 -67892
257 -67892 -99431 104322 48123 -125489 7980 122370 -56624 -92149 97241 51758 -117084
268 -117084 -4784 114461 -47263 -99918 84511 62040 -112541 -13222 122669 -34623
278 -34623 -102173 86017 70655 -113210 -17969 121485 -37369 -106256 81546 65913 -109972
$$ packed form
204C735j36905J92859N3397k14515L0357J99738j14139j55841J82257Q3199k18940
215i4798J3244K20469j09165j73779J88044Q9832k32235J1683K23948j15337j71892
226a49986J90311Q3863k21903J7961K10212j04979j57696J69076Q2430j99792
236h0503r25J93593q1008j60579J44300J00483j85237k3039J98593n8114j74545
247a26981J36458J18632j91062l5952K06994n9243j83323J39661J18015j91091
257f7892l1539K03753n6199j73612J33469J14390j78994l5525J89390m5483j68842
268a17084J12300J19245j61724n2655J84429k2471j74581R9319J35891j57292
278c4623o7550J88190j5362j83865R5241J39454j58854o8887J87802j5633j75885
$$ plain form
289 -109972 -16072 117091 -30077 -95432 76610 67884 -97599 -21448 107932 -22720 -98533
300 -98533 61760 69997 -93487 -32954 107301 -11510 -101285 59184 81160 -90959 -37165
311 -37165 111115 -12250 -107053 57248 77242 -94786 -38066 105387 -12746 -99342 55112
322 55112 75691 -84994 -37256 100397 -5595 -97852 42301 75367 -78015 -48273 93435
333 93435 5129 -99729 35273 85448 -71732 -53118 97805 12365 -103402 33774 87279
344 87279 -75379 -55814 97090 8553 -100897 35815 83827 -69298 -48524 92429 12059
355 12059 -91441 29028 79721 -60774 -53696 81587 18787 -90184 17901 84215 -51538
366 -51538 -60704 82771 30470 -93219 14208 91733 -53303 -67641 83712 29127 -98616
$$ packed form
289a09972R3900J33163j47168o5355J72042q726j65483P6151J29380j30652p5813
300i8533J60293Q237j63484O0533J40255j18811q9775J60469K1976j72119N3794
311c7165J48280j23365r4803J64301J9994j72028N6720J43453j18133q6596J54454
322E5112K0579j60685M7738J37653j05992r2257J40153L3066j53382K9742J41708
333I3435q8306j04858J35002N0175j57180J8614J50923q5440j15767J37176N3505
344H7279j62658J9565J52904q8537j09450J36712M8012j53125K0774J40953q0370
355A2059j03500J20469N0693j40495P078J35283o2800j08971J08085O6314j35753
366e1538r166J43475n2301j23689J07427P7525j45036j4338J51353n4585j27743
$$ plain form
377 -98616 13943 90326 -54383 -63866 83504 28408 -91106 14208 84513 -48048 -62034
388 -62034 71569 29120 -84783 2544 79915 -38289 -66296 64876 39170 -81566 -4044
399 -4044 84896 -32130 -72109 63202 42381 -86123 -8345 85869 -34246 -73571 64493
410 64493 42405 -82818 -4931 84504 -30818 -69300 60180 42096 -77762 -10199 79016
421 79016 -24783 -70098 52104 47865 -72017 -16814 81756 -15910 -73158 50234 54150 -73254
433 -73254 -21408 82909 -15754 -76125 49433 53747 -71750 -19965 81660 -13555 -70815
444 -70815 47278 51863 -65757 -21585 74090 -9679 -69245 37731 52682 -59618 -27787
455 -27787 72532 -1368 -70870 33566 59099 -58732 -33228 74027 165 -76060 32110
$$ packed form
377i8616J12559P6383j44709r483J47370n5096j19514J05314P0305j32561j3986
388f2034J33603m2449j13903Q7327P7371j18204k8007J31172k5706j20736P7522
399d044Q8940j17026l9979J35311k0821j28504P7778R4214j20115l9325J38064
410F4493k2088j25223P7887Q9435j15322l8482J29480j8084j19858O7563Q9215
421G9016j03799m5315J22202m239j19882N5203R8570r7666n7248J23392L916j27404
433g3254N1846J04317r8663o0371J25558M314j25497N1785J01625r5215n7260
444g0815J18093M585j17620M4172R5675q3769n9566J06976J4951j12300L1831
455b7787J00319p3900o9502J04436K5533j17831K5504J07255p3862p6225J08170
$$ plain form
466 32110 59807 -61624 -34025 74847 -669 -73979 33305 58113 -57609 -32550 69621
477 69621 936 -70257 26332 55363 -51427 -36320 63345 8342 -67992 19250 60755 -44979
489 -44979 -42352 63963 14668 -71967 15988 64069 -46258 -45216 65296 14485 -71884 17955
501 17955 63424 -44605 -40847 63296 13964 -66527 15736 58750 -40067 -40924 56227 17353
513 17353 -62128 9532 59604 -32211 -44587 53474 25090 -62781 3322 64038 -30542 -51287
525 -51287 54042 27532 -67106 2836 66472 -31730 -50375 55476 26537 -64661 3444 62473
537 62473 -30096 -48335 49071 25597 -59727 -1443 58053 -23234 -48818 42559 30971 -55395
549 -55395 -7850 59050 -17898 -52746 39426 34410 -57181 -11660 60864 -17559 -54784 40721
$$ packed form
466C2110K7697j21431K7599J08872p5516p3310J07284K4808j15722K5059J02171
477F9621o8685p1193R6589K9031j06790J5107R9665n5003p6334Q7242M1505j05734
489d4979K627J06315m9295q6635Q7955M8081j10327J042J10512n0811q6369Q9839
501A7955M5469j08029L758J04143m9332q0491Q2263M3014r8817q57R7151l8874
513A7353p9481P1660N0072r1815j2376R8061k8384q7871O6103O0716r4580k0745
525e1287J05329k6510r4638O9942O3636r8202j8645J05851k8939r1198O8105N9029
537F2473r2569j8239R7406k3474q5324N8284N9496q1287k5584R1377j1588q6366
549e5395M7545O6900p6948l4848R2172n016r1591M5521P2524p8423l7225R5505
$$ plain form
561 40721 35666 -57141 -10086 60861 -17275 -52860 38935 33827 -54071 -11768 56959 -13498
573 -13498 -51442 34668 36637 -49250 -15237 56689 -7507 -53088 30998 40784 -48689 -19823
585 -19823 57874 -5356 -55768 30868 42599 -48494 -19187 58326 -5018 -53324 29788 40689
597 40689 -45335 -19408 53321 -3036 -50690 24385 39724 -39932 -22583 50226 2839 -50575
609 -50575 19335 43747 -37721 -27596 50218 5368 -54145 17689 45873 -39128 -29084 52196
621 52196 5381 -54352 18922 45036 -39121 -27782 49529 4588 -51762 15952 42122 -34586
633 -34586 -28521 44786 8882 -48739 10728 43974 -29114 -32630 42591 14019 -50184 6430
645 6430 46747 -27990 -35946 43734 15988 -51480 7383 48135 -28385 -34171 44022 14834 -48951
$$ packed form
561D0721n055r2807M7055P0947p8136l5585R1795n108q7898M2303O8727p0457
573a3498l7944Q6110J969q5887L4013P1926o4196m5581Q4086R786q9473K8866
585a9823P7697o3230n0412Q6636J1731r1093K9307P7513o3344m8306Q3112J0901
597D0689q6024K5927P2729n6357m7654P5075J5339p9656J7349P2809m7387n3414
609e0575O9910K4412q1468J0125P7814m4850n9513P1834K8184q5001J0044Q1280
621E2196m6815n9733P3274K6114q4157J1339P7311m4941n6350O7714K6170p6708
633c4586O065P3307l5904n7621N9467L3246p3088l516P5221k8572o4203N6614
645F430M0317p4737p956P9680k7746o7468N8863M0752p6520n786P8193k9188o3785
$$ plain form
658 -48951 7873 44948 -26690 -32284 39958 15415 -44785 4402 43714 -20775 -33389 36174
670 36174 19864 -43845 -656 45537 -18078 -38084 35713 23601 -45991 -2792 48306 -18238
682 -18238 -39247 37088 23546 -46609 -1869 46924 -18744 -37997 34238 21680 -43720 -3617
694 -3617 43350 -14944 -36676 29619 23849 -39608 -7895 42271 -10308 -39096 26062 27054 -39460
707 -39460 -11504 44001 -8925 -41034 26524 28314 -39762 -11333 44047 -9024 -40139 26303
719 26303 27373 -38818 -11040 41774 -7543 -38284 23386 28331 -34832 -13219 40511 -3359
731 -3359 -39077 20455 30830 -33638 -16849 41356 -739 -40939 19625 33244 -33750 -17100
743 -17100 42323 -785 -40420 19566 32008 -32489 -16446 39683 -155 -37897 16661 30726
$$ packed form
658d8951N6824L7075p1638n594P2242k4543o0200M9187L9312o4489j2614O9563
670C6174j6310o3709M3189M6193o3615k0006P3797j2112o9592M3199N1098o6544
682a8238k1009P6335j3542p0155M4740M8793o5668j9253P2235j2558o5400M0103
694c617M6967n8294k1732O6295n770o3457L1713N0166n2579k8788O5158R92o6514
707c9460K7956N5505n2926l2109O7558J790o8076K8429N5380n3071l1115O6442
719B6303J070o6191K7778N2814m9317l0741O1670M945o3163K1613N3730m3870
731c359l5718N9532J0375o4468J6789N8205m2095m0200O0564J3619o6994J6650
743a7100N9423m3108l9635N9986J2442o4497J6043N6129l9838l7742N4558J4065
$$ plain form
755 30726 -28512 -17411 35989 3130 -36752 12671 32149 -25544 -21456 35204 6250 -39055
767 -39055 10401 34423 -26292 -23626 36956 6836 -40260 10938 34836 -27207 -22827 36225
779 36225 5187 -38899 10390 32517 -25134 -21883 32879 7239 -35623 7412 32406 -20667
791 -20667 -24239 29981 11026 -35574 3169 34192 -18483 -27125 30392 13961 -36856 2544
803 2544 36396 -18705 -27298 31130 13215 -36381 3437 34606 -18225 -25142 29206 12917 -33083
816 -33083 2120 32604 -14828 -24915 25806 14883 -31338 -1295 32811 -11966 -27482 24336
828 24336 18128 -32153 -3428 34890 -11370 -29551 25091 18617 -33203 -3282 34540 -12411
840 -12411 -28975 24469 17182 -31913 -3181 32419 -10610 -27506 21751 17375 -28951 -6056
$$ packed form
755C0726n9238J1101N3400l2859l9882M9423J9478n7693M088N6660k8954m5305
767c9055M9456K4022o0715K666O0582l0120m7096N1198K3898o2043M380N9052
779C6225l1038m4086M9289K2127n7651L251N4762k5640m2862M3035K4994n3073
791b0667l572N4220j8955m6600L8743L1023n2675q642N7517j6431n0817L9400
803B544L3852n5101q593N8428j7915m9596L9818L1169n2831o917N4348j6289m6000
816c3083L5203L0484m7432j0087N0721j0923m6221L0043L4106m4777j5516N1818
828B4336o208n0281K8725L8318m6260j8181N4642o474n1820K9921L7822m6951
840a2411j6564N3444p287m9095K8732L5600m3029j6896M9257m376m6326K2895
$$ plain form
852 -6056 30668 -7458 -28100 18631 19596 -27839 -8468 31465 -5324 -29613 18485 21523 -28519
865 -28519 -9294 31768 -5690 -29965 18336 20834 -27762 -8526 30887 -5024 -28387 16883
877 16883 20606 -25480 -9425 29462 -2565 -28187 14506 22228 -23800 -12128 29572 -140
889 -140 -29557 13727 24230 -23930 -13218 30422 333 -29928 13825 24037 -23863 -13111
901 -13111 29409 -4 -28243 12598 22676 -21257 -12671 26783 1930 -26583 9278 22950
913 22950 -18737 -15267 25131 4517 -27874 6895 24852 -18284 -17414 26074 5442 -29353 7177
926 7177 25857 -19602 -17568 26637 4645 -29061 7464 24498 -18854 -16535 24958 5092 -26828
939 -26828 5952 23330 -15985 -17107 22127 7369 -25620 2683 24275 -13333 -19361 21836
$$ packed form
852f056L6724l8126k0642M6731R65m7435J9371L9933l6789k4289M8098L038n0042
865b8519J9225M1062l7458k4275M8301K498m8596J9236L9413l5911k3363M5270
877A6883L723m6086J6055L8887l2027k5622M2693P722m6028J1672M1700k9712
889a40k9417M3284J0503m8160J0712M3640l0089l0261M3753J0212m7900J0752
901a3111M2520k9413k8239M0841J0078m3933Q586L9454k4853k8513L5861J3672
913B2950m1687L470M0398k0614l2391L4769J7957m3136Q70M3488k0632l4795L6530
926G177J8680m5459K034M4205k1992l3706L6525J7034m3352K319M1493j9866l1920
939b6828L2780J7378l9315j122L9234j4758l2989K8303K1592l7608o028M1197
$$ plain form
951 21836 10310 -26258 1407 26210 -13031 -20459 22364 10436 -26777 1797 26026 -13185
963 -13185 -19326 21961 9902 -25052 1955 24505 -11498 -18338 19662 10572 -23104 -334 23793
976 23793 -9242 -19971 17894 12675 -23079 -2519 25129 -7835 -21620 18109 13906 -24495
988 -24495 -2666 25895 -8499 -21681 18152 13554 -24077 -2642 24491 -8191 -20850 16571
1000 16571 12994 -21925 -4045 23011 -5870 -20845 14068 14552 -20762 -6297 23117 -3933
1012 -3933 -21729 13201 15912 -20814 -7239 23934 -3795 -22625 13554 15837 -20711 -6517
1024 -6517 23292 -3912 -21525 13003 15552 -19380 -7054 22239 -2441 -20756 11224 16190
1036 16190 -17885 -8513 21997 -231 -21633 10209 18212 -17673 -9840 22701 298 -22612
$$ packed form
951B1836j1526l6568K7665K4803l9241p428M2823j1928l7213K8574K4229l9211
963a3185o141M1287j2059l4954K7007K2550l6003o840L8000r090l3676K2770K4127
976B3793l3035j0729L7865n219l5754K0560K7648l2964j3785L9729m203l8401
988b4495K1829K8561l4394j3182L9833m598l7631K1435K7133l2682j2659L7421
1000A6571l577l4919J7880K7056k8881j4975L4913M84l5314J4465K9414k7050
1012c933j7796L4930K711l6726J3575L1173k7729j8830L6179K283l6548J4194
1024f517K9809k7204j7613L4528K549l4932J2326K9293k4680j8315L1980M966
1036A6190l4075R372L0510k2228k1402L1842Q003l5885P833L2541k2403k2910
$$ plain form
1048 -22612 10091 18559 -18122 -9624 22514 -26 -21800 9934 17414 -16947 -9357 20559 750
1061 750 -20055 7778 17023 -14801 -10854 19071 2911 -20666 5672 18155 -13768 -12777 19240
1074 19240 4268 -21889 5031 19596 -14431 -13543 20229 3893 -22554 5918 19131 -14462
1086 -14462 -12485 19369 3601 -20989 4950 17963 -12937 -12736 17491 4741 -19878 2878
1098 2878 18230 -10653 -14054 16605 7041 -19875 1294 19445 -10041 -15471 17095 8120 -20598
1111 -20598 1503 20162 -10017 -15201 17089 7690 -19829 1799 19019 -9613 -14235 15660
1123 15660 7419 -18319 496 18115 -7835 -14641 14348 8906 -17815 -1247 18839 -6485
1135 -6485 -16128 13929 10167 -18840 -2050 19743 -6848 -16648 14627 10139 -19040 -1641 19428
$$ packed form
1048b2612L2703Q468l6681Q498L2138k2540k1774L1734P480l4361P590K9916j9809
1061G50k0805K7833R245l1824L947K9925j6160k3577K6338J2483l1923R91L2017
1074A9240j4972k6157K6920J4565l4027Q88L3772j6336k6447K8472J3213l3593
1086a4462J977L1854j5768k4590K5939J3013l0900K01L0227j2750k4619K2756
1098B878J5352k8883l401L0659r564k6916K1169J8151k9486n430L2566q975k8718
1111b0598K2101J8659l0179n184L2290r399k7519K1628J7220k8632m622K9895
1123A5660q241k5738J8815J7619k5950o806K8989n442k6721J6568K0086k5324
1135f485r643L0057l762k9007J6790K1793k6591r800L1275m488k9179J7399K1069
$$ plain form
1148 19428 -6972 -16129 13445 9835 -17772 -2656 17676 -5605 -15719 11700 10443 -16338
1160 -16338 -3843 17730 -4076 -16614 10766 11694 -16370 -5028 18359 -3348 -17563 10817
1172 10817 12211 -16547 -4887 18638 -3405 -17023 10812 11692 -15773 -4691 17642 -2713
1184 -2713 -15892 9554 12105 -14420 -5850 17235 -1121 -16441 8094 13310 -14006 -7384 17617
1197 17617 -196 -17515 8303 14283 -14307 -7574 17996 -259 -17468 8428 13565 -13947
1209 -13947 -6952 16903 -113 -16511 7245 13291 -12405 -7847 15172 1347 -15770 5102
1221 5102 13773 -10945 -9465 15091 2899 -16526 3972 15269 -11206 -10646 15772 3085 -17592
$$ packed form
1148A9428k6400r157K9574l610k7607J5116K0332k3281j0114K7419j257k6781
1160a6338J2495K1573k1806j2538K7380R28k8064J1342K3387k1707j4215K8380
1172A0817J394k8758J1660K3525k2043j3618K7835Q80k7465J1082K2333k0355
1184b713j3179K5446K551k6525Q570K3085j8356j5320K4535N216k7316O622K5001
1197A7617j7813j7319K5818N980k8590O733K5570j8255j7209K5896N137k7512
1209a3947O995K3855j7016j6398K3756O046k5696M558K3019j3825j7117K0872
1221E102Q671k4718J480K4556j2192j9425K0498J1297k6475N60K6418j2687k0677
$$ [...]
8191d48
##END NTUPLES=NMR FID
##END=
