##TITLE=1H_SR52+5*TFAA
 CDCl3, 8 sc, 
 31.05.2021
##JCAMPDX= 6.0         $$ Bruker NMR JCAMP-DX V2.0
##DATA TYPE= NMR FID
##DATA CLASS= NTUPLES
##ORIGIN= UXNMR, Bruker Analytische Messtechnik GmbH
##OWNER= root
$$ XWIN-NMR		Version 3.5
$$ Mon May 31 11:44:38 2021 Russian Standard Time (UT+4h)  she@DPX200
##.OBSERVE FREQUENCY= 200.131506
##.OBSERVE NUCLEUS= ^1H
##.DELAY= (6, 6)
##.ACQUISITION MODE= SIMULTANEOUS
##.ACQUISITION SCHEME= undefined
##.AVERAGES= 8
##.DIGITISER RES= 18
##SPECTROMETER/DATA SYSTEM= spect
##.PULSE SEQUENCE= zg30
##.SOLVENT NAME= CDCl3
##.SHIFT REFERENCE= (INTERNAL, CDCl3, 0, 15.7039)
##AUDIT TRAIL= $$ (NUMBER, WHEN, WHO, WHERE, WHAT)
$$ ##TITLE= Audit trail, XWIN-NMR		Version 3.5
$$ ##JCAMPDX= 5.01
$$ ##ORIGIN= Bruker BioSpin GmbH
$$ ##OWNER= she
$$ F:/spectra/data/she/nmr/H-F/1/audita.txt
$$ ##AUDIT TRAIL=  $$ (NUMBER, WHEN, WHO, WHERE, WHAT)
(   1,<2021-05-31 11:43:24.59 +0400>,<she>,<DPX200>,
      <created by zg, POWCHK disabled, PULCHK disabled
       configuration hash MD5:
       00 E9 B6 7A A2 85 ED C7 34 08 36 98 17 FE 4E 26
       data hash MD5: 16K
       0C 2C 5E 02 8F 78 64 AC 0C 1A 70 6D 13 0D AB B1>)
$$ ##END=
$$ 
$$ hash MD5
$$ 05 17 12 95 40 C8 09 E8 53 BE B2 CE 70 29 23 73
##$RELAX= 
##$RELAX= 
##$RELAX= 
##$RELAX= 
##$RELAX= 
##$RELAX= 
$$ Bruker specific parameters
$$ --------------------------
##$DU= <F:/spectra>
##$EXPNO= 1
##$NAME= <H-F>
##$PROCNO= 1
##$TYPE= <nmr>
##$USER= <she>
##$AMP= (0..31)
100 100 100 100 100 100 100 100 100 100 100 100 100 100 100 100 100 100 
100 100 100 100 100 100 100 100 100 100 100 100 100 100 
##$AQSEQ= 0
##$AQ_mod= 1
##$AUNM= <au_zg>
##$AUTOPOS= <>
##$BF1= 200.13
##$BF2= 200.13
##$BF3= 200.13
##$BF4= 200.13
##$BF5= 200.13
##$BF6= 200.13
##$BF7= 200.13
##$BF8= 200.13
##$BYTORDA= 1
##$CFDGTYP= 0
##$CFRGTYP= 5
##$CHEMSTR= <none>
##$CNST= (0..31)
1 1 145 1 1 1 1 1 1 1 1 1 1 1 1 1 1 1 1 1 1 1 1 1 1 1 1 1 1 1 1 1 
##$CPDPRG= <>
##$CPDPRG1= <>
##$CPDPRG2= <>
##$CPDPRG3= <>
##$CPDPRG4= <mlev>
##$CPDPRG5= <mlev>
##$CPDPRG6= <mlev>
##$CPDPRG7= <mlev>
##$CPDPRG8= <mlev>
##$CPDPRGB= <>
##$CPDPRGT= <>
##$D= (0..31)
0 1.2 0 0 0 0 0 0 0 0.06 0 0.03 0 0 0 0 0.0002 0 0 0 0 0 0 0 0 0 0 0 0 
0 0 0 
##$DATE= 1622447004
##$DBL= (0..7)
120 120 120 120 120 120 120 120 
##$DBP= (0..7)
150 150 150 150 150 150 150 150 
##$DBP07= 0
##$DBPNAM0= <>
##$DBPNAM1= <>
##$DBPNAM2= <>
##$DBPNAM3= <>
##$DBPNAM4= <>
##$DBPNAM5= <>
##$DBPNAM6= <>
##$DBPNAM7= <>
##$DBPOAL= (0..7)
0.5 0.5 0.5 0.5 0.5 0.5 0.5 0.5 
##$DBPOFFS= (0..7)
0 0 0 0 0 0 0 0 
##$DE= 6
##$DECBNUC= <off>
##$DECIM= 32
##$DECNUC= <off>
##$DECSTAT= 4
##$DIGMOD= 1
##$DIGTYP= 9
##$DL= (0..7)
0 120 120 120 120 120 120 120 
##$DP= (0..7)
150 150 150 150 150 150 150 150 
##$DP07= 0
##$DPNAME0= <>
##$DPNAME1= <>
##$DPNAME2= <>
##$DPNAME3= <>
##$DPNAME4= <>
##$DPNAME5= <>
##$DPNAME6= <>
##$DPNAME7= <>
##$DPOAL= (0..7)
0.5 0.5 0.5 0.5 0.5 0.5 0.5 0.5 
##$DPOFFS= (0..7)
0 0 0 0 0 0 0 0 
##$DQDMODE= 0
##$DR= 18
##$DS= 0
##$DSLIST= <SSSSSSSSSSSSSSS>
$$ [...]
##$SUBNAM2= <"">
##$SUBNAM3= <"">
##$SUBNAM4= <"">
##$SUBNAM5= <"">
##$SUBNAM6= <"">
##$SUBNAM7= <"">
##$SUBNAM8= <"">
##$SUBNAM9= <"">
##$SW= 16.9725357007746
##$SWIBOX= (0..15)
0 0 2 0 0 0 0 0 0 0 0 0 0 0 0 0 
##$SW_h= 3396.73913043478
##$TD= 16384
##$TD0= 1
##$TE= 0
##$TE2= 300
##$TE3= 300
##$TEG= 300
##$TL= (0..7)
0 120 120 120 120 120 120 120 
##$TP= (0..7)
150 150 150 150 150 150 150 150 
##$TP07= 0
##$TPNAME0= <>
##$TPNAME1= <>
##$TPNAME2= <>
##$TPNAME3= <>
##$TPNAME4= <>
##$TPNAME5= <>
##$TPNAME6= <>
##$TPNAME7= <>
##$TPOAL= (0..7)
0.5 0.5 0.5 0.5 0.5 0.5 0.5 0.5 
##$TPOFFS= (0..7)
0 0 0 0 0 0 0 0 
##$TUNHIN= 0
##$TUNHOUT= 0
##$TUNXOUT= 0
##$USERA1= <user>
##$USERA2= <user>
##$USERA3= <user>
##$USERA4= <user>
##$USERA5= <user>
##$V9= 5
##$VALIST= <valist>
##$VCLIST= <CCCCCCCCCCCCCCC>
##$VD= 0
##$VDLIST= <DDDDDDDDDDDDDDD>
##$VPLIST= <PPPPPPPPPPPPPPP>
##$VTLIST= <TTTTTTTTTTTTTTT>
##$WBST= 1024
##$WBSW= 4
##$XGAIN= (0..3)
0 0 0 0 
##$XL= 0
##$YL= 0
##$YMAX_a= 171459
##$YMIN_a= -191572
##$ZGOPTNS= <>
##$ZL1= 120
##$ZL2= 120
##$ZL3= 120
##$ZL4= 120
##$ABSF1= 10
##$ABSF2= 0
##$ABSG= 5
##$ABSL= 3
##$ALPHA= 0
##$AQORDER= 0
##$ASSFAC= 0
##$ASSFACI= 0
##$ASSFACX= 0
##$ASSWID= 0
##$AUNMP= <proc_1d>
##$AZFE= 0.1
##$AZFW= 0.1
##$BCFW= 1
##$BC_mod= 2
##$BYTORDP= 1
##$COROFFS= 0
##$CY= 11.3945322036743
##$DATMOD= 1
##$DC= 2
##$DFILT= <>
##$DTYPP= 0
##$F1P= 15.9154993809931
##$F2P= -4.1035820241983
##$FCOR= 0.5
##$FTSIZE= 0
##$FT_mod= 4
##$GAMMA= 1
##$GB= 0.15
##$INTBC= 1
##$INTSCL= 1
##$ISEN= 128
##$LB= 0.24
##$LEV0= 0
##$LPBIN= 0
##$MAXI= 10000
##$MC2= 0
##$MEAN= 0
##$ME_mod= 0
##$MI= 1.114404
##$NCOEF= 0
##$NC_proc= 0
##$NLEV= 6
##$NOISF1= 3.799351
##$NOISF2= 2.8
##$NSP= 1
##$NTH_PI= 0
##$NZP= 0
##$OFFSET= 15.70392
##$PC= 1
##$PHC0= -11116.49
##$PHC1= 4.600991
##$PH_mod= 1
##$PKNL= yes
##$PPARMOD= 0
##$PSCAL= 0
##$PSIGN= 0
##$REVERSE= no
##$SF= 200.130013532006
##$SI= 16384
##$SIGF1= 3
##$SIGF2= 2
##$SINO= 400
##$SIOLD= 16384
##$SREGLST= <1H.CDCl3>
##$SSB= 0
##$STSI= 0
##$STSR= 0
##$SW_p= 3612.71676300578
##$SYMM= 0
##$S_DEV= 0
##$TDeff= 0
##$TDoff= 0
##$TI= <>
##$TILT= no
##$TM1= 0
##$TM2= 0
##$TOPLEV= 0
##$USERP1= <user>
##$USERP2= <user>
##$USERP3= <user>
##$USERP4= <user>
##$USERP5= <user>
##$WDW= 1
##$XDIM= 8192
##$YMAX_p= 0
##$YMIN_p= 0
$$ End of Bruker specific parameters
$$ ---------------------------------
##NTUPLES= NMR FID
##VAR_NAME=  TIME,          FID/REAL,        FID/IMAG
##SYMBOL=    X,             R,               I
##VAR_TYPE=  INDEPENDENT,   DEPENDENT,       DEPENDENT
##VAR_FORM=  AFFN,          ASDF,            ASDF
##VAR_DIM=   8192,          8192,            8192
##UNITS=     SECONDS,       ARBITRARY UNITS, ARBITRARY UNITS
##FACTOR=    0.0002944,     1,               1
##FIRST=     0,             0,               0
##LAST=      2.4114304,     0,               0
##MIN=       0,             -191572,         0
##MAX=       2.4114304,     171459,          0
$$ Real data points
##PAGE= N=1
##DATA TABLE= (X++(R..R)), XYDATA
$$ plain form
0 0 0 0 0 0 0 0 0 0 0 0 0 0 -2 8 -8 8 -8 8 -16 16 -23 24 -32 37 -40 48 -56 64 -74 87 -98 111 -127 143 -165
35 -165 183 -205 229 -259 287 -319 356 -396 438 -483 534 -588 651 -715 787 -871 958 -1054
53 -1054 1164 -1287 1425 -1581 1760 -1972 2218 -2514 2880 -3339 3937 -4756 5942 -7826 11268
68 11268 -19565 80923 6534 -191572 67891 171459 -74470 -149989 89788 125500 -66648
79 -66648 -118442 47388 108903 -24010 -114492 23593 128833 -8627 -123208 16913 114048
90 114048 -9699 -102468 -289 91838 17810 -89242 -28058 85911 37873 -81801 -44107
101 -44107 78081 55737 -73711 -62974 66232 61083 -64025 -71733 52875 76852 -47807
112 -47807 -80694 41620 80941 -37585 -86545 24732 87714 -21389 -94397 12037 87672
$$ packed form
0@%%%%%%%%%%%%kJ0j6J6j6J6k4L2l9M7n6O9p7Q8j04J20j38J61j85K09k38K70l08
35a65L48l88M34m88N46o06O75p52Q34r21J017j122J239j366J502j658J829k012
53a054K218k451K712l006L341l732M190m732N394o219P276q693J0698j3768J9094
68A1268l0833J00488p4389j98106K59463J03568k45929p5519K39777L5712j92148
79f6648n1794J65830O1515j32913r0482J38085J05240j37460j14581J40121R7135
90A14048j23747r2769J02179R2127p4028j07052O1184J13969m8038j19674L7694
101d4107J22188k2344j29448J0737J29206n149j25108p708J24608K3977j24659
112d7807l2887J22314L9321j18526m8960J11277O2982j09103p3008J06434P5635
$$ plain form
123 87672 -12240 -91026 708 87072 5847 -84888 -9672 81115 14674 -79813 -24371 73506
135 73506 28923 -71085 -34283 67530 39475 -61514 -45713 56089 52850 -49169 -54012
146 -54012 47264 58940 -40838 -60989 35058 66482 -27215 -64744 26032 69070 -17432 -68185
158 -68185 13436 70827 -6034 -67903 3897 68283 2570 -65111 -8485 65179 15922 -60462
170 -60462 -17764 61037 25147 -57268 -30597 52889 33941 -51508 -37799 47257 40706 -44117
182 -44117 -45839 37101 47148 -34761 -50312 30033 51244 -26601 -56047 18078 54512 -16705
194 -16705 -57464 10209 55892 -7166 -57687 -1150 55123 2895 -56558 -8745 54078 12366
206 12366 -53535 -18115 50720 20339 -49649 -23837 46637 28055 -43294 -31663 39678 34401
$$ packed form
123H7672r9912p8786R1734Q6364q1225r0735P5216R0787o6441r4487N5442R7877
135G3506m4583j00008L6802J01813k8055j00989J5801J01802l239j02019m843
146e4012J01276J1676r9778k0151R6047L1424r3697l7529R0776M3038q6502n0753
158f8185Q1621N7391p6861o1869P1800O4386o5713o7681N6626P3664m9257p6384
170f0462M2698P8801l5890q2415K6671Q3486j8948q5449J3709Q5056o551q4823
182d4117j722Q2940J0047q1909j5551Q0345K1211p7845k9446P4125L6434p1217
194a6705m0759O7673M5683o3058n0521N6537N6273n2228n9453M7813O2823m1712
206A2366o5901L5420O8835l0381o9988K5812P0474j8582p1349J1631P1341n277
$$ plain form
218 34401 -36664 -36345 33877 40517 -27423 -41386 24931 44677 -20074 -44531 17764 48141 -10390
231 -10390 -46567 8876 49481 -3879 -47429 2398 49356 4479 -46204 -6568 46812 10881
243 10881 -44792 -13280 44031 19476 -40338 -20851 40085 24486 -37409 -27122 34377 30232
255 30232 -31114 -32765 28015 33606 -26510 -36834 21589 37546 -18637 -39553 14744 39318
267 39318 -13707 -41785 7562 40011 -5778 -42015 588 40121 556 -41458 -6076 38816
279 38816 8441 -39211 -12776 36793 13832 -37113 -18400 33389 20500 -31448 -22497 30592
291 30592 25401 -27640 -27218 24832 29703 -21778 -30965 20104 33070 -16487 -33185 14076 35378
304 35378 -8836 -33950 8987 36488 -3736 -34928 1346 35820 2504 -34397 -3558 35508
$$ packed form
218C4401p1065L19P0222O640o7940j3963O6317J9746o4751k4457O2295L0377n8531
231a0390l6177N5443M0605n3360m3550M9827M6958m4877n0683L9636N3380l5931
243A0881n5673L1512N7311k4555n9814J9487O0936j5599o1895J0287O1499m145
255C0232o1346j651O0780N591o0116j0324N8423J5957n6183k0916N4297K4574
267C9318n3025k8078M9347L2449m5789l6237M2603L9533l9565m2014L5382M4892
279C8816l0375m7652K6435M9569k2961n0945J8713N1789j2889n1948Q951N3089
291C0592n191n3041M22N2050M871n1481r187N1069J2966m9557j6698M7261K1302
304C5378m4214k5114M2937K7501m0224l1192L6274L4474l3316l6901L0839L9066
$$ plain form
316 35508 8156 -32428 -9508 32978 13819 -30295 -14919 30279 17703 -28048 -20194 25417
328 25417 21893 -23885 -23645 22156 25508 -19519 -27050 15840 27139 -14960 -30086 11043 29035
341 29035 -10075 -30905 5366 29558 -4127 -31272 839 30562 717 -31000 -5216 28274
353 28274 5001 -29977 -9351 27443 10375 -26832 -13604 24964 15334 -24110 -17444 22644
365 22644 18996 -20603 -20613 18131 21969 -16877 -23179 15707 25156 -12015 -24150 10895 26263
378 26263 -7742 -25918 6685 26970 -2911 -25889 2029 27009 1801 -25510 -2168 26657
390 26657 6200 -23982 -6881 24673 9770 -23186 -10990 22860 13374 -20379 -14440 19794
402 19794 16947 -17671 -17896 16699 19032 -14661 -20267 12248 21005 -11463 -22554 8819 21925
$$ packed form
316C5508k7352m0584K2920M2486j9159m4114J5376M5198j2576m5751P854M5611
328B5417l524m5778K40M5801L352m5027p531M2890J1299m2099j5126M1129J7992
341B9035l9110k0830L6271K4192l3685k7145L2111K9723k9845l1717K5784L3490
353B8274k3273l4978K0626L6794j7068l7207J3228L8568r630l9444O666M0088
365B2644l648l9599j0L8744L838l8846o302L8886R449l7171j2135L5045J5368
378B6263l4005j8176L2603K0285k9881k2978K7918K4980k5208k7311K3342K8825
390B6657k0457l0182J7101L1554j4903l2956J2196L3850r486l3753N939L4234
402A9794k847l4618k25L4595K333l3693n606L2515Q757l2468j1091L1373J3106
$$ plain form
415 21925 -7265 -22923 4618 22825 -3533 -24176 475 22142 -27 -23409 -3663 21810
427 21810 4102 -22791 -7016 20804 7639 -20348 -10062 18717 11194 -18637 -13474 16427
439 16427 14172 -15241 -15878 13697 17335 -12365 -17656 11001 19084 -9133 -19112 7886 20405
452 20405 -5520 -20082 4753 21204 -2003 -19117 1552 20347 1994 -19037 -2706 19334
464 19334 4587 -17987 -5939 17851 8452 -16119 -8136 16548 10738 -15121 -11835 14492 13319
477 13319 -14027 -13977 12336 14410 -10575 -15477 9360 16711 -8257 -17122 6177 16552 -5310
490 -5310 -17971 2737 17004 -2070 -17838 -650 16813 1170 -17963 -3641 16960 3842
502 3842 -17225 -6042 15422 6246 -15851 -8543 13633 8968 -13463 -10517 12214 11198 -11487
$$ packed form
415B1925k9190j5658K7541J8207k6358k0643K4651K1667k2169k3382J9746K5473
427B1810j7708k6893J5775K7820j3165k7987J0286K8779p523k9831N163K9901
439A6427k255k9413o37K9575L638k9700n291K8657Q083k8217r979K6998J2519
452B0405k5925j4562K4835J6451k3207j7114K0669J8795j8353k1031J6331K2040
464A9334j4747k2574J2048K3790r399k4571P983K4684n810k5859L286K6327j173
477A3319k7346N0K6313K074k4985m902K4837P351k4968q865K3299J0375k1862
490e310j2661K0708J4267j9074j5768J7188J7463j5643j9133J4322K0601j3118
502C842k1067J1183K1464r176k2097P308K2176m665k2431K946K2731j016k2685
$$ plain form
515 -11487 -12853 9968 13162 -9077 -13937 7836 14328 -5985 -15045 5351 16012 -3314 -15275
528 -15275 2825 16086 -1065 -15388 568 15944 1530 -14470 -1914 15175 4651 -13652
540 -13652 -4708 14133 6900 -12275 -6928 12505 8820 -11178 -9129 10824 10257 -9520 -10485 8788
554 8788 11930 -7253 -12097 6371 12730 -5633 -13168 4528 13355 -3479 -13893 1961 13397
567 13397 -1258 -13659 -410 12712 1006 -13637 -3210 12272 3218 -12995 -5157 11683
579 11683 5035 -11687 -6895 10458 6741 -10376 -8507 8796 8742 -8659 -10133 7108 10118 -6646
593 -6646 -10725 5441 11465 -4327 -11445 3732 11548 -2692 -11726 1363 12175 -16 -11750
606 -11750 120 12369 1913 -11071 -2170 11782 3986 -10530 -3798 10744 5332 -9383 -5583
$$ packed form
515a1487j366K2821L194k2239m860K1773O492k0313r060K0396J0661j9326j1961
528a5275J8100J3261j7151j4323J5956J5376j4414j6000J2556J7089j0524j8303
540a3652Q944J8841p233j9175N347J9433l685j9998K049J9953n67j9777r65J9273
554H788L142j9183m844J8468O359j8363p535J7696Q827j6834j0414J5854J1436
567A3397j4655j2401J3249J3122j1706j4643J0427J5482r054j6213P838J6840
579A1683o648j6722M792J7353l717j7117J869J7303n4j7401j474J7241L010j6764
593f646m079J6166O024j5792p118J5177P816j4240r034J3089J0812j2191j1734
606a1750J1870J2249j0456j2984Q901J3952p796j4516O732J4542n412j4715L800
$$ plain form
619 -5583 9450 7353 -7911 -7053 8194 8449 -6581 -8370 6363 9405 -5401 -9799 4596 9817
633 9817 -3508 -10267 2894 10572 -2236 -10914 911 10169 -643 -10682 -1294 9868 1299
646 1299 -10545 -2825 9421 2719 -9647 -4468 8852 4224 -9095 -5892 7619 5644 -7735
659 -7735 -7411 6230 7130 -6293 -8049 5445 7961 -4809 -8725 3859 8765 -2994 -9207 2255
673 2255 9152 -1306 -8957 687 9632 351 -8953 -541 9165 1999 -8381 -2216 8912 3290
687 3290 -7900 -3207 7997 4738 -6949 -4401 7702 6032 -6371 -5759 6366 6719 -4893 -6666
701 -6666 4668 7374 -3517 -7257 3448 7718 -2324 -7658 1780 7988 -1318 -8191 393 7872
715 7872 81 -8184 -1332 7771 1293 -8107 -2390 7146 2342 -7805 -3622 6412 3547 -6785
$$ packed form
619e583J5033k097j5264Q58J5247K55j5030j789J4733L042j4806m398J4395N221
633I817j3325o759J3161P678j2808q678J1825R258j0812j0039R388J1162q569
646A299j1844P720J2246o702j2366N179J3320m628j3319L203J3511j975j3379
659g735L24J3641R00j3423j756J3494K516j2770l916J2584M906j1759o213J1462
673B255O897j0458p651R644Q945r281r304Q412R706p166j0380O165J1128n622
687C290j1190M693J1204l259j1687K548J2103j670j2403O12J2125L53j1612j773
701f666J1334K706j0891l740J0705M270j0042n334R438O208r306o873Q584P479
715G872p791q265O852R103o478r400N717R536m804j0147M183J0034k865j0332
$$ plain form
729 -6785 -4818 5780 4582 -5828 -5757 5000 5389 -4962 -6536 3744 6107 -3659 -6826 2608 7035
744 7035 -2261 -6845 1531 7032 -1058 -7236 429 7134 9 -6996 -737 7110 1565 -6593 -1620
759 -1620 6916 2698 -6060 -2577 6056 3948 -5586 -3960 5727 4529 -4595 -4396 4856 5424 -3896 -5291
775 -5291 3645 5597 -2794 -5903 2559 6231 -1547 -5881 1422 6435 -664 -5788 531 6653 345
790 345 -5899 -685 5989 944 -6237 -1627 5429 1396 -6078 -3485 5116 3033 -5105 -3873 4061
805 4061 3692 -4519 -4267 4098 4526 -4479 -4466 2555 3850 -1769 -5539 2230 5148 -1579 -5440 444
821 444 5231 156 -5445 -152 5850 585 -4495 -129 5961 1454 -4636 -1469 5075 2574 -3639
836 -3639 -1195 4761 2677 -3861 -2375 4215 3738 -3307 -3491 3663 4475 -2866 -3447 2842 4705 -1631
$$ packed form
729f785J967J0598j198j0410P1J0757L89j0351j574J0280K363r766l167R434M427
744G035r296m584Q376N501q090o178P665O705p125p005O259P847n545q158M973
759a620Q536m218q758L483Q633k108r534J626R687j198r124J99R252N68r320j395
775e291Q936J952q391l109Q462L672p778m334P303N013p099n124O319O122o308
790C45o244N214O674n045p181M610P056m033p474K593Q601k083q138J232P934
805D061l69q211K52Q365M28r005J3P021J295n619l770P769K918o727l861N884
821D44M787n075n601N293O002n265n080M366O090m507o090L167O544k501o213
836c639K444N956k084o538J486O590m77p045j84P154Q12p341n81O289J863o336
$$ plain form
852 -1631 -4732 1824 5096 -1269 -4550 1063 5117 -463 -4850 150 4794 497 -5173 -777 4816
867 4816 993 -4787 -1442 4525 1586 -4657 -2184 3901 2150 -4379 -3262 3454 3066 -3843 -3775 3061
883 3061 3441 -2957 -4078 2476 3904 -2316 -4635 1311 4226 -1532 -4709 683 4640 -410 -4803
898 -4803 167 4680 487 -4156 -372 4169 1014 -4048 -1474 4446 1050 -3567 -1609 3738 2995
913 2995 -3205 -2657 3209 3718 -2619 -2898 3400 4134 -1691 -2622 2118 3321 -663 -3476 799 3855
929 3855 -1636 -3579 37 4177 84 -4082 -445 4012 570 -3631 -199 4078 53 -3131 -952
944 -952 3551 1733 -3535 -2211 2920 1586 -3377 -2756 2879 2573 -2741 -3226 2152 2832 -2277 -3374
960 -3374 1459 2932 -1492 -3708 874 3248 -1071 -3733 321 3646 -184 -3748 -275 3209 184
$$ packed form
852a631l101O556L272o365l281N613M054n580m387N000M644m297n670M396N593
867D816l823n780L345N967k939o243K473O085j751o529J117O716l88o909O8O836
883C061L80o398j121O554J428o220k319N946K915n758l177N392L957n050m393
898d803M970M513m193m643L784M541l155n062K574N920l396m617J958N347p43
913B995o200N48N866N09o337k79O298P34n825r31M740J203l984k813M275L056
929C855n491j943L616M140m093m166L637M457l442m201L432M277m025l184K179
944i52M503j818n268J324N131j334m963O21N635l06n314m85N378O80n109j097
960c374M833J473m424k216M582K374m319k662M054L325l830l564L473L484l025
$$ plain form
975 184 -3604 -477 3477 1166 -3135 -1137 3253 1486 -2878 -1760 2903 2014 -2835 -2089 2739 2708
991 2708 -2054 -2225 2156 2783 -1523 -2685 1375 3167 -1007 -2685 817 3179 -626 -3173 433 3558
1007 3558 197 -3284 53 3309 764 -3003 -767 2837 1071 -2872 -1340 2925 1158 -2908 -1558
1022 -1558 2376 1665 -2466 -2142 1791 1933 -2028 -2667 1404 2385 -1422 -2925 1124 2611 -968 -3016
1038 -3016 394 2554 -1059 -3249 95 2698 -63 -2938 -393 2818 641 -2905 -815 2649 917
1053 917 -2419 -1283 2694 1402 -2471 -1597 2114 1789 -1875 -1763 2161 2254 -1594 -2010 1556 2206 -1000
1070 -1000 -1972 1133 2459 -820 -2426 797 2846 -261 -2395 270 2830 -45 -2547 -117 2528
1085 2528 605 -2012 -679 2583 895 -2440 -906 2324 1118 -2161 -1239 1933 1532 -1979 -1674 1438
$$ packed form
975A84l788L127L954k311m301J998M390j767m364J118M663q89m849P46M828l1
991B708m762j71M381O27m306j162M060J792m174j678L502K362l805k547L606L125
1007C558l361l481L337L256k545l767K236L604j766l943J532M265j767m066J350
1022a558L934p11m131L24L933J42l961o39M071R81l807j503M049J487l579k048
1038c016L410K160l613k190L344K603k761k875K545L211k177l546K090L464j732
1053I17l336J136L977j292l873Q74L711l25l664J12L924R3l848m16L566O50l206
1070a000r72L105J326l279j606L223K049l107k134K665K560k875k502K430K645
1085B528j923k617J333L262j688l335J534L230j206l279R22L172m01l511L05L112
$$ plain form
1101 1438 1626 -1570 -2117 1069 1855 -968 -2383 667 2132 -995 -2557 478 1891 -574 -2650 9
1117 9 2221 35 -2303 -304 2179 456 -2323 -815 2187 769 -2099 -990 2112 1123 -1895 -1310
1133 -1310 1884 1603 -1548 -1483 1509 1782 -1374 -1657 1441 1968 -1051 -1795 1025 2367 -569 -1798 787
1150 787 2097 -180 -1987 172 2423 188 -2039 -316 2241 567 -1915 -355 2065 1040 -1647
1165 -1647 -1130 1529 1160 -1644 -1154 1664 1293 -1230 -1608 1277 1298 -1024 -1807 870 1658 -1207 -1795
1182 -1795 391 1541 -572 -1979 140 1668 -254 -2118 -218 1767 28 -1905 -462 1680 331
1197 331 -2020 -517 1717 543 -1631 -901 1353 833 -1581 -1066 1461 1318 -1084 -1376 1375 1797 -984
1214 -984 -1535 868 1597 -607 -1449 555 1767 -438 -1599 134 1698 116 -1573 62 1830 326
$$ packed form
1101A438J88l196n47L186P86k823j415L050J465l127j562L035J413k465k076K659
1117IK212k186k338J999K483j723k779J508L002j418k868J109L102r89l018N85
1133a310L194k81l151O5K992K73l156k83L098N27l019p44K820J342k936j229K585
1150G87J310k277j807K159K251k235k227J723K557j674k482J560K420j025k687
1165a647N17K659l69k804M90K818l71k523l78K885K1k322p83K677P88k865n88
1182a795K186J150k113j407K119J528j922j864J900J985j739j933J443K142j349
1197C31k351J503K234j174k174P30K254n20k414N15K527j43k402k92K751M22k781
1214i84n51K403P29k204q42K004J212k205j161J733J564j582j689J635J768j504
$$ plain form
1230 326 -1531 -230 1496 461 -1461 -648 1616 788 -1428 -865 1409 909 -1198 -1284 1280 1401 -1104
1247 -1104 -1243 887 1078 -886 -1320 539 1398 -601 -1651 134 1345 -629 -1620 84 1411 -347
1263 -347 -1668 -57 1384 254 -1729 -426 1429 404 -1364 -632 1127 695 -1373 -1004 1145 934
1279 934 -1153 -1029 1240 1027 -1033 -1070 939 1141 -566 -1262 905 1116 -465 -1351 446 1732 -247
1296 -247 -1191 550 1349 175 -1096 -216 1328 234 -1108 -99 1768 591 -1076 -393 1077 514
1312 514 -1060 -649 1022 782 -951 -910 1049 1034 -936 -1057 701 1095 -569 -1425 535 1239 -550 -1368
1330 -1368 283 1255 -478 -1389 -25 890 -327 -1307 -129 1199 136 -1154 -354 1057 415 -1595
1346 -1595 -506 921 468 -1029 -673 792 731 -1026 -936 908 883 -666 -748 529 1127 -423 -879 481
$$ packed form
1230C26j857J301J726j035j922Q13K264q28k216N63K274n00k107q6K564J21k505
1247a104j39K130J91j964m34J859Q59j999j050J785J211j974r91J704J327j758
1263c47j321J611J441j130j983J303J855j025j768P32J759m32k068L69K149k11
1279I34k087J24K269k13k060l7K009K02j707o96K167K11j581q86J797J286j979
1296b47r44J741P99j174j271Q80J544j094j342J009J867j177j667O83J470n63
1312E14j574M11J671k40j733M1J959j5j970j21J758L94j664q56J960P04j789q18
1330a368J651R72j733r11J364R15j217r80J178J328j063j290Q00J411o42k010
1346a595J089J427m53j497L56J465o1j757R0J844k5j549q2J277N98j550m56J360
$$ plain form
1364 481 1397 -282 -1102 556 1499 134 -1082 -23 1369 184 -1201 -98 1184 180 -932 -270
1380 -270 977 415 -1087 -502 1138 718 -889 -578 1087 736 -815 -896 636 789 -621 -609 511 798
1398 798 -563 -1004 340 915 -333 -1149 263 825 -239 -1032 0 925 76 -1132 -258 808 156
1415 156 -1125 -179 763 272 -1030 -492 787 361 -735 -472 498 501 -674 -707 492 623 -522 -722 395
1434 395 745 -379 -647 379 665 -211 -742 269 858 -105 -911 48 855 -140 -937 -62 984 333 -708
1453 -708 -10 1164 601 -696 -519 911 670 -804 -619 721 389 -668 -463 623 691 -338 -684 499
1471 499 885 -369 -708 622 911 -154 -707 66 521 -138 -957 -326 659 37 -802 31 968 217 -784
1490 -784 -249 718 269 -792 -346 892 313 -919 -571 512 622 -669 -662 505 890 -358 -705 342
$$ packed form
1364D81R16j679q20J658R43j365j216J059J392j185j385J103J282j004j112O62
1380b70J247n62j502N85J640m20j607L11J665l51j551q1J532J53j410J2J120K87
1398G98j361m41J344N75j248q16J412N62j064p93J032R25q49j208Q74J066o52
1415A56j281R46R42m91j302N38J279m26j096K63R70Lj175l3J199J31j145k00J117
1434C95L50j124k68J026K86q76n31J011N89r63q06R59Q07r95p97Q75J046o51j041
1453g08O98J174n63j297J77J430k41j474J85J340l32j057K05J086O8j029l46J183
1471D99L86j254l39J330K89j065n53P73M55o59q19O31R85o22q39Q33R37p51j001
1490g84N35R67m49j061M46J238n79j232L48J083J10j291PJ167L85j248l47J047
$$ plain form
1508 342 484 -233 -880 15 859 -24 -729 190 857 126 -407 -70 696 88 -508 -170 566 275 -772 -237
1528 -237 1026 436 -499 -186 485 695 -536 -267 658 571 -595 -491 538 478 -435 -703 140 485 -176
1547 -176 -869 162 961 -161 -630 6 535 -191 -917 -231 563 -197 -626 44 423 209 -242 -498 415
1566 415 24 -571 -532 305 351 -674 -554 333 440 -614 -622 442 483 -487 -613 414 597 -386 -622 419
1586 419 744 -90 -537 18 752 64 -501 252 839 -89 -623 195 823 278 -596 -118 605 291 -532 -371
1606 -371 504 520 -284 -551 523 690 -404 -462 358 633 -300 -530 232 560 -175 -510 288 609 -207 -504
1626 -504 -149 271 18 -689 54 415 57 -825 -41 562 73 -534 -268 174 138 -641 -384 182 294 -366
1646 -366 -432 373 467 -270 -367 67 448 -361 -227 160 301 -226 -316 148 180 58 -480 -143 713 179 -526 96
$$ packed form
1508C42J42p17o47Q95Q44q83p05R19O67p31n33L37P66o08n96L38P36k91j047N35
1528b37J263n90r35L13O71K10j231K69R25q7j166J04J029o0r13k68Q43L45o61
1547a76o93J031P99j122m69O36N29p26p26O86P94p60m29O70L79k14m51k56R13
1566D15l91n95L9Q37M6j025J20Q87J07j054qJ064M1r70j26J027J83r83k36J041
1586D19L25q34m47N55P34o88n65P53N87r28n34Q18O28n45q74M78P23l14q23J61
1606c71Q75J6q04k67J074J67j094n8Q20K75r33k30P62L28p35l35P98L21q16k97
1626e04L55M20k53p07P43L61l58q82P84O03m89o07K66M42l6p79K57N66J12o60
1646c66o6Q05R4p37r7M34L81q09J34L87J41n27r0M64L2j22n38L37Q56n34p05O22
$$ plain form
1668 96 641 118 -472 36 412 -58 -438 -142 454 347 -415 -283 526 379 -295 -264 208 282 -276 -258 312
1689 312 433 -332 -209 66 772 -106 -524 214 526 -160 -449 -68 190 -50 -537 -55 239 196 -377 -134
1709 -134 136 -131 -454 -180 244 346 -331 -483 -53 58 -461 -244 309 341 -186 -287 18 337 -165 -412
1729 -412 -102 213 -119 -487 -4 110 168 -745 41 415 323 -345 68 66 -256 -840 -72 1124 177 265 24
1750 24 387 278 -159 -100 357 522 -124 -73 257 187 -276 -280 173 266 136 -429 117 443 -29 -183 21 386
1772 386 -78 -123 -133 151 220 -381 -206 333 138 -501 -84 333 81 -346 -389 324 250 -277 3 106 176 -357
1794 -357 -231 108 80 -478 -276 174 292 -260 -372 81 222 -107 -131 83 103 296 -302 -224 550 -237 -381
1815 -381 -4 56 255 -455 -322 383 347 -198 -141 348 260 -219 -333 60 312 -262 -197 317 350 -210 -26 110
$$ packed form
1668I6N45n23n90N08L76m70l80K96N96j07p62J32Q09j47o74L1M72P4n58J8N70
1689C12J21p65J23K75P06q78m18P38L12o86k89L81K58k40m87M82K94m3n73K43
1709a34K70k67l23K74M24J02o77j52M30J11n19K17N53L2n27j01L05L19n02k47
1729d12L10L15l32l68M83J14N8r13P86L74r2o68M13kl22n84P68J196r47Q8k41
1750B4L63j09m37N9M57J65o46N1L30p0m63mM53R3j30n65N46L26m72j54K04L65
1772C86m64m5j0K84O9o01J75N39j95o39M17M17k52m27m3P13p4n27K80J03P0n33
1794c57J26L39k8n58K02M50J18n52j12M53J41l29k4K14K0J93n98P8P74p87j44
1815c81L77O0J99p10J33P05l6n45N7M89q8m79j14L93K52n74O5N14L3n60J84J36
$$ plain form
1837 110 349 -275 -96 -9 416 -137 -217 -123 122 18 -124 14 410 102 -303 -17 291 418 -429 -205 239
1858 239 -32 -330 5 145 220 -193 -225 -58 100 -249 -364 48 143 -451 -469 79 171 -183 -198 65 180 41
1880 41 -385 -28 308 3 -314 12 316 41 -129 5 334 179 -313 -146 325 230 -85 -185 307 178 -29
1901 -29 -102 172 301 -14 -179 30 301 -155 -193 -8 534 -125 -93 -54 311 -62 -225 66 269 207 -346 -144
1923 -144 247 64 -217 34 253 82 -313 -115 79 -19 -314 -63 161 245 -186 -217 -17 141 -139 -400 -22
1944 -22 247 -239 -319 166 355 -119 -266 62 96 -51 -327 117 104 -204 -87 -195 183 65 -241 -97 104
1965 104 15 -122 34 438 156 -110 -130 -12 287 20 -26 258 86 -128 -238 163 267 -140 69 208 513
1986 513 -39 -544 34 120 -188 -214 41 261 200 -78 21 56 -32 -271 93 -78 268 -202 -122 30 136 -217
$$ packed form
1837A10K39o24J79Q7M25n53q0R4K45j04j42J38L96l08m05K86L08J27q47K24M44
1858B39k71k98L35J40P5m13l2J67J58l49j15M12R5n94j8N48R2l54j5K63J15j39
1880D1m26L57L36l05l17L26L04k75j70J34L29j55m92J67M71r5l15j00M92j29k07
1901b9p3K74J29l15j65K09K71m56l8J85N42o59L2L9L65l73j63K91K03o2n53K02
1923a44L91j83k81K51K19j71l95J98J94r8k95K51K24Q4m31l1K00J58k80k61L78
1944b2K69m86q0M85J89m74j47L28L4j47k76M44j3l08J17j08L78j18l06J44K01
1965A04q9j37J56M04k82k66k0J18K99k67m6K84j72k14j10M01J04m07K09J39L05
1986E13n52n05N78Q6l08k6K55K20o1k78R9L5q8k39L64j71L46m70Q0J52J06l53
$$ plain form
2008 -217 -324 48 96 -53 -144 -208 358 -131 -191 -136 209 196 -317 -6 140 85 -245 -19 -25 -25 -170 104 40 87
2032 87 -87 -115 169 97 -33 177 180 -104 -62 -231 70 27 -235 -98 54 269 -57 -158 412 255 74 -133
2054 -133 303 370 -87 -9 398 191 29 -169 132 87 -111 -186 -15 334 116 -51 -104 59 345 -60 -49 467
2076 467 -32 11 18 280 -129 -176 26 278 54 -185 -24 187 59 2 -122 126 -24 -30 -172 -153 98 -193 139
2099 139 -70 216 -123 -103 -272 18 -151 -116 -29 345 3 -351 103 161 -52 -244 -69 155 -71 -28 -208 49
2121 49 48 139 70 44 4 126 5 47 116 -126 124 113 11 -47 84 178 67 114 -204 27 332 37 33 17 304
2146 304 -44 -36 -81 48 2 -297 -173 -63 77 -287 -124 -103 285 137 -169 158 -24 -233 -79 -22 50 -18 -212
2169 -212 -116 -83 -179 -174 -129 83 28 -96 -139 88 -243 -97 -43 -100 -171 -201 -6 16 13 -250 -67 127 142 -157 178
$$ packed form
2008b17j07L72M8j49r1o4N66m89o0N5L45j3n13L11J46n5l30K26o%j45K74o4M7
2032H7j74k8K84p2j30K10Lk84M2j69L01m3k62J37J52K15l26j01N70j57j81k07
2054a33M36O7m57P8M07k07j62j98L01m5j98p5J71L49k18j67n3J63K86m05J1N16
2076D67m99M3PK62m09m7K02K52k24k39J61K11j28n7j24K48j50oj42J9K51k91L32
2099A39k09K86l39K0j69K90j69L5Q7L74l42l54M54N8k13j92J75K24k26M3j80K57
2121D9jR1o9k6m0J22j21M2O9k42K50j1j02n8J31R4j11M7l18K31L05k95mj6K87
2146C04l48Qm5J29m6k99J24J10J40l64J63K1L88j48l06L27j82k09J54N7P2o8j94
2169b12R6L3r6NM5K12n5j24m3K27l31J46N4n7p1l0J95K2lk63J83J94J5k99L35
$$ plain form
2194 178 165 -206 -112 9 124 97 -73 -20 136 33 -212 78 23 57 -106 -128 113 231 277 -65 132 -121 42
2217 42 4 105 -108 230 -62 352 179 24 -47 10 -7 143 0 -147 -97 -111 0 48 134 -115 56 -269 202
2240 202 32 -72 -134 96 -116 74 -327 131 125 -40 -214 -69 -95 -85 -110 -188 -58 -8 -124 -79 16 -6 -148 -98
2264 -98 139 46 -179 36 -113 81 -24 -324 287 45 64 -102 17 265 -130 -43 -88 53 34 -206 121 59
2286 59 292 -79 172 119 -38 88 -245 125 56 -22 154 212 58 -48 -56 241 -6 -55 -13 85 54 -2 38 80 74
2311 74 19 21 -155 49 92 -175 12 -25 -118 156 -158 9 121 -80 98 158 102 -167 -212 -5 194 -81 -206
2334 -206 326 51 -108 237 123 -38 69 27 236 66 -18 74 -42 96 -221 -202 -93 99 -235 -99 59
2355 59 136 -151 -16 451 294 -77 65 -194 59 139 -105 97 159 214 3 -100 216 47 52 59 -125 54 145
$$ packed form
2194A78j3l71R4J21J15k7j70N3J56j03k45K90n5L4j63k2K41J18M6l42J97k53J63
2217D2l8J01k13L38k92M14j73j55p1N7j7J50j43j47N0j4J11M8Q6k49J71l25M71
2240B02j70j04o2K30k12J90m01M58oj65j74J45k6J0k5p8J30N0j16M5R5k2j42N0
2264i8K37r3k25K15j49J94j05l00O11k42J9j66J19K48l95Q7m5J41j9k40L27o2
2286E9K33l71K51n3j57J26l33L70o9p8J76N8j54j06qK97k47m9M2R8l1n6M0M2o
2311G4n5Kj76K04M3k67J87l7r3K74l14J67J12k01J78O0n6k69m5K07J99k75j25
2334b06N32k75j59L45j14j61J07m2K09j70q4R2j16J38l17J9J09J92l34J36J58
2355E9P7k87J35M67j57l71J42k59K53Q0k44K02O2N5k11j03L16j69NPj84J79R1
$$ plain form
2378 145 -44 145 237 -31 -55 39 -122 -146 46 145 -326 -131 -75 -146 53 -283 -27 -119 3 326 -12 31 191
2401 191 -209 -270 -85 -143 -90 -11 -37 -191 -41 -264 20 188 40 -243 -135 206 -139 -186 56 -110 100 82
2423 82 -46 159 -2 44 68 169 -85 -76 131 -53 186 89 -337 231 195 256 72 -62 208 -63 -173 -89 75
2446 75 -129 150 103 -246 144 -132 -35 204 159 -209 -158 10 72 -153 -224 38 8 -142 13 32 291 105 -40
2469 -40 168 145 151 12 374 663 -303 -15 159 -102 -499 143 -188 -45 -260 -103 -135 -128 -84 104 -24 27 121
2492 121 -199 -81 -34 233 149 1 -25 73 125 -119 133 -46 -144 14 19 -4 -306 23 2 0 77 -131 -22 133
2516 133 -128 23 132 75 -49 70 31 95 -66 35 104 -150 -91 -11 -40 215 10 -181 -134 47 -78 -178 -48
2539 -48 -64 265 40 -240 190 -7 15 -37 181 -52 -30 -14 -276 -41 -13 -345 157 315 -145 -47 -207 142 116
$$ packed form
2378A45j89J89R2k68k4R4j61k4J92R9m71J95N6p1J99l36K56r2J22L23l38M3J60
2401A91m00o1J85n8N3P9k6j54J50k23K84J68j48k83J08L41l45m7K42j66K10j8
2423H2j28K05j61M6K4J01k54RK07j84K39r7m26N68l6O1j84j34K70k71j10Q4J64
2446G5k04K79m7l49L90k76R7K39m5l68N1J68O2k25p1K62l0j50J55J9K59j86j45
2469d0K08k3Oj39L62K89r66K88J74k61l97O42l31J43k15J57l2PM4J88j28N1R4
2492A21l20J18M7K67q4j48k6R8N2k44K52j79r8J58Nk3l02L29k1kP7k08J09J55
2516A33k61J51J09n7j24J19l9O4j61J01O9k54N9Q0k9K55k05j91M7J81j25j00J30
2539d8j6L29k25k80M30j97K2n2K18k33K2J6k62K35K8l32N02J58m60R8j60L49k6
$$ plain form
2562 116 -49 15 69 -63 76 -56 -144 54 193 -112 131 -24 -222 -2 77 -132 37 38 -59 -300 139 -93
2584 -93 12 71 34 -124 33 106 -173 152 218 231 84 -191 -43 137 9 -238 155 -62 145 159 232 41 76
2607 76 -43 -146 -85 32 65 142 -287 -99 42 -103 -40 -674 -102 -381 -113 -358 -143 155 288 26 407 -146
2629 -146 -175 -200 -108 -283 -201 194 117 39 287 165 -385 103 155 135 366 140 238 401 -109 -453 -148 -206 142
2652 142 216 0 -448 -67 67 -281 412 181 -73 68 167 -452 269 -133 65 203 -182 -110 81 6 -16 374
2674 374 -131 -215 23 387 -211 32 396 4 61 -77 90 -56 275 168 332 -341 -190 -152 44 103 -125
2695 -125 72 84 -100 -294 339 -48 -207 -95 30 -80 -180 -50 219 -19 -32 19 -290 38 -104 -126 -69 127
2717 127 4 44 -32 -111 -206 -183 -82 162 23 -1 52 64 35 -152 -30 -162 -202 93 -67 -234 -52 122 -58
$$ packed form
2562A16j65O4N4j32J39j32q8J98J39l05K43j55j98K20P9k09J69Jr7k41M39k32
2584i3J05N9l7j58J57P3k79L25O6J3j47k75J48J80j28k47L93k17K07J4P3j91L5
2607G6j19j03O1J17L3P7m29J88J41j45O3o34N72k79K68k45K15K98J33k62L81n53
2629a46k9k5R2j75Q2L95p7p8K48j22n50M88N2k0K31k26R8J63n10l44L05n8L48
2652A42P4k16m48L81J34l48O93k31k54J41R9o19P21m02J98J38l85P2J91p5k2L90
2674C74n05q4K38L64n98K43L64l92N7j38J67j46L31j07J64o73J51L8J96N9k28
2695a25J97J2j84j94O33l87j59J12J25j10j00J30K69k38j3N1l09L28j42k2N7J96
2717A27j23M0p6p9r5K3J01K44j39k4N3J2k9j87J22j32m0K95j60j67J82J74j80
$$ plain form
2740 -58 -256 56 64 -138 10 399 106 221 -89 -86 332 -5 -79 219 -45 47 -120 -219 1 42 85 -96 25
2763 25 -85 -80 -126 12 -103 -74 -4 -21 106 159 -36 -140 108 -128 76 64 217 -183 47 -194 -81 103 89
2786 89 -90 216 220 -251 1 80 58 31 98 -265 -84 -21 -57 178 -201 -203 12 -172 157 154 -85 -94 -30 146 -18
2811 -18 -68 -106 68 11 -105 99 -40 -160 80 359 49 -116 180 65 54 -126 216 26 150 3 -30 1
2833 1 73 6 -220 286 -146 18 -76 48 -242 -29 -19 200 -53 -95 -1 269 150 -98 -166 281 76 148 -194
2856 -194 -117 -34 179 146 174 -185 -119 -224 -49 -69 158 47 89 1 3 47 -100 2 -209 -184 -122 290 262 -335 -54
2881 -54 -8 -182 44 123 303 108 232 -45 215 125 542 226 -47 288 190 -102 -182 586 -83 -107 88 61 30
2904 30 -564 -104 67 -233 -2 240 -349 402 353 359 400 438 562 208 1262 -454 -83 167 -423 367 -400
$$ packed form
2740e8j98L12Qk02J48L89k93J15l10LM18l37p4K98k64R2j67r9K20M1M3j81J21
2763B5j10Nm6J38j15K9P0j7J27N3j95j04K48k36K04j2J53m00K30k41J13J84j4
2786H9j79L06Mm71K52P9k2k7O7l63J81O3l6K35l79kK15j84L29lk39rO4J76j64
2811a8n0l8J74n7j16K04j39j20K40K79l10j65K96j15j1j80L42j90J24j47l3L1
2833AP2o7k26N06m32J64r4J24k90K13J0K19k53m2R4K70j19k48o8M47k05P2l42
2856a94P7Q3K13l3K8l59O6j05J75k0K27j11M2q8KM4j47J02k11K5O2M12k8n97K81
2881e4M6j74K26P9J80j95J24k77K60r0M17l16k73L35r8k92q0P68o69k4J95k7l1
2904C0n94M60J71l00K31K42n89P51m9OM1L8J24l54J054j716L71K50n90P90p67
$$ plain form
2925 -400 -40 291 707 -134 28 728 635 276 215 -320 -165 660 183 -254 -153 -209 -316 -523 -38 -82 220
2946 220 134 259 -535 -487 416 412 311 162 -246 395 -26 -404 3 -98 443 349 566 129 -274 -305 159 92
2968 92 186 53 -109 91 176 31 -91 -204 246 -71 20 52 139 17 -74 44 159 138 104 63 -35 177 -47 -78
2992 -78 -153 -205 113 -161 48 97 -250 64 203 30 84 311 -150 -108 -32 74 59 294 249 -325 72 -278 -171
3015 -171 -195 -558 412 -290 -420 20 -386 425 302 319 -508 29 -245 224 227 -199 -150 217 359 293 179 -298
3037 -298 256 -355 -332 199 -203 -278 -175 -124 23 171 33 -153 -211 113 408 -129 -132 15 205 115 -362 -135
3059 -135 -61 -380 333 205 -156 -254 513 145 311 -572 -883 -275 -357 345 686 -451 -266 -146 -598 -51 -219
3080 -219 282 -419 -809 252 402 -471 -410 153 -523 403 -36 -49 381 -505 18 -1224 -702 16 619 -171
$$ packed form
2925d00L60L31M16q41J62P00r3l59o1n35J55Q25m77m37J01n6j07k07M85m4L02
2946B20q6J25p94M8R03mj01j49m08O41m21l78M07j01N41r4K17m37m03l1M64o7
2968I2R4j33j62K00Q5j45j22j13M50l17R1L2Q7j22r1J18J15k1l4m1r8K12k24l1
2992g8p5n2L18k74K09M9l47L14J39j73N4K27m61M2P6J06j5K35m5n74L97l50J07
3015a71k4l63R70p02j30M40m06Q11j23J7q27N37k74M69Lm26M9L67J42o6j14m77
3037b98N54o11K3N31m02p5J03N1J47J48j38j86n8L24K95n37lJ47J90r0m77K27
3059a35P4l19P13j28l61r8P67l68J66q83l11O08q2P02L41j137J85J20m52N47j68
3080b19N01p01l90J061J50q73O1N63o76R26m39j3M30q86N23j242N22P18O03p90
$$ plain form
3100 -171 257 65 830 -129 119 -93 -59 -625 -104 248 112 50 -218 100 -228 354 -81 -224 95 -804 240
3121 240 -267 -94 -360 -728 350 -457 -5 255 244 -354 177 547 -28 -79 -393 263 166 -79 186 -305 -40
3142 -40 264 -13 -198 -11 -72 -23 -23 -70 -26 236 -188 486 -221 108 -178 -125 -40 -167 29 16 148 -60 -408
3165 -408 -248 40 51 -24 1 -5 -257 -37 -183 -3 100 -16 -79 -2 3 -101 -65 -38 141 -8 -2 158 -348 -70
3189 -70 -269 147 206 -1 -97 382 -212 -72 -275 17 -31 363 -136 41 187 -387 243 88 -220 -520 332
3210 332 -148 -234 -423 -298 176 154 229 -343 152 -58 -221 126 -384 84 103 465 -204 -344 382 731 47
3231 47 -15 -118 116 153 -414 -266 224 -543 140 143 244 -570 277 -234 -157 -84 124 1264 -688 -296 -258 308
3253 308 -364 -17 723 -71 142 107 -23 376 -48 131 198 -163 643 555 375 -162 -7 -81 -359 281 -127
$$ packed form
3100a71M28j92P65r59K48k12L4n66N21L52j36o2k68L18l28N82m35j43L19q99J044
3121B40n07J73k66l68J078q07M52K60j1n98N31L70n75n1l14O56r7k45K65m91K65
3142d0L04k77j85J87o1M9%m7M4K62m24O74p07L29k86N3Q5j27J96j3J32k08l48
3165d08J60K88J1p5K5ok52K20j46J80J03j16o3P7Nj04L6K7J79j49OJ60n06K78
3189g0j99M16N9k07r6M79n94J40k03K92m8L94m99J77J46n74O30j55l08l00Q52
3210C32m80q6j89J25M74k2P5n72M95k10j63L47n10M68J9L62o69j40P26L49o84
3231D7o2j03K34L7n67J48M90p67O83LJ01q14Q47n11P7P3K08J140j952L92L8N66
3253C08o72L47P40p94K13l5j30L99m24J79O7l61Q06q8j80n37J55p4k78O40m08
$$ plain form
3274 -127 194 -543 420 144 -138 -565 111 309 525 939 -395 -393 -1000 -239 -196 222 104 265 537 396 -64
3295 -64 -17 338 -54 -41 -419 59 258 95 -187 38 111 -6 -314 153 39 171 77 -290 -15 -168 -126 21
3317 21 -57 -87 -61 -110 -225 189 253 -188 141 -144 50 -149 -211 146 -93 -182 -152 -329 351 149 -429 95 -122
3340 -122 281 -265 -20 -113 -100 315 -124 86 -145 7 25 -59 -15 -38 -91 -337 117 -208 -264 130 -536 36 359
3363 359 176 -306 196 578 -195 374 138 -18 29 -64 150 -296 291 -1207 20 -305 -243 -236 -71 137 464
3384 464 -365 1018 -156 -38 -132 -27 423 519 369 -135 92 -22 512 171 78 -107 -194 -115 251 186 128 49
3406 49 149 417 -150 -475 186 -321 26 154 -50 -367 -154 -104 -530 111 278 5 236 148 122 -273 -222 -47
3428 -47 29 -34 -324 -230 181 -36 176 463 -52 -80 -296 -122 -155 267 46 -352 136 89 -159 -258 -194 -129 282
$$ packed form
3274a27L21p37R63k76k82m27O76J98K16M14j334Ko07P61M3M18j18J61K72j41m60
3295f4M7L55l92J3l78M78J99j63k82K25P3j17l08M67j14J32r4l67K75j53M2J47
3317B1p8l0K6m9j15M14O4m41L29k85J94j99o2L57k39q9L0j77O80k02n78N24k17
3340a22M03n46K45r3J3M15m39K10k31J52J8q4M4k3n3k46M54l25n6L94o66N72L23
3363C59j83m82N02L82p73N69k36j56M7r3K14m46N87j498J227l25O2PJ65K08L27
3384D64q29J383j174J18r4J05M50R6j50n04K27j14N34l41r3j85q7P9L66o5n8p9
3406D9J00K68n67l25O61n07L47J28k04l17K13N0m26O41J67k73K31q8k6l95N1J75
3428d7P6o3k90R4M11k17K12K87n15k8k16J74l3M22k21l98M88m7k48r9O4O5M11
$$ plain form
3451 282 -277 509 97 445 194 196 -53 -302 538 -101 228 101 -302 413 -322 179 99 449 -340 418 35
3472 35 188 -411 -204 645 -10 110 -180 150 -485 -47 52 382 -228 -128 -141 -219 -321 167 -632 46 294
3493 294 -289 -276 16 62 10 71 6 106 23 -81 55 -3 115 -41 41 -150 152 -119 147 31 27 -8 -57 -182
3517 -182 39 -13 -65 40 27 98 -240 132 0 6 -41 -237 -192 133 1 65 -27 8 161 -6 62 -96 -183 -122 -55
3542 -55 92 35 150 -151 299 234 29 209 -11 -125 384 13 169 48 -122 202 -70 153 41 -58 33 -118
3564 -118 -97 -84 89 -7 -328 -316 -15 64 100 -65 50 -58 127 -42 104 -66 70 -16 -166 -77 -146 102 -49
3587 -49 -132 -23 -23 -92 192 -180 14 -80 -72 17 -89 546 214 258 6 80 -272 34 72 890 -200 -476 -375 116
3611 116 277 -243 -21 464 13 201 327 57 -160 -33 241 41 179 69 -89 78 -104 -138 85 -138
$$ packed form
3451B82n59P86m12L48k51Kk49k49Q40o39L29j27m03P15p35N01q0L50p89P58l83
3472C5J53n99K07Q49o55J20k90L30o35M38R9L30o10J00j3p8j02M88p99O78K48
3493B94n83J3K92M6n2O1o5J00q3j04J36n8J18j56Q2j91L02k71K66j16ml5m9j25
3517a82K21n2n2J05j3P1l38L72j32Om7j96M5L25j32O4r2L5J53j67O8j58q7O1O7
3542e5J47n7J15l01M50o5k05J80k20j14N09l71J56j21j70L24k72K23j12r9R1j51
3564a18K1J3J73r6l21J2L01P9L6j65J15j08J85j69J46j70J36q6j50Q9o9K48j51
3587d9q3J09%o9K84l72J94r4QQ9j06O35l32M4k52P4l52L06L8Q18j090k76J01M91
3611A16J61n20K22M85m51J88J26k70k17J27K74k00J38j10j58J67j82l4K23k23
$$ plain form
3631 -138 -254 212 190 -137 94 80 74 68 -77 -46 -9 61 -118 46 -6 58 188 186 -56 57 -145 -180 68 114 -216
3656 -216 -169 116 -35 93 5 175 18 -44 82 -58 170 46 65 136 31 -213 -97 -41 44 149 -15 23 -50
3679 -50 93 -8 170 -19 -158 18 31 -52 -189 148 45 -129 -123 16 -178 -67 -280 -36 34 19 -10 143 94
3702 94 182 -136 -59 -39 -107 116 144 -92 -104 -16 -43 101 -142 -3 118 69 30 21 8 5 108 -202 167 111 -1 -62
3728 -62 -152 159 90 62 -171 110 112 126 -58 71 51 -237 157 104 72 196 89 108 -20 -99 98 150 -143 -96 104
3753 104 -30 -178 51 -62 28 128 74 -300 -38 -80 29 -2 271 -79 -23 9 -234 -61 -60 60 -289 16 -66
3776 -66 -2 -140 -172 -158 196 -87 63 105 204 -40 -96 120 41 -201 -22 -77 -122 -110 -67 49 -58 -161 -281 -179
3800 -179 13 -132 175 -19 -108 52 -138 0 133 -92 263 -215 -91 -158 -374 -301 185 28 195 107 -71
$$ packed form
3631a38j16M66k2l27K31j4ooj45L1L7P0j79J64n2O4J30kk42J13k02l5K48M6l30
3656b16M7K85j51J28q8J70j57o2J26j40K28j24J9P1j05k44J16N6Q5J05j64L8p3
3679e0J43j01J78j89j39J76J3q3j37L37j03j74OJ39j94J11k13K44P0j5k9J53m9
3702I4Q8l18P7K0o8K23K8k36j2Q8k7J44k43J39J21m9l9rj3lJ03l10L69n6j12o1
3728f2r0L11o9k8k33K81KJ4j84J29k0k88L94n3l2J24j07J9j28p9J97N2k93M7K00
3753A04j34j48K29j13R0J00n4l74K62m2J09l1K73l50N6L2k43J73JJ20l49L05q2
3776f6O4j38l2J4L54k83J50M2R9k44n6K16p9k42J79n5m5J2M3J16j07j03j20J02
3800a79J92j45L07j94q9J60j90J38J33k25L55m78J24o7k16P3M86j57J67q8j78
$$ plain form
3821 -71 58 -159 -71 -40 -328 97 -395 -100 104 -322 360 -1 601 146 332 -1 293 128 152 -556 229
3842 229 4 -419 -85 812 -374 412 -963 445 238 83 -370 -252 405 249 103 -48 660 -41 193
3861 193 -22 449 150 259 -29 96 326 52 -207 -83 61 -174 96 78 -181 -222 60 -236 -161 -84 1 16
3883 16 1 -199 272 17 80 -7 52 0 157 119 -65 -97 -27 82 139 -30 236 14 -58 -73 19 -41 35 109 14 -51
3909 -51 155 47 -183 -104 79 -76 -143 232 -75 83 24 60 -92 -34 -225 -12 -33 151 -221 66 -135 -2
3931 -2 70 18 101 309 -10 -46 142 105 -16 -55 137 -98 -16 -175 -281 159 179 -32 257 88 11 -101 -248 99
3955 99 -114 -132 -233 34 28 -58 57 -186 232 -96 -11 117 -403 104 -343 66 47 28 120 -89 -43 68 110 161
3979 161 90 125 -85 -1 126 172 -37 289 45 -75 -76 36 -29 -156 140 117 -66 -112 -6 -23 58 38 -21 -31 14
$$ packed form
3821g1J29k17Q8L1k88M25m92K95K04m26O82l61O02m55J86l33K94j65K4p08P85
3842B29k25m23L34Q97j186P86j375J408k07j55m53J18O57j56j46j51P08p01K34
3861A93k15M71k99J09k88J25K30k74k59J24J44k35K70j8k59m1K82k96P5P7Q5J5
3883A6j5k00M71k55O3q7N9n2J57l8j84l2P0J09N7j69K66k22p2j5R2o0P6P4r5o5
3909e1K06j08k30P9J83j55o7L75l07J58n9L6j52N8j91K13k1J84l72K87k01J33
3931bP2n2Q3K08l19l6J88l7j21l9J92k35Q2j59j06M40K0k11K89j69p7j12j47L47
3955I9k13j8j01K67oq6J15k43M18l28Q5J28n20N07m47M09j9j9R2k09M6J11M2N1
3979A61p1L5k10Q4J27M6k09L26k44j20jJ12o5j27K96k3j83m6J06j7Q1k0n9j0M5
$$ plain form
4004 14 -169 50 151 17 -231 -93 -212 -17 91 -6 -89 -72 149 -136 -38 168 131 238 -70 183 44 124
4026 124 77 -43 -102 194 -153 113 346 234 175 49 -133 -110 106 -827 288 337 -766 -178 407 536 -289
4047 -289 107 310 -817 556 142 191 -118 -162 58 546 197 -714 -156 -218 -217 -60 363 -511 -127 64 47
4068 47 -113 263 -201 544 -2 242 190 -136 -298 124 77 -441 -88 -323 -154 12 21 468 -152 -89 -63 -583
4090 -583 102 470 -1 -4 95 50 128 -523 -89 247 -420 188 -373 -349 -254 -432 -80 236 221 14 376 253 -27
4113 -27 403 177 -145 541 -55 91 -559 596 567 90 -483 -207 -4 -348 -550 17 354 201 -221 -89
4133 -89 -697 -110 -134 -215 549 -4 470 118 62 -56 -173 -21 510 569 124 -572 216 672 131 -247 -435 -267
4155 -267 201 199 383 354 265 -12 201 -61 56 -133 107 -112 9 -69 -275 -254 -23 46 68 -188 98 -93 -374
$$ packed form
4004A4j83K19J01j34k48J38j19J95J08r7q3J7K21k85R8K06l7J07l08K53j39Q0
4026A24m7j20n9K96l47K66K33j12n9j26j82K3K16r33J115M9j103N88N85J29q25
4047b89L96K03j127J373m14M9l09m4K20M88l49r11N58o2JJ57M23q74L84J91j7
4068D7j60L76m64P45n46K44n2l26j62M22m7n18L53k35J69J66RM47o20O3K6n20
4090e83O85L68m71lR9m5P8o51M34L36o67O08n61K4R5j78L52L16j5k07L62j23k80
4113b7M30k26l22O86n96J46o50J155k9m77n73K76K03l44k02N67L37j53m22J32
4133h9o08N87k4q1P64n53M74l52n6j18j17J52N31N9m45o96P88M56n41l78j88J68
4155b67M68kJ84k9q9k77K13k62J17j89K40k19J21p8k06K1K31O9K2k56K86j91k81
$$ plain form
4178 -374 4 174 -46 -51 -86 -16 6 114 64 38 129 140 -39 9 59 115 -357 93 -97 155 159 -130 -29 163 258
4203 258 72 -372 -90 -33 -298 112 37 127 42 -3 -236 30 -9 157 93 -239 128 -54 -276 -133 80 134 -169
4226 -169 -110 98 37 92 -67 -228 11 4 82 26 -308 -235 115 177 23 -206 60 154 -130 114 -178 -164 84 -158
4250 -158 -1 -158 -161 -116 95 47 158 -107 -45 10 -147 -148 -119 -58 -50 611 -65 -195 192 -247 -67 -234 -421 170
4274 170 477 -395 -381 153 -39 -308 337 -240 402 48 788 499 550 686 206 298 -63 -348 -61 -294 -210
4295 -210 105 121 69 92 -21 -196 -45 -34 -80 -134 159 188 2 219 133 20 -275 99 62 -20 2 78 49 24 47
4320 47 -196 -24 173 232 -34 -90 -92 54 -252 -115 7 24 -119 82 122 -28 -247 106 1 -42 -30 44 98 14
4344 14 104 200 -105 -271 85 112 95 180 124 -57 -3 -60 133 -59 -13 156 36 129 -87 -184 77 151 -99 -92 -106
$$ packed form
4178c74L78J70k20nl5P0K2J08n0k6R1J1j79M8N0N6m72M50j90K52Mk89J01J92R5
4203B58j86m44K82N7k65M10p5R0q5m5k33K66l9J66o4l32L67j82k22J43K13N4l03
4226a69N9K08o1N5j59j61K39pP8n6l34P3L50O2j54k29K66R4k84K44k92J4K48k42
4250a58J57j57lM5K11m8J11k65O2N5j57jK9O1QO61o76j30L87m39J80j67j87N91
4274A70L07q72J4N34j92k69O45n77O42l54P40k89N1J36m80R2l61k85K87k33Q4
4295b10L15J6n2K3j13j75J51J1m6n4K93K9j86K17q6j13k95L74l7q2K2P6k9k5K3
4320D7k43J72J97N9k66n6kJ46l06J37J22J7j43K01M0j50k19L53j05m3J2P4N4q4
4344A4R0R6l05j66L56K7j7Q5n6j81N4n7J93j92M6J69j20R3k16r7K61P4k50Pj4
$$ plain form
4369 -106 107 -16 -18 17 42 -250 -70 115 77 11 79 -183 -1 116 -79 43 -4 -22 56 -208 4 112 -60
4392 -60 137 -105 61 1 -81 -61 29 -150 -44 -6 27 179 70 104 -238 75 219 -134 -253 38 -74 165 189
4415 189 205 52 -12 -194 -44 -153 -99 155 -218 150 58 33 30 -288 -87 -88 26 -73 43 11 -101 24 101 18
4439 18 -97 -134 167 86 63 146 -33 24 -9 -164 -45 -120 -1 47 -22 -84 -53 182 25 -96 169 -149 -23 43
4463 43 -43 -259 -65 95 -242 120 -174 290 -49 137 -23 115 26 -150 197 37 12 121 -96 61 -81
4484 -81 -8 -96 -340 29 30 273 -193 92 78 -525 173 214 92 104 -25 -17 -21 18 182 19 9 -200 -105 85 176
4509 176 227 -53 98 -204 18 73 -23 39 -123 182 38 -190 42 -23 -64 69 -121 -107 20 21 56 4 -70 -80
4533 -80 223 -176 -48 140 81 128 -54 19 112 27 -167 98 -215 -30 -334 -333 -110 124 228 193 -132 -2 76
$$ packed form
4369a06K13j23kL5K5k92J80J85l8o6O8k62J82J17j95J22m7j8P8k64K12J08j72
4392f0J97k42J66o0q2K0R0j79J06L8L3J52j09L4l42L13J44l53j19K91j12K39K4
4415A89J6j53o4j82J50j09N4K54l73L68r2k5ll18K01jJ14r9J16l2j12J25P7q3
4439A8j15l7L01q1k3Q3j79N7l3j55J19p5J19M8o9o2L1K35j57j21K65l18J26O6
4463D3q6k16J94J60l37L62k94M64l39J86j60J38q9j76L47j60k5J09k17J57j42
4484h1P3q8k44L69JK43m66K85j4o03O98M1j22J2j29QmL9J64j63j0k09R5J90R1
4509A76N1k80J51l02K22N5r6O2j62L05j44k28K32o5m1J33j90J4J27JL5n2p4j0
4533h0L03l99J28J88n9M7j82P3R3q5j94K65l13J85l04JK23K34J04l5l25J30P8
$$ plain form
4556 76 184 75 346 225 -81 -62 85 -193 83 138 -100 -55 -121 -84 69 -204 -126 -95 -117 173 73 0 4 118
4580 118 -51 -159 10 -10 43 -146 -347 75 48 -3 12 183 -23 119 -273 139 121 235 -32 -38 -149 228 -231
4603 -231 -149 31 -116 138 131 4 102 -153 -4 -194 -255 -21 -123 -40 -91 83 -102 202 172 -39 15 113 -118
4626 -118 -162 167 203 60 65 -11 -42 83 -61 20 190 0 -18 85 305 82 -124 -50 -202 -34 -49 219 212 173
4650 173 9 -65 -13 144 182 -7 -131 5 45 109 -211 -12 67 216 254 -275 71 -176 -151 49 202 48 350
4673 350 166 10 -193 181 11 39 -160 -168 -262 -254 -138 -15 83 -115 -223 -61 -15 -56 18 69 -29 -191 22 3
4697 3 -129 13 -316 -119 1 3 -112 159 9 -28 131 280 333 -87 -58 -9 199 -32 68 -6 -2 237 -127 -115
4721 -115 29 -87 133 76 47 45 191 182 32 191 -180 397 3 274 129 492 -171 90 29 1 397 168 118
$$ packed form
4556G6J08j09K71j21l06J9J47k78K76N5k38M5o6L7J53k73P8L1k2K90j00p3MJ14
4580A18j69j08J69k0N3j89k01M22k7n1J5J71k06J42l92M12j8J14k67oj11L77m59
4603b31Q2J80j47K54pj27R8k55J49j90o1K34j02Q3n1J74j85L04l0k11N4R8k31
4626a18m4L29L6j43Np6l1J25j44Q1J70j90j8J03K20k23k06P4j52J68j5K68pl9
4650A73j64p4N2J57L8j89j24J36M0O4l20J99P9J49L8n29L46k47K5K00J53j54L02
4673C50j84j56k03L74j70K8j99qr4QJ16J23R8j98j08J62M6m1P4N1r8j62K13j9
4697Cj32J42l29J97J20Kj15K71j50l7J59J49N3m20K9M9K08k31J00p4MK39l64J2
4721a15J44j16K20n7k9kJ46rj50J59l71N77l94K71j45L63o63K61o1k8L96k29n0
$$ plain form
4744 118 193 -2 355 434 269 547 5 -151 -332 -8 118 -145 -620 -313 5 -2 561 76 -861 -1023 -205
4765 -205 467 -604 -379 -18 452 -308 76 302 140 254 -31 43 166 330 -413 403 713 196 -212 -318
4785 -318 942 392 21 70 -275 -4 544 67 105 699 126 399 238 127 127 -153 47 237 -98 509 -230
4806 -230 -66 1 343 226 309 404 319 79 107 -70 372 -145 301 -22 -328 -457 -302 -38 7 152 -251 436
4828 436 -51 -411 -286 139 54 92 -117 -318 -22 -32 16 -120 165 100 38 -57 -60 -165 14 24 34 -115 -181 -46
4852 -46 4 -121 -65 157 130 -106 -10 -41 -73 -231 -23 -76 39 -46 -22 -3 24 83 -106 -128 -177 99 -60 0 137
4877 137 109 -86 -69 129 100 -119 59 11 207 -51 149 -87 9 87 15 25 9 136 97 -1 114 15 22 9 -75
4902 -75 31 -218 70 -115 28 62 -18 -23 83 95 -387 40 -351 33 -92 -262 58 -101 -138 -59 148 -23 52
$$ packed form
4744A18P5j95L57P9j65K78n42j56j81L24J26k63m75L07L18pN63m85r37j62Q18
4765b05O72j071K25L61M70p60L84K26j62J14k85P4J23J64p43Q16L10n17m08j06
4785c18J260n50l71M9l45K71N48m77L8N94n73K73j61j11%k80K00J90l35O07p39
4806b30J64O7L42j17Q3R5q5k40K8j77M42n17M46l23l06j29J55K64M5J45m03O87
4828D36m87l60J25M25q5L8k09k01K96j0M8j36K85o5o2r5lj05J79J0J0j49o6J35
4852d6N0j25N6K22k7k36R6l1l2j58K08n3J15q5K4J9K7N9j89k2m9K76j59O0J37
4877A37k8j95J7J98k9k19J78m8J96k58K00k36R6P8p2J0j6J27l9r8J15r9Pj3q4
4902g5J06k49K88j85J43L4q0nJ06J2m82M27l91L84j25j70L20j59l7P9K07j71P5
$$ plain form
4925 52 270 -122 119 -5 -273 161 -326 -317 59 -262 -167 -143 -33 167 159 152 328 243 440 9 93 71 -263 -122
4949 -122 -66 -303 -164 246 149 357 337 131 215 61 228 219 -251 262 27 -114 -135 -241 142 -267 86 113 -4
4972 -4 -438 -167 -54 244 220 -160 -142 -275 233 -286 473 739 -135 214 -172 -23 172 -57 65 79 -432 202
4994 202 -338 62 -379 131 74 160 -480 317 -453 158 177 -6 61 -334 -131 0 -72 -37 665 117 -235 109
5016 109 186 -109 78 537 -108 6 286 -54 -410 -87 -360 90 264 100 166 244 160 -169 328 292 192 -437
5038 -437 -253 289 10 352 19 -307 109 -428 42 -299 129 -128 -517 452 -739 363 -567 -235 111
5057 111 -695 1113 -174 275 405 643 75 393 351 9 266 -684 65 123 -240 -6 429 -127 -265 -633
5077 -633 617 158 175 -324 -82 -544 -658 575 27 67 -58 -583 521 217 -322 403 10 177 271 400
$$ packed form
4925E2K18l92K41j24k68M34m87RL76l21R5K4J10K00qpJ76q5J97m31Q4k2l34J41
4949a22N6k37J39M10r7K08k0k06Q4j54J67rm70N13k35j41k1j06L83m09L53K7j17
4972dm34K71J13K98k4l80J8j33N08n19P59K66q74L49l86J49J95k29J22J4n11O34
4994B02n40M00m41N10n7Q6o40P97p70O11J9j83O7l95K03J31p2L5P02n48l52L44
5016A09P7k95J87M59o45J14K80l40l56L23k73M50J74j64O6P8q4l29M97l6j00o29
5038d37J84N42k79L42l33l26M16n37M70l41M28k57l89R69j191J102r30L32L46
5057A11q06J808j287M49J30K38n68L18m2l42K57r50P49N8l63K34M35n56j38l68
5077f33J250m59J7m99K42m62j14J233n48M0j25n25J104l04n39P25l93J67R4J29
$$ plain form
5097 400 -281 92 209 -10 -261 -352 -526 -124 -164 503 -54 -288 -145 -53 -799 687 335 5 524 -97 369
5118 369 -392 601 246 -11 305 -19 -12 618 -375 789 442 -387 26 -606 289 100 -27 78 28 831 595
5139 595 -690 855 129 81 -367 74 -778 -1512 566 306 428 -398 482 -57 126 201 115 -233 637 61
5159 61 -280 -285 97 -506 -56 -29 -381 -26 358 -284 -259 -135 -122 251 279 -93 166 -55 -198 -18 138 -144
5181 -144 276 -63 39 -173 -208 -26 -80 192 25 -108 111 -144 -230 -122 235 -151 193 4 -158 33 -311
5202 -311 191 43 -141 -83 -29 -15 76 -61 15 -158 99 131 -116 -152 -125 -155 62 221 -341 62 47 14 21 17 -216
5227 -216 7 -109 -293 -5 186 -52 -91 -2 47 -74 -22 -121 97 88 -56 54 -83 93 5 52 -52 -12 161
5250 161 81 -47 -2 318 43 286 -638 337 248 -41 -135 -111 120 198 -163 -20 -41 21 11 -192 41 -108 -15
$$ packed form
5097D00o81L73J17k19k51r1j74M02m0O67n57k34J43R2p46J486l52l30N19o21M66
5118C69p61R93l55k57L16l24PO30r93J164l47q29M13o32Q95j89j27J05n0Q03k36
5139E95j285J545p26m8m48M41q52p34K078k60J22q26Q80n39J83P5q6l48Q70n76
5159F1l41nL82o03M50K7l52L55L84o42K5J24J3L73K8l72K59k21j43J80J56k82
5181a44M20l39J02k12l5J82n4K72j67j33K19k55q6J08L57l86L44j89j62J91l44
5202c11N02j48j84N8N4J4R1j37P6j73K57L2k47l6K7l0K17J59n62M03j5l3Pmk33
5227b16K23j16j84K88J91k38l9Q9M9j21N2r9K18rj44J10j37J76q8M7j04M0J73
5250A61q0j28M5L20k75K43r24R75q9k89r4K4K31P8l61J43k1O2j0k03K33j49R3
$$ plain form
5273 -15 17 114 41 35 -98 25 3 -14 -58 168 98 108 -142 -25 26 56 26 123 -64 -32 -9 163 193 -252 -19 164
5299 164 -83 16 130 14 -90 47 -13 -24 -1 -116 51 34 67 -8 -22 -107 10 -49 -171 -157 147 75 -73 -105
5323 -105 223 -96 10 5 -115 -125 -65 -6 -115 137 58 64 4 98 -82 147 -55 136 18 41 -16 131 -230 -117
5347 -117 -39 -78 4 -177 72 -38 44 -181 60 -16 -165 200 214 -223 -76 -127 -227 -25 74 -16 44 49 -249 -110
5371 -110 -18 43 20 103 -43 49 225 58 66 -4 158 19 167 -133 -179 -94 94 150 -89 -110 -100 -166 90 142 162
5396 162 169 -17 -2 -169 62 86 6 -2 -3 -16 -55 30 38 8 159 -57 -39 -56 212 -18 -74 -192 14 -480 29 175
5422 175 542 -151 160 -40 105 132 -79 -2 -240 220 -190 31 24 210 225 -166 178 128 -192 303 -84 -22
5444 -22 -408 156 136 -243 242 197 194 -65 -107 -118 139 -107 -109 64 -32 93 85 110 22 233 -828 -385 225 64
$$ packed form
5273a5L2R7p3oj33J23k2j7m4K26p0J0k50J17N1L0l0R7j87L2K3J72L0m45K33J83
5299A64k47R9J14j16j04J37o0j1K3j15J67j7L3p5j4q5J17n9j22J4L04p2j48l2
5323a05L28l19J06nj20j0O0N9j09K52p9Oo0R4j80K29k02J91j18K3n7J47l61J13
5347a17P8l9Q2j81K49j10Q2k25K41p6j49L65J4m37J47n1j00K02R9r0O0Nk98J39
5371a10R2O1k3Q3j46R2J76j67Qp0J62j39J48l00m6Q5J88N6k39k1J0o6K56N2K0
5396A62Pj86J5j67K31K4q0qjj3l9Q5Ql0J51k16J8j7K68k30n6j18K06m94N09J46
5422A75L67o93L11k00J45K7k11P7k38M60m10K21pJ86J5l91L44n0l20M95l87O2
5444b2l86N64k0l79M85m5lk59m2j1K57k46kJ73r6J25qK5q8K11j061M43O10j61
$$ plain form
5468 64 169 306 -108 -234 172 -150 -5 -332 -116 99 264 -121 43 -15 -28 -198 400 -29 13 -403 -219
5489 -219 272 115 -109 -117 -440 305 116 564 301 377 802 188 -276 -121 -235 -597 -330 42 104 -157 -454
5510 -454 -292 -102 586 7 -88 538 244 -267 -202 5 124 120 36 -154 38 215 121 587 123 -516 100 231
5532 231 -525 542 125 160 32 -20 -129 -119 27 361 -70 54 110 180 -18 95 73 276 68 -21 -138 -98
5554 -98 -22 -73 -248 -174 -59 154 -114 -156 -194 170 -113 13 128 113 -6 -153 91 -10 53 -43 -35 86 -182 249
5578 249 77 310 -67 176 -78 277 109 106 -13 -160 133 -35 223 183 -27 -66 42 -112 -23 -160 420 42
5600 42 38 -70 86 124 -163 38 28 56 -95 -36 -47 6 -250 -158 -77 95 86 232 118 134 -143 -16 157 -13 96
5625 96 -45 33 -109 110 166 -12 97 -39 -209 109 -34 28 -17 27 -131 51 335 -2 -288 -19 42 226
$$ packed form
5468F4J05J37m14j26M06l22J45l27K16K15J65l85J64n8j3j70N98m29M2m16J84
5489b19M91j57k24ql23P45j89M48k63P6M25o14m64J55j14l62K67L72O2k61k97
5510d54J62J90O88n79r5O26k94n11O5K07J19mq4j90J92J77r4M66m64o39O16J31
5532B31p56J067m17L5j28n2j09J0J46L34m31J24N6P0j98J13k2K03k08q9j17M0
5554i8P6n1j75P4J15K13k68m2l8L64k83J26J15j5j19j47K44j01O3r6QJ21k68M31
5578B49j72K33l77K43k54L55j68lj19j47K93j68K58m0k10l9J08j54Q9j37N80l78
5600D2mj08J56L8k87K01j0K8j51N9j1N3k56R2Q1J72rJ46j14J6k77J27J73j70J09
5625I6j41P8j42K19N6j78J09j36j70L18j43O2m5M4j58J82K84l37k86K69O1J84
$$ plain form
5647 226 144 -125 -8 -184 -93 -144 32 -37 56 -5 -138 -284 231 78 31 -59 180 338 80 -83 -139 -134 -23 42
5671 42 34 74 62 -174 70 -164 3 205 -32 15 76 232 -166 139 216 48 -158 -19 -40 -28 -101 67 -49 -53
5695 -53 -61 -249 -135 50 -203 32 -76 -273 49 141 -145 -217 91 -30 323 175 155 52 -28 98 -195 -114 112
5718 112 -262 -269 79 -115 -141 149 -21 -71 116 113 165 204 -250 156 -112 -15 -77 89 71 -165 45 41 147 -73
5742 -73 11 -112 168 -38 97 -120 44 -86 -103 -93 100 -147 78 133 -187 2 214 -42 -102 227 100 -91
5764 -91 88 -55 -120 161 103 11 -90 -139 119 -92 163 35 -130 -67 -75 -79 2 33 154 232 46 141 -89 -141 -36
5789 -36 -98 -49 -178 -16 45 183 -239 51 -48 60 -81 -19 102 -199 174 -144 -214 7 164 -196 100 -219
5811 -219 58 16 -241 -192 -155 95 -76 147 -99 23 51 -135 -156 -122 -36 -72 -52 94 181 -79 120 183 90 4
$$ packed form
5647B26q2k69J17j76R1n1J76o9R3o1j33j46N15j53m7r0K39J58k58j63n6NJ11O5
5671D2qM0j2k36K44k34J67K02k37M7O1J56l98L05P7j68k06J39k1J2p3J68j16m
5695e3qj88J14J85k53K35j08j97L22R2k86p2L08j21L53j48k0j03q0J26k93Q1K26
5718A12l74pL48j94k6K90j70n0J87lN2L9m54M06k68R7o2J66j8k36K10mJ06k20
5742g3Q4j23K80k06J35k17J64j30j7J0J93k47K25N5l20J89K12k56o0L29j27j91
5764i1J79j43o5K81n8r2j01m9K58k11K55j28j65O3qmQ1L1J21P8j86R5k30n2J05
5789c6o2M9j29J62O1J38m22K90r9J08j41O2J21l01L73l18p0K21J57l60K96l19
5811b19K77m2k57M9L7K50j71K23k46J22K8j86k1L4Q6l6K0J46Q7k60J99O3r3q6
$$ plain form
5835 4 -5 192 197 95 11 -221 249 -68 173 155 53 -51 93 106 -139 -81 2 -90 43 127 -10 -32 -164 12 5
5860 5 -104 -54 128 -80 -260 51 -53 -128 -63 63 91 228 -153 -81 196 106 138 -111 87 -122 87 -3 -67 199
5884 199 -143 34 206 123 193 232 -152 157 74 181 -45 38 323 -44 23 27 -212 -65 -21 -80 12 190 -54 8
5908 8 -132 -75 -150 173 -59 19 -182 458 -16 -166 -45 -285 14 -12 51 -45 -19 163 213 -27 85 -241 2
5931 2 18 318 -5 159 5 285 -53 18 127 -34 140 -52 178 48 105 40 89 64 208 -117 11 134 87
5954 87 -209 -277 196 68 114 96 -137 -138 114 -10 33 -125 -124 122 167 -98 9 -183 -14 0 124 -137 140 97
5978 97 2 -210 -48 89 -24 215 -15 100 15 -171 -187 -191 -266 65 -298 -29 224 241 28 204 210 122 -181 -245
6002 -245 -44 -332 -1 -354 -339 31 -169 -197 -41 -309 88 -550 -198 -30 -79 -115 241 -133 -325 461 -293
$$ packed form
5835DrJ97Nj02q4k32M70l17K41j8j02j04J44J3k45N8Q3r2J33Q4j37k2j32J76p
5860Ej09N0J82k08j80L11j04p5O5J26K8J37l81P2K77r0L2k49J98k09K09r0o4K66
5884A99l42J77J72q3P0L9l84L09q3J07k26Q3K85l67O7Mk39J47M4n9R2J78k44O2
5908Hj40N7p5L23k32P8k01O40m74j50J21k40K99k6O3r6K6J82N0k40J12l26K43
5931BJ6L00l23J64j54K80l38P1J09j61J74j92K30j30N7o5M9k5J44l25J28J23m7
5954H7k96o8M73j28M6j8k33jK52j24M3j58JK46M5k65J07j92J69J4J24k61K77m3
5978I7r5k12J62J37j13K39k30J15q5j86j6mp5L31l63K69K53J7k13J76Oq8l03o4
6002b45K01k88L31l53J5L70k00k8J56k68L97o38L52J68m9l6L56l74j92P86p54
$$ plain form
6023 -293 -27 94 -263 -584 195 -58 -164 -89 -38 -829 -201 187 353 183 -266 8 222 -211 -229 90 288
6044 288 64 -773 553 -93 380 229 29 65 29 -243 -429 -475 86 -180 5 -387 33 222 -1 154 -111
6065 -111 145 -34 189 -99 77 6 -309 -163 -429 -14 127 -45 -336 -99 373 215 -42 -359 -23 116
6085 116 55 -268 149 28 370 -695 368 -214 498 292 -940 -138 -17 268 -469 756 -306 -42 113
6104 113 -279 205 543 -342 18 -469 40 -190 -454 -417 -339 -499 177 341 129 -135 328 -335 231 443 417
6125 417 -947 -76 -322 -698 -1012 -949 -468 -354 -681 322 -250 472 122 278 4 264 266 -68 14 -240 61
6146 61 245 -71 151 365 -142 -271 165 403 -349 -226 -30 232 -256 -31 -349 183 -604 97 -541 -816
6166 -816 81 168 -200 181 -116 118 106 172 -357 -207 -32 136 15 -228 79 66 -331 149 -71 122 213 10
$$ packed form
6023b93K66J21l57l21P79k53j06P5N1p91O28L88J66j70m49K74K14m33j8L19J98
6044B88k24q37J326o46M73j51k00L6l6k72j86m6N61k66J85l92M20J89k23J55k65
6065a11K56j79K23k88J76p1l15J46k66M15J41j72k91K37M72j58k57l17L36J39
6085A16o1l23M17j21L42j065J063n82P12k06j232Q02J21K85p37J225j062K64J55
6104A13l92M84L38q85L60m87N09k30k64L7P8j60O76J64k12k64M63o63N66K12k6
6125D17j364Q71k46l76l14O3M81J14l27J003n72P22l50J56k74K60Kl34Q2k54L01
6146F1J84l16K22K14n07j29M36K38p52J23J96K62m88K25l18N32p87P01o38k75
6166h16Q97Q7l68L81k97K34j2O6n29J50J75J68j21k43L07j3l97M80k20J93R1k03
$$ plain form
6188 10 80 73 -89 -161 -158 64 134 -49 -7 84 -150 -4 -199 178 160 -28 140 -98 34 -109 147 -88 11 -26
6212 -26 -108 -105 88 -125 -37 166 -140 -105 88 -137 77 -27 -103 28 -222 -207 128 40 -135 -37 -8 212 -112 -6
6236 -6 -70 134 -144 -148 -72 -109 -23 67 89 253 76 108 158 76 -82 127 90 147 -17 161 -121 -16 -2 -13 -51 84
6262 84 -150 -104 -58 -108 82 55 52 15 13 -158 244 -129 40 261 -16 70 122 198 -214 32 -75 78 88 -70 106
6287 106 8 -210 -102 45 -124 -58 -124 -55 -290 114 -29 -89 -216 -259 327 637 181 -102 567 -345 411 -252
6309 -252 -46 -340 152 308 -551 64 490 -291 215 97 330 257 -164 -123 20 152 -138 -111 142 231 -9
6330 -9 38 -62 50 -72 189 61 -45 -123 -87 104 59 -3 34 -132 -132 247 64 16 -57 -62 -13 263 207 72 -73
6355 -73 -14 -163 -97 110 80 142 -106 64 133 -233 3 -26 281 145 -68 -106 167 230 11 -195 174 -33 -60
$$ packed form
6188A0P0pj62p2LK22P0j83M2R1k34J46j95L77j8j88J68k38J32j43K56k35R9l7
6212b6q2LJ93k13Q8K03l06L5J93k25K14j04p6J31k50J5L35q8j75R8K9K20l24J06
6236fo4K04k78mP6l7Q6R0K2J64j77L2N0q2j58K09l7N7j64J78k82J05J4j1l8J35
6262H4k34M6M6n0J90k7ll7kj71M02l73J69K21k77Q6N2P6m12K46j07J53J0j58J76
6287A06r8k18J08J47j69O6o6O9k35M04j43o0j27m3N86L10m56k83O69r12P56o63
6309b52K06k94M92J56q59O15M26p81N06j18K33p3m21M1J43J32k90K7K53Q9k40
6330iM7j00J12j22K61j28j06p8L6J91m5o2L7j66%L79j83m8p3nM9K76n6j35j45
6355g3N9j49O6K07l0O2k48J70O9l66K36k9L07j36k13l8K73O3k19k06L69k07k7
$$ plain form
6378 -60 243 -231 175 -166 -171 157 -68 -77 0 40 120 -49 188 -232 78 -5 -195 349 23 189 5 90 -110
6401 -110 -196 -206 78 -82 96 -89 32 -35 -22 303 -110 102 9 -105 25 12 -164 -162 102 202 -104 -218 -109
6424 -109 252 -184 102 -151 -3 -27 -23 37 17 21 109 -179 17 -62 -34 2 -134 40 -54 257 -57 37 -43 28 33 66
6450 66 -153 22 189 -20 57 -167 -144 84 -87 -115 24 -55 -36 25 143 185 114 -143 5 130 7 -137 171
6473 171 94 101 -107 34 63 -15 -13 147 -89 -135 -178 -151 -77 280 255 29 -22 -103 -78 -266 175 -116 -102 -39 -57 35
6499 35 230 -36 62 216 -97 -2 -7 -296 45 -61 291 -137 -165 -27 72 -142 -76 -74 139 69 -43 34 -311 -152
6523 -152 136 -22 -173 -224 5 35 -5 51 -89 -87 -20 137 -12 61 162 19 37 -145 -151 -213 65 84 167 -122 37
6548 37 55 44 69 -42 50 107 -12 92 109 -102 -53 -211 104 -41 75 173 266 36 -17 -64 145 38 -169 242
$$ packed form
6378f0L03m74M06l41nL28k25rP7M0Q0j69K37m20L10q3j90N44l26J66j84Q5k00
6401a10q6j0K84j60J78j85J21o7J3L25m13K12r3j14J30j3j76KK64J00l06j14J09
6424a09L61m36K86k53J48k4MO0k0MQ8k88J96p9K8L6j36J74r4L11l14R4q0P1NL3
6450F6k19J75J67k09P7k24K3K28j71k8J39p9J9O1J18M2p1k57J48J25j23j44L08
6473A71p7Pk08J41K9p8KJ60k36m6m3K7P4L57k5k26n1q1K5j88M41k91J4O3j8R2
6499C5J95k66R8J54l13R5nk89L41j06L52m28k8J38R9k14O6KK13p0j12P7l45J59
6523a52K88j58j51n1K29L0m0N6j40KO7J57j49P3J01j43J8j82oo2K78J9Q3k89J59
6548C7J8j1K5j11R2N7j19J04J7k11M9j58L15j45J16R8R3k30n3m7K09j07k07M11
$$ plain form
6572 242 -177 111 -48 -43 -31 -132 45 9 211 85 -4 -216 -108 9 -165 57 -39 -114 76 -111 171 26
6594 26 56 25 105 38 -113 -47 39 47 90 -93 93 -35 -44 -112 44 14 60 66 55 -144 -108 -15 89 135 84 -50 -73 -229
6622 -229 213 -104 129 91 -116 209 31 15 31 -33 41 -75 50 -15 56 87 -13 -71 -141 190 -21 82 -111
6645 -111 -169 276 27 -17 -81 -312 -151 -116 91 -4 -246 68 90 -242 73 61 10 208 -24 128 -50 5 -111
6668 -111 108 254 103 -28 -48 -12 -132 -89 -152 -64 -90 143 18 18 201 229 -16 -118 -237 70 -80 -152 71
6691 71 183 -32 310 -35 -62 -270 104 -216 -192 20 102 -60 -41 118 -17 3 -30 -113 -49 46 -68 -131 -263 202
6715 202 -21 -23 -138 -66 8 209 286 74 4 -88 -45 150 34 37 -171 -174 -115 -80 125 22 -26 -82 83 -20 -197
6740 -197 -272 -9 19 144 -259 -57 -262 267 7 48 132 -24 -219 19 -141 -114 106 -84 13 17 79 40 -31 77
$$ packed form
6572B42m19K88j59NJ2j01J77l6K02j26q9k12J08J17j74K22r6p5J90j87K82j45
6594B6L0l1Q0o7j51O6Q6QM3j83J86j28ro8J56l0M6Oj1j99L6R3J04M6n1j34k3j56
6622b29M42l17K33l8k07L25j78j6J6o4P4j16J25o5P1L1j00n8p0L31k11J03j93
6645a11n8M45k49m4o4k31J61L5K07r5k42L14K2l32L15j2n1J98k32J52j78N5j16
6668a11K19J46j51j31k0L6j20M3o3Q8k6K33j25%J83K8k45j02j19L07j50p2K23
6691G1J12k15L42l45k7k08L74l20K4K12Q2j62J9J59j35K0l3q3O4R5j14o3j32M65
6715B02k23kj15P2P4K01P7k12p0r2M3J95j16Lk08lN9L5K05j03m8n6J65j03j77
6740a97p5K63K8J25m03K02k05N29k60M1Q4j56j95K38j60K7K20j90R7MO2l9p1J08
$$ plain form
6764 77 230 47 -241 97 -23 32 -50 -280 74 71 -103 49 -41 -140 -115 -82 55 32 -69 160 -272 14 12 -127
6788 -127 3 -157 3 15 -71 -38 -1 31 79 -96 128 15 101 -179 -6 -82 26 -90 254 90 -160 -139 68
6811 68 5 -48 -195 -151 60 16 -175 54 215 -26 -53 -135 -75 153 44 -247 -235 271 10 33 36 50 -10 -186 39
6836 39 -8 124 95 160 0 -78 -91 -188 128 18 -178 93 -105 -57 202 -199 11 52 100 -135 46 -151 336
6859 336 -3 -6 -138 283 45 -363 -16 39 -175 -113 -105 -285 -169 245 537 21 -136 499 -521 814 225
6880 225 27 -337 7 99 266 -12 24 11 -167 61 11 146 -165 29 248 -1 71 -75 30 150 -309 42
6902 42 -51 117 -71 -43 -125 -240 -59 -158 -24 65 -200 -211 -71 -51 83 1 16 -260 -274 -236 -46 23 -145 -36
6926 -36 55 22 -45 -237 109 229 146 121 147 2 29 118 81 65 24 -37 -43 -95 -99 -64 -125 118 -3 -77 180 44 132
$$ packed form
6764G7J53j83k88L38j20N5q2k30L54lj74J52r0r9K5L3J37k3j01K29m32K86kj39
6788a27J30j60J60J2q6L3L7L2M8j75K24j13Q6k80J73p6J08j16L44j64k50K1K07
6811F8o3n3j47M4K11m4j91K29J61k41k7q2O0K28j09k91J2N06k61K3LJ4o0j76K25
6836C9m7J32k9O5j60p8j3r7L16j10j96K71j98M8K59m01K10M1M8k35J81j97M87
6859C36l39lj32M21k38m08L47N5k14O2Qj80J16M14K92n16j57O35j020J335n89
6880B25j98l64L44R2J67k78L6j3j78K28n0J35l11J94K19k49P2j46J05J20m59L51
6902D2r3J68j88K8q2j15J81r9J34Q9k65j1J40K0J34q2J5k76j4L8J90O9j68J09
6926c6R1l3o7j92L46J20q3k5K6j45K7Q9l7j6m1o1on2mL5o1K43j21p4K57j36Q8
$$ plain form
6953 132 -136 -110 159 0 -7 -43 89 -58 -120 184 -12 -71 -252 -92 -137 188 98 45 8 2 -172 158 59 -69
6977 -69 -47 -199 107 -146 -115 -41 244 75 -169 96 -61 51 31 45 -67 29 -138 -136 145 -120 73 21 66 -112
7001 -112 -8 -272 54 -14 -89 228 144 126 88 -4 -120 83 94 5 -81 -89 80 171 65 -14 117 157 3 -37 27
7026 27 -55 -72 -78 107 -181 -57 -141 -123 -74 -77 -39 1 134 36 -185 -26 147 203 64 192 -34 -18 95 -107 -224
7051 -224 148 129 -215 -187 51 -4 -179 19 -142 -68 74 249 121 82 -31 127 88 -206 -105 160 94 61 218
7074 218 -188 -31 81 156 26 70 -17 -8 43 64 -102 97 -168 99 15 37 -153 45 -10 -300 -99 4 67 -188
7098 -188 -4 -50 -61 124 158 -296 -121 49 -12 -176 -56 352 -189 131 -34 -126 -2 -81 43 87 180 -44 -122
7121 -122 96 146 123 -145 184 141 -115 -298 229 -191 -156 -136 -2 -12 -61 -66 -27 -175 132 194 -250 -55 -4 -203
$$ packed form
6953A32k68K6K69j59pl6J32j47o2L04j96n9j81J60m5L25r0n3l7oj74L30r9j28
6977f9K2j52L06k53L1P4K85j69k44K65j57J12k0J4j12R6j67KK81k65J93n2M5j78
7001a12J04k64L26o8p5L17q4j8l8r2j16K03J1q9q6qJ69R1j06p9J31M0j54m0O4
7026B7q2j7oJ85k88J24q4J8M9lL8M0J33r8k21J59J73N6j39J28k26J6J13k02j17
7051b24L72j9l44K8K38n5j75J98j61P4J42J75j28l9j13J58l9k94J01K65o6l3J57
7074B18m06J57J12P5j30M4q7RN1K1j66J99k65K67q4K2j90J98n5k90K01J03O3k55
7098a88J84m6j1J85L4m54J75J70o1j64J20M08n41L20j65r2J24p9J24M4R3k24p8
7121a22K18N0k3k68L29m3k56j83N27m20L5K0J34j0m9nL9j48L07O2m44J95N1j99
$$ plain form
7145 -203 -221 46 -94 62 49 -56 58 81 -101 -111 -134 32 96 133 4 20 61 -144 -84 260 -123 -103 -199 -33
7169 -33 276 121 -31 -158 -116 165 -15 -81 -24 -49 40 -52 -11 -6 11 -79 -10 25 -160 33 8 2 -155 -146 -50 -17 81
7196 81 -69 -21 -28 142 104 6 -75 52 -4 -270 -191 -35 -55 -143 -80 -46 240 179 -143 281 -137 -244 -139 57 -152
7221 -152 21 -57 -224 -14 48 92 39 170 -10 38 121 133 99 -7 45 -69 32 212 235 201 -14 -160 188 -101
7245 -101 -19 -74 195 -149 54 22 108 -288 18 356 -51 33 154 70 93 18 -65 -35 7 87 10 50 -178 60 -101
7270 -101 39 77 71 -125 -177 -10 1 -150 81 136 37 -66 107 82 -14 -107 0 -129 -27 -66 -58 -161 -352 31
7294 31 -48 -151 123 19 34 162 -90 -169 123 -168 62 177 7 -47 -18 -152 44 -74 4 -103 197 41
7316 41 -150 -90 8 -28 120 57 56 76 -111 63 -8 -80 -7 -103 77 -114 159 -26 -33 19 -84 54 114 -163 76
$$ packed form
7145b03j8K67j40J56j3j05J14K3j82j0k3J66O4L7j29J6M1k05O0L44l83K0r6J66
7169c3L09j55j52j27M2K81j80o6N7k5Q9r2M1NJ7r0O9L5j85J93k5oj57RR6L3R8
7196H1j50M8pJ70l8r8q1J27n6k66P9J56k0q8O3L4K86o1l22M24m18j07J05J96k09
7221a52J73p8j67K10O2M4n3J31j80M8Q3J2l4j06N2j14J01J80K3l4k15j46L48k89
7245a01Q2n5K69l44K03l2Q6l96L06L38m07Q4J21q4K3p5q3L0M2Q0p7M0k28K38j61
7270a01J40L8oj96n2J67J1j51K31N5r9j03J73k5r6r3J07j29J02l9Qj03j91L83
7294C1p9j03K74j04J5J28k52p9K92k91K30J15j70n4K9j34J96j18P8j07L00j56
7316D1j91O0R8l6J48o3jK0j87J74p1p2P3r6J80j91K73j85pN2j03J38O0k77K39
$$ plain form
7341 76 53 46 -91 -75 192 -52 -70 -25 45 -158 -86 -103 -147 123 146 -92 98 74 -111 -16 -43 107 -151 15 19 78
7367 78 229 44 -2 -83 70 -55 121 73 80 124 150 -164 -244 -85 218 115 240 -36 -91 -54 -30 -51 13 175 -196
7392 -196 72 -237 -17 -128 89 66 53 -158 -155 256 88 196 177 20 74 148 113 -186 192 -96 -23 -74 -69 59
7416 59 -23 -51 20 38 122 -163 110 115 6 172 -26 115 70 217 22 76 150 78 38 -70 64 97 29 155 55
7441 55 -67 -72 27 -18 153 -43 18 -250 -121 -100 -167 199 -25 -240 226 36 275 100 207 -99 -49 180 103
7464 103 75 57 -27 -137 171 -118 -96 143 -37 36 18 -127 75 -151 -142 174 -16 81 -31 -113 164 -30 -89 -76
7488 -76 131 -98 -1 60 -139 -136 229 -233 -27 -50 -238 -31 -90 -73 119 81 -60 142 136 -174 -68 89 136 -165
7512 -165 -158 -128 169 147 120 25 28 84 236 83 -15 -49 -162 11 -39 -84 -84 -127 364 98 183 81 -41 -74 162 -76
$$ packed form
7341G6k3pj37J6K67k44j8M5P0k03P2j7m4K70K3k38J90k4j85R5k7J50k58J66MN9
7367G8J51j85m6q1J53j25J76m8PM4K6l14q0J59L03j03J25k76n5L7K4k1O4J62l71
7392a96K68l09K20j11K17k3j3k11LM11j68J08j9j57N4P4l5k99L78k88P3n1NJ28
7416E9q2k8P1J8Q4k85K73Nj09J66j98J41m5J47j95N4P4p2m0j08J34L3o8J26j00
7441E5j22nR9m5J71j96O1k68J29K1o7L66k24k15M66j90K39j75J07l06N0K29p7
7464A03k8j8q4j10L08k89K2K39j80P3j8j45K02k26RL16j90R7j12q2K77j94n9J3
7488g6K07k29R7O1j99LL65m62K06k3j88K07n9J7J92l8j41K02ol10J06J57M7l01
7512a65PL0K97k2k7r5LN6J52j53r8l4j13J73n0m5%m3M91k66Q5j02j22l3K36k38
$$ plain form
7538 -76 304 188 150 -110 -209 81 -92 -96 -73 -102 149 69 -33 37 -130 54 -25 -21 79 -199 18 185 -38 -63
7562 -63 -171 -60 -92 -269 385 119 -431 280 32 530 -422 258 -227 103 -104 -339 144 -701 -141 -180 -391
7583 -391 152 291 -387 6 404 -500 -520 331 -563 -64 -44 5 1 -77 78 282 -146 -63 -101 -69 -304 100 60
7606 60 44 115 14 -133 90 131 -41 -130 121 -15 -207 -146 103 -224 -10 -9 129 -84 -23 -203 26 -62 -45 44
7630 44 165 -85 -34 -277 -61 -67 -81 -78 -92 -109 -83 -231 -137 252 -64 26 -41 46 207 72 -232 -271 222 -271 256
7655 256 327 216 -147 -244 -266 -240 -126 428 152 -108 -31 -119 53 -335 -18 -516 431 -38 -384 -131 -219 243
7677 243 132 -189 -112 27 -165 197 -104 -128 -201 -190 63 170 -4 -302 175 132 -75 -249 -155 -266 -221 -142 -56
7700 -56 -119 -72 -21 267 -133 73 -26 -23 -321 -261 -112 -182 -358 129 173 -591 129 -747 -124 95 95 -176 347 158
$$ packed form
7538g6L80j16l8k60r9K90j73mK3k9K51q0j02P0j67J84p9MJ00k78K17J67k23k5
7562f3j08J11l2j77O54k66n50P11k48M98r52O80m85L30k07k35M83q45N60l9k11
7583c91N43J39o78L93L98r04k0Q51q94M99K0M9mp8J55K04m28Q3l8L2k35M04m0
7606F0j6P1j01j47K23M1j72q9K51j36j92O1K49l27K14JJ38k13O1j80K29q8J7Q9
7630D4J21k50N1k43K16oj4Lj4j7K6j48R4L89l16R0o7Q7J61j35l04l9M93m93N27
7655B56P1j11l63r7k2K6J14N54k76k60P7q8J72l88L17m98R47m69l46K53q8M62
7677B43j11l21P7J39j92L62l01k4p3J1K53J07j74k98M77m3k07j74R4j11M5P9Q6
7700e6o3M7N1K88m00K06r9Lk98O0J49p0j76M87M4p64P20q76O23K19%k71N23j89
$$ plain form
7724 158 213 -425 182 -55 167 -11 277 267 -164 -381 -231 738 340 296 458 -67 -363 -20 249 -18 -628
7745 -628 243 10 100 207 166 -407 -356 97 -156 -212 -385 -404 -466 392 -16 -188 168 597 297 -140 -328 507
7767 507 109 -740 -161 165 701 450 -196 -204 -193 618 461 -394 204 -395 -16 523 -21 258 581 -106 114
7788 114 -428 310 156 130 103 -148 -301 279 304 207 367 13 134 551 167 -679 206 -914 -299 -141 -96
7809 -96 900 -319 504 -61 -232 -827 851 -660 238 569 143 179 -9 441 345 347 415 -404 -117 74 -19
7830 -19 69 670 152 236 284 -721 72 166 92 460 -581 119 129 -74 -513 -442 -54 -257 293 65 100 40 -42
7853 -42 18 282 55 321 125 532 -15 118 156 342 -355 -185 -673 19 -80 280 -206 -67 -1 -157 290 -515
7875 -515 235 -41 701 -228 184 -162 -744 346 215 -329 -359 25 647 -887 -277 -339 35 529 -237 -186
$$ packed form
7724A58N5o38O07k37K22j78K88j0m31k17J50R69l98m4J62n25k96L43K69k67o10
7745f28Q71k33R0J07m1n73N1M53k53n6j73j9o2Q58m08j72L56M29l00m37j88Q35
7767E07l98q49N79L26N36k51o46qJ1Q11j57q55N98n99L79N39n44K79L23o87K20
7788A14n42P38j54k6k7k51j53N80K5r7J60l54J21M17l84q46Q85j120O15J58M5
7809i6R96j219Q23n65j71n95J678j511Q98L31m26L6j88M50r6KO8q19K87J91r3
7830a9Q8O01n18Q4M8j005P93R4p4L68j041P00J0k03m39P1L88k03N50k28L5o0q2
7853d2O0K64k27K66j96M07n47J33L8J86o97J70m88O92r9L60m86J39O6j56M47q05
7875e15P50k76P42r29M12l46n82J090j31n44l0L84O22j534O10o2L74M94p66N1
$$ plain form
7895 -186 50 674 -712 67 139 274 132 -179 149 80 3 -307 379 660 -149 283 705 637 -337 -515 259
7916 259 264 -317 -107 21 -139 -722 -137 -366 -1 247 329 389 84 -212 442 -175 58 -155 51 222 299 34
7938 34 251 281 -145 134 -75 -88 -102 73 172 183 152 -167 -268 -21 -130 22 -121 -88 -108 -115 68 123 159 -100
7962 -100 46 -86 181 85 -201 61 28 -32 -109 -47 -62 -148 26 -62 72 65 -66 -44 -106 -24 -81 -9 317 -197 -143
7987 -143 125 2 -9 -43 -348 27 -5 -56 168 -144 -236 -3 207 -95 131 -170 80 -90 104 -114 11 -133
8009 -133 -108 -33 96 173 -246 -98 34 -333 -89 -12 -29 -20 174 -62 -57 -25 -110 -5 147 -29 50 152 1 60
8033 60 -230 41 -8 92 -340 -62 -104 -142 112 -97 -40 -253 45 65 -52 81 67 63 28 178 85 56 -39 -60 -18
8058 -18 -191 -36 108 -123 -177 -42 108 243 -14 149 -14 -65 70 -133 -49 -21 -7 -4 -95 95 45 35 138 -25
$$ packed form
7895a86K36O24j386P79P2J35j42l11L28o9p7l10O86K81q09M32M22o8r74j78P74
7916B59Nn81K10J28j60n83N85k29L65K48Q2O0l05k96O54o17K33k13K06J71P7k65
7938C4K17L0m26K79k09j3j4J75R9J1l1l19j01K47j09J52j43L3k0pJ83N5L6k59
7962a00J46j32K67r6k86K62l3o0p7O2j5q6J74q8J34pj31K2o2Q2n7P2L26n14N4
7987a43K68j23j1l4l05L75l2n1K24l12r2K33K10l02K26l01K50j70J94k18J25j44
8009a33K5P5J29P7m19J48J32l67K44P7j7RJ94k36NL2q5J05J52j76P9J02j51N9
8033F0k90K71m9J00m32K78m2l8K54k09N7k13K98K0j17J33j4ml5J50r3k9r5k1M2
8058a8j73J55J44k31n4J35J50J35k57J63j63n1J35k03Q4K8J4Lr1J90n0j0J03j63
$$ plain form
8082 -25 -80 -43 -122 -143 -34 -5 -6 -3 69 -2 -84 21 163 57 -57 129 -108 124 -144 -120 0 18 86 -10 -183 100
8108 100 -67 336 115 -76 24 -195 -148 -18 -191 -26 87 -164 126 2 122 80 94 94 261 -103 -260 -226
8130 -226 -135 -92 25 -27 -247 -214 -35 -147 59 -144 161 195 152 -93 -45 -73 -84 -42 -49 -60 -79 69 -66 -40 2
8155 2 212 -77 -63 -18 -274 258 -143 4 178 124 113 347 55 -239 129 36 66 51 -137 -74 2 249 -47 -20
8179 -20 211 -41 32 -90 45 -153 -28 -100 126 175 111 -24
$$ packed form
8082b5n5L7p9k1J09K9jLP2p1q2J05J42j06j14J86k37K32k68K4J20J8O8r6j73K83
8108A00j67M03k21j91J00k19M7J30j73J65J13k51K90j24J20m2J4%J67l64j57L4
8130b26R1M3J17n2k20L3J79j12K06k03L05L4m3k45M8k8j1M2pj1j9J48j35K6M2
8155BK10k89J4M5k56N32m01J47J74n4j1K34k92k94L68r3L0j5j88O3P6K47k96K7
8179b0K31k52P3j22J35j98J25p2K26M9o4j35
8191b4
$$ Imaginary data points
##PAGE= N=2
##DATA TABLE= (X++(I..I)), XYDATA
$$ plain form
0 0 0 0 0 0 0 0 0 0 0 0 0 0 -4 8 -8 8 -8 15 -16 18 -23 29 -31 39 -46 54 -62 70 -82 93 -108 121 -138 158
34 158 -177 199 -223 252 -281 314 -348 388 -429 474 -527 581 -640 707 -780 857 -946 1041
52 1041 -1147 1267 -1398 1548 -1719 1916 -2141 2410 -2730 3124 -3620 4264 -5142 6414 -8428
67 -8428 12111 -21045 91876 40023 -138522 -5428 65281 41321 -54044 -72303 33385 103858
79 103858 -32754 -105183 33029 110503 -32321 -100707 16900 98264 383 -99804 -23893
90 -23893 103315 23786 -116856 -34949 113647 34702 -106959 -41319 100445 42539 -99794
101 -99794 -55246 87063 53503 -82936 -63753 72748 66610 -71850 -72683 63325 74411 -51982
113 -51982 -78161 43997 79783 -42488 -83853 30965 80552 -21051 -79009 13733 83201
$$ packed form
0@%%%%%%%%%%%%mJ2j6J6j6K3l1L4m1N2o0P0q5J00j16J32j52J75k01K29k59K96
34A58l35L76m22M75n33N95o62P36q17R03j001J108j221J347j487J637j803J987
52A041k188K414k665K946l267L635m057M551n140N854o744P884r406J1556j4842
67h428K0539l3156J12921n1853j78545J33094P0709k3960r5365j8259J05688P0473
79A03858j36612p2429J38212P7474j42824o8386J17607Q1364r7881j00187P5911
90b3893J27208p9529j40642Q1907J48596p8945j41661O5640J41764n7906j42333
101i9794M4548J42309l3560j36439J9183J36501o138j38460q33J36008J1086j26393
113e1982k6179J22158L5786j22271m1365J14818M9587j01603n7958R2742O9468
$$ plain form
124 83201 -2837 -81536 -2612 82669 12978 -78280 -18172 80441 26720 -77090 -30995 74550
136 74550 38715 -66860 -40434 68802 49664 -61884 -50592 59434 54106 -50975 -55248
147 -55248 48164 62110 -40365 -62529 35659 63342 -27534 -63851 22609 67044 -16630 -67718
159 -67718 8197 63074 -3458 -65667 -3201 65814 8521 -65880 -14981 60780 17590 -61856
171 -61856 -24560 58769 26875 -57722 -34453 50529 34253 -49837 -41478 45200 44038 -42311
183 -42311 -48239 35859 47800 -33495 -52811 27782 53735 -23533 -55217 17750 54568 -13284
195 -13284 -55808 8803 57653 -3626 -55442 -417 55342 5829 -53890 -9360 54824 16104
207 16104 -49939 -17879 49256 24137 -45705 -27029 45192 33084 -39485 -32946 38723 38176 -34072
$$ packed form
124H3201q6038p8699P8924Q5281o9691r1258O0108R8613n3721j03810M6095J05545
136G4550l5835j05575K6426J09236j9138j11548J1292J10026n328j05081m273
147e5248J03412J3946j02475k2164R8188K7683r0876l6317Q6460M4435q3674n1088
159f7718P5915N4877o6532o2209O2466O9015n7293p4401N0899P5761m3190p9446
171f1856L7296Q3329l1894q4597K3269Q4982j6276q4090Q359Q6678j162q6349
183d2311n928Q4098J1941q1295j9316Q0593K5953p7268l1684P2967L6818o7852
195a3284m2524O4611M8850o1279n1816N5025N5759m9513n9719M4530O4184l8720
207A6104o6043L2060O7135k5119o9842J8676P2221j2108p2569O539P1669n47p2248
$$ plain form
220 -34072 -39557 32743 43819 -26944 -42759 24854 45543 -19770 -46638 16760 48196 -11230
232 -11230 -46723 7651 46856 -3716 -48661 -1694 46944 4638 -46453 -9306 44339 12387
244 12387 -44820 -17262 41784 18862 -40519 -23437 36467 24570 -36986 -30624 31765 30157
256 30157 -30504 -33523 26179 34829 -24680 -38705 20003 38203 -17527 -39717 12951 40038
268 40038 -10405 -42057 6373 41626 -2961 -40418 310 41156 3959 -40542 -7124 39498
280 39498 10515 -37283 -12172 37817 17597 -34502 -18566 34424 22793 -29885 -22800 29495
292 29495 27846 -25801 -28728 24064 30763 -20031 -30530 18859 34454 -13999 -33829 12292 35006
305 35006 -9236 -35121 5859 35739 -2999 -36308 -650 34956 2912 -34564 -6117 33904
$$ packed form
220c4072n485P2300J1076p0763j5815O7613K0689o5313k6868O3398L1436n9426
232a1230l5493N4374L9205n0572m4945M6967M8638m2306n1091L7147N3645l1952
244A2387n7207K7558N9046k2922n9381J7082N9904j1897o1556O362O2389j608
256C0157o0661l019N9702Q650n9509j4025N8708J8200n5730k2190N2668K7087
268D0038n0443l1652M8430L5253m4587l7457M0728M0846l7197m4501L3418M6622
280C9498k8983m7798K5111M9989k0220n2099J5936N2990j1631n2678P085N2295
292B9495j649n3647k927N2792O699n0794j0499M9389J5595m8453j9830M6121K2714
305C5006m4242k5885M0980K9880l8738l3309L5658L5606l2044l7476K8447M0021
$$ plain form
317 33904 9169 -33655 -12496 30803 12726 -31353 -17452 27722 18372 -27480 -21608 24309
329 24309 21779 -23321 -25303 19867 25918 -18964 -28518 14673 27060 -13968 -29864 9933 30400
342 30400 -7521 -30540 4999 30591 -2974 -30806 -363 30364 2814 -30025 -4857 29369
354 29369 7853 -27678 -9166 28261 13413 -25477 -13313 25452 16411 -22991 -17571 22088
366 22088 20419 -18885 -20192 18687 23082 -14678 -22996 13873 25552 -10656 -25051 9464 26134
379 26134 -6877 -26118 4554 27206 -1975 -26332 585 26451 2160 -26137 -4836 25257
391 25257 6024 -25229 -8512 23308 9754 -23082 -13028 21121 13601 -20774 -15825 17912
403 17912 16077 -17959 -19511 14530 18810 -14501 -21011 11486 20693 -10245 -22498 7370 22154
$$ packed form
317C3904k4735m2824K1159M3299j8077m4079J3901M5174r350m5852N872M5917
329B4309k530m5100j982M5170O051m4882r554M3191J2387m1028j5896L9797K0467
342C0400l7921k3019L5539K5592l3565k7832L0443L0727k7550l2839K5168L4226
354B9369k1516l5531J8512L7427j4848l8890J2164L8765r041l9402N420L9659
366B2088j669l9304j307L8879M395l7760q318L6869J1679l6208j4395L4515J6670
379B6134l3011j9241L0672K2652k9181k4357K6917K5866k4291k8297K1301L0093
391B5257j9233l1253J6717L1820j3554l2836J0054L4149p520l4375M949L3737
403A7912j835l4036j552L4041M280l3311o510L2497R207l0938j2253K9868J4784
$$ plain form
416 22154 -6377 -23169 3709 22828 -1972 -23543 -765 23073 2203 -22547 -3584 22280
428 22280 6180 -20996 -7795 20818 9613 -19635 -10468 19240 13156 -16858 -13430 17236 16051
441 16051 -14366 -15227 14233 17671 -10888 -17349 10364 18994 -7832 -18533 6812 20342 -3547
454 -3547 -19708 3006 20742 -998 -19671 -1085 20086 2708 -19195 -4979 18947 5725
466 5725 -19227 -6907 18046 8162 -16901 -9727 15686 10474 -15294 -12458 13009 13081 -12374 -15172
480 -15172 10693 14510 -10693 -16339 7449 15973 -6793 -17671 4614 17111 -4628 -18316 1910
493 1910 17663 -1042 -18066 -490 17349 1445 -17054 -3486 16394 5425 -15778 -6768
505 -6768 15954 8181 -14846 -8619 14665 10404 -12692 -10330 12664 12226 -10423 -12223 10115 14256
$$ packed form
416B2154k8531j6792K6878J9119k4800k1571K2778K3838k0870k4750J8963K5864
428B2280j6100k7176J3201K8613j1205k9248R167K9708o084l0014L428L0666j185
441A6051l0417q61K9460L438k8559o461K7713Q630k6826j0701K5345J3530k3889
454c547j6161K2714J7736k1740j8673J8586K1171j7378k1903J4216K3926j3222
466E725k4952J2320K4953r884k5063P174K5413n212k5768K836K5467P2k5455k798
480a5172K5865L817k5203n646K3788Q524k2766j0878K2285J2497k1739j3688K0226
493A910J5753j8705j7024J7576J7839j5904j8499J3568J9880j0969k1203R010
505f768K2722p773k3027O227K3284m261k3096K362K2994m38k2649j800K2338M141
$$ plain form
519 14256 -7647 -13842 8081 15120 -5505 -14336 5187 15556 -2739 -14865 2127 15568 0
532 0 -14885 -763 15517 2829 -14977 -3201 15140 4683 -14285 -5880 13582 6967 -13216
545 -13216 -7997 11951 8688 -11589 -10146 10002 10155 -9732 -11769 7779 11475 -7892 -12901 5605
559 5605 12228 -5236 -13377 3242 12767 -2857 -13699 739 13178 -319 -13992 -1396 13300
572 13300 1635 -13254 -3017 12680 4060 -12091 -5091 11745 6100 -10568 -7338 10465 8376
585 8376 -9705 -8399 9491 9800 -7473 -9467 7435 10712 -5932 -10588 5489 12031 -3740 -11237
599 -11237 3319 12304 -1606 -11409 1853 12160 419 -11245 -894 11869 2300 -11514 -3315
612 -3315 10714 4373 -10550 -5244 10164 5785 -9692 -6891 8881 6914 -8656 -8254 7377 8227
$$ packed form
519A4256k1903o195K1923P039k0625q831J9523J0369j8295j2126J6992J3441j5568
532@j4885J4122J6280j2688j7806J1776J8341j0457j8968Q405J9462o615k0183
545a3216N219J9948l263k0277J443K0148J53j9887k037J9548L696j9367n009J8506
559E605O623j7464q141J6619R525j5624j0842J4438J2439j3497j3673J2596J4696
572A3300j1665j4889J0237J5697q620j6151P000J6836n645j6668L230J7803k089
585H376j8081J306J7890L09j7273j994J6902L277j6644m656J6077O542j5771p497
599a1237J4556Q985j3910r803J3262J0307j1741j1664J0351J2763r569j3814Q199
612c315J4029o341j4923N306J5408m379j5477K801J5772j967j5570M02J5631Q50
$$ plain form
626 8227 -7415 -9353 5566 9014 -5411 -10167 4150 9792 -3681 -10535 1760 9775 -1926
639 -1926 -10920 169 10262 -105 -10701 -1155 9898 2015 -10051 -3073 9534 3609 -9358
652 -9358 -4556 8580 5295 -8154 -5729 8035 6615 -6928 -7030 6574 7811 -5452 -7863 5259
666 5259 8844 -4085 -8396 3566 9073 -2344 -8973 2487 9603 -755 -8920 808 9630 646
680 646 -8928 -941 9197 2310 -8449 -2471 8601 3593 -7854 -4046 7700 4793 -7248 -5540
694 -5540 6535 5601 -6197 -6478 5378 6574 -5188 -7352 4023 7211 -4050 -8170 2577 7691
708 7691 -2782 -8505 1400 7703 -1292 -8609 32 7896 74 -8189 -1360 7453 1639 -7893 -2609
723 -2609 7361 3142 -7097 -3778 6659 4350 -6051 -4696 5838 5122 -5399 -5224 4897 6189
$$ packed form
626H227j5642j938J4919L448j4425m756J4317N642j3473o854J2295Q015j1701
639a926q994J1089J0093j0367j0596R546J1053p883j2066O978J2607n925j2967
652i358M802J3136l285j3449K425J3764j420j3543j02J3604J237j3263k411J3122
666E259L585j2929m311J1962N507j1417o629J1460P116j0358q165R728Q822q984
680F46r574P987J0138o887j0759N978J1072n008j1447L808J1746k907j2041J708
694e540J2075r34j1798k81J1856J196j1762k164J1375L188j1261m120J0747N114
708G691j0473n723R905O303q995p317Q641P864p822q263O829Q813n814r532N284
723b609R970m219j0239L319J0437k309j0401J355J0534p16j0521J75J0121J292
$$ plain form
737 6189 -3951 -6354 4363 6942 -2693 -6338 3026 7413 -1558 -6872 1830 7354 -853 -6945 288
752 288 7207 777 -6848 -702 7377 1909 -6573 -1976 6733 2782 -6432 -3131 6301 3727 -5574
767 -5574 -4083 5256 4550 -4540 -5112 4292 5215 -3839 -5829 2973 5284 -2887 -6144 1562 6076 -2018
783 -2018 -6554 1057 6231 -488 -7290 -11 6195 247 -6555 -1561 5683 1121 -6076 -2182 5357
798 5357 2399 -5349 -2430 5435 3147 -4126 -3852 4715 3908 -3900 -4603 3397 3386 -3448 -4297 2875 6400
815 6400 -2136 -4519 1218 5266 -1858 -5355 727 5006 -459 -3962 6 5936 1694 -4673 -517
830 -517 6072 2056 -4959 -2138 5438 2101 -4498 -2455 4963 3781 -4203 -2697 3848 3589 -3803 -3711
846 -3711 3312 3843 -3094 -4260 2219 4169 -2454 -4489 1575 4467 -1700 -4828 934 4686 -828
$$ packed form
737F189j0140k403J0717K579r635l645R364M387q971n314Q702N524q207o092P233
752B88O919o430p625O146Q079n468q482M597Q709l951r214L301R432k574r301
767e574J491R339p06r090n72R404R23r054j990Q802K311q171l257P706M514q094
783b018m536P611N174o719o802P279O206n948o802M994P244m562p197L894P539
798E357k958p748K919P865k288p273K74Q567q07p808p03Q000j1o834q49P172L525
815F400q536k383N737M048p124l497O082M279n465l503L968N930m242o367M156
830e17O589m016p015K821P576l337o599K043P418j182p984J506O545k59p392R2
846c711P023N31o937j166O479J950o623k035O064K892o167l128N762L752n514
$$ plain form
861 -828 -5521 -484 4515 65 -4900 -1060 4570 906 -5071 -1939 4595 1744 -4496 -2559 3948
876 3948 2870 -4120 -3102 3707 3309 -3103 -3625 2791 3865 -2236 -3736 2401 4294 -1699 -3960 1451
892 1451 4854 -787 -4160 1028 4721 -344 -4056 -81 4749 823 -4011 -280 4568 1292 -4057
907 -4057 -1356 4394 2387 -3604 -1766 3814 2608 -3062 -2280 3146 2959 -3522 -2811 2430 3657 -1562
923 -1562 -2771 1351 3217 -1271 -3971 1381 3590 -1253 -4482 664 3407 170 -3661 -598 3450
938 3450 1100 -4040 -821 2828 341 -4101 -1650 2960 703 -3604 -2238 3146 2419 -2813 -2436 2614
954 2614 2561 -2465 -3047 2138 3190 -2259 -3337 1843 3527 -1206 -3336 1080 3447 -851 -3194 566
970 566 3583 -107 -3459 -35 3742 836 -3351 -498 3404 1528 -2952 -1492 3047 1878 -2642
$$ packed form
861h28m693N037M999m450m965L840N630l664n977L132O534k851o240J937O507
876C948j078o990J018O809l98o412n22O416J074o101j500O137J893n993k261N411
892A451L403n641l373N188L693n065l712L975M830l926m834L731M848l276n349
907d057K701N750k007n991J838N580j206n670P82N426j87o481P11N241J227n219
923a562j209M122J866m488k700N352K209m843l229N146K743l237l831L063M048
938C450k350n140L219L649k487m442K451M610k257m307J366N384p27n232L77N050
954B614n3n026n82N185J052n449j078N180J684m733k130M416K367m298k343L760
970E66L017l690l352L424L777k906m187K853L902j876m480J460M539j169m520
$$ plain form
985 -2642 -1650 2868 2250 -2311 -2213 2429 2778 -1898 -2922 1848 2857 -1801 -3095 1567 3018 -1141
1001 -1141 -3309 655 3188 -612 -3347 69 2847 -106 -3305 -540 3000 499 -3222 -1226 2588
1016 2588 792 -2997 -1552 2022 1360 -2727 -2226 2155 1827 -2362 -2522 1880 2393 -1855 -2467 1665
1032 1665 2628 -1416 -2428 1119 2715 -734 -2699 534 2853 -392 -2968 327 2937 342 -2688
1047 -2688 -39 3026 1137 -2578 -762 2698 1133 -2179 -1110 2659 1603 -1876 -1501 2082 1958
1062 1958 -1691 -1891 1842 2186 -1425 -2187 1318 2628 -1024 -2197 1024 2621 -631 -2607 505 2542
1078 2542 -379 -2784 -210 2377 -85 -2854 -481 2398 572 -2755 -994 2363 710 -2602 -1137
1093 -1137 2024 1133 -2338 -1708 1627 1643 -1710 -2136 1645 1950 -1423 -2020 1130 1908 -1147 -2089 631
$$ packed form
985b642R92M518o18m561R8M642L49m676j024M770J009m658j294M662J451m159
1001a141k168L964K533l800k735L416K778k953l199K765L540k501l721J996L814
1016B588j796l789J445L574o62m087N01M381l28m189j60M402N13m248o12M132
1032A665R63m044j012L547J596l449j965L233K319l245k576L295K610k595l030
1047b688K649L065j889l715J816L460j565l312J069L769j056l479L75L583j24
1062A958l649k00L733L44l611p62L505J310l652j173L221J597l252j976L112K037
1078B542k921k405K574K587k462k769K373K879j826l327J761L357j653l312J465
1093a137L161q91l471O30L335J6l353m26L781L05l373n97L150P78l055r42K720
$$ plain form
1110 631 2161 -575 -2337 526 2451 -295 -2214 47 2331 146 -2154 -99 2213 706 -2031
1125 -2031 -563 2312 984 -1780 -824 2084 1492 -1460 -1461 1950 1672 -1358 -1252 1431 1575 -1002 -1674
1142 -1674 1260 2007 -812 -1915 726 2079 -563 -1988 293 2119 -211 -2068 -64 1954 119
1157 119 -2130 -534 2054 299 -2072 -1011 1685 851 -2037 -1028 1375 1127 -1654 -1285 1099 1337
1173 1337 -1498 -1868 1013 1375 -1187 -1846 504 1672 -724 -2096 523 1877 -333 -2036 244 1769
1189 1769 -398 -2105 30 2017 299 -1713 -279 2180 385 -1607 -671 1737 1121 -1603 -805 1723
1205 1723 1177 -1202 -956 1424 1430 -1010 -1221 1261 1652 -982 -1458 732 1838 -542 -1408 460 1921
1222 1921 -364 -1737 164 1764 -280 -1887 -28 1534 61 -1828 -240 1553 306 -1691 -857
$$ packed form
1110F31J530k736j762K863J925k746j919K261K284k185k300K055K312j507k737
1125b031J468K875j328k764R56K908n92k952jL411k78l030J06K683J44k577o72
1142a674K934P47k819j103K641J353k642j425K281J826k330j857K004K018j835
1157A19k249J596K588j755k371J061K696q34k888J009K403k48k781L69K384K38
1173A337k835l70K881L62k562o59K350J168k396j372K619J354k210j703K280J525
1189A769k167j707K135J987j718k012J434K459j795j992R36K408o16k724P98K528
1205A723n46k379K46K380Ok440k11K482L91k634m76K190J106k380q66J868J461
1222A921k285j373J901J600k044j607J859J562j473j889J588J793j247j997Q34
$$ plain form
1237 -857 1384 672 -1666 -1157 1203 1024 -1345 -1228 986 1097 -1134 -1375 930 1264 -1042 -1574 573
1254 573 1448 -573 -1512 372 1615 -395 -1512 -41 1636 123 -1541 -16 1464 347 -1496 -214
1270 -214 1466 712 -1486 -452 1610 762 -1034 -942 1218 1045 -1061 -910 1342 971 -712 -991 950
1287 950 1557 -444 -1186 737 1371 -382 -1315 355 1387 -340 -1589 83 1304 51 -1357 -192
1303 -192 1316 330 -1367 -569 1213 258 -1328 -653 1115 306 -1181 -786 1073 542 -1079 -941 889
1320 889 857 -1028 -1164 564 1168 -739 -1213 564 944 -324 -1367 155 1022 -195 -1450 108 1030
1337 1030 -128 -1537 -310 1195 95 -937 -408 1086 538 -1354 -753 1152 808 -708 -712 1023 897
1354 897 -715 -765 776 799 -745 -771 724 1284 -397 -1083 489 1206 -283 -1045 397 1051 -134 -1094
$$ packed form
1237h57K241p12k338N09K360j79k369J17K214J11k231k41K305L34k306n32K147
1254E73Q75k021r39J884J243k010j117J471J677j513j664J525J480j117j843J282
1270b14J680p54k198J034K062q48j796R2K160j73k106J51K252l71j683k79J941
1287I50O07k001p42J923O34j753r33J670J032j727j249J672J221j253j408J165
1303a92J508r86j697P98J782r55j586O75J768q09j487L95J859n31j621J38J830
1320H89l2j885j36J728O04j907m74J777L80j268j043J522Q67j217j255J558R22
1337A030j158j409J227J505j100j032N29J494n48j892O01J905l44j516mJ735j26
1354H97j612n0J541K3j544k6J495N60j681o86J572P17j489p62J442O54j185r60
$$ plain form
1372 -1094 31 1138 330 -1102 121 1116 -79 -937 -355 858 350 -1120 -554 767 232 -858 -634
1389 -634 698 797 -822 -827 662 614 -687 -1021 391 791 -595 -980 289 1059 -101 -1209 248 1050
1407 1050 -138 -1229 -78 860 70 -997 -239 729 166 -990 -241 1071 314 -848 -353 945 472
1424 472 -740 -726 634 770 -610 -654 991 857 -387 -565 745 1067 -310 -645 480 1070 -99 -796
1442 -796 218 747 -83 -727 -132 1028 -26 -817 -234 852 290 -935 -291 825 620 -800 -579 608
1460 608 395 -696 -684 598 488 -496 -819 444 448 -638 -925 305 623 -654 -779 173 942 -231 -1012
1479 -1012 195 935 76 -836 -213 787 51 -970 -46 606 80 -709 -457 710 593 -601 -64 673
1497 673 296 -686 -703 812 568 -224 -365 492 587 -260 -579 263 636 -242 -684 497 697 -73 -785 -15
$$ packed form
1372a094J125J107q08j432J223R95j195q58N82J213n08j470N66J321n35j090K24
1389f34J332R9j619nJ489m8j301l34J412M00j386l85J269P70j160j108J457Q02
1407A050j188j091J151R38p90j067P58R68n63j156P49J312p57j162M95J298m73
1424D72j212J4J360J36j380m4J645j34j244j78J310L22j377l35J125N90j169o97
1442g96J014N29q30o44N95J160j054p91N83J086n62j225O44J116k05j420K21J187
1460F08k13j091J2J282j10r84l23J263Mj086k87J230L18j277j25R52P69j173p81
1479a012J207P40q59r12O23J000p36j021R24O52n26p89K52J167j17j194N37P37
1497F73l77r82j7J515k44p92j41Q57R5q47l19Q42L73q78m42J181K00p70p12P70
$$ plain form
1517 -15 551 90 -730 12 840 372 -713 -152 917 29 -798 -113 681 443 -642 -378 333 235 -532 -510
1537 -510 393 393 -668 -485 165 685 -296 -755 264 697 -445 -954 87 604 -118 -897 -30 632 -63
1556 -63 -642 -222 408 76 -545 187 501 -88 -538 -451 846 450 -504 -384 222 581 -549 -362 494 644
1576 644 -262 -341 401 423 -374 -588 241 1063 27 -415 214 789 25 -588 205 777 101 -628 -12 614
1596 614 -16 -623 -142 587 159 -531 -323 230 292 -400 -511 446 257 -400 -497 283 262 -557 -498 310 574
1617 574 -510 -582 -6 604 -313 -538 67 263 -373 -521 -73 432 37 -467 -229 546 82 -734 -143 699
1637 699 340 -388 -30 717 202 -292 -178 413 362 -385 -372 316 426 -167 -339 301 453 -112 -602 104 409
1658 409 -17 -485 279 543 -97 -431 -84 691 257 -288 -59 585 11 -401 -272 434 300 -425 -217 499
$$ packed form
1517a5N66m61q20P42Q28m68j085N61J069q88q27O85P94k38j085K64P11r8p67K2
1537e10R03%j061J83O50N20r81m59J019M33j142n09J041N17p22p79Q67O62o95
1556f3n79M20O30l32o21P32L14n89m50Q7J297l96r54J20O06L59j130J87Q56J50
1576F44r06p9P42K2p97k14Q29Q22j036m42O29N75p64o13P93N72o76p29O16O26
1596F14o30o07M81P29m28o90K08N53O2o92j11R57j89o57r7P80k1q19N9Q08K64
1617E74j084p2N76O10r17k25O05J96o36j48M48N05l95n04K38P75m64q16N91Q42
1637F99l59p28L58P47n15m94J14N91n1p47J3O88J10n93j72O40J52n65m90P06L05
1658D09m26m68P64K64o40l34L47P75m34n45K29O44n74m12J29P06j34p25K08P16
$$ plain form
1678 499 355 -305 -381 530 411 -391 -252 447 224 -246 -454 67 347 -508 -724 44 264 -174 -388 306
1698 306 398 -47 -466 -66 471 20 -448 -325 358 -2 -428 -265 359 27 -710 -264 428 11 -429 -147
1718 -147 199 259 -174 -337 275 526 -146 -25 306 313 -206 -409 349 518 -120 -269 -74 384 58 -109 162
1739 162 694 -68 -175 -6 786 379 -191 -89 608 362 -756 91 142 312 -501 -124 376 218 -162 -289
1759 -289 99 370 -165 -358 230 211 -167 -429 -56 214 -96 -215 56 409 124 -315 -59 279 -205 -395
1779 -395 -80 285 250 -459 -214 207 -2 -229 -209 81 192 -315 -351 212 250 -655 -330 277 105 -211 -53
1800 -53 361 322 -42 -373 8 279 -16 -88 104 531 27 -532 28 306 162 -224 -23 234 174 -334 54
1821 54 221 256 -280 85 80 -191 -186 -32 222 109 -189 -239 232 98 -145 -245 133 -40 -244 -278 279 253 -192
$$ packed form
1678D99j44o60p6R11j19q02J39O99k23m70k08N21K80q55k16P68K20m38k14O94
1698C06R2m45m19M00N37m51m68J23O83l60m26J63O24l32p37M46O92m17m40K82
1718a47L46O0m33j63O12K51o72J21L31Pn19k03P58J69o38j49J95M58l26j67K71
1739A62N32p62j07J69P92m07n70J02O97k46j118Q47N1J70q13L77N00j58l80j27
1759b89L88K71n35j93N88j9l78k62L73K70l10j19K71L53k85m39K56L38m84j90
1779c95L15L65l5p09K45M21k09k27K0K90J11n07l6N63L8r05L25O07j72l16J58
1800e3M14l9l64l31L81K71k95p2J92M27n04n59N60K78j44l86K01K57o0n08L88
1821E4J67L5n36L65nk71NJ54K54j13k98n0M71j34k43j00L78j73k04l4N57k6m45
$$ plain form
1844 -192 -385 -69 272 5 -557 -20 204 221 -346 -40 362 284 -340 -306 180 -62 -270 -230 298 184 -27
1865 -27 8 256 71 196 -336 101 447 -17 -167 36 238 -262 -228 -65 377 244 -403 -24 205 71 -89
1886 -89 -71 115 235 -192 -11 193 454 80 -35 289 32 -32 -55 28 250 258 -138 83 328 -63 -486 65
1908 65 179 47 -265 -12 248 86 -193 41 131 -260 -499 -150 11 -131 -340 -59 239 -69 -354 -191 323
1929 323 3 -97 -225 -101 -18 -99 -215 151 207 -141 -196 255 224 -255 -285 281 256 -255 -436 83 214 29
1951 29 72 179 231 -119 -248 -111 -45 21 34 -26 372 159 -76 174 250 -61 -24 61 20 235 -212 -5 188 215
1975 215 117 41 244 438 52 -46 187 331 -1 34 -62 125 -104 -249 -101 60 -120 -295 -86 193 -7 -266
1997 -266 -156 -49 -125 -491 -269 213 -89 -193 -80 128 267 -481 -70 236 217 -222 -320 -58 230 -161 -70
$$ packed form
1844a92j93L16L41k67n62N37K24J7n67L06M02p8o24L4M86k42k08M0N28j14k11
1865b7L5K48j85J25n32M37L46m64j50K03K02n00L4J63M42j33o47L79K29j34j60
1886h9J8J86J20m27J81K04K61l74j15L24k57o4k3Q3K22Ql96K21K45l91m23N51
1908F5J14j32l12K53K60j62k79K34R0l91k39L49J61j42k09K81K98l08k85J63N14
1929C23l20j00j28J24Q3q1j16L66N6l48n5M51l1m79l0N66k5n11j81N19J31j85
1951B9M3J07N2l50j29J37O6O6J3o0L98k13k35K50P6l11L7Q5m1K15m47K07J93K7
1975B15r8p6K03J94l86r8K33J44l32L5r6J87k29j45J48J61j80j75K09K79k00k59
1997b66J10J07p6l66K22M82l02j04J13K08J39p48M11L06j9m39r8K62K88l91R1
$$ plain form
2018 -70 -10 -3 -138 -161 46 44 75 9 -45 302 29 -232 84 233 64 -196 -10 365 -103 113 -23 150 224 -98
2042 -98 -213 26 148 105 -231 159 242 214 -45 95 26 134 -225 19 126 -24 -288 -11 125 -103 -32 208
2064 208 62 -49 -303 112 143 62 -26 102 158 69 -167 -186 191 46 -137 -281 154 190 -124 -201 -165 -172 -81 -48
2088 -48 43 -24 108 -198 34 -60 -77 -127 11 -101 -158 -69 116 -10 -42 -102 -126 351 142 -141 40 -57 157 54
2112 54 -121 182 28 -128 151 47 286 15 -11 258 197 -204 -112 256 206 -48 51 38 152 -71 -137 -133 93
2135 93 21 -137 70 238 -106 -155 120 95 -161 -273 -69 298 -73 36 -212 -27 31 -106 -159 -127 167 -9
2157 -9 -70 -185 87 -106 192 8 -37 13 81 -64 8 -139 -357 -58 -115 -197 -162 94 344 12 -320 53 262
2180 262 63 -142 61 -57 -65 -56 109 183 236 60 -131 211 78 45 -117 105 242 25 -10 41 234 -109 55
$$ packed form
2018g0O0Pj35k3K07kL1o6n4L47k73k61L16J49j69k60J86L75m68K16j36J73P4l22
2042i8j15K39J22m3l36L90Q3k8k59J40o9J08l59K44J07j50k64K77J36k28P1K40
2064B08j46j11k54M15L1q1q8J28N6q9k36j9L77j45j83j44M35L6l14p7L6pR1L3
2088d8R1o7J32l06K32r4j7n0J38j12n7Q9J85j26l2o0k4M77k09k83J81r7K14j03
2112E4j75L03j54j56K79j04K39k71k6K69o1m01R2L68n0k54R9j3J14k23o6MK26
2135I3p2j58K07J68l44m9K75k5k56j12K04L67l71J09k48J85N8j37n3L2K94j76
2157io1j15K72j93K98j84m5N0O8j45P2j47k18K99n7q2L5K56K50l32l32L73K09
2180B62j99k05K03j18qRJ65P4N3j76j91L42j33l3j62K22J37k17l5N1J93l43J64
$$ plain form
2203 55 64 112 -90 -146 193 321 -133 -180 -124 179 -69 -59 -181 -80 161 -191 -180 -143 -58 -150 51 12 -199 -198 -144
2228 -144 -4 -14 -367 -4 249 4 -147 -304 60 41 42 -226 162 258 -47 64 46 161 -222 -7 -25 281
2250 281 125 -74 -143 161 -51 -179 -112 125 -10 -219 64 110 97 177 115 141 90 -109 66 38 8 50 15 34
2274 34 158 59 -12 15 91 -334 15 164 186 -100 -142 162 67 90 -23 28 250 132 15 -53 -39 149 -347 -33
2298 -33 -20 141 -208 -111 -27 -53 -11 -140 58 -80 -32 -185 157 -190 6 51 145 129 111 88 51 -68 -126 111 214
2323 214 -29 124 15 -22 -3 -16 -121 -38 232 -51 18 59 141 131 -14 103 -179 260 -184 77 288 238 176
2346 176 -93 -55 -169 -111 36 -38 -27 -24 -64 42 -5 175 -179 58 10 -49 -3 -88 -74 174 -418 -150 76 54 -6
2371 -6 -10 121 175 39 -55 107 -16 -22 -136 25 250 -60 8 -211 40 -97 -190 -165 2 -47 -65 48 52 4 -268
$$ packed form
2203E5RM8k02n6L39J28m54m7N6L03k48J0j22J01K41l52J1L7Q5r2K01l9k11JN4
2228a44J40j0l53L63K53k45j51j57L64j9Jk68L88R6l05J11j8J15l83K15j8L06
2250B81j56j99o9L04k12j28O7K37j35k09K83M6j3Q0o2K6n1j99J75k8l0M2l5J9
2274C4J24r9p1K7P6m25L49J49K2k86m2L04r5K3j13N1K22j18j17o8J4J88m96L14
2298c3J3J61l49R7Q4k6M2j29J98j38M8j53L42l47J96M5R4j6j8k3l7j19n8K37J03
2323B14k43J53j09l7J9j3j05Q3K70k83O9M1Q2j0j45J17k82M39m44K61K11n0o2
2346A76k69L8j14N8J47p4J1Lm0J06m7J80l54K37m8n9M6q5J4K48n92K68K26k2o0
2371fmJ31N4j36r4J62j23oj14J61K25l10O8k19K51j37r3K5J67m9j8J13Mm8k72
$$ plain form
2396 -268 -55 -25 -214 -121 -202 55 -29 -147 -145 -73 -194 -370 -135 214 -174 -97 54 129 109 165 61 228 -120 114
2420 114 -56 -151 -48 -67 -19 194 111 -51 -53 -47 109 147 -184 -11 25 -86 24 45 242 38 93 1 1 -54 -169
2445 -169 -36 141 57 -27 100 59 67 -319 -108 290 27 -69 86 61 161 -27 56 44 -288 -163 -71 -16 -100 -60
2469 -60 -61 85 42 -187 -138 -263 -421 95 305 -495 -152 -9 -218 114 -198 -69 -33 -22 -67 -6 -93 80 -238
2492 -238 -21 -21 47 272 -80 -416 26 89 280 -144 -166 45 104 134 -252 -69 -162 108 79 131 39 85 74 -138
2516 -138 94 308 195 181 60 252 -301 22 89 -136 139 -161 9 185 -224 -119 -122 158 -11 -41 17 106
2538 106 -38 84 245 -66 106 -172 -42 2 13 -384 -200 -20 49 -20 39 291 194 -270 -41 44 51 -112 -72
2561 -72 -204 74 -233 28 33 -26 -312 147 -163 -155 -104 24 125 68 64 157 98 341 172 170 167 86 8 80 111 -124 284
$$ packed form
2396b68K13L0j89R3q1K57q4j18KP2j21j76K35L49l88P7J51P5k0N6j04J67l48K34
2420A14j70r5J03j9M8K13q3j62kOJ56L8l31J73L6j11J10K1J97k04N5r2%n5j15
2445a69J33J77q4q4J27m1Ql86K11L98k63r6J55k5J00j88Q3j2l32J25R2N5q4M0
2469f0jJ46m3k29M9j25j58N16K10q00L43J43k09L32l12J29L6J1m5O1q7J73l18
2492b38K17%O8K25l52l36M42O3J91m24k2K11N9L0l86J83r3K70k9N2r2M6j1k12
2516a38K32K14j13j4j21J92n53L23O7k25K75l00J70J76m09J05lK80j69l0N8Q9
2538A06j44J22J61l11J72k78J30M4J1l97J84J80O9o9N9K52r7m64K29Q5Pj63M0
2561g2j32K78l07K61Nn9k86M59l10QN1J28J01n7mR3n9K43j69klq1p8P2L1k35M08
$$ plain form
2588 284 -85 18 -47 -331 -207 -4 257 -46 -232 -3 -90 209 150 -123 19 18 81 -113 -14 -299 -96 -27 -89
2611 -89 30 531 -191 232 127 -511 318 30 343 148 28 -26 -91 -58 -83 704 -359 -148 -300 -290 -14 -2
2633 -2 302 -272 -129 -544 624 157 -532 387 -128 -377 -306 77 -3 -87 43 57 -7 -484 219 140 31 -103
2655 -103 74 280 51 193 163 -79 -37 160 -112 166 263 -232 -313 193 30 -158 -188 8 16 -336 -140 -75 -193
2678 -193 97 -286 153 -100 -261 244 -48 -81 38 -3 39 158 8 -108 116 11 -73 66 -91 -40 -241 -200
2700 -200 -119 183 -270 209 -365 55 141 -89 112 44 151 -21 76 183 -133 102 -6 149 27 -43 -144 -11
2722 -11 287 -107 20 -146 9 -49 89 47 395 212 40 339 -108 76 -115 -128 -74 -90 -108 -142 91 -43 -197
2745 -197 -19 256 322 -175 28 314 -176 -81 -61 125 7 -411 2 63 -33 -22 -107 -7 -30 -43 -29 -109 -135 -236
$$ packed form
2588B84l69J03o5k84J24K03K61l03j86K29q7K99n9k73J42jO3j94R9k85K03O9o2
2611h9J19N01p22M23j05o38Q29k88L13j95j20n4o5L3k5P87j063K11j52J0K76J2
2633bL04n74J43m15J168m67o89R19n15k49P1L83q0q4J30J4o4m77P03p9j09j34
2655a03J77K06k29J42l0k42M2J97k72K78R7m95q1N06j63j88l0J96Ql52J96O5j18
2678a93K90l83M39k53j61N05k92l3J19m1M2J19j50j16K24j05q4J39j57N1k01M1
2700b00Q1L02m53M79n74M20Q6k30K01o8J07j72R7J07l16K35j08J55j22p0j01J33
2722a1K98l94J27j66J55n8J38m2L48j83j72K99m47J84j91j3N4j6j8l4K33j34j54
2745a97J78K75O6m97K03K86m90R5K0J86j18m18M13O1r6J1q5J00k3j3J4q0k6j01
$$ plain form
2769 -236 -254 -11 -299 -40 277 81 57 -118 -209 -2 300 -90 -109 108 7 -65 3 -201 97 169 -128 270
2791 270 186 80 116 -92 49 -134 -5 -53 -111 -52 -104 29 62 29 -126 -15 -87 -96 190 168 -139 -187 13 74 174
2816 174 224 -28 -93 -77 -25 139 71 -30 -145 67 34 -28 -118 -276 5 79 -279 43 -97 -55 211 334 -85
2839 -85 -59 -161 -190 -45 -90 -22 210 117 -296 -84 -164 -83 -37 -62 -284 132 -238 -10 -8 109 154 239 -50 -224 -176
2864 -176 -193 -89 359 18 -13 2 3 -21 267 193 36 58 11 91 -495 146 -105 125 -35 341 -45 214 193 218
2888 218 -778 29 26 -314 -316 -427 462 368 -419 -635 82 234 378 -192 -32 412 -200 -91 -147 -186 -344 231
2910 231 -361 770 -407 361 113 171 -597 -142 15 -601 -19 131 -317 -416 186 -286 429 217 -54 236
2930 236 288 -328 384 -662 -23 -854 313 564 36 161 301 -114 -536 496 256 -146 147 -440 -825
$$ packed form
2769b36j8K43k88K59L17j96k4j75r1K07L02l90j9K17j01p2O8k04K98P2k97L98
2791B70q4j06L6k08J41j83J29m8n8N9n2J33L3l3j55J11p2rK86k2l07m8K00O1J00
2816A74N0k52o5J6N2J64o8j01j15K12l3o2r0j58K81P4l58L22j40M2K66J23m19
2839h5K6j02k9J45m5O8K32r3m13K12q0Q1M6k5k22M16l70K28KJ17M5Q5k89j74M8
2864a76j7J04M48l41l1J5Jk4K88p4j57K2m7Q0n86O41k51K30j60L76l86K59k1K5
2888B18r96Q07ll40kj11Q89r4p87k16P17J52J44n70J60M44o12J09n6l9j58N75
2910B31n92J131j177P68k48N8p68M55J57o16N82J50m48r9O02m72P15k12k71K90
2930B36N2o16P12j046O39q31J167K51n28J25J40m15m22J032k40m02K93n87l85
$$ plain form
2949 -825 466 -532 -355 117 -60 511 -125 -16 189 -642 -76 60 154 17 125 28 -176 -287 49 -101
2969 -101 -14 -140 116 -33 -18 6 -197 -67 69 -316 151 193 106 -123 35 261 -184 -26 62 82 -125 65
2991 65 280 97 20 -98 -111 49 -222 -183 158 -31 106 -20 330 16 98 217 -245 -339 23 118 -510 71
3013 71 -257 169 34 -17 -167 -348 232 -100 -165 -179 214 173 294 44 -334 139 505 -359 -100 -218 -82 -107
3035 -107 137 397 101 73 319 42 361 129 741 230 -643 43 58 -87 -177 31 -160 314 -230 -6 -174
3056 -174 -491 -57 -292 668 124 173 -125 173 476 442 -585 488 -252 738 -398 97 -526 -237 339 -278
3076 -278 123 34 40 2 -384 262 -242 -388 -107 -174 -34 -255 47 -233 -306 364 -572 52 137 -165 152 -56
$$ packed form
2949h25J291r98J77M72j77N71o36J09K05q31N66J36R4j37J08r7k04j11L36j50
2969a01Q7j26K56j49J5K4k03J30J36l85M67M2q7k29J58K26m45J58Q8K0k07J90
2991F5K15j83p7j18j3J60k71L9L41j89J37j26L50l14Q2J19m62r4L62R5o28N81
3013G1l28M26j35n1j50j81N80l32o5j4L93m1J21k50l78M73L66q64K59j18J36k5
3035a07K44K60k96k8K46k77L19k32O12n11q73O86J5j45r0K08j91M74n44K24j68
3056a74l17M34k35R60n44M9k98K98L03l4j027J073p40R90j136M95o23K89N76o17
3076b78M01q9Ol8l86O46n04j46K81o7J40k21L02k80p3O70r36O24Q5l02L17k08
$$ [...]
8191B3
##END NTUPLES=NMR FID
##END=
