##TITLE=1H_SR52+5xTFAA'
 CDCl3, 8 sc, 
 31.05.2021
##JCAMPDX= 6.0         $$ Bruker NMR JCAMP-DX V2.0
##DATA TYPE= NMR FID
##DATA CLASS= NTUPLES
##ORIGIN= UXNMR, Bruker Analytische Messtechnik GmbH
##OWNER= root
$$ XWIN-NMR		Version 3.5
$$ Mon May 31 12:44:13 2021 Russian Standard Time (UT+4h)  she@DPX200
##.OBSERVE FREQUENCY= 200.131506
##.OBSERVE NUCLEUS= ^1H
##.DELAY= (6, 6)
##.ACQUISITION MODE= SIMULTANEOUS
##.ACQUISITION SCHEME= undefined
##.AVERAGES= 8
##.DIGITISER RES= 18
##SPECTROMETER/DATA SYSTEM= spect
##.PULSE SEQUENCE= zg30
##.SOLVENT NAME= CDCl3
##.SHIFT REFERENCE= (INTERNAL, CDCl3, 0, 15.7039)
##AUDIT TRAIL= $$ (NUMBER, WHEN, WHO, WHERE, WHAT)
$$ ##TITLE= Audit trail, XWIN-NMR		Version 3.5
$$ ##JCAMPDX= 5.01
$$ ##ORIGIN= Bruker BioSpin GmbH
$$ ##OWNER= she
$$ F:/spectra/data/she/nmr/H-F/1/audita.txt
$$ ##AUDIT TRAIL=  $$ (NUMBER, WHEN, WHO, WHERE, WHAT)
(   1,<2021-05-31 12:42:32.92 +0400>,<she>,<DPX200>,
      <created by zg, POWCHK disabled, PULCHK disabled
       configuration hash MD5:
       00 E9 B6 7A A2 85 ED C7 34 08 36 98 17 FE 4E 26
       data hash MD5: 16K
       6C 0E 80 EC 35 A3 04 EC 21 94 1D 7D 11 AB 91 0B>)
$$ ##END=
$$ 
$$ hash MD5
$$ 8A 87 F8 78 A8 23 E8 D1 91 B4 C5 AE 46 BE 1E 47
##$RELAX= 
##$RELAX= 
##$RELAX= 
##$RELAX= 
##$RELAX= 
##$RELAX= 
$$ Bruker specific parameters
$$ --------------------------
##$DU= <F:/spectra>
##$EXPNO= 1
##$NAME= <H-F>
##$PROCNO= 1
##$TYPE= <nmr>
##$USER= <she>
##$AMP= (0..31)
100 100 100 100 100 100 100 100 100 100 100 100 100 100 100 100 100 100 
100 100 100 100 100 100 100 100 100 100 100 100 100 100 
##$AQSEQ= 0
##$AQ_mod= 1
##$AUNM= <au_zg>
##$AUTOPOS= <>
##$BF1= 200.13
##$BF2= 200.13
##$BF3= 200.13
##$BF4= 200.13
##$BF5= 200.13
##$BF6= 200.13
##$BF7= 200.13
##$BF8= 200.13
##$BYTORDA= 1
##$CFDGTYP= 0
##$CFRGTYP= 5
##$CHEMSTR= <none>
##$CNST= (0..31)
1 1 145 1 1 1 1 1 1 1 1 1 1 1 1 1 1 1 1 1 1 1 1 1 1 1 1 1 1 1 1 1 
##$CPDPRG= <>
##$CPDPRG1= <>
##$CPDPRG2= <>
##$CPDPRG3= <>
##$CPDPRG4= <mlev>
##$CPDPRG5= <mlev>
##$CPDPRG6= <mlev>
##$CPDPRG7= <mlev>
##$CPDPRG8= <mlev>
##$CPDPRGB= <>
##$CPDPRGT= <>
##$D= (0..31)
0 1.2 0 0 0 0 0 0 0 0.06 0 0.03 0 0 0 0 0.0002 0 0 0 0 0 0 0 0 0 0 0 0 
0 0 0 
##$DATE= 1622450552
##$DBL= (0..7)
120 120 120 120 120 120 120 120 
##$DBP= (0..7)
150 150 150 150 150 150 150 150 
##$DBP07= 0
##$DBPNAM0= <>
##$DBPNAM1= <>
##$DBPNAM2= <>
##$DBPNAM3= <>
##$DBPNAM4= <>
##$DBPNAM5= <>
##$DBPNAM6= <>
##$DBPNAM7= <>
##$DBPOAL= (0..7)
0.5 0.5 0.5 0.5 0.5 0.5 0.5 0.5 
##$DBPOFFS= (0..7)
0 0 0 0 0 0 0 0 
##$DE= 6
##$DECBNUC= <off>
##$DECIM= 32
##$DECNUC= <off>
##$DECSTAT= 4
##$DIGMOD= 1
##$DIGTYP= 9
##$DL= (0..7)
0 120 120 120 120 120 120 120 
##$DP= (0..7)
150 150 150 150 150 150 150 150 
##$DP07= 0
##$DPNAME0= <>
##$DPNAME1= <>
##$DPNAME2= <>
##$DPNAME3= <>
##$DPNAME4= <>
##$DPNAME5= <>
##$DPNAME6= <>
##$DPNAME7= <>
##$DPOAL= (0..7)
0.5 0.5 0.5 0.5 0.5 0.5 0.5 0.5 
##$DPOFFS= (0..7)
0 0 0 0 0 0 0 0 
##$DQDMODE= 0
##$DR= 18
##$DS= 0
##$DSLIST= <SSSSSSSSSSSSSSS>
$$ [...]
##$SUBNAM2= <"">
##$SUBNAM3= <"">
##$SUBNAM4= <"">
##$SUBNAM5= <"">
##$SUBNAM6= <"">
##$SUBNAM7= <"">
##$SUBNAM8= <"">
##$SUBNAM9= <"">
##$SW= 16.9725357007746
##$SWIBOX= (0..15)
0 0 2 0 0 0 0 0 0 0 0 0 0 0 0 0 
##$SW_h= 3396.73913043478
##$TD= 16384
##$TD0= 1
##$TE= 0
##$TE2= 300
##$TE3= 300
##$TEG= 300
##$TL= (0..7)
0 120 120 120 120 120 120 120 
##$TP= (0..7)
150 150 150 150 150 150 150 150 
##$TP07= 0
##$TPNAME0= <>
##$TPNAME1= <>
##$TPNAME2= <>
##$TPNAME3= <>
##$TPNAME4= <>
##$TPNAME5= <>
##$TPNAME6= <>
##$TPNAME7= <>
##$TPOAL= (0..7)
0.5 0.5 0.5 0.5 0.5 0.5 0.5 0.5 
##$TPOFFS= (0..7)
0 0 0 0 0 0 0 0 
##$TUNHIN= 0
##$TUNHOUT= 0
##$TUNXOUT= 0
##$USERA1= <user>
##$USERA2= <user>
##$USERA3= <user>
##$USERA4= <user>
##$USERA5= <user>
##$V9= 5
##$VALIST= <valist>
##$VCLIST= <CCCCCCCCCCCCCCC>
##$VD= 0
##$VDLIST= <DDDDDDDDDDDDDDD>
##$VPLIST= <PPPPPPPPPPPPPPP>
##$VTLIST= <TTTTTTTTTTTTTTT>
##$WBST= 1024
##$WBSW= 4
##$XGAIN= (0..3)
0 0 0 0 
##$XL= 0
##$YL= 0
##$YMAX_a= 145946
##$YMIN_a= -168535
##$ZGOPTNS= <>
##$ZL1= 120
##$ZL2= 120
##$ZL3= 120
##$ZL4= 120
##$ABSF1= 10
##$ABSF2= 0
##$ABSG= 5
##$ABSL= 3
##$ALPHA= 0
##$AQORDER= 0
##$ASSFAC= 0
##$ASSFACI= 0
##$ASSFACX= 0
##$ASSWID= 0
##$AUNMP= <proc_1d>
##$AZFE= 0.1
##$AZFW= 0.1
##$BCFW= 1
##$BC_mod= 2
##$BYTORDP= 1
##$COROFFS= 0
##$CY= 11.3945322036743
##$DATMOD= 1
##$DC= 2
##$DFILT= <>
##$DTYPP= 0
##$F1P= 15.9154993809931
##$F2P= -4.1035820241983
##$FCOR= 0.5
##$FTSIZE= 0
##$FT_mod= 4
##$GAMMA= 1
##$GB= 0.15
##$INTBC= 1
##$INTSCL= 1
##$ISEN= 128
##$LB= 0.24
##$LEV0= 0
##$LPBIN= 0
##$MAXI= 10000
##$MC2= 0
##$MEAN= 0
##$ME_mod= 0
##$MI= 1.114404
##$NCOEF= 0
##$NC_proc= 0
##$NLEV= 6
##$NOISF1= 3.799351
##$NOISF2= 2.8
##$NSP= 1
##$NTH_PI= 0
##$NZP= 0
##$OFFSET= 15.70392
##$PC= 1
##$PHC0= -11117.47
##$PHC1= 5.800989
##$PH_mod= 1
##$PKNL= yes
##$PPARMOD= 0
##$PSCAL= 0
##$PSIGN= 0
##$REVERSE= no
##$SF= 200.130013532006
##$SI= 16384
##$SIGF1= 3
##$SIGF2= 2
##$SINO= 400
##$SIOLD= 16384
##$SREGLST= <1H.CDCl3>
##$SSB= 0
##$STSI= 0
##$STSR= 0
##$SW_p= 3612.71676300578
##$SYMM= 0
##$S_DEV= 0
##$TDeff= 0
##$TDoff= 0
##$TI= <>
##$TILT= no
##$TM1= 0
##$TM2= 0
##$TOPLEV= 0
##$USERP1= <user>
##$USERP2= <user>
##$USERP3= <user>
##$USERP4= <user>
##$USERP5= <user>
##$WDW= 1
##$XDIM= 8192
##$YMAX_p= 0
##$YMIN_p= 0
$$ End of Bruker specific parameters
$$ ---------------------------------
##NTUPLES= NMR FID
##VAR_NAME=  TIME,          FID/REAL,        FID/IMAG
##SYMBOL=    X,             R,               I
##VAR_TYPE=  INDEPENDENT,   DEPENDENT,       DEPENDENT
##VAR_FORM=  AFFN,          ASDF,            ASDF
##VAR_DIM=   8192,          8192,            8192
##UNITS=     SECONDS,       ARBITRARY UNITS, ARBITRARY UNITS
##FACTOR=    0.0002944,     1,               1
##FIRST=     0,             0,               0
##LAST=      2.4114304,     0,               0
##MIN=       0,             -168535,         0
##MAX=       2.4114304,     145946,          0
$$ Real data points
##PAGE= N=1
##DATA TABLE= (X++(R..R)), XYDATA
$$ plain form
0 0 0 0 0 0 0 0 0 0 0 0 0 0 0 4 -8 8 -8 8 -16 16 -16 24 -24 32 -39 42 -48 58 -66 77 -88 100 -114 130 -146
35 -146 164 -184 206 -231 257 -286 318 -352 389 -432 476 -527 581 -639 706 -777 855 -941
53 -941 1040 -1150 1274 -1413 1574 -1761 1982 -2245 2570 -2980 3514 -4238 5290 -6953 9976
68 9976 -17199 70258 -11293 -168535 76859 145946 -73915 -129043 81465 117119 -62557
79 -62557 -114032 54660 106340 -34522 -107447 30225 119592 -16422 -117661 23084 113162
90 113162 -13887 -102736 6325 98375 8829 -99166 -16509 98685 22205 -93865 -27378
101 -27378 89599 38385 -88196 -44749 83461 43504 -79190 -51679 67525 58485 -67397
112 -67397 -66907 62971 64723 -58843 -69872 47201 74324 -45859 -82956 39411 77644 -37809
$$ packed form
0@%%%%%%%%%%%%%Mj2J6j6J6k4L2l2M0m8N6p1Q1r0J06j24J43j65J88k14K44k76
35a46L10l48L90m37M88n43O04o70P41q21R08j003J108j220J345j483J632j796
53i41J981k190K424k687K987l335L743m227M815n550O494p752R528j2243J6929
68I976k7175Q7457q1551j57242K45394O9087k19861n5128K10508L5654j79676
79f2557n1475J68692N1680j40862p2925J37672Q9367j36014j01239J40745R0078
90A13162j27049q8849J09061R2050q9546j07995Q2657J15194p6480j16070O6487
101b7378J16977n1214j26581M3447J28210l9957j22694K7511J19204r040j25882
112f7397M90J29878J752j23566j1029J17073K7123j20183l7097J22367L8233j15453
$$ plain form
124 -37809 -81040 25851 80149 -21589 -84049 15822 82852 -11511 -82837 3605 81875 1732
136 1732 -83281 -6350 81659 10370 -77181 -16782 73926 26101 -70627 -29178 72121 34272
148 34272 -66395 -36754 63522 45454 -58759 -46117 59670 50145 -52056 -50955 48100
159 48100 58421 -41730 -58849 41109 61638 -34138 -60780 29176 64601 -22369 -64461 20197
171 20197 65952 -13775 -64672 7221 65714 -2419 -66895 -1944 65780 4700 -65278 -11834
183 -11834 61331 15453 -62846 -20575 59711 22212 -58650 -29271 52878 31757 -53909 -37359
195 -37359 49255 36566 -47560 -42635 40622 43953 -40056 -48897 35183 48146 -32521 -51481 26333
208 26333 53349 -23796 -55594 20512 55484 -15981 -55590 11365 56594 -6566 -57073 3986
$$ packed form
124c7809m3231J06891N4298j01738o2460R9871O7030r4363p1326Q6442P8270q0143
136A732q5013P6931Q8009p1289q7551O0399R0708m7825r6728M1449J01299l7849
148C4272j00667K9641J00276j8068j04213J2642J05787r525j02201J101R9055
159D8100J0321j00151j7119R9958K0529r5776k6642Q9956L5425q6970m2092Q4658
171B0197M5755p9727n0897P1893N8493o8133o4476O4951O7724o1080o9978N3444
183a1834P3165m5878p8299M2271Q0286l7499q0862K9379Q2149k1121q5666J6550
195c7359Q6614j2689q4126M925Q3257L331q4009q841Q4080J2963q0667j8960P7814
208B6333K7016p7145l1798P6106L4972p1465l9609O6955M5229o3160n0507O1059
$$ plain form
220 3986 57153 1335 -54264 -4381 55605 10694 -53115 -11966 53865 17649 -48788 -19416
232 -19416 49409 26205 -46366 -26714 46739 31236 -41431 -32315 39975 37590 -36764 -38577 35397
245 35397 41196 -29827 -41503 27185 45350 -23654 -46598 20973 46769 -17108 -47803 12140
257 12140 48512 -10203 -50419 5627 48581 -3277 -49194 -2583 47929 4295 -50108 -9180
269 -9180 46812 10122 -46925 -16130 44010 17591 -44833 -21607 40889 22256 -39835 -27305
281 -27305 36098 29063 -35670 -32283 32334 32504 -29806 -35118 26681 38024 -24297 -38804 21789
294 21789 39940 -17806 -40290 15337 42656 -11384 -42536 9711 43351 -4774 -41398 2865
306 2865 44121 2122 -42026 -2710 42745 7128 -40155 -9197 40874 13740 -38926 -14752
$$ packed form
220C986N3167n5818n5599M9883N9986m4911o3809M1149O5831l6216o6437K9372
232a9416O8825k3204p2571J9652P3453j5503p2667R116P2290k385p4354j813P3974
245C5397N799p1023j1676O8688J8165o9004k2944O7571K5796o3877l0695N9943
257A2140L6372n8715m0216N6046M2954n1858m5917M6611N0512m3634n4403M0928
269i180N5992l6690n7047L0795O0140k6419o2424K3226O2496j8633o2091J2530
281b7305O3403p035o4733L387O4617J70o2310n312O1799J1343o2321j4507O0593
294B1789J8151n7746k2484N5627K7319n4040l1152N2247L3640m8125l6624M4263
306B865M1256m1999m4148L9316M5455l5617m7283L0958N0071k7134n2666K4174
$$ plain form
318 -14752 38909 18347 -35445 -20315 34580 23802 -32754 -25048 30874 26834 -28216 -29067 25633
331 25633 31044 -24257 -32649 21449 32551 -19308 -35073 14919 35142 -14334 -37762 10066
343 10066 36025 -9039 -37829 3935 37256 -2822 -38408 -1015 36125 1985 -37366 -7155
355 -7155 34584 7970 -36575 -11002 33969 12549 -33040 -15963 31473 18148 -30666 -19642
367 -19642 28764 21465 -26269 -23725 25014 26618 -22629 -26772 22004 28758 -17779 -28983 16629
380 16629 31764 -13371 -30984 12711 32545 -8442 -31516 7134 34075 -3263 -32538 2890
392 2890 33588 992 -32060 -3247 32956 5954 -31805 -7126 31595 9976 -29659 -12403
404 -12403 29251 14660 -28534 -15943 26708 17152 -25252 -20246 22839 21074 -22683 -23458 20249
$$ packed form
318a4752N3661k0562n3792J5130N4895j0778n6556P706N5922m040n5050q51N4700
331B5633N411n5301q392N4098J1102n1859j5765M9992K0223m9476k3428M7828
343A0066K5959m5064k8790M1764L3321m0078l5586L7393L7140l4140l9351L0211
355g155M1739k6614m4545K5573M4971k1420m5589J7077M7436j3325m8814J1024
367a9642M8406p299m7734K544M8739J604m9247m143M8776O754m6537j1204M5612
380A6629J5135m5135j7613M3695J9834m0987k3074L8650K6941l7338k9275L5428
392B890L0698l2596l3052K8813L6203k7002l7759K4679L8721k1619l9635J7256
404a2403M1654j4591m3194J2591M2651r556m2404N006M3085j765m3757p75M3707
$$ plain form
417 20249 23379 -18895 -25935 15233 26014 -15197 -28235 11531 27089 -10668 -29575 6683
429 6683 28980 -6112 -30446 3032 29021 -1821 -29670 -1458 29221 2668 -29340 -4850
441 -4850 28343 7070 -27325 -9037 27252 11535 -26076 -12215 25208 14976 -22842 -16040
453 -16040 22786 18844 -20484 -18718 19778 21315 -16956 -21177 16322 23873 -13672 -23294 13249
466 13249 24773 -9913 -24714 8805 26353 -6360 -25996 5275 26634 -2525 -26037 636
478 636 26583 1454 -26213 -2818 25111 4850 -25280 -7313 24412 8020 -24427 -10407
490 -10407 22435 11117 -22274 -13906 20417 14247 -20530 -16447 17798 16641 -17302 -19220 14609
503 14609 19433 -14708 -21121 12001 20661 -11230 -22477 8813 22506 -7644 -23226 5518 22768
$$ packed form
417B0249L130m2274p040M1168J0781m1211j3038L9766J5558l7757j8907L6258
429F683K2297l5092k4334L3478K5989l0842k7849K8212L0679k6553l2008K4490
441d850L3193k1273l4395J8288L6289j5717l7611J3861L7423j0232l7818O802
453a6040L8826l942l9328J766L8496J537l8271m221L7499P551l7545r622L6543
466A3249J1524l4686j4801L3519J7548l2713j9636L1271K1359k9159k3512K6673
478F36K5947k5129k7667K3395K7929k0261l0130J7967L1725j6392l2447J4020
490a0407L2842j1318l3391Q368L4323o170l4777M083L4245j157l3943j918L3829
503A4609M824l4141o413L3122Q660l1891j1247L1290J3693l0150j5582K8744J7250
$$ plain form
516 22768 -3780 -23575 2001 24019 -573 -23793 -591 23483 2952 -22232 -4257 22945
528 22945 6360 -21336 -7148 21409 9774 -19359 -10354 19890 12695 -18079 -12750 17801 15047
541 15047 -15583 -15306 15387 17647 -13464 -17192 12625 18365 -10433 -19270 9316 20263 -7828
554 -7828 -20273 6613 20469 -4835 -21047 2859 20918 -2050 -21430 -203 20576 1339
566 1339 -21191 -3628 20073 3757 -20689 -6010 18859 6502 -19497 -9052 17787 9114
578 9114 -17842 -11181 15712 11729 -15446 -13790 13944 13694 -13887 -15169 11921 15539 -10536 -16838
592 -16838 9134 17167 -8137 -17477 7017 18362 -5092 -18448 4207 18981 -2538 -18275
604 -18275 1845 18899 719 -18274 -1254 19268 3392 -17775 -3650 18129 5877 -16620
$$ packed form
516B2768k6548j9795K5576K2018k4592k3220K3202K4074k0531k5184J7975K7202
528B2945j6585k7696J4188K8557j1635k9133R005L0244p195l0774N329L0551k754
541A5047l0630K77L0693K260l1111l728K9817N740k8798q837K8586J0947k8091
554g828j2445K6886J3856k5304j6212K3906J8059k2968j9380K1227K0779j9237
566A339k2530J7563K3701j6316k4446J4679K4869j2357k5999J0445K6839q673
578I114k6956O661K6893l983k7175J656K7734k50k7581j282K7090L618k6075o302
592a6838K5972Q033k5304r340K4494J1345k3454j3356K2655J4774k1519j5737
604a8275K0120J7054j8180j8993J7020K0522j5876k1167J4125K1779j2252k2497
$$ plain form
616 -16620 -6230 17371 8123 -15743 -8248 15583 10193 -13858 -11117 13991 12186 -12442 -12737
629 -12737 11787 13666 -10444 -14552 9262 15296 -8476 -15643 6942 15614 -6105 -16735 4374
642 4374 16561 -3733 -17335 1839 16286 -1424 -17685 -851 16734 935 -17020 -2819
654 -2819 15789 3521 -16352 -5284 15028 5635 -15149 -7190 13887 8040 -13576 -9353 12805
667 12805 9788 -12208 -10701 11078 11477 -9907 -12232 9364 13143 -8174 -13528 7552 14493 -5703
681 -5703 -14218 5498 15143 -3654 -14566 3294 15521 -1311 -14685 1060 15649 750 -14340
694 -14340 -1335 14889 3004 -13995 -3602 14437 4847 -13433 -5559 13295 6441 -12574 -7287
707 -7287 12096 8461 -11584 -9171 10370 9768 -10160 -11026 8864 10746 -8467 -12116 6946 11795
$$ packed form
616a6620J0390K3601r248k3866P495K3831n390k4051K741K5108j805k4628k95
629a2737K4524J879k4110m108K3814O034k3772p167K2585Q672k1719j0630K1109
642D374J2187k0294j3602J9174J4447j7710j6261J6834J7585j5799j7955J4201
654b819J8608j2268j9873J1068K0312r393k0784P959K1077n847k1616M223K2158
667A2805l017k1996J507K1779L99k1384k325K1596L779k1317n354K1080O941k0196
681e703q515J9716R645j8797j0912J7860J2227j6832j3374J5745J4589j4899j5090
694a4340J3005J6224j1885j6999J0393J8039r590j8280P874J8854o854j9015N287
707g287J9383l635k0045K413J9541o02j9928q66J9890J882j9213l649J9062M849
$$ plain form
721 11795 -6378 -13014 5025 12534 -4828 -13528 3017 12945 -2929 -13598 864 13477 -1095
734 -1095 -13479 -559 13193 1278 -13375 -2516 12831 3113 -12832 -4485 12049 5112 -11814
747 -11814 -6102 11505 6759 -10815 -7256 10398 8596 -9489 -8640 9017 9800 -7787 -9739 7400
761 7400 10926 -6163 -10823 6059 12089 -4536 -11280 4264 11945 -2679 -11704 2397 12514
774 12514 -1103 -11772 897 12343 764 -12061 -1302 12052 2105 -11541 -3083 11219
786 11219 4183 -11091 -4807 10495 5154 -10207 -6269 9379 6692 -9372 -8038 8317 7902 -8273
800 -8273 -8872 6838 8823 -6859 -10064 5399 9714 -5332 -10532 3919 10346 -3400 -11187 2349
814 2349 10642 -2078 -10899 1144 10776 74 -11289 -707 10779 1487 -10568 -2422 10553
$$ packed form
721A1795j8173o636J8039P509j7362q700J6545R928j5874j0669J4462J2613j4572
734a095j2384J2920J3752j1915j4653J0859J5347r718j5945Q347J6534o937j6926
747a1814N712J7607m746j7574L559J7654j802j8085Q49J7657P83j7587j952J7139
761G400L526j7089m660J6882O030j6625o744J5544P681j4624r025J4101J0117
774A2514j3617j0669J2669J1446j1579j2825J0759J3354r947j3646Q458J4302
786A1219p036j5274O284J5302n341j5361L938J5648k687j6064J334J6355m15j6175
800h273n99J5710J985j5682l205J5463M315j5046n200J4451O427j3746p787J3536
814B349Q293j2720q821J2043R632j0702j1363J0582J1486r292j2055Q146J2975
$$ plain form
827 10553 2973 -9971 -3530 10295 4597 -9211 -4809 9386 5980 -8227 -6259 8721 7222
840 7222 -7419 -6889 7375 8194 -6272 -8137 6240 9199 -4744 -8670 4488 9660 -3532 -9479
854 -9479 3126 9853 -2415 -9770 1411 10049 -876 -9838 70 10135 599 -9974 -1659 9366
868 9366 1699 -9881 -3134 8800 3020 -8994 -4349 7799 4632 -8504 -5716 7581 5110 -7331
882 -7331 -6655 6431 6468 -6645 -7433 5465 7348 -5157 -8175 4359 7980 -3790 -8596 3195
896 3195 8641 -2568 -8691 2097 8791 -1202 -8745 678 9150 -18 -8607 -487 9045 1865 -8430
911 -8430 -1775 8845 2980 -7995 -3083 8168 3948 -7199 -4248 7633 5186 -6472 -4790 6484
925 6484 5944 -5902 -6100 5502 6643 -5049 -7029 4452 7294 -3914 -7172 3255 7694 -2703
$$ packed form
827A0553p580j2944O441J3825n698j3808M402J4195l406j4207J968J4980j499
840G222j4641N30J4264Q19j4466j865J4377K959j3943l926J3158N172j3192n947
854i479J2605O727j2268p355J1181Q638j0925q962R908J0065r536j0573Q315J1025
868I366p667j1580O747J1934n780j2014M645J2148l167j3136K788J3297k471j2441
882g331O76J3086L7j3113p88J2898J883j2505l018J2534L621j1770m806J1791
896C195N446j1209o123J0788O694r993p543R423Q472r168q589Q120R532p180j0295
911h430O655J0620n865j0975M912J1251m220j1147K951J1881k447j1658J682J1274
925F484n40j1846j98J1602J141j1692j980J1481K842j1208l258J0427M439j0397
$$ plain form
939 -2703 -7458 2335 7825 -1553 -8257 1225 7276 -899 -7935 -397 7538 300 -7477 -1727 7108
954 7108 1354 -7537 -3065 6715 2325 -7312 -4211 6745 3444 -6624 -4775 5964 4581 -5950
968 -5950 -5767 5269 5305 -4951 -5845 4301 6353 -3792 -6300 3464 6524 -2603 -6758 2424 6891
983 6891 -1629 -6936 1554 7571 -587 -7013 405 7645 418 -7374 -496 7297 1634 -6628 -1681
998 -1681 6857 2569 -6509 -2486 5865 2541 -5814 -3646 5813 4070 -5303 -4274 4907 4178 -4894
1013 -4894 -4980 4202 5322 -3725 -5902 3175 5693 -2914 -6333 2236 6114 -1991 -6638 990 6023
1028 6023 -1322 -6741 252 6370 -518 -6808 -700 6238 870 -6358 -1501 6316 2465 -6145 -2177
1043 -2177 5624 2438 -5250 -3172 5099 3252 -4734 -3581 4679 4540 -4476 -4547 3240 4670 -2604 -4734
$$ packed form
939b703m755R793N490r378o704R482O051q175p036P538P935p238p777N750Q835
954G108n754q891M472R780m390r637L101J0956l301j0068J849J0739j383j0531
968e950J83J1036L6j0256q94J0146K052j0145k508R764L060r127m155R182M467
983F891q520n307Q490O017q158o426P418P240p227p792O878P793n663q262M947
998a681Q538m288r078M023Q351l324q355K168R459j743r373J029R181p29r072
1013d894q6R182J120r047k177R077K518q607l419Q569L878q105m647P628N033
1028F023p345n419O993O118o888o290O108O938n368p228M857P817l851q610L968
1043b177P801l186p688K078Q271j847p986J153Q260j39r016p1P787J430p274k130
$$ plain form
1059 -4734 3561 5926 -3063 -4825 2345 5770 -1701 -5757 1873 6105 -1287 -5444 964 6702 -86
1074 -86 -5828 11 6039 310 -5250 -1087 5117 1490 -5613 -1409 4685 2344 -4903 -2495 3832
1089 3832 2876 -5023 -3596 4091 3578 -4352 -3901 3377 4247 -3913 -4699 3197 4110 -2726 -5671 2532
1105 2532 4250 -2036 -5260 1087 4729 -1055 -5477 875 5257 -545 -5151 55 5154 463 -5634
1120 -5634 -897 5335 1156 -5060 -1471 5280 1830 -4762 -2230 4571 2656 -4283 -2663 4294 3293
1135 3293 -3732 -3280 3724 3902 -3221 -3420 3411 4159 -2758 -4131 2374 4715 -1826 -4428 1971 4780
1151 4780 -1194 -4957 627 4763 -639 -4728 -104 5213 348 -4821 -401 4237 1172 -4668 -1306
1166 -1306 4603 1430 -4219 -1811 4299 2075 -3992 -2445 3744 2564 -3626 -3267 3191 3028 -3456
$$ packed form
1059d734Q295K365q989j762P170L425p471m056P630M232p392m157O408N738o788
1074h6n742N839O028n729n560M163O204l627p103M204O094k341p247K408O327
1089C832r56p899J427P687n13p930M51P278Q70q160p86P896R13o836k945Q203
1105B532J718o286l224O347L642n784m422O352M382n802m606N206N099m691o097
1120e634M737O232m179o216L589O751l450o592K532O801j915o939J620O957j001
1135C293p025M52P004J78p123j99O831P48o917j373O505K341o541k602O399K809
1151D780n974l763N584M136n402m089M624N317m865n169M420M638l065n840L362
1166a306N909l173n649K408O110k224o067J547O189j180o190L59O458j63o484
$$ plain form
1181 -3456 -3680 2915 3470 -2807 -4031 2214 3848 -2061 -4215 1753 4140 -1383 -4307 1022 4416
1196 4416 -846 -4309 528 4241 134 -4468 -110 4332 639 -4242 -695 4287 1133 -3956 -1380
1211 -1380 4079 1761 -3638 -1749 3955 2614 -3323 -2349 3524 3065 -2902 -2723 2934 3101 -2597 -3340
1227 -3340 2442 3663 -1893 -3456 1563 3808 -1452 -3919 1311 3972 -926 -3830 442 3722 -319
1242 -319 -4049 26 3923 50 -4028 -721 3857 705 -3936 -1244 3528 1255 -3784 -1864 3027
1257 3027 1775 -3676 -2076 3097 2281 -2913 -2643 2642 2639 -2484 -2884 2272 3009 -2043 -3099 1878 3228
1274 3228 -1717 -3387 1239 3362 -960 -4015 693 3594 -548 -3506 364 3805 255 -3450 -269
1289 -269 3776 783 -3181 -914 3618 1075 -3059 -1514 3588 1739 -3094 -1605 3226 1934 -2763
$$ packed form
1181c456k24O595N55o277j224O245J634n909k154N968K387n523k924N329L394
1196D416n262l463M837L713m107m602M358M442l693m881L547M982l154n089K576
1211a380N459k318n399J889N704j341n937R74N873m59n967J79N657J67n698p43
1227c340N782J221n556j563N019K245n260k467N230K661m898k904M272L280m041
1242c19l730M075L897l873m078L307M578l152m641K692M772k273n039J920M891
1257C027j252n451J600N173q16n194K70N285ln123m00N156P37n052j056M977J350
1274C228m945j670M626K123m322l055M708K901m142k958L870L441l550l705L181
1289b69M045k993l964K267M532k543m134J545N102j849m833J489M831j292m697
$$ plain form
1304 -2763 -1988 2786 2528 -2338 -2410 2272 2876 -1955 -2796 1756 3119 -1496 -3023 1260 3275 -1043
1320 -1043 -3352 620 3013 -652 -3461 229 3268 -260 -3368 -345 3269 353 -3402 -707 3292
1335 3292 759 -3074 -1504 2920 1190 -2924 -1648 2761 1510 -2732 -1985 2405 1969 -2407 -2323 2203
1351 2203 2344 -1798 -2368 1783 2936 -1325 -2956 1339 2802 -1322 -2720 1038 3101 -723 -2999
1366 -2999 701 3306 -186 -2940 115 3287 290 -3017 -161 2999 718 -2744 -833 3118 1251
1381 1251 -2714 -1376 2510 1503 -2414 -1646 2290 1680 -2025 -1979 2184 2242 -1925 -2310 1695 2319 -1593
1398 -1593 -2648 1306 2642 -1275 -2699 911 2676 -747 -2793 218 2759 -606 -2760 96 2635
1413 2635 -242 -2907 -396 2527 251 -2650 -839 2405 835 -2639 -1110 2774 1430 -2211 -1472
$$ packed form
1304b763P75M774k58m866p2M682O04m831q41M552J363m615j527M283K015m318
1320a043k309L972K393l665k809L690L039l528l108L023L614k916l755K695L999
1335C292k533l833J570M424j730m114J276M409j251m242P47M390m36m376Q4M526
1351B203J41m142n70M151J153m261j631M295J463m124j398L758K063l824k276
1366b999L700K605l492k754L055L172k997l307K856L160k281l462J911L951j867
1381A251l965J338L886j007l917P68L936o10l705M6M163N8m167l85M005O24l912
1398a593j055L954J336l917j424L610J765l423k046L011K541l365k154K856K539
1413B635k877k665K511K923k276k901J811L244j570l474J529L884j344l641P39
$$ plain form
1428 -1472 2173 1725 -1922 -1790 2042 2000 -1660 -2376 1810 1985 -1449 -2058 1329 2407 -1065 -2578 1051
1445 1051 2778 -708 -2261 819 2711 -196 -2446 306 2458 158 -2369 -80 2504 346 -2599
1460 -2599 -706 2422 688 -2347 -650 2253 948 -2057 -1079 2251 1455 -2071 -1555 1705 1602 -1986
1476 -1986 -1878 1764 1775 -1476 -2181 1305 1973 -1290 -2328 835 2000 -1219 -2443 496 2390 -386
1492 -386 -2429 218 2390 24 -2268 -108 2203 208 -2461 -381 2242 424 -2211 -496 2078
1507 2078 1148 -1851 -888 1971 625 -2052 -1495 2030 1451 -1648 -1773 1053 2201 -658 -1161 1934
1523 1934 1750 -1206 -1870 778 2289 -1001 -2343 446 2068 -268 -2063 239 2438 -36 -2189
1538 -2189 -100 2383 238 -2166 -384 2113 315 -2119 -628 2069 356 -1932 -886 2081 848
$$ packed form
1428a472L645m48l647J32L832m2l660p16M186J75l434o09L387J078l472j513L629
1445A051J727l486j553L080J892k907k250K752K152k300k527K289K584k158k945
1460b599J893L128j734l035J697K903j305l005R78L330p96l526N16L260j03l588
1476a986J08L642J1l251p05L486O68l263j038L163J165l219j224K939J894k776
1492c86k043K647K172k366k292K160K311j995k669K080K623j818k635J715K574
1507B078r30k999R63K859j346k677N57L525n79l099j25K826J148k859n03L095
1523A934j84k956o64K648J511l290j342K789J622k336j795K302K199k474k153
1538b189K089K483k145k404J782K497j798k434J491K697j713k288J046K967j233
$$ plain form
1553 848 -1853 -936 1832 1055 -1854 -1657 1604 1176 -1639 -1753 1096 1618 -1484 -1836 863 1934 -844
1570 -844 -1439 1013 2054 -741 -1890 216 1744 -114 -2082 393 2194 -121 -2096 117 2001
1585 2001 266 -2027 -527 1831 678 -1994 -553 1823 585 -1480 -862 1744 1023 -1651 -1020 1663
1601 1663 1430 -1591 -1294 1355 1531 -1234 -1435 1061 1570 -871 -1410 893 1981 -772 -1724 460 1932
1618 1932 -311 -1796 161 1752 -195 -2098 -12 1460 408 -2061 -882 1685 105 -1725 -316
1633 -316 1483 33 -1770 -695 1458 464 -1202 -1134 1589 437 -1364 -873 1353 652 -1603 -1431 780
1650 780 1656 -1404 -1751 431 1484 -807 -1668 609 1960 -668 -1479 532 1624 -172 -1688 196
1666 196 1976 -12 -1687 32 1709 469 -1591 -114 1702 713 -1604 -349 1481 746 -1365 -512
$$ packed form
1553H48k701R17K768p77k909J97L261m28k815j14K849N22l102l52K699J071k778
1570h44n95K452J041k795j149K106J528j858j968K475J801k315j975K213J884
1585B001j735k293J500K358j153k672J441K376j238k065O18K606p21k674O31K683
1601A663k33l021K97K649J76k765k01K496N09k441n39K303J088k753r52K184J472
1618A932k243j485J957J591j947j903K086J472j052k469J179K567j580j830J409
1633c16J799j450j803J075K153r94j666O8K723j152j801M91K226p01k255J72K211
1650G80Q76l060l47K182J053k291q61K277J351k628q11K011J092j796j516J884
1666A96J780j988j675J719J677j240k060J477J816r89k317J255J830p35k111Q53
$$ plain form
1682 -512 1293 817 -1209 -853 1403 988 -1058 -1007 1019 1413 -786 -1335 701 1219 -829 -1412 484
1699 484 1395 -553 -1585 375 1308 -281 -1564 26 1678 -373 -1721 -103 1534 111 -1778 -389
1715 -389 1353 378 -1533 -537 1127 547 -1264 -740 1382 712 -1399 -880 1070 1135 -1178 -974 927
1732 927 735 -744 -1124 980 1494 -853 -1216 796 1336 -492 -1339 647 1536 -528 -1176 502 1439
1749 1439 -158 -1157 253 1384 217 -1467 11 1468 457 -1584 -431 1311 612 -1248 -525 1481
1765 1481 1002 -997 -802 1355 804 -1398 -803 759 830 -1066 -578 801 875 -1274 -984 797 1195 -983
1783 -983 -1416 683 937 -746 -1488 195 1443 -392 -1988 431 1131 297 -1342 -360 1174 400 -1374
1800 -1374 -147 1300 504 -1332 -689 892 772 -961 -582 1132 391 -896 -691 974 783 -1018 -930
$$ packed form
1682e12J805m76k026L56K256m15k046N1K026L94k199n49K036N18k048n83J896
1699D84R11j948j032J960R33j589j283J590J652k051j348J618J637j423j889J389
1715c89J742r75j911R96J664n80j811N24K122o70k111N19J950O5k313K04J901
1732I27j92j479l80K104N14k347l63K012N40j828q47J986Q89k064o48J678R37
1749A439j597r99J410J131j167j684J478J457j011k041J153J742o99j860P23K006
1765A481m79j999J95K157n51k202N95J562P1j896M88J379P4k149K90J781L98k178
1783i83m33K099K54j683p42J683J248j835j596K419P00q34j639R82J534p74j774
1800a374J227J447p96j836O43J581j20j733L79J714p41j287K05J665j91j801Q8
$$ plain form
1817 -930 780 1009 -808 -872 775 886 -570 -1161 707 1181 -233 -1029 263 1214 -252 -1203 169
1834 169 1230 -9 -1255 16 983 312 -1049 -246 1517 187 -1065 -376 1255 433 -1099 -339 1177
1851 1177 624 -952 -574 989 636 -908 -664 516 618 -801 -1156 541 1008 -775 -1127 356 1085
1868 1085 -549 -1087 386 734 -165 -1058 82 1004 -154 -1241 8 969 88 -1109 -109 999 190
1885 190 -1104 -353 1165 295 -940 -345 902 631 -936 -584 1002 584 -912 -732 933 614 -622
1902 -622 -654 650 764 -414 -913 804 919 -153 -843 485 887 -139 -961 233 1312 -286 -770
1919 -770 439 1005 -294 -1050 -6 1031 34 -981 37 485 435 -1286 -283 790 163 -1047 -328
1936 -328 868 443 -960 -883 653 396 -895 -624 672 527 -397 -665 442 771 -559 -839 373 692
$$ packed form
1817i30J710K29j817o4J647J11j456n91J868M74j414p96J292R51j466r51J372
1834A69J061j239j246J271R67o71j361Q03J763j330j252O89J631q22j532P60J516
1851A177n53j576L78J563l53j544K44J180J02j419l55J697M67j783l52J483P29
1868A085j634n38J473L48q99q93J140R22j158j087J249R61q81j197J000J108q09
1885A90j294P51J518q70j235N95J247k71j567L52J586m18j496J80J665l19j236
1902f22l2J304J14j178m99J717J15j072o90J328M02j026q22J194J079j598m84
1919g70J209N66j299p56J044J037r97j015J018M48n0j721J003J073o27j210P19
1936c28J196m25j403P7J536k57j291K71J296j45r24k68J107L29j330k80J212L19
$$ plain form
1954 692 -373 -1005 291 893 -171 -665 213 784 -107 -834 147 870 66 -904 89 917 78 -687 -192
1973 -192 905 411 -963 -419 734 204 -729 -477 925 650 -737 -476 538 602 -596 -742 562 632
1991 632 -418 -621 215 653 -341 -717 368 663 -124 -847 315 894 49 -726 13 1012 -243 -814 -288
2010 -288 860 195 -819 -226 649 82 -936 -63 778 363 -667 -547 552 585 -792 -598 632 150
2028 150 -650 -499 478 644 -448 -559 208 659 -565 -596 299 884 -187 -679 209 823 -158 -481 88
2047 88 824 -3 -775 -7 687 69 -741 247 884 254 -575 -220 759 401 -657 -224 607 321 -564 -362
2067 -362 671 456 -647 -474 486 639 -664 -740 535 619 -616 -524 -10 642 -182 -926 534 756 -489
2086 -489 -910 215 317 -334 -403 141 614 238 -667 -57 569 47 -567 -136 546 325 -796 -333 627 227
$$ packed form
1954F92j065o32J296O02j064m94Q78N71q91p27R81P23q04r70R93Q28q39p65M95
1973a92J097m94j374N44J153n30r33K52J402k75j387K61J014O4j198j46J304P0
1991F32j050k03Q36M38r94l76J085K95p87p23J162N79q45p75P39R99j255n71N26
2010b88J148o65j014N93Q75n67j018Q73Q41m15j030J20J099L3j377J94J230m82
2028A50q00J51R77J66j092j11P67M51j224l1Q95N85j071m92Q88O14r81l23N69
2047H8P36q27p72P68O94o18q10R88O37o30q29L55R79l58j058M33Q31k86q85K02
2067c62J033k15j103J73R60J53j303p6J275Q4j235R2N14O52q24p44J460K22j245
2086d89m21J125J02o51o9N44M73l76r05O10O26n22o14M31O82k21j121M63R60m00
$$ plain form
2106 227 -426 -484 455 374 -494 -260 563 436 -382 -411 202 514 -297 -523 441 526 -278 -462 333 464 -353
2127 -353 -655 313 675 238 -801 191 789 211 -597 39 462 -125 -793 -145 759 202 -633 -187 442 408
2147 408 -461 -247 714 251 -538 -394 648 399 -350 -60 380 335 -669 -491 91 378 -424 -354 363 380
2167 380 -64 -423 23 691 -174 -407 -59 603 -140 -688 54 409 -8 -475 -20 481 265 -543 -150 423
2187 423 208 -784 -280 412 158 -636 -553 541 154 -519 -315 310 70 -414 -338 247 496 -194 -319 238
2207 238 318 146 -282 180 539 -159 -555 214 530 -24 -515 -91 460 162 -731 -77 526 334 -518 11
2227 11 419 159 111 -273 365 359 -420 -154 293 -405 -603 -394 617 168 -646 -974 212 637 -978 -425
2247 -425 52 656 -68 -658 247 492 -511 -27 301 104 91 -640 279 343 -59 -659 -32 773 176 -652
$$ packed form
2106B27o53n8R39q1q68K34Q23j27q18k9O13L12q11k26R64Q5q04j84P95J31q17
2127c53l02R68L62m37j039R92N98n78q08O36M23n87o68O48R04n57q35M46O29l4
2147D08q69K14R61m63p89J44J042k49p49K90M40m5j004J78N82K87q02P0P17J7
2167C80m44l59M46O68q65k33L48O62p43n48P42L55m17m67M55N01k16q08L93N73
2187D23k15r92N04O92k54p94Q3J094l87o73K04O25k40m84P6N85K49o90j25N57
2207B38Q0j72m28M62L59o98l96P69L16n54m91M24N51k98q93O54O03j92q52N29
2227A1M08k60m8l84O38op79K66M47o98j98K09J011m49q14l28J186M25j615N53
2247d25M77O04p24n90R05K45j003M84L28j97j3p31R19O4m02o00O27Q05n97q28
$$ plain form
2267 -652 -260 288 206 -431 -96 601 105 -615 -482 461 -44 -299 23 435 136 -93 -332 242 440 -291
2287 -291 -562 349 351 -460 -519 108 354 -273 -678 80 161 -129 -663 720 385 131 292 155 647 9 -645
2308 -645 -211 410 -33 -495 192 435 76 -431 -257 326 257 -448 -240 319 101 -499 -284 267 132 -347
2328 -347 -546 254 306 -175 -410 273 389 -200 -485 29 230 -54 -512 335 441 -243 -615 148 284 93
2348 93 -181 -50 174 66 -274 67 588 92 -445 -182 456 175 -220 -149 450 24 -527 -285 273 254 -527
2369 -527 -205 304 202 -9 -104 401 391 -151 -238 58 291 -35 -174 377 533 -190 -380 -136 308 -156 -215
2390 -215 -173 541 -261 -527 -26 282 -221 -360 -186 375 -93 -381 -5 253 191 -292 -294 351 250 -253 -307 446
2412 446 299 67 539 -5 326 -340 -86 147 379 -89 -94 315 461 -156 -457 69 444 -137 -240 83 162
$$ packed form
2267f52L92N48q2o37L35O97m96p20J33R43n05k55L22M12k99k29k39N74J98p31
2287b91k71R11Kq11n9O27K46o27m05P58Q1k90n34J383l35k54J61j37M92o38o54
2308f45M34O21m43m62O87K43l59n07J74N83o9p05K08N59k18o00K15N51j35m79
2328c47j99Q00N2m81k35O83J16n89k85N14K01k84m58Q47J06o84l72P63J36j91
2348I3k74J31K24j08l40L41N21m96n37K63O38k81l95P1N99m26n51K42N58j9p81
2369e27L22N09j02k11r5N05j0n42q7K96K33l26j39N51J56p23j90K44M44m64n9
2390b15M2P14q02k66N01L08n03j39J74N61m68k88L76K58o2m83kO45j01n03n4P53
2412D46j47k32M72n44L31o66K54K33K32m68nM09J46o17l01N26L75n81j03L23P9
$$ plain form
2433 162 40 -289 -76 312 73 -138 -112 668 39 -342 111 281 235 -380 -123 167 123 -392 -34 150 -3
2454 -3 -225 -291 141 220 42 -309 290 113 -20 -123 309 479 -100 -349 51 187 -280 -287 -34 244 -136 -276
2476 -276 -39 24 149 -244 -67 215 38 -283 -77 157 -30 -313 -91 214 152 -217 -30 68 -1 -247 23
2497 23 379 15 -108 -180 293 261 136 -53 505 369 -305 -293 193 204 192 -350 242 148 -52 -267 73 92 -508
2520 -508 -753 -10 213 -378 805 -156 76 -435 665 -325 172 -543 -22 -69 512 23 -33 -676 864 241
2540 241 -592 -478 69 93 -845 -222 88 363 -365 -190 -15 379 -196 -123 -137 139 -18 -336 -71 335 -178
2561 -178 -359 -46 122 -84 -233 21 225 236 -160 -18 47 195 -346 -121 387 88 -492 -186 248 199 -29
2582 -29 -201 89 108 -439 -320 12 377 9 -431 189 -36 -161 -913 64 832 -349 -400 -446 65 181 21
$$ packed form
2433A62j22l29K13L88k39k11K6P80o29l81M53J70m6o15K57K90m4n15L58J84j53
2454ck22o6M32P9j78l51N99j77j33j03M32J70n79k49M00J36m67pK53K78l80j40
2476b76K37O3J25l93J77K82j77l21K06K34j87k83K22L05o2l69J87R8o9k46K70
2497B3L56l64j23p2M73l2j25j89N58j36o74J2M86J1j2n42N92r4k00k15L40J9o00
2520e08k45P43K23n91J183r61K32n11J100r90M97p15N21m7N81m89n6o43J540o23
2540B41q33J14N47K4r38O23L10K75p28J75J75L94n75P3j4K76j57l18K65M06n13
2561a78j81L13J68k06j49K54K04J1l96J42O5J48n41K25N08k99n80L06M34m9k28
2582b9j72K90J9n47J19L32L65l68m40O20k25j25p52R77P68j181n1m6N11J16j60
$$ plain form
2603 21 261 213 -462 -222 -66 168 78 -295 -81 310 -131 -344 -23 67 118 -364 18 141 65 -264 -138 287
2625 287 107 -66 -249 84 81 12 -83 275 135 -322 -191 -36 210 11 -293 347 43 24 -199 32 352 -237
2647 -237 -185 132 115 223 -34 -111 406 -13 -178 -247 145 197 -215 -29 182 340 -108 -248 325 148 -131 -212
2669 -212 272 222 -439 -319 237 246 -127 -99 90 78 -142 -237 5 273 -30 9 -96 -45 180 -355 -37 -31 -87 -152
2693 -152 -33 331 51 -283 110 239 57 -369 -332 193 296 -126 -112 111 228 -296 -179 -18 105 -198 -127
2714 -127 125 145 -26 -26 10 380 -159 -132 -45 176 -52 -178 120 178 67 -280 106 -20 -75 -311 291 222 -123
2737 -123 -155 139 283 144 -235 30 191 69 -124 176 230 163 -134 -306 194 135 -54 -118 -71 -94 -156 -451 156
2760 156 112 -56 167 257 150 -41 -179 6 66 -7 -154 -42 79 -190 -126 -218 180 -117 -99 0 58 10 -316
$$ packed form
2603B1K40m8o75K40J56K34r0l73K14L91m41k13L21R0N1m82L82J23p6l29J26M25
2625B87j80j73j83L33lo9r5L58j40m57J31J55K46j99l04O40l04j9k23K31L20n89
2647b37N2L17j7J08k57p7N17m19j65o9L92N2m12J86K11J58m48j40N73j77k79q1
2669b12M84n0o61J20N56Rl73K8J89j2k20r5K42K68l03L9j05N1K25n35L18On6o5
2693a52J19L64k80l34L93J29j82m26L7N25J03m22J4K23J17n24J17J61J23l03P1
2714a27K52K0j71%L6L70n39K7Q7K21k28j26K98N8j11l47L86j26n5k36O02o9l45
2737a23l2K94J44j39l79K65J61j22j93L00N4o7k97j72N00n9j89o4M7k3o2k95O07
2760A56m4j68K23R0j07j91j38J85O0p3j47J12J21k69O4r2L98k97J8R9N8m8l26
$$ plain form
2783 -316 42 154 38 -217 17 231 69 -58 -7 138 5 -97 -115 144 -22 -47 -54 142 58 49 -97 39 293
2806 293 -16 -193 95 182 -64 -213 172 197 -173 -31 -18 -120 -23 12 77 187 -100 6 -146 164 15 -237
2828 -237 30 374 107 -98 -74 21 256 -169 -172 271 -246 -202 -226 60 -118 -328 -60 93 2 -59 -186 -3 -21
2851 -21 -25 -9 -199 287 -213 -126 -127 153 -77 -175 8 19 36 -141 -173 -21 -287 -16 -135 76 117 -278 23 476
2875 476 210 66 -124 262 236 -114 -132 4 35 38 -248 -5 188 5 -8 53 -215 78 39 34 92 101 13 74 257
2900 257 -106 -194 -224 257 -142 -311 120 35 -21 -282 -45 100 -43 -233 1 209 91 -125 -249 1 162
2921 162 -407 -288 126 8 206 151 4 92 -159 -272 244 -198 69 -266 229 143 -26 -166 105 19 -126
2942 -126 -82 -102 -72 -156 -167 50 -1 209 -46 -18 31 127 -199 -116 85 -7 -215 -188 207 104 -29 -283 157 19
$$ packed form
2783c16L58J12j16k55K34K14j62j27N1J45j33j02j8K59j66k5pJ96q4rj46J36K54
2806B93l09j77K88Q7k46j49L85K5l70J42J3j02R7L5O5J10k87J06j52L10j49k52
2828b37K67L44k67k05K4R5K35m25lM43n17M4k4K86j78k10K68J53r1o1j27J83j8
2851b1mJ6j90M86n00Q7jK80k30r8J83J1J7j77l2J52k66K71j19K11M1l95L01M53
2875D76k66j44j90L86k6l50j8J36L1Lk86K43J93j83j3O1k68K93l9nN8Rq8O1J83
2900B57l63q8l0M81l99j69M31q5n6k61K37J45j43j90K34K08j18k16j24K50J61
2921A62n69J19M14j18J98n5j47Q8k51j13N16m42K67l35M95q6j69j40K71q6j45
2942a26M4k0L0q4j1K17n1K10k55K8M9R6l26Q3K01r2k08K7L95j03j33k54M40j38
$$ plain form
2966 19 18 -146 81 96 128 186 -151 -15 0 -30 146 79 -190 -41 -126 110 53 136 116 310 -9 -218 -218 259 28
2991 28 60 8 -122 -8 -179 1 140 -137 87 15 207 103 42 -48 -110 22 -1 -308 30 -85 -28 24 47 145
3015 145 -193 3 127 60 -97 -294 146 234 212 -111 55 349 -224 -203 -177 20 -92 56 244 374 43 -86
3037 -86 -81 3 -13 19 0 84 92 -196 0 109 -120 49 96 156 126 -88 -248 63 29 -16 -305 -24 48 48 -91 58
3063 58 105 253 -59 230 -46 120 -36 -276 -33 28 -113 -151 52 38 69 -177 -138 105 11 -190 116 -65 -15
3086 -15 -154 194 -147 175 116 175 249 48 183 124 160 37 -85 -60 78 -281 55 78 9 -134 152 -285 -83
3109 -83 37 -154 41 41 -42 11 14 199 21 193 145 261 -56 -101 0 153 -59 -176 -20 -124 43 -206 145
3132 145 -121 -99 -81 20 -23 -92 -73 -111 28 -61 -193 -128 173 -114 35 -178 166 141 -174 39 -102 55 42
$$ packed form
2966A9jj64K27J5L2N8l37J36J5l0J76o7k69J49q5K36n7Q3k0J94l19k09%M77k31
2991B8L2n2j30J14j71J80J39k77K24p2J92j04o1r0o2J32k3l07L38j15N7N2K3R8
3015A45l38J96J24o7j57j97M40Q8k2l23J66K94n73K1K6J97j12J48J88J30l31j29
3037h6NQ4j6L2j9Q4Qk88J96J09k29J69M7O0l0k14j60L11l4m5k89K81P2%j39J49
3063E8M7J48l12K89k76J66j56k40K43O1j41l8K03j4L1k46L9K43r4k01L06j81N0
3086a5j39L48l41L22n9N9P4k01J35n9L6j23j22K5J38l59L36K3o9j43K86m37K02
3109h3J20j91J95%q3N3LJ85j78J72m8J16l17m5J01J53k12j17J56j04J67k49L51
3132A45k66K2J8J01m3o9J9l8J39q9j32O5L01k87J49k13L44k5l15K13j41J57j3
$$ plain form
3155 42 -139 139 111 27 -391 41 216 -8 154 -114 19 83 78 -162 -26 31 -50 -47 363 -143 -224 187 -1 9
3179 9 -13 94 210 236 -34 97 -11 184 -124 -10 -128 75 23 -241 -7 -55 22 -69 2 129 78 12 69 4
3203 4 75 -153 126 188 133 8 -43 315 -179 -106 -48 70 -95 -190 -240 155 91 -26 -274 64 122 62 -68 -90 -62
3228 -62 -14 -62 239 128 108 265 324 23 -129 171 130 188 30 19 57 126 -72 -187 100 109 -11 223 115 196
3252 196 -25 -34 33 240 -19 -69 -257 134 -98 7 -39 256 -14 -98 -97 138 26 12 -163 4 208 95 7
3275 7 -89 88 7 -184 -82 -66 50 -201 4 127 35 -88 -11 132 -25 -23 112 344 -163 -114 -110 -9 -8 13 -178
3300 -178 30 69 77 -48 -158 90 56 -108 226 6 43 -226 31 -108 -178 -83 91 -118 60 138 210 115 -33
3323 -33 81 191 47 279 -154 13 178 6 255 114 133 -59 -39 38 1 -83 119 -4 -225 21 -264 -170
$$ packed form
3155D2j81K78k8q4m18M32J75k24J62k68J33O4nk40J36N7q1LM10n06q1M11j88J0
3179Ik2J07J16K6k70J31j08J95l08J14j18K03n2k64K34m8P7r1P1J27n1o6N7o5
3203DP1k28K79O2n5j25n1L58m94P3N8J18j65r5n0L95o4j17k48L38N8o0j30k2K8
3228f2M8m8L01j11k0J57N9l01j52L00m1N8j58j1L8O9j98j15K87Rj20K34j08Q1
3252A96k21rO7K07k59n0j88L91k32J05m6K95k70q4JK35j12j4j75J67K04j13q8
3275Gr6J77q1j91J02J6J16k51K05J23r2j23P7J43j57KJ35K32n07M9MJ01JK1j91
3300a78K08L9Qj25j10K48l4j64L34k20L7k69K57j39p0R5J74k09J78P8P2r5j48
3323c3J14J10j44K32m33J67J65j72K49j41J9j92K0P7l7q4K02j23k21K46k85R4
$$ plain form
3345 -170 -153 -41 -169 -102 -20 91 -68 -236 -170 117 -1 -66 332 146 -10 291 -114 -128 -139 54 7 186 -29
3368 -29 114 -66 146 103 -103 8 287 20 -108 137 117 -27 -200 -45 -91 -257 -77 119 -1 -84 -177 -33
3390 -33 399 83 -211 -106 -15 49 -31 -192 289 71 -56 97 -135 -193 49 -207 163 -24 10 107 32 243 114
3413 114 -51 84 51 277 -91 -196 265 -34 -45 0 -30 89 -183 -97 -56 20 -99 78 241 -91 216 -48
3435 -48 45 86 -22 -156 111 295 -91 206 268 297 -101 -117 46 -17 22 -123 -122 287 142 -176 136 -139 -169 115
3459 115 -119 -44 92 193 -5 56 207 -29 -77 38 -233 -4 -40 -11 -4 -10 84 -108 229 -70 -55 70 -100 -72
3483 -72 72 180 55 180 -140 285 264 198 29 -229 -2 80 8 -343 -23 -61 -212 202 10 170 62 -25
3505 -25 -5 -52 -13 -149 -23 134 -232 160 28 139 42 226 -49 50 -53 75 42 -65 -42 -33 -220 39 21 -218
$$ packed form
3345a70J7J12j28O7Q2J11j59j68O6K87j18o5L98j86j56L01m05j4j1J93m7J79k15
3368b9J43j80K12m3k06J11K79k67j28K45k0j44j73J55m6j66J80J96j20q3r3J44
3390c3M32l16k94J05R1O4q0j61M81k18j27J53k32n8K42k56L70j87L4R7p5K11j29
3413A14j65J35l3K26l68j05M61k99j1M5l0J19k72Q6M1P6j19J77J63l32L07k64
3435d8R3M1j08j34K67J84l86K97O2K9l98j6J63o3L9j45JM09j45l18L12k75l0K84
3459A15k34P5J36J01j98O1J51k36m8J15k71K29l6K9PoR4j92L37k99J5J25j70K8
3483g2J44J08j25J25l20M25k1o6j69k58K27Q2p2l51L20l8j51M14j92J60j08q7
3505b5K0m7L9j36J26J57l66L92j32J11r7J84k75R9j03J28l3j07K3Rj87K59j8k39
$$ plain form
3529 -218 121 -103 -7 27 29 -102 -193 78 -75 -108 -11 96 -117 -78 98 -90 135 -263 24 -7 -112 -26 169
3552 169 200 -86 99 -148 -276 191 178 22 44 33 286 -6 231 31 -7 -37 32 21 177 82 -56 -56 -143 -150 -128
3577 -128 -115 -195 -33 -220 58 -46 -49 -176 -43 191 67 53 -177 72 -84 197 247 32 55 176 37 -10 140
3600 140 -207 -39 147 47 41 -79 -18 -76 -75 -295 -146 -8 -115 -167 -52 25 -34 77 -77 98 27 131 29
3623 29 -109 -53 -75 -110 -84 -62 153 5 76 121 -262 -53 -114 123 -50 127 -100 105 215 -24 -27 -110 70 -85
3647 -85 19 -107 62 -87 -97 17 246 -91 -115 -191 -27 -244 -52 -286 -42 107 -101 -68 -31 -54 70 -55
3669 -55 58 -18 -84 33 70 14 -164 139 -87 112 -136 -151 271 159 -196 31 -66 -53 -60 -167 169 18 -66 218
3693 218 66 -32 -109 -380 12 -5 -134 26 -213 13 62 -22 73 155 19 32 -67 52 -59 60 65 97 179 -50
$$ packed form
3529b18L39k24R6L4Kj31r1K71j53l3R7J07k13L9J76j88K25l98K87l1j05Q6J95
3552A69L1k86J85k47j28M67j3j56K2j1K53k92K37k00l8l0O9j1J56r5j38%q7pK2
3577a28J3q0J62j87K78j04lj27J33K34j24j4k30K49j56K81N0k15K3J21j39m7J50
3600A40l47J68J86j00oj20O1n8Jk20J49J38j07n2J15P7n9J11j54J75p1J04j02
3623B9j38N6k2l5K6K2K15j48P1M5l83K09o1K37j73J77k27K05J10k39lq3J80j55
3647h5J04j26J69j49j0J14K29l37k4p6J64k17J92k34K44J49k08L3L7k3J24j25
3669e5J13p6o6J17L7n6j78L03k26J99k48j5M22j12l55K27r7J3pj07L36j51q4K84
3693B18j52r8p7k71L92j7j29J60k39K26M9q4R5Q2j36J3r9J19j11J19NL2Q2k29
$$ plain form
3717 -50 -8 157 61 -114 -125 -78 13 -236 -37 89 -133 -82 -49 211 52 -68 -159 -43 -64 146 -139 33 225
3740 225 128 226 20 -39 54 53 -78 23 0 -96 -365 87 -3 149 107 203 109 -58 -187 17 -99 -137 13 88 18
3765 18 -141 24 18 -48 -29 -28 -34 137 132 64 -30 83 48 32 -124 -97 53 165 37 212 -31 123 277 -98 -152 21
3791 21 53 -24 -37 -26 48 230 -87 -90 3 -21 100 -29 -43 195 -46 0 -120 -12 160 -37 158 130 90 -37 34
3816 34 -26 322 -63 193 179 72 63 -114 -97 -38 95 -9 14 9 -92 -149 117 -118 58 -96 -52 188 85 -192
3840 -192 -50 -106 -5 28 109 -78 47 -9 183 93 -29 51 -12 149 22 2 -20 55 -148 -69 -73 28 -72 -137 -196
3865 -196 -107 -30 -20 -93 3 16 35 36 -179 -45 -61 -53 277 -117 -23 185 35 53 35 -44 -74 -25 -47 10 -233 259 -5
3892 -5 -33 157 24 24 209 123 31 22 -31 67 153 -129 15 18 145 240 77 -5 -56 -126 68 -33 133 370 -13 254
$$ packed form
3717e0M2J65r6j75j1M7R1k49J99J26k22N1L3K60j59j20r1J16k1K10k85J72J92
3740B25r7R8k06n9R3jj31J01k3r6k69M52r0J52m2R6r4j67j29K04j16l8J50P5p0
3765A8j59J65oo6J9JoJ71no8r4J13l5j6j56K7J50J12j28J75k43J54J54l75n4J73
3791B1L2p7j3J1P4J82l17lR3k4J21j29j4K38k41M6j20J08J72j97J95k8m0j27P1
3816C4o0L48l85K56j4j07rj77J7N9J33j04K3nj01n7K66k35J76j54M4K40j03k77
3840a92J42n6J01L3Q1j87J25n6J92r0j22Q0o3J61j27k0k2P5k03P9mJ01j00o5n9
3865a96Q9P7J0p3R6J3J9Jk15J34j6QL30l94R4K08j50J8j8p9l0M9k2N7k43M92k64
3892ek8J90j33%J85q6r2rn3R8Q6k82J44LJ27R5j63q2n1p0J94j01J66K37l83K67
$$ plain form
3918 254 -36 -46 -46 -232 65 52 75 63 65 73 -161 133 135 -12 1 49 -123 49 148 39 125 -126 198 -234 -6
3943 -6 -63 141 80 22 -147 -236 -102 185 -121 -92 -69 -34 -167 31 63 34 -45 -31 79 188 176 66 148 66 -13 61
3969 61 -57 -39 -58 8 -68 -137 18 -9 183 -110 10 -129 264 -29 -23 -72 -30 -78 -32 -147 27 -122 114 -69
3993 -69 111 178 54 -43 -171 -23 -91 47 3 31 43 71 147 -9 -52 96 253 79 -134 95 -133 3 -119
4016 -119 -108 73 -92 131 -100 -10 -26 -132 66 0 -143 -259 -122 155 41 47 -60 -96 20 -48 -61 -37 -93 84
4040 84 93 170 -34 -183 -136 46 138 -163 -116 6 -209 -40 -70 40 39 61 -248 20 130 174 54 -85 59 50 -12
4065 -12 -130 -70 -176 78 82 15 131 182 -72 -34 -11 -2 -286 -22 46 75 -59 10 145 55 58 13 4 -133 -38 -179 -127
4092 -127 -47 -66 37 65 357 89 166 -204 3 -24 28 -121 31 -132 -54 -158 47 133 271 189 69 -84 18
$$ packed form
3918B54k90j0%j86K97j3K3j2KQk34K94Kj47J3M8j72J72R9j09Q6k51L24m32K28
3943fn7K04o1n8j69q9J34K87l06K9K3L5j33J98L2k9p9J4J10J09j2j10Q2q2p9P4
3969F1j18J8j9O6p6o9J55k7J92k93J20j39L93k93Om9M2m8M6j15J74j49K36j83
3993f9J80O7j24r7j28J48o8J38m4K8J2K8P6j56m3J48J57j74k13K29k28J36j22
4016a19J1J81j65K23k31R0j6j06J98o6j43j16J37K77j14Oj07l6J16o8j3K4n6J77
4040H4RP7k04j49M7J82R2l01M7J22k15J69l0J10jK2l09K68J10M4j20j39J44ro2
4065a2j18O0j06K54Mo7J16N1k54L8K3Rk84K64O8K9j34O9J35r0Lm5rj37R5j41N2
4092a27Q0j9J03K8K92k68P7l70K07k7N2j49J52j63P8j04K05Q6J38q2j20j53J02
$$ plain form
4115 18 31 43 52 -136 -101 260 11 -34 67 56 -98 -177 162 -156 -93 -163 28 -77 -278 53 -126 205 -183 67
4139 67 147 128 -151 147 13 45 33 228 -94 98 13 -136 -11 124 64 -51 41 174 4 161 -52 43 -58
4162 -58 184 -83 149 -75 -79 -72 -153 26 31 22 9 133 -75 -31 -97 21 -227 50 -80 147 -321 345 -106 131
4186 131 -140 42 5 -59 82 -140 0 -52 11 -52 53 -55 -19 -129 -62 183 -8 182 94 -110 -140 29 110
4209 110 165 -89 -42 4 -44 58 -130 -20 -52 -48 170 186 -97 -291 -111 -6 -189 -56 395 34 32 -154 -194 -38
4233 -38 -2 52 148 134 106 76 8 -36 18 179 365 165 74 -141 93 47 132 -190 -48 157 -74 -47 19 97 -110
4258 -110 81 -76 -231 1 8 -4 -113 -67 134 202 -260 8 -34 -32 -141 -203 -24 156 -62 -28 137 -62 -100 -43
4282 -43 -88 -2 161 -193 -87 -148 80 -118 -52 -66 -138 167 94 36 -102 -244 -113 -51 233 49 186 5 8 54
$$ packed form
4115A8J3J2Rj88L5L61k49m5J01j1j54p9L39l18O3p0J91j05k01L31j79L31l88K50
4139F7Q0j9k79K98j34L2j2J95l22J92q5j49J25J35o0j15R2J33j70J57k13R5j01
4162e8K42k67K32k24mPq1J79Nrj3J24k08M4o6J18k48K77j30K27m68O66m51K37
4186A31k71J82l7o4J41k22J40n2O3o3J05j08L6j10O7K45j91J90q8k04l0J69Q1
4209A10N5k54M7M6m8J02j88J10l2MK18J6k83j94J80J05j83J33M51l61kj86m0J56
4233c8L6N4R6j4k8l0o8m4N4J61J86k00r1k15K34m6Q5l22J42K05k31K7O6P8k07
4258a10J91j57j55K32Pj2j09M6K01O8m62K68m2Kj09o2J79J80k18L4J65j99l8N7
4282d3m5Q6J63l54J06o1K28j98O6j4p2L05p3n8j38j42J31O2K84j84J37j81LM6
$$ plain form
4306 54 25 -90 100 15 -13 47 18 149 -36 -196 -11 -83 259 -4 -124 175 -182 -99 -114 95 79 -115 -119 13
4330 13 79 161 -119 155 81 183 -10 -101 -158 -168 92 -208 68 -95 -109 128 -32 76 -117 -75 189 -103 193
4353 193 -144 -68 -66 86 116 126 -247 69 7 40 14 -73 65 31 -139 215 109 114 194 131 78 -9 -67 -180 -122 -82
4379 -82 140 167 100 -135 113 -27 -78 66 122 124 -134 -54 -192 -28 -236 101 -63 101 31 29 140 -129 -45 1
4403 1 -83 39 127 32 11 -213 236 57 77 213 99 152 -89 206 -163 -80 -112 -103 -16 -137 -125 -266 63 88 172
4428 172 31 176 -87 -57 107 -69 -174 191 183 -118 -205 -96 -67 -175 99 -51 -73 -131 -10 -148 -38 231
4450 231 -87 -251 144 -5 42 93 1 -250 -83 25 -108 -3 68 -118 -6 60 -38 -28 165 -185 -76 60
4472 60 -35 -1 61 -53 335 76 -32 126 154 90 57 -55 110 40 -54 23 -96 -85 -76 -75 -188 156 26 17 15 -177
$$ packed form
4306E4k9j15J90q5k8O0k9J31j85j60J85p2L42k63j20K99l57Q3j5K09j6j94mJ32
4330A3O6Q2k80K74p4J02j93r1n7j0K60l00K76j63j4K37j60J08j93M2K64k92K96
4353A93l37P6KJ52L0J0l73L16o2L3k6q7J38l4j70L54j06NQ0o3n3q7n8j13N8M0
4379h2K22K7o7k35K48j40n1J44N6Kk58Q0j38J64k08L37j64J64p0kJ11k69Q4M6
4403Aq4J22Q8r5k1k24M49j79K0J36j14N3k41K95l69Q3l2RQ7j21J2j41L29K5Q4
4428A72j41J45k63L0J64j76j05L65ql01q7J09K9j08K74j50k2n8J21j38J10K69
4450B31l18j64L95j49M7N1r2k51J67J08j33J05P1j86J12O6r8J0J93l50J09J36
4472F0r5L4O2j14L88k59j08J58K8o4l3j12J65p0r4P7j19J1RJj13L44j30rkj92
$$ plain form
4498 -177 143 177 179 -184 -135 -133 17 112 -196 9 -51 85 -63 51 -128 -105 123 75 42 -81 148 82 -105 -53
4522 -53 80 -59 143 -9 -162 108 -26 88 18 -347 38 31 161 -99 -119 40 -134 -145 -84 117 -76 -119 -113
4545 -113 -63 146 28 -106 61 291 44 -115 -43 -174 21 -190 -39 1 -96 -49 106 -26 125 -350 -54 84
4567 84 -27 -155 -28 22 -170 78 -77 194 -58 62 5 -32 69 92 22 -222 -60 -159 -236 -78 -98 -63 -61 -18
4591 -18 82 112 -66 -57 138 50 30 -2 114 10 -105 -315 -117 46 311 46 2 54 24 8 -75 68 129 -135
4615 -135 196 -177 -272 36 84 92 -107 161 -145 178 -215 -132 6 -403 -25 63 297 -61 -136 -18 184 72
4637 72 -126 120 -93 -71 87 -56 -90 -175 -240 98 -154 126 -6 -104 -213 35 298 234 -154 13 112 82 -11
4660 -11 34 -64 -53 -91 3 96 -24 155 -53 -72 -17 47 -180 42 214 -48 58 57 93 -107 -87 139 218 30 -161
$$ packed form
4498a77L20L4Kl63M9KJ50R5l08K05o0J36j48J14j79K3K28m8l3j23K29o6j87N2
4522e3J33j39K02j52j53K70j34J14p0l65L85pJ30k60k0J59j74j1O1K01j93m3O
4545a13N0K09j18j34J67K30k47j59P2j31J95k11J51M0r7M7J55j32J51m75K96J38
4567H4j11j28J27N0j92K48j55K71k52J20n7l7J01K3p0k44J62r9p7J58k0L5KM3
4591a8J00L0j78RJ95q8k0l2J16j04j15k10J98J63K65k65m4N2l0j6q3J43O1k64
4615a35L31l73r5L08M8Qj99K68l06L23l93Q3J38m09L78Q8K34l58p5J18K02j12
4637G2j98K46k13K2J58j43l4q5o5L38k52K80j32r8j09K48K63o4l88J67R9l0r3
4660a1M5r8J1l8R4R3j20J79k08j9N5O4k27K22J72k62J06jL6k00K0K26P9j88j91
$$ plain form
4685 -161 168 109 -57 194 -35 -62 1 -273 37 10 -76 19 -10 -37 -16 -78 -17 -92 -74 23 -75 -116 -103 236 -20 174
4711 174 -58 140 177 236 -97 -154 -8 55 -119 116 41 -80 -27 -1 -34 74 4 154 -145 53 11 -44 66 50
4735 50 35 -128 -101 -368 340 114 -50 -68 55 -29 230 -80 35 81 29 -65 -70 241 14 -239 264 -20 51 -172
4759 -172 31 16 -179 4 -214 95 -133 91 129 228 217 -33 -116 70 124 194 305 21 21 -37 196 7 56 -77
4783 -77 -171 -110 -188 61 -62 61 51 -125 58 202 65 63 -138 -55 -186 47 55 12 -145 -101 48 219 193 178 -1
4808 -1 -31 -116 -7 34 -3 -170 29 -57 408 9 -39 51 -220 -168 37 137 -88 257 65 21 -72 14 93 -37 332
4833 332 4 235 56 805 102 -404 128 -588 171 202 -14 72 -198 274 296 106 126 185 -4 -44 42 -128
4855 -128 -24 -119 78 -80 -212 -182 -53 -251 -92 61 -53 51 15 182 -154 215 88 -2 -25 26 -3 -118
$$ packed form
4685a61L29n9j66K51k29k7O3k74L10k7q6R5k9k7K1o2O1p5J8R7r8m1J3L39k56J94
4711A74k32J98L7N9l33n7J46O3j74K35p5j21N3K6l3J08p0J50k99J98m2n5J10j6
4735E0j5j63K7k67P08k26j64j8J23q4K59l10J15M6n2r4nL11k27k53N03k84P1k23
4759a72K03j5j95J83k18L09k28K24L8R9j1k50q3J86N4P0J11k84%n8K33j89M9j33
4783g7r4O1p8K49j23J23j0j76J83J44j37kk01Q3j31K33Qm3j57M4J49J71k6j5j79
4808al0q5J09M1l7j67J99q6M65l99m8R0k71N2K05J00k25L45j92m4r3Q6P9j30L69
4833C32l28K31j79P49p03n06N32p16P59L1k16Q6k70M72K2j90K0N9j89m0Q6j70
4855a28J04r5J97j58j32L0J29j98J59J53j14J04l6J67l36L69j27r0k3N1k9j15
$$ plain form
4877 -118 -229 -51 24 -183 11 178 -113 -242 3 -66 -18 -17 56 -138 -91 -64 168 0 -255 0 -41 163 -59
4900 -59 33 130 248 54 -8 -379 33 56 -156 -111 -151 -237 54 -148 55 -69 28 -131 -237 127 106 -28 -100 177
4924 177 -292 -73 -117 150 -15 178 -56 45 75 -59 123 101 63 -147 -306 -69 -67 -199 49 -13 -123 -82 -135
4947 -135 34 45 -188 -22 95 244 -19 -33 -152 -51 95 53 -294 -220 43 57 -155 26 -45 -83 120 125 37
4970 37 145 -129 161 93 42 -107 108 19 34 -130 -245 1 -84 57 -66 -80 -18 248 -206 12 156 82 22
4993 22 4 20 -116 125 208 -148 -99 77 190 -5 -76 -157 51 58 67 38 -46 11 29 97 -319 134 -100 105 -197
5018 -197 -185 -136 -90 -20 -80 34 -127 22 105 74 15 -156 -115 123 -10 58 -220 -14 29 41 -41 -163 0 -85 -136
5043 -136 -120 103 -240 71 -34 -142 23 21 189 -19 44 -22 -211 166 205 -115 -93 19 130 -120 16 51 -31
$$ packed form
4877a18j11J78P5k07J94J67k91j29K45o9M8JP3j94M7K7K32j68k55K55m1K04k22
4900e9R2R7J18j94o2l71M12K3k12M5m0q6K91k02K03j24R7j59j06L64k1j34p2K77
4924A77m69K19m4K67j65J93k34J01L0j34J82k2l8k10j59K37Kj32K48o2j10M1n3
4947a35J69J1k33J66J17J49k63j4j19J01J46m2l47P4K63J4k12J81p1l8K03Nq8
4970C7J08k74K90o8n1j49K15q9J5j64j15K46q5J41j23j4O2K66m54K18J44p4o0
4993B2j8J6j36K41Q3l56M9J76J13j95p1q1K08PRk9q4N7J8O8m16M53k34K05l02
5018a97J2M9M6P0o0J14j61J49Q3l1n9j71M1K38j33O8k78K06M3J2q2j22J63q5n1
5043a36J6K23l43L11j05j08J65kJ68k08O3o6j89L77L9l20K2J12J11k50J36L5q2
$$ plain form
5066 -31 44 -57 32 86 55 -136 49 187 -37 -22 117 -25 -291 131 -263 38 -2 201 -84 24 -48 -72 -112
5089 -112 -45 -28 199 -112 53 64 36 433 150 118 145 181 49 -195 -218 -132 26 29 45 18 24 -60 69 35 -8 29
5115 29 -18 -77 -60 -5 -271 148 41 53 37 148 90 -78 -21 78 81 -185 -211 116 -344 31 108 161 68 -38 131
5140 131 -13 -256 -190 -52 51 101 -4 2 127 -433 180 -163 -50 42 21 24 -164 4 -105 -12 101 -87 132
5163 132 80 314 160 165 259 -157 -15 14 63 -58 -20 -243 -109 46 -137 -405 106 -66 20 -115 -146 15 118
5186 118 195 103 97 139 -73 339 -128 59 -43 59 262 -135 -200 50 -34 51 2 -110 -90 22 103 -55 202 54
5210 54 -142 -13 -181 -68 45 -38 189 375 -56 -95 56 13 55 91 -64 25 -173 63 292 -64 29 14 108
5233 108 84 -56 39 121 11 -137 -149 32 90 -67 44 -26 44 279 -153 -143 237 -124 -218 -40 180 -184 39
$$ packed form
5066c1P5j01Q9N4l1j91J85J38k24J5J39j42k66M22l94L01m0K03k85J08p2k4m0
5089a12O7J7K27l11J65J1k8L97k83l2K7L6j32k44k3Q6J58LJ6k7Oq4J29l4m3L7
5115B9m7n9J7N5k66M19j07J2j6J11n8j68N7R9Lk66k6L27m60L75P7N3r3j06J69
5140A31j44k43O6J38J03N0j05OJ25n60O13l43J13R2k1Lj88J68j09R3J13j88K19
5163A32n2K34j54NR4m16J42K9M9j21L8k23J34J55j83k68N11j72Q6j35l1J61J03
5186A18P7r2oM2k12M12m67J87j02J02K03l97o5K50q4Q5m9j12K0J12Q1j58K57j48
5210E4j96J29j68J13J13q3K27J86m31l9J51m3M2L6j55Q9j98K36K29l56R3j5R4
5233A08k4j40R5Q2j10j48j2J81N8j57J11p0P0K35m32J0L80l61r4J78K20l64K23
$$ plain form
5256 39 -55 10 6 79 340 -76 135 60 -56 39 -138 27 -2 -71 -101 116 355 -49 -74 61 39 -8 -26 4 28 -106
5282 -106 -75 -20 205 77 98 161 206 -96 14 279 170 -122 111 -95 128 -30 61 126 48 -44 144 161 -29
5305 -29 49 51 -124 -86 -86 -11 137 93 272 7 -65 -1 79 79 -162 -138 -57 184 214 102 181 -97 71 -132 125 -178
5331 -178 -19 66 30 132 -19 45 180 -103 -162 -58 0 -61 112 -35 352 57 -88 79 251 11 141 -54
5353 -54 106 -194 6 38 -8 -27 49 -259 -159 -150 76 28 -166 -25 17 29 253 -159 -109 78 23 67 93 69 96
5378 96 -107 10 -77 -103 -47 -74 -85 -238 325 -14 -97 -161 196 180 74 19 -11 42 -111 176 -237 -39 -25 -64 -33
5403 -33 -16 -32 197 123 -183 -100 -44 59 -12 -15 -104 -119 78 -160 -103 100 -49 14 -163 90 -33 -94 -174 81 60
5428 60 149 -17 26 -32 -257 56 92 179 189 99 135 28 -20 271 -96 71 -28 -67 -57 -34 43 -10 1 74 -119 -106
$$ packed form
5256C9r4O5mP3K61m16K11p5j16R5j77J65k9o9l0K17K39m04k5J35k2m7j8L0K4j34
5282a06L1N5K25j28K1O3M5l02J10K65j09k92K33k06K23j58R1O5p8r2J88J7j90
5305b9P8Kj75L8%P5J48m4J79k65p2O4Q0%k41K4Q1K41L0j12P9k78J68k03K57l03
5331a78J59Q5l6J02j51O4J35k83n9J04N8o1J73j47L87k95j45J67J72k40J30j95
5353e4J60l00K00L2m6j9P6l08J00RK26m8j94J41M2J2K24m12N0J87n5M4K6k4K7
5378I6k03J17q7k6N6k7j1j53N63l39q3o4L57j6j06n5l0N3j53K87m13J98J4l9L1
5403c3J7j6K29p4l06Q3N6J03p1lq9j5J97k38N7K03j49O3j77K53j23o1q0K55k1
5428F0Q9j66M3n8k25L13L6Q7J0r0L6j07m8K91l67J67r9l9J0K3P7n3J1P3j93J3
$$ plain form
5454 -106 -115 188 -71 45 0 77 -75 -83 161 -50 150 97 160 -111 45 -41 -39 6 57 -164 -225 9 175 19 -151
5479 -151 -68 -212 -232 -25 183 72 52 65 -225 271 123 -75 125 105 -151 -293 118 501 228 131 -130 -14
5501 -14 70 36 30 -6 122 17 63 1 114 -198 19 383 -10 -219 39 -203 -34 -60 68 -133 -81 136 -113
5524 -113 -83 89 294 -12 -25 43 49 6 -285 -202 29 208 169 89 -17 -58 112 -167 -66 -126 -306 65 -58 -9
5548 -9 -130 119 53 -60 -140 20 133 -40 89 14 139 -50 -98 -86 53 65 211 30 129 83 72 238 -237 -251
5572 -251 -32 -27 63 94 -136 46 -63 17 -307 -78 83 5 174 -244 -88 66 87 -182 56 6 64 -60 109
5595 109 111 102 191 93 51 -190 -193 -68 125 66 106 -72 123 -144 -23 35 133 174 193 144 -47 -14 195 35 -57 55
5621 55 -93 25 -80 -14 -115 -114 -85 -21 -37 -75 16 -94 -45 183 2 -193 -17 -240 185 93 -54 -253 -4 -75
$$ packed form
5454a06rL03k59J16m5P7j52qK44k11K00n3O3k71J56q6KM5N1k21o1K34J66j56j70
5479a51Q3j44k0K07K08j11k0J3k90M96j48j98K00k0k56j42M11L83k73r7k61J16
5501a4Q4l4ol6J28j05M6o2J13l12K17L64l93k09K58k42J69k6J28k01N2K17k49
5524a13L0J72K05l06j3O8Om3k91Q3K31J79l9q0j06m1J70k79J01o0j80L71j23M9
5548ij21K49o6j13q0J60J13j73J29p5J25j89m8J2J39J2J46j81R9m6j1J66m75j4
5572b51K19NR0L1k30J82j09Q0l24K29J61p8J69m18J56J54K1k69K38n0N8j24J69
5595A09KrQ9r8m2k41lJ25J93n9M0j78J95k67J21N8R8M1J9m9j91L3K09j60r2J12
5621E5j48J18j05O6j01JK9O4j6l8R1j10M9K28j81j95J76k23M25r2j47j99K49p1
$$ plain form
5645 -75 265 -51 -26 105 -248 -58 79 -10 376 129 89 162 -243 -111 116 149 55 -20 53 -185 84 72 113 18
5669 18 -69 -14 -250 142 -77 -77 11 6 -26 147 -165 -280 -62 69 110 -38 136 26 139 -81 -128 -181 112 -160
5693 -160 40 -72 116 25 239 -125 -23 60 -168 -247 -251 37 20 44 -18 -19 95 43 157 -57 126 115 113 249 267
5718 267 42 88 -100 -130 16 -60 237 -158 189 -164 -14 96 51 13 208 -48 10 -146 9 -168 -179 223
5740 223 175 -206 -42 -8 -14 1 -102 -124 -115 106 -91 15 190 -53 80 -271 59 -162 50 174 -187 85 -160
5763 -160 -21 -54 -13 76 52 26 115 -51 58 -27 318 -7 120 -81 -24 -217 294 250 -51 27 79 -199 -115 -6
5787 -6 -145 244 -30 4 5 -277 -130 -171 -53 9 -44 -251 -63 104 133 31 3 -163 -17 73 -56 -22 -60 134
5811 134 39 112 122 -80 -22 173 -34 -68 121 -91 -139 -19 3 129 -103 158 -69 -76 188 75 -235 -156 -87 129
$$ packed form
5645g5L40l16K5J31l53J90J37q9L86k47m0P3m05J32K27L3r4p5P3k38K69j2M1r5
5669A8q7N5k36L92k19%Q8nl2J73l12j15K18J31M1j48J74j10J13k20m7n3K93k72
5693a60K00j12J88r1K14l64J02Q3k28p9mK88j7K4o2jJ14n2J14k14J83j1kJ36J8
5718B67k25M6j88l0J46p6K97l95L47l53J50J10m5l8J95k56N8j56J55j77j1M02
5740B23m8l81J64L4oJ5j03k2RK21j97J06J75k43J33l51L30k21K12J24l61K72k45
5763a60J39l3M1Q9k4k6Q9j66J09q5L45l25J27k01N7j93N11m4l01P8N2k78Q4J09
5787fj39L89k74L4Jk82J47m1J18O2n3k07J88J67K9j02k8j66J46R0j29L4l8J94
5811A34r5P3J0k02N8J95k07l4J89k12m8J20K2J26k32K61k27pK64j13l10P9O9K16
$$ plain form
5835 129 1 1 92 125 -75 -105 -120 -48 -129 159 74 -62 111 59 120 28 9 -32 -45 -34 81 63 117 203 -189 -84
5861 -84 0 -166 167 -13 112 -184 188 -105 -211 42 -187 151 234 -74 -289 46 34 100 -35 245 -46 -61
5883 -61 3 -137 -31 48 226 36 20 137 -278 -23 53 -109 -84 89 404 75 93 27 31 -44 -93 -19 -70 73 -21
5908 -21 -58 24 138 -80 189 103 -124 -32 11 -74 56 23 403 -108 87 -60 -124 103 99 -248 0 -122 -297 -75
5932 -75 -105 -201 -124 -64 26 -23 182 165 64 28 -159 217 -23 6 100 49 -97 -23 -96 134 134 54 -52 143 229 24
5958 24 195 190 -61 -256 177 -183 -26 -34 41 53 103 162 169 118 -180 -2 67 -36 343 200 10 215 3 -32 11
5983 11 -87 -32 -51 -99 -160 -73 90 111 115 -125 1 112 -251 17 163 111 -8 66 56 7 255 -87 231 183 177 156
6009 156 -6 -157 32 -26 -13 -89 -168 138 0 62 -92 -123 -211 25 -331 0 -6 -28 -42 127 -69 142 -5 -306
$$ packed form
5835A29j28%R1L3k00l0j5P2q1K88q5j36J73n2O1r2j9m1j3J1J15j8N4Q6l92J05
5861h4Q4j66L33j80J25k96L72k93j06K53k29L38Q3l08k15L35j2O6j35K80k91j5
5883f1O4j40J06P9J78j90j6J17m15K55P6j62K5J73L15l29J8o6Mp5m9P4n1J43r4
5908b1l7Q2J14k18K69q6k27R2M3q5J30l3L80n11J95j47o4K27ml47K48j22j75K22
5932g5l0r6P7O0R0m9K05j7j01l6j87L76k40K9R4n1j46P4p3K30%q0j06J95Q6k05
5958B4J71nk51j95M33l60J57qP5J2N0N9Pn1k98J78O9j03L79j43j90K05k12l5M3
5983A1r8N5j9m8o1Q7J63K1Mk40J26J11l63K68J46n2j19P4j0m9K48l42L18m8ok1
6009A56j62j51J89n8J3p6p9L06j38O2j54l1q8K36l56L31ok2j4J69j96K11j47l01
$$ plain form
6033 -306 -3 165 -196 -153 -64 330 -130 61 -44 33 -259 -56 29 22 67 26 98 179 18 -27 -135 20 92 -112
6057 -112 -47 -38 125 134 43 -44 13 -86 5 224 -287 -225 -76 -39 49 -117 189 180 22 -23 -55 58 41 -37 281 -56
6083 -56 168 18 -268 28 52 99 -81 -94 32 300 36 23 52 17 -40 163 34 -61 273 -267 -121 -125 -82 180
6107 180 54 -9 158 58 -313 -215 97 137 49 59 222 165 111 -142 -72 56 95 68 72 51 255 11 50 -26 -33 117
6133 117 182 -102 -73 -189 -11 141 -163 -240 189 -101 -23 209 -8 77 9 27 77 106 -68 99 -105 -111 -226 28
6157 28 38 -112 179 -45 207 -114 39 -114 -82 -55 -146 165 -110 -26 -281 158 -53 145 162 65 -109 166 -36
6180 -36 -196 25 122 31 -106 -191 -166 286 3 38 -112 148 -155 79 2 -11 -21 -96 13 5 285 -107 -97 -168 -3
6205 -3 244 -49 193 -114 20 -113 -211 -89 -6 58 87 6 45 106 -143 44 75 -64 -76 -50 102 -135 -17 -305
$$ packed form
6033c06L03J68l61M3Q9L94m60J91j05P7k92K03Q5pM5m1P2Q1j61m5j08J55P2k04
6057a12O5RJ63Rr1q7N7r9R1K19n11O2J49L7Q8j66L06rj58m5l2J13j7p8L18l37
6083e6K24j50k86K96K4M7j80j3J26K68k64j3K9l5n7K03j29r5L34n40J46mM3K62
6107A80j26o3J67j00l71R8L12M0q8J0J63n7n4k53P0J28L9k7Mk1K04k44L9p6pJ50
6133A17O5k84K9j16J78J52l04p7M29k90P8K32k17Q5o8J8N0K9j74J67k04oj15K54
6157B8J0j50K91k24K52l21J53j53L2K7r1L11k75Q4k55M39k11J98J7r7j74K75k02
6180c6j60K21R7r1j37q5K5M52k83L5j50K60l03K34p7j3j0p5J09qK80l92J0p1J65
6205cK47k93K42l07J34j33r8J22Q3O4K9q1L9O1k49J87L1j39j2K6J52k37J18k88
$$ plain form
6229 -305 -61 31 -40 -57 29 53 57 -1 -26 -96 55 -77 -77 -184 93 204 0 -129 -106 -39 -17 -134 -29 256 37
6254 37 -92 112 73 -222 70 77 205 -177 -147 77 -144 -68 -146 -225 75 160 -82 -56 -60 270 -103 -27 90 -60
6278 -60 72 -71 161 -7 96 -55 42 92 -230 -110 322 -89 54 198 214 -112 -44 169 -111 110 -21 -67
6300 -67 -3 -45 -150 88 61 66 -57 225 49 -15 -47 127 72 -26 -2 -49 0 -235 356 223 -140 -17 203 -44
6324 -44 104 109 -57 31 -32 -38 -115 -295 -84 85 130 77 99 126 26 69 108 -59 -36 119 -7 -61 -58 -61 -123 -120 32 153
6352 153 -183 -151 -53 259 22 -151 -10 -367 -160 -58 333 -19 -124 -199 16 -60 455 218 -312 298 117
6373 117 -532 -323 -317 12 -483 -462 495 -307 -239 1073 20 -188 -189 -200 56 164 -90 -57 -44 -134 -231 30 61
6396 61 -95 31 -122 -62 78 -41 155 -2 156 166 -15 240 53 -125 -140 81 152 267 65 -127 -151 22
$$ packed form
6229c05K44R2p1j7Q6K4Mn8k5p0J51j32%j07K77J11k04j29K3O7K2j17J05K85k19
6254C7j29K04l9k95K92PJ28l82L0K24k21P6p8p9L00Q5k42K6mL30l73P6J17j50
6278f0J32j43K32j68J03j51R7N0l22J20M32m11J43J44J6l26O8K13k80K21j31m6
6300f7O4m2j05K38k7Nj23K82j76o4l2J74n5r8K4m7M9k35N91j33l63J23K20k47
6324d4J48Nj66Q8o3op7j80K11J69M5n3K2K7j00M3L9j67K3J55j26n4Llo2LJ52J21
6352A53l36L2R8L12k37j73J41l57K07J02L91l52j05p5K15p6N15k37n30O10j81
6373A17o49K09OL29m95K1R57q02O8J312j053k08jj1K56J08k54L3J3r0r7K61L1
6396F1j56J26j53O0J40j19J96j57J58J0j81K55j87j78j5K21P1J15k02j92k4J73
$$ plain form
6418 22 7 5 -71 97 -112 89 4 84 -213 -96 -32 -47 -62 175 -36 -165 -162 -192 -116 32 -164 266 -259 -111 -44
6443 -44 -2 -103 296 65 188 -143 -108 -143 -77 28 158 -262 -60 126 -72 -190 -10 -50 136 -157 -422 -143
6465 -143 -105 -117 -97 159 130 -152 18 -93 107 159 29 133 -13 -243 -41 179 -161 125 -47 131 36 133
6487 133 -54 133 44 178 12 3 79 62 -183 -40 75 363 -62 120 217 29 -20 -161 -131 -95 -33 48 10 148
6511 148 -34 -61 -40 43 -33 139 296 157 -59 231 -112 192 111 -158 60 152 10 68 169 -29 -130 179
6533 179 154 -138 -65 69 -85 45 48 -43 269 -69 51 78 -21 -14 115 -38 -50 -134 -274 -45 -97 -6 146 -105
6557 -105 128 -146 -156 6 57 20 7 180 -143 93 -86 81 -40 -4 16 -39 -23 -66 -23 23 98 -22 9 -29 -4
6582 -4 159 109 -167 -50 41 7 -28 -102 -29 -34 -109 -51 -95 25 -54 45 249 86 -76 185 -222 38 -163 -322 232
$$ packed form
6418B2j5kp6J68k09K01q5Q0k97J17O4j5j5K37k11j29Ll0P6J48j96M30n25J48O7
6443d4M2j01L99k31J23l31L5l5O6J05J30m20K02J86j98j18J80m0J86k93k65K79
6465a43L8j2K0K56k9k82J70j11K00N2j30J04j46k30K02K20l40K86j72J78r5R7
6487A33j87J87q9J34j66rP6j7k45J43J15K88m25J82R7j88m9j41L0L6O2Q1l8J38
6511A48j82k7K1Q3p6J72J57j39k16K90l43L04q1k69K18R2j42N8J01j98j01L09
6533A79k5k92P3J34j54J30Lr1L12l38J20K7r9PJ29j53j2q4j40K29n2R1J52k51
6557a05K33k74j0J62N1l7j3J73l23K36j79J67j21L6K0n5J6m3M3M6P5j20L1l8K5
6582dJ63n0k76J17R1l4l5p4P3np5N8m4J20p9R9K04j63j62K61m07K60k01j59N54
$$ plain form
6607 232 -211 -126 -15 -146 -88 92 -62 52 -9 10 -131 64 -64 21 -155 -33 -152 57 -52 -111 34 36 -72
6630 -72 -20 -76 129 17 1 -23 -208 168 107 -62 -210 79 182 163 108 132 -73 -143 10 105 -40 -187 235 -340
6654 -340 -72 128 107 2 117 53 13 -39 52 -129 -24 76 118 -247 215 230 -204 23 100 -155 -157 31 171
6677 171 6 228 -5 -28 89 -46 -150 -78 -358 86 -34 111 35 -189 25 14 -100 -29 -13 -10 -30 -16 -1 -110
6701 -110 -93 -107 -25 2 115 -124 71 166 3 49 -9 -133 -86 70 122 -236 188 -60 -54 226 -13 -166 -119 -3
6725 -3 201 -98 -141 108 58 55 46 10 77 177 96 -66 94 -80 155 54 -82 142 25 41 -214 -259 90 76 77
6750 77 -154 39 -21 -248 -250 100 99 290 -20 90 -67 289 233 -119 -51 10 77 160 -488 -288 -73 -329 364 231
6774 231 217 62 -293 -355 67 -159 38 -309 291 368 -45 -21 374 85 -93 125 -195 531 -409 86 374
$$ packed form
6607B32m43Q5J11j31N8J80j54J14o1J9j41J95j28Q5j76J22j19K09j09n9J45Kj08
6630g2N2n6K05j12j6k4j85L76o1j69j48K89J03j9n5K4k05p0J53R5j45j47M22n75
6654c40K68K00k1j05J15o4m0n2R1j81J05J00M2l65M62J5m34K27P7k55kJ88J40
6677A71j65K22k33k3J17j35j04P2k80M44j20J45p6k24K14j1j14P1J6Lk0J4J5j09
6701a10J7j4Q2K7J13k39J95R5j63M6n8j24M7J56N2l58M24k48OK80k39j53M7J16
6725cK04k99m3K49n0lrl6O7J00q1j62J60j74K35j01j36K24j17J6k55m5L49j4J
6750G7k31J93o0k27kL50jJ91l10J10j57L56n6l52O8O1O7Q3o48K00K15k56O93j33
6774B31j4j55l55o2M22k26J97l47O00P7m13K4L95k89j78K18l20P26r40M95K88
$$ plain form
6795 374 -554 507 452 259 -58 -178 -13 59 -90 -82 -286 -242 -445 134 -500 338 -420 181 802 113 161 -699
6817 -699 -1012 -709 399 1005 -651 -304 165 -190 -361 -419 -155 -337 -562 -229 -88 -696 -134 212 -272 249
6837 249 253 -35 -165 409 351 -457 -329 413 52 -172 -165 117 -136 -68 -427 86 180 -175 701 219 516 267
6859 267 43 -341 -265 242 129 -384 497 15 -573 124 320 -187 -416 346 408 -189 -48 367 264 13 -385
6880 -385 -21 4 284 -36 6 350 -810 387 -480 -19 -672 -43 -356 555 777 -522 -360 -442 -593 -225
6900 -225 544 228 11 194 -287 172 6 214 -145 -177 128 -624 -22 498 -467 -89 0 55 -1 -161 -72 -98
6922 -98 67 284 -110 51 -48 -9 65 -101 255 71 3 83 -216 -116 19 80 -185 71 162 -26 112 38 131
6945 131 157 172 120 -102 -199 94 5 -67 -48 -179 -89 96 28 260 -210 112 -40 334 -38 -186 73 -105 33
$$ packed form
6795C74r28J061n5j93l17j20J65P2j49Qk04M4k03N79o34Q38p58O01O21o89M8q60
6817f99l13L03J108O06j656L47M69l55j71n8K64j82k25L33J41o08N62L46m84N21
6837B49Mk88j30N74n8q08J28P42l61k24PK82k53O8l59N13R4l55Q76m82K97k49
6859B67k24l84P6N07j13n13Q81m82n88O97J96n07k29P62O2n97J41M15j03k51l98
6880c85L64K5K80l20M2L44j160J197q67M61o53O29l13R11K22j299J62q2j51L68
6900b25P69l16k17J83m81M59j66K08l59l2L05p52O02N20r65L78Q9N5n6j60Q9k6
6922i8J65K17l94J61r9L9P4j66L56j84o8Q0k99J00J35O1k65K56R1j88J38p4R3
6945A31K6J5n2k22r7K93q9p2J9j31R0J85o8K32m70L22j52L74l72j48K59j78J38
$$ plain form
6968 33 132 52 -94 75 33 -79 -243 -289 -128 -28 -234 -34 40 109 -76 127 -23 -27 5 145 88 -210 70 116
6992 116 -30 159 77 -216 288 342 65 539 710 -498 -12 424 -297 -60 -3 77 -266 165 516 527 -27
7013 -27 390 -54 -84 343 228 -848 115 -304 -246 -41 248 -10 -304 -536 -375 -27 -359 10 -38 -101 -180 -113
7035 -113 -148 -372 -133 2 -56 -34 -219 65 319 -27 -108 -125 -140 67 69 -67 206 74 87 -165 134 -114 112
7058 112 -128 -123 -7 70 -297 154 42 -196 -20 -140 260 268 -236 -484 -69 -23 -244 230 246 -95 -426 35
7080 35 -320 -623 -266 64 -351 -335 -250 15 -159 -47 -374 -381 68 96 -441 46 351 -480 -399 114 -952 -60
7102 -60 131 -674 489 -389 53 -555 31 1149 94 738 342 83 398 248 72 -255 -255 -364 -58 307
7122 307 -709 -584 109 99 495 262 288 -123 -152 122 -221 406 -689 353 -167 79 -112 -160 -117 -319 -139
$$ packed form
6968C3R9q0j46J69m2j12j64m6J61J00k06K00P4O9j85K03j50mL2J40n7k98K80M6
6992A16j46J89q2k93N04N4k77M74J71j208M86M36p21K37N7Q0l43M31L51J1n54
7013b7M17m44l0M27j15j076R63m19N8K05K89k58k94k32J61L48l32L69m8o3p9O7
7035a13l5k24K39J35n8K2j85K84K54l46q1j7j5K07Kj36K73j32J3k52K99k48K26
7058A12k40NJ16P7l67M51j12k38J76j20M00Qn04k48M15M6k21M74J6l41l31M61
7080C5l55l03L57L30m15J6Q5K65j74J12l27pM49K8n37M87L05q31Q1N13j066Q92
7102f0J91q05J163q78M42o08N86J118j055O44l96k59L15j50j76l27%j09L06L65
7122C07j016J25O93j0L96k33K6m11k9K74l43O27j095J042n20K46j91m8M3k02J80
$$ plain form
7143 -139 173 913 -251 128 -104 -400 -305 -472 -440 -250 -740 955 -310 490 -333 301 -153 120 290 -927
7163 -927 112 -235 251 -136 -27 136 -1119 -951 -148 -393 -432 -403 -28 278 -18 128 80 -232 208 -91
7183 -91 23 594 113 372 182 221 126 366 -391 -10 156 180 -121 47 -111 17 -9 -91 -71 213 91 272
7205 272 148 -357 44 -51 77 68 83 -215 -60 -271 -119 30 -46 -205 -47 -66 185 77 -46 133 240 82
7227 82 54 -147 -55 -61 312 117 -428 -37 -7 -96 365 -174 -87 574 -460 17 -460 34 374 47 107 -574 -370
7250 -370 -9 87 -407 -720 -23 -592 436 585 110 -104 -299 86 352 -121 -62 85 69 -206 -162 30 55
7271 55 39 -4 -161 -66 257 -10 -55 350 231 -61 111 147 81 2 12 -214 191 -17 -105 -257 -230 -132 -206 0
7295 0 16 6 0 35 183 187 -104 -61 -4 122 242 59 -308 -432 317 145 48 55 107 -600 -139 158 -159 342 -9
$$ packed form
7143a39L12P40j164L79k32k96R5j67L2J90m90J695j265Q00q23O34m54K73J70j217
7163i27J039l47M86l87J09J63j255J68Q03k45l9K9L75L06k96J46m8l12M40k99
7183i1J14N71m81K59j90L9r5K40p57L81J66K4l01J68j58J28k6q2K0K84j22J81
7205B72j24n05M01r5J28rJ5k98J55k11J52J49p6j59J58j9K51j08j23J79J07j58
7227H2k8k01R2oL73j95n45L91L0q9M61n39Q7O61j034M77m77M94L40l27O0o81K04
7250c70L61R6m94l13O97n69J028J49m75k14j95L85K66m73N9J47j6k75M4J92K5
7271E5j6m3j57R5L23k67m5M05j19k92J72L6o6p9J0k26M05k08q8j52K7R8p4K06
7295@J6j0oL5J48Mk91M3N7J26J20j83l67j24P49j72r7PN2p07M61K97l17N01l51
$$ plain form
7320 -9 686 1019 57 -432 -119 115 419 -115 -84 -85 33 21 58 -289 -95 217 40 69 124 100 -108 -103 -81 -64 32
7345 32 46 -195 72 85 246 -89 18 81 -94 89 103 -23 76 213 -50 -68 260 9 -59 -56 98 -134 53
7368 53 -23 136 323 -35 -30 -60 -77 -111 80 75 162 -55 -258 -82 158 -183 78 -29 26 -1 119 -85 -144 11
7392 11 5 165 84 43 -48 -17 129 -105 -144 -180 -102 -39 194 5 -76 -101 -139 227 -68 39 134 160 65 66 -106 -67 -77
7419 -77 295 198 93 -691 172 197 94 16 -145 455 2 124 68 -241 -73 280 -82 -71 -126 242 198 67 -15
7442 -15 18 105 42 -206 -126 75 -32 13 -25 -96 105 11 -53 96 -6 199 15 -292 10 28 82 -8 9 -208 -94
7467 -94 -13 -69 -135 41 68 -74 -94 -42 -126 -221 114 86 -107 110 90 4 -21 -57 43 -41 12 -92 284 -110 145
7492 145 20 100 26 -31 21 210 211 138 57 28 125 28 4 146 -69 -3 57 -120 -70 -137 -83 63 -75 77 184 -60
$$ packed form
7320iO95L33r62m89L13K34L04n34L1jJ18j2L7l47J94L12j77K9N5k4k08NK2J7R6
7345C2J4k41K67J3J61l35J07O3j75J83J4j26R9J37k63j8L28k51o8LJ54k32J87
7368E3p6J59J87l58Nl0j7l4J91nQ7k17k03J76K40l41K61j07N5k7J20k04n9J55
7392A1oJ60q1m1r1L1J46k34l9l6P8O3K33j89q1k5l8L66k95J07R5K6r5Jj72L9j0
7419g7L72r7j05p84Q63K5j03p8j61O00m53J22n6l09J68L53l62J1n5L68m4j31q2
7442a5L3Q7o3k48Q0K01j07M5l8p1K01r4o4J49j02K05j84l07L02J8N4r0J7k17J14
7467i4Q1n6o6J76K7j42k0N2q4r5L35k8j93K17k0q6k5l6J00q4N3j04L76l94K55
7492A45j25Q0p4n7N2J89Jp3q1k9R7r7k4J42k15O6O0j77N0o7N4J46j38J52J07k44
$$ plain form
7518 -60 -87 127 283 53 23 0 -104 -57 249 77 -64 -61 112 28 33 127 -56 -171 -127 -228 -63 -122 7 -167
7542 -167 29 -73 -83 106 85 415 -85 37 -99 39 -90 -61 15 60 56 362 -523 83 341 -320 158 32
7564 32 -83 1 74 -110 88 -213 141 156 -168 -112 -319 217 -117 109 -161 -203 109 147 -20 -29 147 122 -23
7587 -23 20 72 65 -1 -110 -169 -37 -49 -452 -89 -3 -87 -156 43 -226 59 58 219 -687 226 -256 162 522 -213
7611 -213 257 137 77 106 10 191 251 -23 256 -28 -137 -229 67 105 -34 117 -79 -98 51 29 217 -37 140
7634 140 16 -74 -63 230 85 238 176 -39 -85 -51 146 141 -157 -83 73 -61 23 8 112 -35 -136 214 269 117
7658 117 -41 -166 42 -146 -57 111 161 150 136 -12 28 -196 -34 7 38 -36 -41 -5 40 7 -185 -10 -14 -93 -205
7683 -205 -114 -55 144 53 -172 0 113 -182 -25 -48 -37 146 -120 110 -126 -101 -65 -25 136 197 -179 198 -183
$$ packed form
7518f0k7K14J56k30l0k3j04M7L06j72j41LJ73q4NR4j83j15M4j01J65n9J29j74
7542a67J96j02j0J89k1L30n00J22j36J38j29K9P6M5mL06q85O06K58o61M78j26
7564C2j15Q4P3j84J98l01L54J5l24N6k07N36l34K26k70m2L12L8j67rJ76k5j45
7587b3M3N2po6j09n9J32j2m03L63Q6q4o9J99k69K85jJ61r06R13m82M18L60p35
7611b13M70j20o0K9r6J81O0k74K79k84j09r2K96L8j39J51j96j9J49k2J88k54J77
7634A40j24r0J1K93j45J53o2k15m6L4J97nk98P4J56j34Q4j5J04j47j01L50N5j52
7658A17j58j25K08j88Q9J68N0j1j4j48M0k24J62M1L1p4nL6M5l3j92J75mp9j12
7683b05R1N9J99r1k25J72J13k95J57k3J1J83k66K30k36K5L6M0J61O1l76L77l81
$$ plain form
7706 -183 103 -22 -204 -376 -240 -275 153 654 292 321 -58 509 445 591 -271 -193 414 -207 -1082 301 796
7727 796 -412 -817 315 23 -13 78 -41 274 422 358 277 250 248 181 378 -132 216 199 -44 346 170 -27
7749 -27 268 -79 -556 -369 -251 -183 305 285 401 221 216 272 -167 86 -95 340 -34 -39 363 254 -198 -104 -21
7772 -21 216 -67 108 -114 -100 -103 -12 -302 -72 -160 -19 -235 -176 90 -260 93 -122 -29 61 -83 -87 13 -91 -79
7796 -79 -101 -105 136 -81 104 -170 113 -371 -169 -72 46 239 133 -1154 35 555 59 -7 -412 151 70 312
7818 312 -14 -148 -43 -135 288 306 -34 32 -61 -365 104 -40 -99 110 -102 -56 -115 29 -100 -111 -97 -23 -5 -221
7842 -221 -94 142 14 -33 -114 9 32 -7 -137 29 34 82 35 19 -7 15 -201 -28 0 -52 357 -34 21 63 -292
7867 -292 -148 -27 164 80 5 -26 -190 -74 29 71 64 -89 -73 -14 48 202 -49 -141 289 -59 219 129 157 -79
$$ packed form
7706a83K86j25j82j72J36l5M28N01l62K9l79N67o4J46q62P8O07o21q75J383M95
7727G96j208m05J132k92l6R1j19L15J48o4q1k7ko7J97n10L48j7k43L90j76j97
7749b7K95l47m77J87J18O8M88k0J16j80nN6m39K53j81M35l74nM02j09m52R4Q3
7772b1K37k83J75k22J4lR1k90K30q8J41k16N9K66l50L53k15R3R0j44mJ00j04J2
7796g9k2mK41k17J85k74K83m84K02R7J18J93j06j287J189N20m96o6m05N63q1K42
7818C12l26j34J05r2M23J8l40O6r3l04M69j44n9K09k12M6n9J44j29j1J4P4J8k16
7842b21J27K36j28m7q1J23K3l9j30J66NM8m7j6k6K2k16J73K8n2M09l91N5M2l55
7867b92J44J21J91q4p5l1j64J16J03M2pj53J6N9O2J54k51r2M30l48K78r0K8k36
$$ plain form
7891 -79 133 77 -201 388 -40 44 -243 -21 30 109 61 156 -78 16 -256 -34 -150 -27 213 180 244 -30 56 257
7915 257 -222 -38 -267 -41 -33 39 133 51 -53 -162 244 83 29 92 109 -40 73 103 -144 126 -68 -135 115
7938 115 16 21 -9 -19 -22 45 186 91 156 -272 -74 48 -267 -31 -169 -100 -53 38 84 52 71 60 -36 -316 31 -155
7964 -155 -186 -27 146 191 106 100 -107 -184 53 111 -3 80 33 -49 -40 -5 27 -236 -93 -269 164 199 34 -67 13
7989 13 -224 -286 96 -140 34 -93 -201 54 87 144 -50 -167 29 128 -168 -127 194 64 231 -163 -166 -163 44
8012 44 -203 85 -83 97 -201 120 22 -92 95 -249 20 139 -156 -164 181 -67 89 12 -7 -31 64 -91 136
8035 136 235 63 170 -71 -75 -65 103 49 -101 -102 161 9 19 -186 -48 118 -230 -152 5 37 70 -170 55 -134
8059 -134 68 -70 -10 -147 -21 -36 -77 44 39 -119 -273 -5 -202 -151 23 17 -155 -125 62 -51 -15 -9 125 55
$$ packed form
7891g9K12n6k78N89m28Q4k87K22N1P9m8R5k34R4k72K22j16J23K40l3O4k74Q6K01
7915B57m79J84k29K26QP2R4q2j04j09M06j61n4O3J7j49J13L0k47K70j94o7K50
7938A15r9Nl0j0lO7J41r5O5m28J98J22l15K36j38O9M7R1M6l2J9j1r6k80L47j86
7964a55l1J59J73M5q5ok07p7K37N8j14Q3m7q2RL5L2k63J43j76M33L5j65j01Q0
7989A3k37o2L82k36J74j27j08K55L3N7j94j17J96R9k96M1L21j30J67l94lLK07
8012D4k47K88j68J80k98L21r8j14J87l44K69J19k95qL45k48J56p7j9k4R5j55K27
8035A36R9j72J07k41mJ0J68n4j50jK63j52J0k05J38J66l48P8J57L2L3k40K25j89
8059a34K02j38O0j37J26j5m1J21nj58j54K68j97N1J74oj72L0J87j13L6OJ34p0
$$ plain form
8083 55 -179 132 -145 -25 108 45 -141 357 -67 117 12 114 72 77 -92 134 -70 -305 -354 -114 297 63
8105 63 -216 -171 -283 -99 -116 -30 -208 148 -2 125 290 100 -62 -56 60 -184 62 -129 83 -124 -56 112
8127 112 -44 -25 -23 47 -173 166 -32 -16 -7 30 81 66 -185 50 -108 -165 -372 -111 117 -123 7 97 -7 -110
8151 -110 204 228 18 214 78 -100 25 75 183 162 -24 -14 -29 128 -104 -100 9 -68 -31 -222 -73 108 269
8174 269 -28 -199 40 -13 -336 5 121 -50 -51 250 -91 -39 -201 43 -114 80 66
$$ packed form
8083E5k34L11k77J20J33o3j86M98m24J84j05J02m2Nj69K26k04k35m9K40M11k34
8105F3k79M5j12J84j7Q6j78L56j50J27J65j90j62OJ16k44K46j91K12k07O8J68
8127A12j56J9KP0k20L39j98J6RL7N1j5k51K35j58n7k07K61K28k40J30R0j04j03
8151a10L14K4k10J96j36j78J25N0J08k1j86J0j5J57k32MJ09p7L7j91J49J81J61
8174B69k97j71K39n3l23L41J16j71jL01l41N2j62K44j57J94j4
8191F6
$$ Imaginary data points
##PAGE= N=2
##DATA TABLE= (X++(I..I)), XYDATA
$$ plain form
0 0 0 0 0 0 0 0 0 0 0 0 0 0 0 8 -8 8 -8 9 -16 16 -23 24 -32 32 -40 48 -56 64 -72 83 -96 110 -123 142 -161
35 -161 179 -201 226 -252 280 -312 348 -386 426 -473 523 -578 635 -700 773 -850 936 -1032
53 -1032 1138 -1258 1393 -1545 1722 -1925 2167 -2455 2811 -3257 3839 -4632 5783 -7609 10969
68 10969 -19202 85939 52960 -124512 -27350 67176 62203 -64274 -80248 49076 99947 -44842
80 -44842 -101817 39760 109478 -40900 -102240 30922 99707 -17361 -101042 -3044 104185
91 104185 3792 -113212 -12296 108598 12636 -103773 -24313 98058 28854 -100685 -38431
102 -38431 92873 37999 -89052 -50889 81299 55351 -84657 -60652 78444 60036 -68870
113 -68870 -66238 61171 71502 -60895 -74864 54184 72676 -44924 -75439 37432 81406
$$ packed form
0@%%%%%%%%%%%%%Qj6J6j6J7k5L2l9M7n6O4p2Q8j04J20j36J55j79K06k33K65l03
35a61L40l80M27m78N32n92O60p34Q12q99R96j101J213j335J473j623J786j968
53a032K170k396K651k938L267l647M092m622N266o068P096q471J0415j3392J8578
68A0969l0171J05141l2979j77472R7162R4526m973j26477j5974J29324N0871j44789
80d4842n6975J41577O9718j50378o1340J33162O8785j17068q3681R7998J07229
91A04185j00393j17004J00916J20894r5962j16409P9460J22371o9204j29539O2254
102c8431J31304n4874j27051L8163J32188k5948j40008K4005J39096j8408j28906
113f8870K632J27409J0331j32397j3969J29048J8492j17600l0515J12871M3974
$$ plain form
124 81406 -31325 -81614 29126 83279 -19246 -80297 14300 84171 -5928 -81806 2628
135 2628 81558 5677 -76826 -10806 80256 20199 -77324 -20367 77772 25550 -70675 -29020
147 -29020 69658 37280 -66181 -39412 63031 42671 -56303 -46978 52531 52906 -50569 -55682
159 -55682 45132 55083 -40094 -59812 33441 62424 -31262 -65710 25273 63785 -21892 -67248
171 -67248 14091 66752 -13017 -69694 5777 64727 -4008 -66506 -4694 64263 7863 -66006
183 -66006 -13546 61763 16028 -60656 -22386 58215 26096 -57381 -29630 53318 31900 -49627
195 -49627 -36869 47222 41247 -44487 -42626 42141 45579 -35822 -47065 33874 52249 -28918 -51075
208 -51075 26860 53914 -19112 -53046 16962 57281 -11430 -55413 10352 57375 -3351 -55090
$$ packed form
124H1406j12731n0289J10740N4153j02525o1051R4597O9871r0099p5878Q4434
135B628P8930p5881q2503O6020R1062o0057r7523N6957R8139n2222r6225M1655
147b9020R8678l2378j03461K6769J02443k0360r8974R325R9509L75j03475n113
159e5682J00814R951r5177j9718R3253K8983r3686l4448R0983L8512q5677m5356
171f7248Q1339N2661p9769n6677P5471N8950o8735o2498O1812O8957n6400p3869
183f6006N2460P5309m5735p6684L8270Q0601l2119q3477K7751Q2948k1418q1527
195d9627J2758Q4091n975q5734J861Q4767L438q1401j1243Q0939J8375q1167k2157
208e1075P7935K7054p3026l3934P0008M0319o8711m3983O5765M7023o0726n1739
$$ plain form
220 -55090 556 57578 5027 -55445 -6551 55741 11799 -53196 -15578 53510 19746 -51429
232 -51429 -21655 49061 24805 -46451 -29513 42994 31916 -42355 -35089 38126 35768 -35696
244 -35696 -40859 31335 41727 -30647 -44547 25699 43411 -23353 -47879 17095 47067 -16862
256 -16862 -49753 11329 47691 -8627 -49628 3169 48932 -1422 -49602 -2446 47241 5892
268 5892 -47153 -10560 46501 13499 -45692 -15577 44053 19830 -41163 -22629 40890 26457
280 26457 -38241 -26920 36969 30844 -32095 -32112 31503 36592 -27542 -35453 26875 38600 -21169
293 -21169 -38795 19804 41807 -15971 -40939 14653 42593 -9135 -41941 7432 44182 -4110
305 -4110 -43356 1908 42746 2260 -42333 -6126 42011 7954 -41981 -11195 38974 13397
$$ packed form
220e5090N5646N7022n2551o0472M8894O2292m3942o4995L7618O9088l3764p1175
232e1429K9774P0716k4256p1256J6938P2507j1078p4271P266P3215k358p1464
244c5696n163P2194J0392p2374j3900P0246J7712o6764k4526O4974K9972o3929
256a6862l2891O1082L6362n6318m1001N2797M5763n0354m8180M7156M9687m1349
268E892n3045L6593N7061l3002n9191L0115N9630k4223o0993J8534O3519j4433
280B6457o4698J1321O3889o125o2939j7O3615N089o4134p911O2328J1725n9769
293b1169j7626N8599K2003n7778k4968N5592K7940n1728l2806M9373L6750m8292
305d110l9246M5264M0838m0486m4593L6207M8137l4057m9935L0786N0169k5577
$$ plain form
317 13397 -38414 -17547 36475 18455 -36627 -22010 32569 22580 -31996 -27260 28422 27447 -28809
330 -28809 -30382 24257 30555 -22853 -34157 18840 34039 -18524 -36056 14564 35520 -11709
342 -11709 -36822 8727 37752 -6862 -37780 3930 37361 -823 -37071 -1892 37740 4445
354 4445 -35890 -5909 35307 10398 -33684 -11468 34582 15612 -32211 -15884 31673 19574
366 19574 -28447 -20743 28616 24115 -25806 -23693 24644 26449 -20640 -27209 19974 29590 -17402
379 -17402 -29827 15337 30924 -12198 -31772 10272 33280 -8402 -32891 5469 32492 -2896
391 -2896 -33596 -500 32864 1041 -33572 -4527 31263 5686 -31908 -9930 30436 10400
403 10400 -30732 -13471 27599 14230 -27991 -18164 25408 18588 -25535 -20718 22468 21376 -21261
$$ packed form
317A3397n1811K0867N4022j8020n5082J4617N4579r989n4576M736N5682r75n6256
330b8809j573N4639O298n3408j1304N2997J5199n2563j7532N0620K0956m7229
342a1709k5113M5549K9025m4614l0918M1710L3431l8184l6248L5179L9632l3295
354D445m0335K9981M1216k4909m4082K2216M6050j8970m7823J6327M7557j2099
366A9574m8021P704M9359m501m9921K113M8337J805m7089o569M7183R616m6992
379a7402j2425M5164J5587m3122j9574M2044K3008m1682k4489L8360K7023l5388
391b896l0700L3096L3364l1823l4613K9045L5790k5577l7594K1978M0366k0036
403A0400m1132J7261M1070j3369m2221R827M3572o820m4123M817M3186j092m2637
$$ plain form
416 -21261 -24335 18872 25239 -17855 -25888 15216 26533 -13139 -27936 11448 28951 -9021 -28589
429 -28589 7470 29163 -4055 -29115 2946 30294 297 -28757 -1095 29660 4979 -27864
441 -27864 -5964 29180 9130 -27061 -9194 26863 12553 -24643 -13797 24995 16012 -22751
453 -22751 -16505 21958 18753 -19652 -20088 18757 21343 -17252 -22268 15167 23004 -13234 -24625
466 -24625 11041 24801 -10138 -25858 7185 25413 -6044 -26852 2694 26187 -2699 -27049
478 -27049 -649 25341 1626 -26636 -4550 25099 5014 -25551 -7877 23633 8925 -23634
490 -23634 -11552 22142 12348 -21838 -14415 19828 15740 -18811 -17297 17959 18428 -16414 -18759
503 -18759 15010 20065 -12781 -20631 11957 22344 -9797 -21556 8929 23190 -5665 -22727
$$ packed form
416b1261l074M3207O367m3094q033M1104J1317l9672j4797L9384J7503l7972j9568
429b8589L6059K1693l3218k5060L2061K7348k9997k9054K7662L0755k4681l2843
441b7864K1900L5144k0050l6191J7867L6057j4310l7196J0846L8792q983l8763
453b2751O246L8463l205l8405m36L8845K586l8595n016L7435P837l6238j1391
466b4625L5666J3760l4939j5720L3043J8228l1457k0808K9546K3493k8886k4350
478b7049K6400K5990k3715k8262K2086K9649k0085l0565J7674L1510j4708l2559
490b3634J2082L3694r794l4186P423L4243m088l4551J514L5256M69l4842k345
503a8759L3769N055l2846p850L2588J0387l2141j1759L0485J4261k8855j7062
$$ plain form
515 -22727 5473 24183 -2851 -22686 2082 23707 1428 -22598 -1996 23706 4296 -22246
527 -22246 -4899 22417 7342 -21277 -8337 21258 9784 -19817 -10933 18743 12585 -17709
539 -17709 -14562 16684 15059 -16103 -16176 13739 16762 -13285 -18559 11323 18428 -10753 -19824 7986
553 7986 19448 -7584 -20960 5282 20612 -5081 -21393 2019 20552 -1309 -21357 -756
565 -756 20663 1340 -20638 -3838 19617 5100 -19568 -7020 19310 7773 -18237 -9186 17639
578 17639 10726 -16580 -11521 16264 12889 -14624 -13151 13932 15095 -12164 -15348 12292 16952
591 16952 -9820 -16147 9867 17812 -7162 -17842 6918 18778 -4370 -17984 3664 18953
603 18953 -1498 -18544 969 19099 524 -18135 -1566 18207 3653 -18203 -4751 17506
$$ packed form
515b2727K8200J8710k7034j9835K4768K1625k2279k4026K0602K5702j9410k6542
527b2246J7347K7316j5075k8619J2940K9595j1474k9601Q884K9676o158l0294
539a7709L147L1246j625l1162p3K9915L023l0047n274K9882P105k9181r071K7810
553G986J1462k7032j3376K6242J5330k5693j6312K3412J8533k1861k0048K0601
565g56K1419j9323k1978J6800K3455j4517k4668J2548K6330j1537k6010R051K6825
578A7639o913k7306N059K7785l375k7513J473K7083J163k7259l184K7640M660
591A6952k6772o327K6014P945k4974j0680K4760J1860k3148j3614K1648J5289
603A8953k0451j7046J9513J8130j8575j8659J6569J9773j4554k1856J3452K2257
$$ plain form
615 17506 5953 -16963 -7401 16322 8253 -16141 -9848 14850 10034 -14440 -11790 12516 11944
628 11944 -12556 -14043 10518 13565 -10534 -14883 8602 14873 -8092 -16492 6224 15923 -6006
641 -6006 -16524 3982 16287 -3082 -17011 1442 16847 -423 -16524 -1141 16336 2269
653 2269 -16535 -3274 16165 4425 -15480 -5404 15247 7398 -14318 -7675 14261 9326 -12993
666 -12993 -9210 12784 11026 -11366 -11167 11381 12613 -9608 -12413 9033 13545 -7019 -13509 7336
680 7336 14500 -5691 -13991 4633 14795 -3012 -15035 2659 15296 -1250 -15174 -141 14974
693 14974 1084 -15365 -2431 14318 2705 -14464 -4568 13512 4919 -13913 -6493 12571 6645
706 6645 -12805 -8399 11367 8719 -11404 -9986 9970 9747 -10012 -11202 8524 11233 -8193 -12273
$$ packed form
615A7506j1553k2916R562K3723q069k4394O293K4698m816k4474K650K4306n72
628A1944k4500j487K4561L047k4099m349K3485O271k2965q400K2716R699k1929
641f006j0518K0506J2305j9369j3929J8453J5405j7270j6101J5383J7477j4067
653B269j8804J3261J9439j1740j9905J0076K0651p849k1716O643K1936m935k2319
666a2993L783K1994j758k2392J99K2548J232k2221k805K1446M512k0564o490K0845
680G336P164k0191q300J8624J0162j7807j2023J7694J2637j6546j3924J5033J5115
693A4974j3890j6449J2934J6749j1613j7169R896J8080q593j8832P420J9064n926
706F645j9450M406J9766k648k0123J418J9956k23j9759j190J9726K709j9426m080
$$ plain form
720 -12273 6760 12474 -6156 -12693 4841 12934 -3909 -13267 3096 13562 -1914 -13244 1197
733 1197 13807 303 -13394 -573 13761 2107 -12736 -2677 13106 4422 -12247 -4327 12667
746 12667 5782 -11311 -5911 11132 7726 -10038 -7635 10171 8842 -8819 -9054 8415 10213 -7628
760 -7628 -10302 7075 10781 -6045 -11009 5198 11453 -4381 -12019 3129 11897 -2744 -12234 1254
774 1254 12002 -832 -12707 -420 11762 504 -12313 -2242 11523 2258 -11881 -3995 10862
787 10862 3935 -11132 -5391 9688 5848 -9997 -6948 9364 7088 -9073 -7994 7876 8485 -7814
801 -7814 -9095 6878 9405 -5904 -9605 5250 10354 -4575 -10262 3949 10894 -2630 -10503 2454
815 2454 11172 -759 -10739 894 11025 663 -10451 -815 11019 2232 -10153 -2307 10756
$$ packed form
720a2273J9033N714j8630o537J7534Q093j6843r358J6363J0466j5476j1330J4441
733A197J2610j3504j3697J2821J4334j1654j4843J0059J5783q684j6669P920J6994
746A2667o885j7093N400J7043l406j7764K403J7806j329j7661k35J7469J798j7841
760g628k674J7377L706j6826m964J6207O255j5834p638J5148Q768j4641r490J3488
774A254J0748j2834j1875J2287J2182j1258j2817J0071J3765r265j4139P886J4857
787A0862o927j5067N741J5079l840j5845L049J6312k276j6161J079J5870O09j6299
801g814j281J5973K527j5309l701J4855N104j4929n687J4211O945j3524p873J2957
815B454Q718j1931r980J1633J0131j0362j1114R636J1834q787j2385P846J3063
$$ plain form
828 10756 3416 -9747 -3913 9841 4959 -9113 -5340 9038 5920 -8277 -6793 7615 7269 -7336
842 -7336 -7871 6895 8096 -6254 -8609 5107 8573 -4965 -9444 3843 9145 -3465 -9904 2156
856 2156 9565 -2253 -10070 1004 9616 -663 -10130 -439 9627 886 -10244 -1878 9463 2087
870 2087 -9537 -3557 8845 3693 -8688 -4634 8283 4967 -7963 -5471 7317 6160 -6668
883 -6668 -6399 6717 7188 -5657 -7346 5793 8120 -4809 -7897 4492 8509 -3074 -8256 2961
897 2961 9081 -1792 -8396 1895 9292 -564 -8632 379 9388 731 -8664 -746 8705 1667 -8378
912 -8378 -2514 8334 2898 -8141 -3405 7892 3879 -7625 -4626 7108 5289 -6858 -5749 6150
926 6150 5600 -5881 -6504 4701 6341 -5116 -7144 3838 7096 -3990 -7929 2586 7399 -3258
$$ packed form
828A0756p340j3163N834J3754m882j4072L773J4378l118j4197J484J4408l46j4605
842g336n35J4766J201j4350k355J3716L466j3538m479J3287N302j2610o439J2060
856B156P409j1818p817J1074Q612j0279r467R691J0066q741j1130Q366J1341p376
870B087j1624N980J2402n152j2381M054J2917l316j2930K492J2788j157j2828
883f668K69J3116M71j2845j689J3139K327j2929l088J2389M017j1583n182J1217
897B961O120j0873o604J0291P397r856q068R011R009q657r395P918R451p038j0045
912h378N864J0848n436j1039M736J1297m013j1504K999J1734j819j2147J109J1899
926F150n50j1481o23J1205J640j1457k028J0982L258j1086l939J0515M813j0657
$$ plain form
940 -3258 -8303 2102 7974 -1421 -7922 189 7975 -582 -8124 -554 7271 376 -8381 -1456 7982
955 7982 2391 -7565 -2510 6697 3304 -6598 -3725 6415 4437 -6342 -4230 6156 5232 -4929
969 -4929 -5318 5120 6129 -4424 -5835 4288 6599 -3573 -6491 3446 7134 -2416 -6709 2428
983 2428 7150 -1693 -7035 1305 7138 -420 -7146 -192 7159 808 -7171 -1180 6815 1417 -6972
998 -6972 -2038 6512 2461 -6482 -3491 5664 3618 -6261 -4369 5311 4072 -5378 -5114 4392 4936 -4566
1014 -4566 -5638 3718 5381 -3779 -5881 2812 5837 -2637 -6361 1878 6307 -1613 -6602 1123 6725
1029 6725 -1183 -6306 413 6425 459 -6639 -558 6188 1573 -6002 -1830 6141 2459 -6188 -2370
1044 -2370 5813 2444 -5230 -2781 5100 3146 -4470 -4371 4395 4669 -3705 -4056 4103 4970 -3429 -4305
$$ packed form
940c258n045J0405N872r395o501Q111P786q557p542P570P825o895q757O925R438
955G982n591r956N055R207l393r902K873J0140j978j0779K112J0386r24j0161
969d929l89J0438J009j0553j411J0123K311j0172k918R937L688r550m293R137
983B428M722q843n342Q340N833p558o726O954P351o351p979N991P995n398q389
998f972M934Q550m051q943K991R155k046r879J892R680j239r450K64R506N44r502
1014d566j072R356J663r160k102Q693L025q474l724Q239M429p920m989P725N602
1029F725p908n123O719O012n966p098O081O746m615p575M172P971l682q647L818
1044b370Q183l369p674K449P881j954p616R9Q766K74q374l51Q159Q67q399q76
$$ plain form
1060 -4305 3250 5315 -1998 -5206 2318 5279 -2074 -5586 1442 5725 -910 -5135 406 6092 -322
1075 -322 -5752 -528 5275 653 -5880 -983 4725 1291 -5740 -2875 4976 2458 -5791 -3325 4248
1090 4248 2902 -4321 -3943 3806 3848 -3888 -3820 3893 4036 -3866 -4556 2557 4156 -2743 -5165 2369 4866
1107 4866 -2375 -5277 1824 5244 -983 -4513 706 5646 -212 -5264 -404 5340 888 -4836 -715
1122 -715 5257 1477 -4866 -1582 5142 2524 -4623 -2327 4761 2728 -4262 -2820 4356 3214 -3396
1137 -3396 -3367 3489 3746 -3090 -3817 2758 4052 -2604 -4266 2155 4337 -1488 -4727 1845 4503 -913
1153 -913 -5115 494 5017 -734 -4768 4 3912 -61 -4337 -716 4829 370 -4998 -1567 4376
1168 4376 1371 -4552 -1681 3854 2259 -3963 -2755 3904 2987 -3562 -3000 3378 3218 -2782 -3649 2864
$$ packed form
1060d305P555K065p313l208P524K961p353l512P028M283o635m225N541N686o414
1075c22n430N224N803m622o533M897N708l434p031K865P851k518q249K466P573
1090D248j346p223L78P749M2p736O8P713J43p902o90P113J599o899k422P534K497
1107D866p241k902P101L420o227l530N219M940n858n052M860N744m452n724M121
1122g15N972l780o343L284O724k618p147K296P088k033o990J442P176j142o610
1137c396K9O856K57o836p27O575J294o656j662O421K182n825l239O572K658n416
1153i13m202N609M523n751m034M772L908l973m276L621N545m459n368L431N943
1168D376l005n923K871N535j595o222J208O659r17o549N62O378j60o000q67O513
$$ plain form
1184 2864 4242 -2385 -3880 2283 4317 -1685 -4093 1854 4455 -933 -4130 1036 4768 -397 -4213
1199 -4213 358 4704 24 -4189 -260 4511 981 -4245 -949 4249 1293 -3906 -1323 4038 1832
1214 1832 -3508 -2252 3518 2326 -3404 -2662 3353 2757 -2947 -3168 2583 3249 -2456 -3528 2201 3396
1230 3396 -1810 -3857 1400 3604 -1475 -4009 1078 3859 -925 -4128 307 3918 -537 -4219 -134
1245 -134 3966 287 -3923 -1002 3851 911 -3850 -1388 3605 1614 -3485 -1774 3161 2102 -2953
1260 -2953 -2275 3181 2468 -2731 -2691 2807 3204 -2467 -3037 2383 3375 -1574 -3179 1906 3544 -1217 -3364
1277 -3364 1173 3748 -786 -3362 761 3756 -400 -3482 166 3938 202 -3642 -333 3705 798
1292 798 -3332 -1100 3543 1186 -3309 -1542 3086 1511 -3071 -1957 2660 2132 -2758 -2455 2458 2416
$$ packed form
1184B864J378o627j495O163K034o002k408N947K601n388l197N166L732n165l816
1199d213M571M346m680m213L929M771l530n226L296N198k956n199K583N361k206
1214A832n340J256N770j192n730P42O015n96n704k21N751O66n705j072N729J195
1230C396n206k047N257K204n079k534N087K781m784l203M435L611m455l682M085
1245a34M100l679m210K921M853k940m761K462M993j991n099J711M935j059n055
1260b953O78N456p13n199M0N498L97n671n70N420R92m949j605N085J638m761k147
1277c364M537K575m534k576M123K995m156l082L648L772l736l844L309M038k907
1292G98m130K232M643k357m495J767M628j575m582J114M617n28m890L03M913m2
$$ plain form
1308 2416 -2516 -2791 2024 2933 -2130 -2957 1550 2804 -1861 -3240 910 3227 -1050 -3549 668 3020
1324 3020 -546 -3579 30 3094 -219 -3337 -266 3174 474 -3437 -651 3323 1264 -3250 -1226
1339 -1226 3052 1392 -2797 -1638 2685 1907 -2341 -1734 2495 2334 -2104 -2248 2328 2700 -1887 -2545
1355 -2545 1940 2760 -1465 -2641 1345 3159 -723 -2882 837 3145 -872 -2950 346 3076 -105
1370 -105 -3212 22 3007 261 -2870 -675 2850 814 -2824 -979 2771 1058 -2654 -1428 2604
1385 2604 1650 -2590 -1842 2047 1866 -2107 -2455 1790 2161 -1970 -2455 1763 2481 -1313 -2649 1256 2459
1402 2459 -1242 -2800 727 2892 -512 -2948 381 2823 -112 -2794 -80 2767 163 -2615 -520
1417 -520 2959 715 -2676 -617 2791 1028 -2410 -1016 2344 1665 -2053 -1447 2302 1586 -1774 -1711
$$ packed form
1308B416m932k75M815R09n063q27M507J254m665j379M150K317m277k499M217K352
1324C020l566l033L609L064l313l118L071L440k700l911K786L974k059m514K024
1339a226M278j660m189J159M323p78m248O07M229j61m438j44M576L72m587o58
1355b545M485Q20m225j176L986J814l882k159L719K308m017k078L296K730l181
1370a05l107L234K985k746l131K195L525k036l638J845L750j713l712J226M032
1385B604r54m240P48L889j81l973l48M245L71m131m85M218P18l794j336L905J203
1402B459l701j558L527K165l404k436L329K442k935k682K714K847k604k778K095
1417e20L479k244l391K059L408j763l438J394L360o79l718O06L749p16l360O3
$$ plain form
1433 -1711 2105 2067 -1618 -2068 1586 2254 -1406 -2143 1476 2189 -1244 -2399 800 2656 -726 -2468
1449 -2468 513 2550 -335 -2521 22 2489 -23 -2691 -437 2562 127 -2780 -843 2398 720
1464 720 -2573 -1178 2315 1052 -2411 -1434 2002 1344 -1996 -1697 1745 1574 -1729 -2061 1563 1861 -1300
1481 -1300 -1921 1418 2244 -1053 -2087 687 2316 -815 -2435 559 2630 -545 -2301 452 2419
1496 2419 139 -2376 41 2708 366 -1813 -323 2487 1039 -2171 -139 1958 653 -2414 -1383
1511 -1383 2174 1176 -1794 -1408 2148 1470 -1476 -1198 1776 1883 -1389 -921 679 2027 -1258 -1517 559
1528 559 1913 -1330 -1723 296 2165 -501 -2576 271 2133 -344 -2179 -302 2257 293 -2479
1543 -2479 -511 2115 507 -2384 -480 1826 932 -2027 -1246 1864 1218 -1705 -1333 1785 1199 -1633
$$ packed form
1433a711L816l8l685m50L654O68l660p37L619P13l433j155L199J856l382j742
1449b468K981K037k885k186K543K467k512k668K254K999k435k907J937L241j678
1464G20l293J395L493j263l463R77L436o58l340K99L442j71l303l32L624K98l161
1481a300o21L339Q26l297j034K774J629l131j620K994K071l175j756K753J967
1496B419k280k515K417K667k342k179J490K810j448l210K032K097j305l067J031
1511a383L557r98k970L86L556o78k946K78K974J07l272M68J600J348l285k59K076
1528E59J354l243l93K019J869k666k075K847J862k477j835J877K559j964k772
1543b479J968K626j608k891J904K306q94k959P81L110o46k923L72L118n86k832
$$ plain form
1559 -1633 -1165 1541 1563 -1250 -1542 1320 1802 -1018 -1633 1037 2033 -817 -1716 761 2053 -593 -2098
1576 -2098 239 2411 -4 -2019 216 2352 -120 -2176 -125 1837 253 -1653 -444 1890 745
1591 745 -1749 -737 1784 1062 -1658 -851 1647 1059 -1797 -1095 1116 1350 -1611 -1615 1360 1666 -1047
1608 -1047 -1631 922 1369 -897 -1717 632 1812 -862 -1808 781 1867 -139 -1858 178 1751 67
1624 67 -2050 258 1695 282 -2035 -313 1384 689 -2077 -817 1906 728 -1848 -895 1659 725
1640 725 -1333 -574 1513 1552 -945 -1695 1334 1323 -875 -1310 613 1657 -183 -1182 547 1542 -610
1657 -610 -1680 521 1835 -273 -1359 433 1823 -154 -1493 159 1773 -104 -1818 -26 1675
1672 1675 360 -1344 -395 1691 559 -1635 -570 1400 678 -1374 -875 1279 842 -1357 -1171 1112
$$ packed form
1559a633M68K706K2k813k92K862M82k820o15K670R96k850q99K477J292k646j505
1576b098K337K172k415k015K235K136k472k056K051J962j584j906J209K334j145
1591G45k494J012K521p22k720Q07K498n88k856P02K211K34k961mK975L06k713
1608a047n84K553M47k266q20K349J180k674r46K589J086k006j719K036J573j684
1624F7k117K308J437j413k317J722J697o95k766J260K723j178k576R53K554r34
1640G25k058P59K087L9k497p50L029j1k198m35J923J044j840r99J729R95k152
1657f10j070K201J314k108j086J792J390j977j339J652J614j877j714J792J701
1672A675j315j704R49K086j132k194J065J970p22k052M99K154m37k199J86K283
$$ plain form
1688 1112 977 -1093 -1258 1043 1167 -709 -1527 889 1330 -789 -1599 460 1510 -841 -1618 218 1469
1705 1469 -509 -1662 134 1570 -53 -1838 -136 1542 -33 -1577 -246 1491 509 -1542 -584
1720 -584 1485 678 -1296 -549 1346 1054 -1079 -816 1135 1142 -1056 -1230 1245 1082 -935 -952 953 1387
1738 1387 -557 -1239 730 1602 -606 -1387 525 1388 -443 -1243 137 1322 -2 -1432 75 1366
1754 1366 -15 -1488 -301 1464 211 -1430 -407 1195 849 -1286 -722 1023 578 -1226 -1073 1280
1770 1280 743 -1047 -1280 1073 709 -962 -990 381 1381 -701 -1491 338 1131 -625 -1715 358 1613
1787 1613 -234 -1239 550 953 -391 -891 -203 1465 -204 -1268 17 916 372 -1432 -496 1421
1803 1421 371 -1356 -540 1205 527 -695 -629 720 603 -953 -637 795 928 -958 -881 825 917 -619
$$ packed form
1688A112j35k070j65K301J24j876q18K416M41k119q10K059J050k351p77J836J251
1705A469j978j153J796J436j623j785J702J678j575j544J331J737r82k051R58
1720e84K069q07j974P47J895k92k133K63J951Pk198j74K475j63k017j7J905M34
1738A387j944o82J969Q72k208p81J912Q63j831q00J380J185j324j430J507J291
1754A366j381j473J187J765j253j641J023J602l46k135N64J745m45j804J53K353
1770A280n37j790k33K353l64j671k8J371J000k082p90J829P93j756j090K073J255
1787A613j847j005J789M03j344n00O88J668j669j064J285Q99n44j804R36J917
1803A421j050j727Q16J745o78j222O6J349j17j556L16J432J33j886P7J706R2j536
$$ plain form
1821 -619 -1156 664 988 -635 -1003 535 1075 -627 -1140 245 1118 -309 -1535 152 985 181 -1067
1838 -1067 -10 940 103 -1619 -389 982 133 -1038 -570 1061 472 -1008 -635 891 381 -1192 -470
1855 -470 764 741 -1041 -955 886 599 -867 -856 864 858 -489 -1222 707 1070 -317 -1068 349 961 -226
1874 -226 -937 331 1020 -144 -978 199 1223 101 -1077 -38 822 299 -985 -243 1198 462 -875
1891 -875 -448 1080 609 -916 -550 1106 722 -1033 -698 587 680 -906 -656 724 764 -405 -834 660
1909 660 1099 -383 -1014 286 901 -451 -1031 388 856 -176 -1314 -162 853 -165 -1054 -292 880
1926 880 50 -1079 -210 834 284 -726 -501 814 288 -966 -450 931 410 -726 -554 762 793 -283
1944 -283 -745 490 575 -393 -853 435 910 -476 -902 233 1003 -472 -862 289 915 -19 -838 -1
$$ packed form
1821f19n37J820L24j623l68J538N40j702n13J385Q73j427j226J687Q33q04j248
1838a067J057R50q37j722J230J371q49j171M68J631n89j480L73J526n10j573P22
1855d70J234k3j782Q6J841k87j466J1J720oj347p33J929L63j387p51J417O12j187
1874b26p11J268O89j164q34J177J024j122j178J039Q60n23j284P42J441p36j337
1891h75M27J528m71j525L66J656l84j755L35J285R3j586K50J380M0j169m29J494
1909F60M39j482o31J300O15j352n80J419M68j032j138J152J015j018q89P62J172
1926H80q30j129Q69J044n50j010K25J315n26j254N16J381n21j136J72J316L1j076
1944b83m62J235Q5r68m60J288M75j386m26J135P70j475l90J151O26r34q19Q37
$$ plain form
1962 -1 775 -24 -905 70 1136 16 -836 -77 746 136 -814 -502 948 119 -727 -357 931 430 -656
1981 -656 -523 699 713 -915 -594 630 531 -676 -698 376 595 -794 -742 350 904 -458 -724 286
1999 286 642 -268 -944 265 739 -279 -817 -36 910 -247 -935 -18 1051 139 -786 -74 728 348 -612
2018 -612 -543 669 453 -736 -345 544 395 -648 -469 544 476 -457 -555 500 643 -350 -374 304 765 -365
2038 -365 -620 152 703 -166 -640 -22 809 -250 -728 -8 717 56 -904 -32 573 37 -673 -209 697 203
2058 203 -647 -350 518 184 -680 -168 500 -37 -758 -595 727 381 -714 -399 653 870 -746 -1038 366
2077 366 807 -97 -743 120 668 -194 -634 347 757 -227 -299 123 500 125 -678 -491 456 5 -328 -372 800
2098 800 224 -765 39 880 227 -829 -83 503 426 -342 -360 436 573 -429 -271 535 416 -705 -383 657
$$ packed form
1962aP76p99q81R75J066j120q52P59Q23o10r50L12J450q29q46L70J288n01j086
1981f56J33J222J4j628L21J224r9j207k2J074K19j389N2J092N54j362k66J010
1999B86L56r10o76J209M74j018n38P81R46j157o88R17J069r12r25P12Q02l80r60
2018f12O9J212k16j189L91Q89j49j043J79J013o8r33r8J055J43r93k4O78M61j130
2038c65k55P72N51q69m74O18Q31j059m78P20P25o61r60Q72O05n36p10M64R06m94
2058B03q50K97Q68l34q64N12O68n37p21J63J322l46j095L15J052K17j616k92J404
2077C66M41r04o46Q63N48q62m40R81M10r84p2M22L77l75q03J87R47m51l33m4J172
2098H00n76r89Q04Q41o53j056P46N86p7p68j8P96J37j002J58Q06j19j121L22J040
$$ plain form
2118 657 482 -541 -432 375 578 -138 -689 119 427 -232 -535 107 733 -261 -623 41 736 -42 -641 -75
2138 -75 722 153 -404 -152 542 233 -591 -306 470 128 -654 -341 572 266 -589 -601 182 528 -503 -591 462
2159 462 222 -262 -519 350 772 -392 -468 295 552 -114 -491 28 613 67 -681 37 579 -136 -467 -11
2179 -11 651 18 -608 147 509 298 -580 -47 593 259 -431 -241 753 289 -428 -185 147 375 -345 -175
2199 -175 381 64 -512 -141 196 139 -251 -393 8 560 -349 -567 -79 319 -356 -631 338 375 -186 -490 -66
2220 -66 704 36 -324 39 242 64 -502 -135 463 65 -365 -814 57 34 -476 -728 539 343 -554 -124
2240 -124 926 249 240 86 259 71 -689 -504 118 91 -585 -304 76 249 -226 -331 268 532 137 -179 -407
2261 -407 613 183 -812 -65 761 60 -32 156 356 199 -150 -167 604 43 -409 -413 391 102 -334 -520 528
$$ packed form
2118F57j75j023J09Q07K03p16n51Q08L08o59l03O42O26r94l62O64O95p78n99N66
2138g5P97n69n57K52O94l09q24K85P76l42p82L13R13l06q55j2P83L46j031q8J053
2159D62k40m84k57Q69M22j164p6P63K57o66l77N19N85n46p48P18N42p15l31M56
2179a1O62o33o26P55L62k11q78N33O40l34o90J90R94m64p17K43L32K28p20J70
2199a75N56l17n76L71L37n7l90j42M01N52r09k18M88L98o75k75R69L7n61l04M24
2220f6P70o68l60L63K03j78n66L67N98l98m30m49Q71k3n10k52J267j96q97M30
2240a24J050o77rj54J73j88p60J85O22k7o76K81L80J73m75j05N99K64l95l16k28
2261d07J020m30r95P47Q26p01r2J88K00j57l49j7P71n61m52mQ04k89m36j86J048
$$ plain form
2282 528 226 -390 -561 293 399 -374 -648 472 143 -704 -582 -18 302 -535 -450 -27 -509 230 -553 462
2302 462 912 -865 -831 -605 789 -49 -710 202 289 -41 -559 -12 80 -94 -206 56 387 318 -189 -314 283
2323 283 311 -197 -458 94 592 -331 -397 479 279 -162 -410 71 264 -53 -72 85 160 -263 -389 172 217 14
2345 14 -433 105 195 86 -151 63 512 177 -476 -202 392 160 -268 -206 187 295 -291 -88 222 133 -446
2366 -446 -235 414 142 -403 -207 283 21 -143 -270 197 103 -287 -215 -36 370 -23 -328 116 187 99 -336
2387 -336 -109 587 -108 -367 24 223 -262 -411 -30 323 38 -332 -103 617 -37 -29 -65 388 133 -226 -58
2408 -58 214 294 -323 -139 -3 622 -496 -730 196 441 -286 -67 127 298 -161 -58 305 529 -109 -229
2428 -229 -7 219 -108 -447 -3 406 -4 -139 -30 187 -81 -287 -13 24 217 -232 -29 146 269 -151
$$ packed form
2282E28l02o16j71Q54J06p73k74J120l29q47J22N64L20q37Q5M23m82P39p83J015
2302D62M50j777L4K26J394q38o61R12Q7l30n18N47R2j74j12K62L31o9n07j25N97
2323B83K8n08k61N52M98r23o6Q76k00m41k48M81J93l17j9J57P5m23j26N61M5k03
2345A4m47N38R0j09k37K14M49l35o53K74N94k32m28O2L93J08n86K03L10q9n79
2366d46K11O49k72n45J96M90k62j64j27M67r4l90P2J79M06l93l05M44P1q8m35
2387c36K27O96o95k59L91J99m85j49L81L53k85l70K29P20o54Ql6M53k55l59J68
2408e8K72Q0o17J84J36O25j118k34R26K45p27K19J94J71m59J03L63K24o38j20
2428b29K22K26l27l39M44M09m10j35J09K17k68k06K74L7J93m49K03J75J23m20
$$ plain form
2448 -151 -329 215 403 -500 -125 239 154 -277 -205 126 454 -187 -381 278 320 -258 -107 -14 302 -20 -291
2469 -291 235 300 -179 -280 125 287 193 -287 -211 152 14 -234 -10 129 -19 -310 -264 344 -5 -147 -49 332
2491 332 225 -387 -180 340 202 -176 -121 24 305 -134 -426 141 178 32 -290 37 104 -146 -169 157 -112
2512 -112 358 -427 41 693 -474 -231 261 175 -128 -227 -216 495 138 -1332 -140 -87 -602 32 65 117 331
2533 331 13 -142 208 90 -157 -745 -332 110 -488 -81 236 138 -186 -228 161 373 -23 -578 -202 -44 41
2554 41 -276 -31 127 -29 -270 128 185 162 -196 -19 94 43 -313 -70 227 96 -6 -94 237 280 -203 -54
2576 -54 126 333 -163 -46 569 52 -34 228 528 276 -675 -89 73 258 -298 -174 396 117 218 -483 -224
2597 -224 172 -356 -592 74 -176 -253 123 -174 -273 12 -232 -126 232 -16 -375 0 83 -171 -434 -62 170
$$ packed form
2448a51j78N44J88r03L75L64q5m31P2L31L28o41j94O59M2n78J51R3L16l22k71
2469b91N26O5m79j01M05J62r4m80P6L63j38k48K24J39j48k91M6O08l49j42R8L81
2491C32j07o12K07N20j38l78N5J45K81m39k92N67L7j46l22L27O7k50k3L26k69
2512a12M70p85M68O52j167K43M92q6l03r9J1P11l57j470J192N3n15O34L3N2K14
2533C31l18j55L50j18k47n88M13M42n98M07L17r8l24m2L89K12l96n55L76J58Q5
2554D1l17K45J58j56k41L98N7k3l58J77J13n1l56K43K97j31j02q8L31M3m83J49
2576e4J80K07m96J17O15n17q6K62L00k52r51N86J62J85n56J24N70k79J01p01K59
2597b24L96n28k36O66k50p7L76k97r9K85k44J06L58k48l59L75Q3k54k63L72K32
$$ plain form
2618 170 -42 -270 -430 211 226 -171 -369 382 148 -232 -125 32 83 -440 -186 87 196 -157 -268 52 120
$$ packed form
2618A70k12k28j60O41J5l97j98P51k34l80J07J57N1n23K54K73J09l53j11L20O8
$$ [...]
8191a4
##END NTUPLES=NMR FID
##END=
