##TITLE=1H_SR52+5xTFAA 1n
 CDCl3, 8 sc, 
 31.05.2021
##JCAMPDX= 6.0         $$ Bruker NMR JCAMP-DX V2.0
##DATA TYPE= NMR FID
##DATA CLASS= NTUPLES
##ORIGIN= UXNMR, Bruker Analytische Messtechnik GmbH
##OWNER= root
$$ XWIN-NMR		Version 3.5
$$ Mon May 31 13:54:12 2021 Russian Standard Time (UT+4h)  she@DPX200
##.OBSERVE FREQUENCY= 200.131506
##.OBSERVE NUCLEUS= ^1H
##.DELAY= (6, 6)
##.ACQUISITION MODE= SIMULTANEOUS
##.ACQUISITION SCHEME= undefined
##.AVERAGES= 8
##.DIGITISER RES= 18
##SPECTROMETER/DATA SYSTEM= spect
##.PULSE SEQUENCE= zg30
##.SOLVENT NAME= CDCl3
##.SHIFT REFERENCE= (INTERNAL, CDCl3, 0, 15.7039)
##AUDIT TRAIL= $$ (NUMBER, WHEN, WHO, WHERE, WHAT)
$$ ##TITLE= Audit trail, XWIN-NMR		Version 3.5
$$ ##JCAMPDX= 5.01
$$ ##ORIGIN= Bruker BioSpin GmbH
$$ ##OWNER= she
$$ F:/spectra/data/she/nmr/H-F/1/audita.txt
$$ ##AUDIT TRAIL=  $$ (NUMBER, WHEN, WHO, WHERE, WHAT)
(   1,<2021-05-31 13:53:17.26 +0400>,<she>,<DPX200>,
      <created by zg, POWCHK disabled, PULCHK disabled
       configuration hash MD5:
       00 E9 B6 7A A2 85 ED C7 34 08 36 98 17 FE 4E 26
       data hash MD5: 16K
       59 7C BF C8 37 FF 46 85 73 D3 C0 5C DE 54 56 01>)
$$ ##END=
$$ 
$$ hash MD5
$$ D4 9E 93 76 D3 72 9D 69 34 0C F5 EA 08 02 85 2B
##$RELAX= 
##$RELAX= 
##$RELAX= 
##$RELAX= 
##$RELAX= 
##$RELAX= 
$$ Bruker specific parameters
$$ --------------------------
##$DU= <F:/spectra>
##$EXPNO= 1
##$NAME= <H-F>
##$PROCNO= 1
##$TYPE= <nmr>
##$USER= <she>
##$AMP= (0..31)
100 100 100 100 100 100 100 100 100 100 100 100 100 100 100 100 100 100 
100 100 100 100 100 100 100 100 100 100 100 100 100 100 
##$AQSEQ= 0
##$AQ_mod= 1
##$AUNM= <au_zg>
##$AUTOPOS= <>
##$BF1= 200.13
##$BF2= 200.13
##$BF3= 200.13
##$BF4= 200.13
##$BF5= 200.13
##$BF6= 200.13
##$BF7= 200.13
##$BF8= 200.13
##$BYTORDA= 1
##$CFDGTYP= 0
##$CFRGTYP= 5
##$CHEMSTR= <none>
##$CNST= (0..31)
1 1 145 1 1 1 1 1 1 1 1 1 1 1 1 1 1 1 1 1 1 1 1 1 1 1 1 1 1 1 1 1 
##$CPDPRG= <>
##$CPDPRG1= <>
##$CPDPRG2= <>
##$CPDPRG3= <>
##$CPDPRG4= <mlev>
##$CPDPRG5= <mlev>
##$CPDPRG6= <mlev>
##$CPDPRG7= <mlev>
##$CPDPRG8= <mlev>
##$CPDPRGB= <>
##$CPDPRGT= <>
##$D= (0..31)
0 1.2 0 0 0 0 0 0 0 0.06 0 0.03 0 0 0 0 0.0002 0 0 0 0 0 0 0 0 0 0 0 0 
0 0 0 
##$DATE= 1622454796
##$DBL= (0..7)
120 120 120 120 120 120 120 120 
##$DBP= (0..7)
150 150 150 150 150 150 150 150 
##$DBP07= 0
##$DBPNAM0= <>
##$DBPNAM1= <>
##$DBPNAM2= <>
##$DBPNAM3= <>
##$DBPNAM4= <>
##$DBPNAM5= <>
##$DBPNAM6= <>
##$DBPNAM7= <>
##$DBPOAL= (0..7)
0.5 0.5 0.5 0.5 0.5 0.5 0.5 0.5 
##$DBPOFFS= (0..7)
0 0 0 0 0 0 0 0 
##$DE= 6
##$DECBNUC= <off>
##$DECIM= 32
##$DECNUC= <off>
##$DECSTAT= 4
##$DIGMOD= 1
##$DIGTYP= 9
##$DL= (0..7)
0 120 120 120 120 120 120 120 
##$DP= (0..7)
150 150 150 150 150 150 150 150 
##$DP07= 0
##$DPNAME0= <>
##$DPNAME1= <>
##$DPNAME2= <>
##$DPNAME3= <>
##$DPNAME4= <>
##$DPNAME5= <>
##$DPNAME6= <>
##$DPNAME7= <>
##$DPOAL= (0..7)
0.5 0.5 0.5 0.5 0.5 0.5 0.5 0.5 
##$DPOFFS= (0..7)
0 0 0 0 0 0 0 0 
##$DQDMODE= 0
##$DR= 18
##$DS= 0
##$DSLIST= <SSSSSSSSSSSSSSS>
$$ [...]
##$SUBNAM2= <"">
##$SUBNAM3= <"">
##$SUBNAM4= <"">
##$SUBNAM5= <"">
##$SUBNAM6= <"">
##$SUBNAM7= <"">
##$SUBNAM8= <"">
##$SUBNAM9= <"">
##$SW= 16.9725357007746
##$SWIBOX= (0..15)
0 0 2 0 0 0 0 0 0 0 0 0 0 0 0 0 
##$SW_h= 3396.73913043478
##$TD= 16384
##$TD0= 1
##$TE= 0
##$TE2= 300
##$TE3= 300
##$TEG= 300
##$TL= (0..7)
0 120 120 120 120 120 120 120 
##$TP= (0..7)
150 150 150 150 150 150 150 150 
##$TP07= 0
##$TPNAME0= <>
##$TPNAME1= <>
##$TPNAME2= <>
##$TPNAME3= <>
##$TPNAME4= <>
##$TPNAME5= <>
##$TPNAME6= <>
##$TPNAME7= <>
##$TPOAL= (0..7)
0.5 0.5 0.5 0.5 0.5 0.5 0.5 0.5 
##$TPOFFS= (0..7)
0 0 0 0 0 0 0 0 
##$TUNHIN= 0
##$TUNHOUT= 0
##$TUNXOUT= 0
##$USERA1= <user>
##$USERA2= <user>
##$USERA3= <user>
##$USERA4= <user>
##$USERA5= <user>
##$V9= 5
##$VALIST= <valist>
##$VCLIST= <CCCCCCCCCCCCCCC>
##$VD= 0
##$VDLIST= <DDDDDDDDDDDDDDD>
##$VPLIST= <PPPPPPPPPPPPPPP>
##$VTLIST= <TTTTTTTTTTTTTTT>
##$WBST= 1024
##$WBSW= 4
##$XGAIN= (0..3)
0 0 0 0 
##$XL= 0
##$YL= 0
##$YMAX_a= 146055
##$YMIN_a= -168910
##$ZGOPTNS= <>
##$ZL1= 120
##$ZL2= 120
##$ZL3= 120
##$ZL4= 120
##$ABSF1= 10
##$ABSF2= 0
##$ABSG= 5
##$ABSL= 3
##$ALPHA= 0
##$AQORDER= 0
##$ASSFAC= 0
##$ASSFACI= 0
##$ASSFACX= 0
##$ASSWID= 0
##$AUNMP= <proc_1d>
##$AZFE= 0.1
##$AZFW= 0.1
##$BCFW= 1
##$BC_mod= 2
##$BYTORDP= 1
##$COROFFS= 0
##$CY= 11.3945322036743
##$DATMOD= 1
##$DC= 2
##$DFILT= <>
##$DTYPP= 0
##$F1P= 15.9154993809931
##$F2P= -4.1035820241983
##$FCOR= 0.5
##$FTSIZE= 0
##$FT_mod= 4
##$GAMMA= 1
##$GB= 0.15
##$INTBC= 1
##$INTSCL= 1
##$ISEN= 128
##$LB= 0.24
##$LEV0= 0
##$LPBIN= 0
##$MAXI= 10000
##$MC2= 0
##$MEAN= 0
##$ME_mod= 0
##$MI= 1.114404
##$NCOEF= 0
##$NC_proc= 0
##$NLEV= 6
##$NOISF1= 3.799351
##$NOISF2= 2.8
##$NSP= 1
##$NTH_PI= 0
##$NZP= 0
##$OFFSET= 15.70392
##$PC= 1
##$PHC0= -11119.95
##$PHC1= 16.60099
##$PH_mod= 1
##$PKNL= yes
##$PPARMOD= 0
##$PSCAL= 0
##$PSIGN= 0
##$REVERSE= no
##$SF= 200.130013532006
##$SI= 16384
##$SIGF1= 3
##$SIGF2= 2
##$SINO= 400
##$SIOLD= 16384
##$SREGLST= <1H.CDCl3>
##$SSB= 0
##$STSI= 0
##$STSR= 0
##$SW_p= 3612.71676300578
##$SYMM= 0
##$S_DEV= 0
##$TDeff= 0
##$TDoff= 0
##$TI= <>
##$TILT= no
##$TM1= 0
##$TM2= 0
##$TOPLEV= 0
##$USERP1= <user>
##$USERP2= <user>
##$USERP3= <user>
##$USERP4= <user>
##$USERP5= <user>
##$WDW= 1
##$XDIM= 8192
##$YMAX_p= 0
##$YMIN_p= 0
$$ End of Bruker specific parameters
$$ ---------------------------------
##NTUPLES= NMR FID
##VAR_NAME=  TIME,          FID/REAL,        FID/IMAG
##SYMBOL=    X,             R,               I
##VAR_TYPE=  INDEPENDENT,   DEPENDENT,       DEPENDENT
##VAR_FORM=  AFFN,          ASDF,            ASDF
##VAR_DIM=   8192,          8192,            8192
##UNITS=     SECONDS,       ARBITRARY UNITS, ARBITRARY UNITS
##FACTOR=    0.0002944,     1,               1
##FIRST=     0,             0,               0
##LAST=      2.4114304,     0,               0
##MIN=       0,             -168910,         0
##MAX=       2.4114304,     146055,          0
$$ Real data points
##PAGE= N=1
##DATA TABLE= (X++(R..R)), XYDATA
$$ plain form
0 0 0 0 0 0 0 0 0 0 0 0 0 0 0 5 -8 8 -8 8 -16 16 -16 24 -24 32 -40 40 -48 56 -66 77 -88 101 -114 128 -146
35 -146 165 -184 205 -231 259 -286 318 -355 392 -434 477 -530 582 -641 706 -779 859 -946
53 -946 1044 -1154 1277 -1418 1580 -1768 1990 -2255 2581 -2992 3527 -4257 5313 -6985 10023
68 10023 -17292 70384 -9195 -168910 75326 146055 -71957 -129086 78814 116964 -60076
79 -60076 -113736 52066 105618 -31622 -106025 26487 117517 -12384 -115736 18452 111690
90 111690 -9178 -100028 1648 95961 13837 -96246 -21929 95056 27795 -89847 -32787
101 -32787 84706 43794 -82388 -50270 77430 49182 -71814 -56844 59584 64101 -58587
112 -58587 -72803 53214 70134 -48218 -74630 36253 78683 -33992 -86255 26770 80555
$$ packed form
0@%%%%%%%%%%%%%Nj3J6j6J6k4L2l2M0m8N6p2Q0q8J04j22J43j65J89k15K42k74
35a46L11l49L89m36M90n45O04o73P47q26R11j007J112j223J347j485J638j805
53i46J990k198K431k695K998l348L758m245M836n573O519p784R570j2298J7008
68A0023k7315Q7676p9579j59715K44236P0729k18012n7129K07900L8150j77040
79f0076n3660J65802N3552j37240p4403J32512R1030j29901j03352J34188R3238
90A11690j20868r0850J01676R4313q2124j10083P4317J16985o7261j17642N7060
101c2787J17493m0912j26182L2118J27700k8248j20996J4970J16428M517j22688
112e8587j4216J26017J6920j18352k6412J10883M2430j12675n2263J13025N3785
$$ plain form
123 80555 -24896 -82564 12065 80927 -7211 -84796 763 82191 3582 -81363 -11881 78979
135 78979 17355 -79105 -21886 76489 25593 -71279 -31815 65863 40403 -62375 -43623 62522
147 62522 48122 -54947 -49924 51682 57322 -45604 -57706 45056 61082 -36285 -60085 31585
159 31585 66800 -24281 -65964 23614 67628 -15564 -65347 10211 68204 -2858 -66474 372
171 372 66420 6628 -63643 -12795 63091 18137 -62755 -22035 59634 24515 -57498 -31044
183 -31044 52371 33997 -52020 -38969 47482 39406 -45096 -45348 38359 47077 -38029 -51435 32214
196 32214 49474 -29578 -54136 21238 54157 -20150 -57443 14273 54880 -10979 -56921 4115
208 4115 56856 -1280 -57618 -2541 55652 6924 -53980 -12164 53482 16636 -51696 -18963
$$ packed form
123H0555j05451n7668R4629O8862q8138p7585Q5559Q1428p8609q4945O9482R0860
135G8979o1624r6460N7219R8375n0896r6872L9464R7678k5460j02778J8752J06145
147F2522j4400j03069N023J01606N640j02926j2102J02762J6026r7367k3800R1670
159C1585L5215r1081m1683Q9578M4014q3192m9783P5558N7993p1062o3616O6846
171C72O6048n9792p0271N0848P5886m4954q0892M0720Q1669l5119q2013K6454
183c1044Q3415j8374q6017J3051Q6451q076q4502k52Q3707Q718q5106j3406Q3649
196C2214J7260p9052k4558P5374L2919p4307l7293P1716M0607o5859m5942O1036
208D115N2741n8136n6338N5077N8193m8728o0904M1816O5646l6846o8332L2733
$$ plain form
220 -18963 50159 23976 -45865 -26449 45036 31988 -41399 -32332 39966 37086 -33478 -38139 32523
233 32523 43825 -27670 -42933 26835 46045 -20352 -45550 17855 49097 -13458 -48366 11245
245 11245 48753 -4844 -47694 1710 49654 2336 -49004 -4968 47395 8999 -46190 -13984
257 -13984 44908 15913 -44897 -19654 41162 21714 -39885 -26973 36834 28114 -37012 -31829
269 -31829 32335 31680 -30521 -36341 25621 36460 -24846 -39568 19846 38682 -17441 -41463 12386
282 12386 41812 -11403 -43232 7139 41692 -3796 -42082 -231 42860 2771 -42171 -5489
294 -5489 40773 9660 -39068 -12757 39376 16107 -37196 -17267 35919 21357 -32083 -23013
306 -23013 32455 27045 -28954 -26611 27877 30092 -23352 -30761 22339 34319 -19050 -33415 17217
$$ packed form
220a8963O9122k6183o9841J9416P1485j3048p3387R067P2298k880p0564m661P0662
233C2523J1302p1495j5263O9768J9210o6397k5198O3405L1242o2555l4908N9611
245A1245L7508n3597m2850M9404M7944m7318n1340M4036N2363l8396n5189L2206
257a3984N8892k8995o0810K5243O0816j9448o1599J2912O3807q720o5126N183
269c1829O4164o55o2201n820O1962J0839o1306j4722N9414J8836n6123k4022N3849
282A2386K9426n3215l1829N0371L4553m5488l8286M1851M3091m0089m4942L6682
294e489M6262l1113m8728K6311N2133k3269n3303J9929N3186j4562n3440R070
306b3013N5468n410n5999K343N4488K215n3444p409N3100J1980n3369j4365N0632
$$ plain form
319 17217 35574 -12615 -35516 10649 37611 -7578 -37051 5280 36643 -1721 -36925 -1530
331 -1530 36792 3497 -36693 -6208 34595 8722 -34234 -12920 32630 13741 -33000 -17207
343 -17207 28872 18137 -28934 -22238 26221 22756 -25810 -25394 21465 25462 -20640 -29104 17222
356 17222 28759 -16955 -30578 12774 30071 -10887 -31781 7710 32288 -5844 -31908 2932
368 2932 31518 81 -31680 -2498 32335 4812 -30967 -6193 30595 9945 -28487 -11166
380 -11166 29313 14434 -26622 -14507 26189 18256 -22797 -19026 23288 21833 -20015 -21114 19047
393 19047 24061 -15728 -24662 15208 26492 -12529 -26101 10636 27482 -7480 -27825 5744
405 5744 28649 -3939 -28005 1475 27238 1121 -28069 -3807 27487 4719 -27301 -7606
$$ packed form
319A7217J8357m8189k2901M6165K6962m5189k9473M2331L1363l8364l5204L5395
331a530L8322l3295m0190L0485M0803k5873m2956K1314M5550j8889m6741J5793
343a7207M6079j0735m7071O696M8459l465m8566M16M6859L997m6102q464M6326
356A7222J1537m5714j3623M3352J7297m0958k0894L9491K4578l8132k6064L4840
368B932K8586l1437l1761K9182L4833k7523l5779K4774L6788k0650l8432J7321
380a1166M0479j4879m1056J2115M0696p933m1053L771M2314j455m1848j099M0161
393A9047N014l9789q934L9870J1284l9021j3572L6737J6846l4962k0345L3569
405E744K2905l2588k4066K9480K5763k6117k9190K4262L1294k2768l2020J9695
$$ plain form
417 -7606 25145 8734 -25616 -12166 23763 12554 -23917 -15368 20758 15653 -20922 -18845 18493
430 18493 18663 -17966 -20735 15129 21123 -13795 -22901 11710 22856 -10419 -23696 7856 23686
443 23686 -5733 -24842 4234 25034 -2228 -24471 606 24808 2285 -24224 -3515 24614
455 24614 5777 -23084 -6492 22983 9647 -21206 -10311 21637 12868 -19183 -12551 18914
467 18914 15505 -16493 -15928 16707 17731 -14133 -17845 13198 19675 -10752 -20390 10158 20971
480 20971 -8226 -20860 6038 21707 -4650 -22021 2755 21751 -1750 -22143 -898 20999
492 20999 1827 -21801 -4479 20312 4763 -20616 -7182 18938 8294 -19388 -10624 17722
504 17722 10852 -17592 -13025 15181 13309 -15214 -15388 13226 15346 -12419 -16658 10362 17328 -9464
$$ packed form
417g606L2751j6411l4350J3450L5929j1209l6471Q549L6126n105l6575K077L7338
430A8493J70l6629k769L5864N994l4918r106L4611J1146l3275j3277L1552J5830
443B3686k9419j9109K9076K0800k7262k2243K5077K4202k2523k6509K0709K8129
455B4614j8837k8861J6592K9475j3336l0853J0895L1948q769l2051O632L1465
467A8914l409l1998N65L2635J024l1864l712L1043O477l0427r638L0548J0813
480B0971k9197j2634K6898J5669k6357j7371K4776J8996k3501k0393K1245K1897
492B0999j9172k3628J7322K4791j5549k5379J3434K6120j0644k7682Q764K8346
504A7722o870k8444M567K8206j872k8523j74K8614K120k7765m239K7020O966k6792
$$ plain form
518 -9464 -18342 7883 18550 -6757 -18438 4850 19180 -2865 -19031 1973 19572 188
530 188 -18379 -1225 19085 3621 -18135 -3571 18727 6011 -16804 -6575 17066 8830 -15588
543 -15588 -9045 15855 11013 -13716 -11457 13432 13168 -11815 -13357 11351 14506 -9573 -14509 8413
557 8413 15709 -7170 -16483 6116 16177 -4693 -16646 2885 16765 -2124 -17390 424 16497
570 16497 105 -16840 -2439 15864 2833 -16436 -4794 15139 5103 -15074 -7242 14018
582 14018 7624 -14460 -9185 12399 9434 -12012 -11020 10576 11759 -10200 -12662 8880 12991 -7880
596 -7880 -13342 6863 14027 -5461 -14450 4946 14486 -3187 -14417 2436 15090 -609 -14480
609 -14480 106 14953 1271 -13678 -1999 14775 4279 -13197 -4250 13341 6138 -12127
$$ packed form
518i464q878K6225J0667k5307j1681K3288J4330k2045j6166K1004J7599j9384
530A88j8567J7154K0310j5464k1756J4564K2298j2716k2815J0229K3641q236k4418
543a5588O543K4900m842k4729K259K4889k64k4983j542K4708L155k4079m936K2922
557H413P296k2879r313K2599J0061k0870j1953J9531J3880j8889j5266J7814J6073
570A6497j6392j6945J4401J8303j3031j9269J1642J9933j0036k0177P832K1260
582A4018o394k2084N275K1584k965k1446R92K1596J183k1959k462K1542M111k0871
596g880n462K0205P164j9488q989J9396R540j7673j1230J6853J2654j5699j3871
609a4480J4586J4847j3682j4949J1679J6774j0496j7476Q947J7591p203j8265
$$ plain form
621 -12127 -6767 12304 7765 -11339 -8192 11026 9080 -9429 -9733 9398 10987 -8301 -10885 7189
635 7189 11397 -6362 -11821 5116 12279 -4440 -12959 3211 12346 -2576 -13043 420 12446
648 12446 -696 -13227 -1120 12335 1477 -12713 -3367 11632 3434 -11993 -4968 10763 5109
661 5109 -10965 -6798 9608 7007 -9661 -8143 8861 8262 -7940 -9146 6953 9725 -6671 -10159
675 -10159 5880 10451 -4436 -10814 4014 11381 -2727 -11319 2434 11445 -948 -11000 655
688 655 11586 1023 -10778 -1127 11294 2564 -10314 -2736 10801 4200 -9828 -4226 9883
701 9883 5617 -8813 -5661 8823 6676 -7899 -7037 7543 7561 -6692 -8234 6072 8750 -5413
715 -5413 -9129 4466 9220 -3793 -9582 2643 9775 -2461 -10311 1306 9233 -878 -9977 -308
$$ packed form
621a2127N360J9071m539j9104L147J9218j946j8509l04J9131J589j9288k584J8074
635G189M208j7759n459J6937P163j6719q519J6170R135j4922j0467J3463J2026
648A2446j3142j2531J2107J3455j0858j4190R346J4999q198j5427P025J5731n654
661E109j6074M167J6406k601j6668J518J7004n99j6202j206J6099K772j6396l488
675a0159J6039M571j4887o378J4828P367j4108q592J3753R011j2393j0052J1655
688F55J0931j0563j1801R651J2421q730j2878P578J3537o601j4028N602J4109
701I883m266j4430L152J4484k147j4575Q62J4580J8j4253j542J4306K678j4163
715e413l716J3595M754j3013n789J2225P132j2236p850J1617P927j0111r099R669
$$ plain form
729 -308 9608 919 -9927 -1792 9218 1891 -9271 -3590 8607 3209 -8882 -4386 7638 4775
743 4775 -7769 -6064 7058 6004 -6643 -6588 5834 7138 -5472 -7282 4847 7767 -4032 -8102
757 -8102 3712 8277 -2395 -8421 2328 8827 -1338 -8342 910 8882 134 -8211 -377 8850
771 8850 1380 -8110 -1549 8140 2866 -7675 -2779 7542 3916 -6728 -3959 6689 4470 -6091
785 -6091 -5000 5888 5492 -5779 -5908 4776 6076 -4843 -6476 3714 6887 -3458 -7098 2594
799 2594 6897 -2589 -7820 1276 7174 -1464 -7574 298 7177 27 -7437 -903 7122 908 -7417
814 -7417 -2007 6480 2180 -6721 -3079 6264 3446 -6237 -3975 5707 4651 -5307 -4872 4722 4988 -4394
830 -4394 -5088 4064 5698 -3238 -5890 3223 6117 -2275 -6145 2406 6523 -1260 -6004 965 6680
$$ packed form
729c08R916q689j0846Q135J1010p327j1162N681J2197n398j2091M496J2024k863
743D775j2544J705J3122j054j2647N5J2422J304j2610j810J2129K920j1799m070
757h102J1814M565j0672o026J0749O499j0165p004R252P972q748q345P834R227
771H850p470r490O561R689n274j0541M896J0321l626j0644K769J0648k219j0561
785f091J091J0888l96j1271j29J0684J300j0919j633J0190L173j0345l640R692
799B594M303r486n231R096N898q638o110P872O879p150p464O534Q025o214q325
814g417N410Q487m300q901L642R343k818r683K262R682j056r958M35R594K66r382
830d394o94R152J634q936k652R113K894q392l870Q551M117p783m744O969N715
$$ plain form
845 6680 -277 -6118 89 6412 826 -6172 -1015 6385 1720 -5837 -2074 5687 2614 -5283 -2641
860 -2641 5481 3449 -4693 -3551 4752 4286 -4552 -4178 3976 4643 -3569 -4962 2827 4935 -2944 -5542
876 -5542 2056 5374 -2010 -5727 1227 5235 -1371 -5844 248 5262 -339 -5688 -696 5371 929
891 929 -5501 -1576 5218 1524 -5189 -2110 4757 2532 -4839 -2877 4332 3266 -3990 -3390 3798 3886
907 3886 -3507 -3848 3252 4237 -2774 -4292 2388 4804 -1756 -4602 1978 4811 -920 -4861 985 4922
923 4922 -297 -4810 240 5115 260 -4680 -513 4879 1442 -4291 -1219 4724 1944 -4165 -1958
938 -1958 4096 2542 -4109 -2799 3784 2646 -3441 -3219 3008 3543 -2642 -3815 2317 3556 -2167 -4195
954 -4195 1866 4041 -1563 -4407 1039 4283 -619 -4355 270 4165 -213 -4463 -525 4131 261
$$ packed form
845F680o957n841O207O323n586o998N157P400m665p557L763P761l073p897K642
860b641Q122k032q142J142Q303m66q838L74Q154O67q212j393P789K108p879k598
876e542P598L318p384l717O954M008o606m473O092N014n601n349M992O067m442
891I29o430L925O794l694o713L079O867k225p371J962P209j066p256O00P188Q8
907C886p393l41P100R85p011j518O680K416o560k846O580K833n731l941N846L937
923D922n219m513N050M875m855m940M167N392l437n733L072N943k780o109K207
938a958O054j554o651J310O583j138o087K22O227N35o185j173O132J239n723k028
954d195O061K175n604k844N446L244m902l736M625L895m378m250L938M656l870
$$ plain form
969 261 -4148 -1083 3926 1130 -3886 -1553 3654 1762 -3577 -2187 3377 2256 -3190 -2492 3090 2703
985 2703 -2548 -2839 2302 3305 -2117 -3071 2249 3555 -1502 -3266 1255 3897 -928 -3471 971 3975
1001 3975 -465 -3708 284 3866 551 -3567 -535 3733 993 -3364 -1034 3309 1369 -3320 -1568
1016 -1568 3132 1829 -2808 -2105 2932 2245 -2819 -2468 2285 2532 -2225 -2851 1696 2931 -1612 -3108
1032 -3108 1266 3091 -1101 -3088 455 2957 -774 -3320 121 3286 -30 -3221 -443 2957 462
1047 462 -3350 -677 2923 837 -3018 -1352 2912 1367 -2647 -1768 2447 1814 -2307 -1869 2344 2187
1063 2187 -1870 -2598 1851 2617 -1257 -2313 1416 3094 -1084 -2716 1057 2926 -681 -2866 436
1078 436 2979 -40 -2787 104 3122 463 -2803 -532 2728 855 -2810 -1054 2567 1069 -2651
$$ packed form
969B61m409L065N009k796n016K333N207j892n339J390N564j121n446O98N582l87
985B703n251k91N141J003n422r54N320J306n057j764M521K642m825k543M442L004
1001C975m440l243L992L582l315m118L032M268k740m357K330M343j940m689J752
1016a568M700j303m637P03N037o87n064L51M753K47m757o26M547J235m543j496
1032c108M374J825m192j987L543K502l731k546L441L165l316l191K778L400k495
1047D62l812K673L600k086l855J666M264j545m014Q79M215o33m121M38M213j57
1063B187m057p28M449P66l874j056L729J678m178j632L773J869l607k185L302
1078D36K543l019k747K891L018k659l266K271L260j873l665J756L621j498l720
$$ plain form
1093 -2651 -1166 2482 1613 -2308 -1926 2157 1695 -1971 -2348 1643 1896 -1783 -2520 1332 2153 -1237 -2332
1110 -2332 943 2185 -801 -2746 478 2393 -313 -2508 17 2496 117 -2473 -408 2222 427
1125 427 -2328 -744 2440 786 -2361 -1061 2085 1103 -2116 -1344 1815 1555 -1789 -1712 1446 1902 -1488
1142 -1488 -1919 1375 2017 -1181 -1781 1247 2117 -693 -2507 760 2447 -271 -2017 36 2404 13
1158 13 -2396 76 2355 511 -2143 -477 2274 853 -2156 -923 1938 1110 -1838 -1348 1605 1393
1174 1393 -1611 -1545 1206 1238 -1479 -1555 1040 1656 -1051 -1743 778 1955 -967 -2085 545 1762 -791
1191 -791 -2041 96 1983 59 -1965 -39 2062 192 -1850 -313 1984 240 -1845 -829 1690
1206 1690 767 -1641 -985 1679 1205 -1371 -1050 1598 1388 -1136 -1204 1094 1448 -932 -1752 1039 1883
$$ packed form
1093b651J485L648q69l921L82M083m62l666l77L991K53l679p37L852Q21l390j095
1110b332L275J242k986j945L224J915k706k195K525K479k379k590K065K630j795
1125D27k755J584L184j654l147J300L146r82l219P72L159k60l344P7L158M56l390
1142a488m31L294O42l198o00L028Q70k810j814L267J687k718j746K053K368k391
1158A3k409K472K279j844k654J666K751j421l009J233K861q28k948M90K953k12
1174A393l004O6K751L2k717p6K595O16k707o92K521J177k922j118K630J217k553
1191g91j250K137J887j924k024J926K101j870k042J537K297j744k085J016K519
1206A690r23k408O56K664m74k576L21K648k10k524o8K298L54k380q20K791Q44
$$ plain form
1223 1883 -664 -1736 402 1668 -392 -1805 358 1887 -129 -1613 24 1824 145 -1710 -226
1238 -226 1847 322 -1576 -530 1751 740 -1518 -958 1567 1146 -1464 -983 1320 1310 -1232 -1186 1146
1255 1146 1251 -945 -1828 855 1309 -952 -1761 332 1185 -619 -1510 259 1522 -331 -1450 -142
1271 -142 1504 -92 -1783 -422 1471 334 -1711 -380 1332 737 -1656 -550 1601 790 -1488 -926
1287 -926 1300 971 -1209 -830 1085 1046 -866 -847 1009 1275 -791 -1492 309 1398 -323 -1240 477
1304 477 1353 -214 -1417 136 1429 193 -1496 -208 1673 341 -1391 -463 1344 645 -1237 -558
1320 -558 1391 793 -1401 -1044 1125 930 -1207 -1225 1139 1079 -763 -1016 714 1006 -1044 -1172 595 1322
1338 1322 -384 -1104 424 1191 -403 -1250 76 1200 249 -1369 -15 1399 294 -1454 -271 1515
$$ packed form
1223A883k547j072K138J266k060j413K163J529k016j484J637J800j679j855J484
1238b26K073j525j898J046K281j011k258N60K525m21k610M81K303j0k542M6K332
1255A146J05k196q83K683M54k261q09K093Q53j804q91J769J263j853j119J308
1271a42J646j596j691J361J893j137k045J331J712n95k393J106K151q11k278N62
1287i26K226l29k180L79J915l9j912J9J856K66k066p01J801J089j721r17J717
1304D77Q76j567j203J553J293j236j689J288J881j332j732R28J807o99j882O79
1320e58J949n98k194L57K169j95k137j8K364o0j842k53J730K92k050j28J767P27
1338A322j706p20J528P67j594q47J326J124r51j618J354J414j105j748J183J786
$$ plain form
1354 1515 344 -1109 -416 1566 777 -1208 -594 1188 682 -1183 -901 1228 1129 -1101 -846 758 1014
1371 1014 -779 -1041 927 981 -758 -1160 631 1236 -381 -1129 501 1115 -25 -1344 174 1310 149
1388 149 -1332 -453 1237 331 -1213 -488 1296 458 -1290 -867 1000 692 -1268 -892 938 628 -1073
1405 -1073 -887 765 824 -816 -1042 681 947 -832 -1063 458 820 -476 -1226 239 1337 -103 -1109
1422 -1109 -27 1117 27 -1175 -41 934 185 -1109 -249 1034 341 -1229 -474 1180 657 -950
1438 -950 -779 783 842 -934 -903 948 758 -601 -623 804 1023 -492 -1125 519 1107 -243 -963 285
1456 285 1194 -181 -1088 67 1182 -234 -1101 46 1126 -59 -1335 -289 1288 244 -994 -723
1472 -723 847 521 -1174 -682 694 641 -954 -569 818 853 -822 -1027 938 1054 -862 -1215 562 688
$$ packed form
1354A515j171j453O93J982p89j985O14J782n06j865K82K129r9k230K55J604K56
1371A014j793k62J968N4j739m02J791O05j617p48J630O14j140j319J518J136j161
1388A49j481Q79J690r06j544P25J784q38j748M23J867l08j960L76J830l10j701
1405a073J86J652N9j640k26J723K66j779k31J521L62j296p50J465J098j440j006
1422a109J082J144j090j202J134R75p49j294Q60J283o93j570P55J654n23j607
1438i50J71J562N9j776L1J851j90j359k2J427K19j515o33J644N88j350p20J248
1456B85R09j375r07J155J115j416q67J147J080j185j276J046J577j044j238K71
1472g23J570l26j695M92J376n3j595L85J387L5j675k05J965J16j916l53J777J26
$$ plain form
1490 688 -637 -1073 278 885 -487 -1018 53 1038 -207 -992 232 1013 -44 -917 -80 1124 213
1507 213 -1002 -292 931 559 -1129 -650 1009 673 -872 -617 991 760 -930 -645 863 847 -687
1524 -687 -713 842 1005 -444 -703 543 1005 -380 -822 444 1324 -22 -1096 133 994 -89 -1356
1541 -1356 115 1205 29 -1095 -94 901 129 -1252 -358 815 536 -998 -495 756 503 -844
1557 -844 -815 670 603 -794 -763 817 922 -599 -1160 373 819 -227 -986 470 826 -329 -1152 216
1575 216 935 -81 -1101 -10 952 -15 -858 -72 908 213 -977 -46 868 420 -924 -332 890 320
1593 320 -953 -416 976 526 -781 -663 971 673 -612 -973 344 1039 -392 -855 715 1113 -212
1610 -212 -869 201 916 -89 -876 265 809 35 -1017 3 996 65 -1027 -121 1054 271 -958
$$ packed form
1490F88j325m36J351O07j372n31J071R85j245p85J224P81j057q73Q37J204r11
1507B13j215P10J223l72j688M79J659l36j545K55J608k31j690K85J508j6j534
1524f87k6J555J63j449k59J246M62j385m42J266Q80j346j074J229Q61j083j267
1541a356J471J090j176j124J001R95p72j381Q94J173k79j534N03J251k53j347
1557h44K9J485o7j397L1J580J05j521n61J533M46j046p59J456L56j155q23J368
1575B16P19j016j020J091R62r67q43P86R80o95j190R31R14m48j344N92J222n70
1593C20j273N37J392m50j307J18J634k98j285l61J317O95j431m63J570L98j325
1610b12o57J070P15j005p87J141N44p74j052J020R93r31j092R06J175p83j229
$$ plain form
1627 -958 -556 888 482 -694 -455 844 182 -750 -594 874 523 -873 -1050 668 529 -691 -926 470
1645 470 730 -456 -840 345 817 -265 -1000 305 929 -99 -1076 -65 898 -38 -926 90 917 147
1663 147 -883 -231 1016 306 -643 -305 793 655 -683 -417 798 591 -679 -493 802 730 -622 -908
1681 -908 552 792 -426 -718 611 993 -244 -613 103 972 -214 -857 266 1005 -117 -1102 -30
1698 -30 963 9 -972 13 782 281 -660 -416 632 181 -753 -359 840 650 -864 -498 538 467 -578
1717 -578 -772 711 606 -732 -680 563 804 -538 -868 219 808 -361 -890 520 710 -233 -952 52
1735 52 793 -114 -807 216 680 310 -917 -97 1128 317 -746 -346 669 377 -604 -410 783 641
1753 641 -713 -466 643 890 -533 -380 802 608 -723 -958 566 612 -249 -885 277 797 -212 -859
$$ packed form
1627i58M02J444m06j176K39J299o62r32J56J468l51j396j77J718j39j220k35J396
1645D70K60j186l84J185M72j082p35J305O24j028r77J011R63r36q88J016Q27p70
1663A47j030O52J247p10r49L38J098j38j338K66J215k07j270J86J295p2j352k86
1681i08J460K40j218k92J329L82j237l69P16Q69j186o43J123P39j122r85J072
1698c0R93r54r81R85P69n01r41K44J048m51r34L94J199j90j514L66J036p1j045
1717e78j94J483j05j338N2J243K41j342l30J087N89j169n29J410J90r43p19J004
1735E2P41r07o93J023M64l70j227Q20J225q11j063M00J015k92r81J94J193j42
1753F41j354K47J109K47j423J53J182j94j331k35J524M6q61o36J162N20j009o47
$$ plain form
1771 -859 339 769 16 -955 -51 659 -29 -785 -210 817 190 -614 -214 600 164 -846 -256 649 342
1790 342 -995 -500 661 449 -777 -745 674 418 -577 -770 725 479 -623 -822 366 903 -343 -886
1808 -886 41 804 -322 -499 198 727 -101 -721 -89 1059 -178 -627 48 845 372 -890 -200 980
1826 980 245 -751 -229 975 564 -717 -353 715 558 -607 -491 619 486 -629 -525 510 789 -336
1844 -336 -526 439 574 -92 -617 216 1024 -235 -914 14 548 -69 -743 -155 848 118 -850 -110 680
1863 680 53 -946 7 598 37 -523 -501 679 253 -683 -526 484 301 -681 -649 610 718 -572 -450
1882 -450 331 738 -629 -652 502 771 -132 -847 384 848 -352 -951 287 705 -125 -653 211 916 108
1901 108 -687 -224 718 134 -724 -120 882 406 -739 -463 431 466 -362 -159 478 430 -354 -652 543 347
$$ packed form
1771h59J198M30p53r71R04P10o88p56N75J027o27q04M00Q14m36j010N90R05l07
1790C42j337M95J161k12j226L2J419k56r95j93J495k46j102j99J188N37j246n43
1808h86R27P63j126j77O97N29q28o20O32J148j237m49O75P97m73j262O90J180
1826I80p35r96N22J204m11j281L64J068j57j165J16J110j33j115J04J035K79j125
1844c36j90R65J35o66n25Q33Q08j259o79R28N34o17o74N88J003p30r68P40P90
1863F80o27r99R53N91n61n60K2J180m26r36J57J010j83r82L2J259J08j290J22
1882d50P81M07j367k3J154K69r03p15J231M64j200n99J238M18q30n28Q64P05q08
1901A08p95M63R42n84q58O04J002m76j145K76Q94L5q28K03O37m8p84k98J195j96
$$ plain form
1921 347 -371 -482 399 751 -424 -477 324 632 -253 -600 177 477 -147 -804 224 803 -172 -724 -134 563
1941 563 36 -814 -202 769 250 -637 -408 597 194 -787 -510 561 321 -825 -330 458 323 -697 -601
1960 -601 511 507 -560 -611 542 447 -248 -502 38 808 -217 -703 305 843 -134 -579 -228 964 80
1979 80 -466 -155 684 175 -482 5 703 173 -682 -90 734 268 -566 -32 519 626 -420 -448 617 423
1999 423 -622 -488 541 506 -552 -729 319 873 -447 -663 251 689 -224 -616 218 512 -159 -785 22
2018 22 822 177 -700 -325 440 27 -637 -249 591 347 -485 -317 629 236 -619 -409 324 614 -406 -548
2038 -548 330 544 -248 -525 217 681 -264 -716 429 716 -157 -731 235 806 -100 -525 140 622 -24 -724
2058 -724 208 708 121 -789 57 665 177 -827 -57 645 316 -620 -352 492 321 -741 -496 431 551
$$ packed form
1921C47p18j11Q81L52j175n3Q01L08q85l47P77L00o24o57J028N79r75n52N90O97
1941E63n27q50O12R71n19q87K29J005m03r81K77J071k40j146M95P88j35j020R6
1960f01J112mj067n1J153r5o95k54N40P70j025m86J008N38r77m45L51J192q84
1979H0n46L11Q39n09o57M87O98n30q55N92Q24m66q34N34N51J07j046k8J065j94
1999D23j045J34J029l5j058j77J048N54j320k16R14M38r13l92Q34K94o71o26Q07
2018B2Q00o45q77L75P65m13o64L88Q40k44q32J68R46l93q55K10P33K90j020j42
2038e48Q78K14p92k77P42M64r45m52J145K87q73n74R66N71r06m25O65M82o46p00
2058g24R32N00n87r10Q46O08m88j004P70P02l29r36K68Q44j71j062K45R27J20
$$ plain form
2077 551 -473 -419 454 384 -491 -739 421 415 -366 -592 75 643 -134 -603 277 366 -143 -852 43 589 234
2098 234 -658 49 661 62 -825 -137 609 135 -592 -291 471 211 -446 -458 327 435 -467 -339 443 530 -239
2119 -239 -631 269 385 -264 -400 472 908 -248 -402 232 436 -196 -721 89 659 -2 -564 59 455 27
2139 27 -602 -141 736 188 -428 -230 579 280 -658 -21 617 170 -498 -239 310 277 -433 -441 290 206 -206 -292
2161 -292 184 359 -406 -418 140 413 -164 -540 57 440 -73 -682 -79 476 -271 -604 -96 495 95 -890
2181 -890 -102 398 110 -651 -393 488 356 -588 -195 501 305 -311 -395 435 423 -419 -477 354 460 -137 -563
2202 -563 148 747 -478 -180 274 363 -185 -488 182 822 -20 -532 219 591 187 -295 -162 705 76 -344
2222 -344 -231 532 -50 -564 -123 534 266 -679 -413 472 528 -654 -460 409 477 -324 -572 345 397 -421 -592
$$ packed form
2077E51j024N4Q73p0q75k48J160op81k26O67N68p77m69Q80Q9n09p09Q95N46l55
2098B34q92P07O12n99q87O88P46m74p27L01P62k60o57j2P85J08r02J28P82Q7p69
2119b39l92R00J16o49j36Q72M36j156j54O34K04o32n25Q10N70o61n62O23L96m28
2139B7o29M61Q77n48o16J98Q09k99r38O37O38m47o68K59N49l3p10qP31q4m12q6
2161b92M76J75p65j2N58K73n77l76N97L83n13o09O03N55p47l33N08N91m00r85
2181h90P88N00k88p61K58Q81j32r44L93O96j96o16q4Q30j2q42n8Q31J06n97m26
2202e63P11N99j225K98M54Q9n48l03O70O40q42n12P51L72m04m82J33Q67o29m20
2222c44J13P63n82n14M41O57k68r45K66Q85N6j182J94Q69O8q01k48R17N2q18j71
$$ plain form
2243 -592 279 467 -382 -472 3 375 50 -391 156 570 181 -534 -115 591 -275 -533 -55 944 316 -424
2263 -424 -118 638 300 -672 -338 538 252 -610 -488 361 455 -301 -680 274 488 -223 -92 314 589 -306
2283 -306 -418 111 532 -296 -422 151 547 -189 -423 171 500 174 -426 111 618 128 -368 -157 491 91
2303 91 -497 -170 489 154 -158 -139 605 338 -272 -80 382 138 -309 -404 170 447 -544 -161 143 389 -117
2324 -117 -674 158 657 -270 -479 -131 275 64 -413 -84 466 -74 -496 -223 453 -225 -748 -307 586 215
2344 215 -474 -289 576 256 -548 -138 235 493 -348 -417 534 429 -422 -415 281 481 -158 -386 344 344 -400 -546
2366 -546 137 489 -212 -277 125 712 57 -484 289 485 302 -180 -149 369 -85 -315 -77 378 119 -377 -442
2387 -442 301 314 -558 -194 573 318 -458 -387 244 293 -460 -639 315 449 -271 -382 348 405 -139 -538 218
$$ packed form
2243e92Q71J88q49r0M75L72l25m41N47M14l89p15M19P06q66k58M78R99o28p40
2263d24L06P56l38r72L34Q76k86q62J22Q49R4p56l79R54K14p11J31M06K75q95
2283c06j12N29M21q28j26N73L96p36k34N94L29l26o00N37N07m90m96K11O48m00
2303I1n88L27O59l35l12J9P44k67o10J92M62k44m47r5N74K77r91L83L04K46n06
2324a17n57Q32M99r27k09L48M06k11m77L29N50n40m22K73O76o78n23M41Q93l71
2344B15o89J85Q65l20q04M10L73K58q41o9R51j05q51PO96K00o39k28P30%p44j46
2366e46O83L52p01o5M02N87o55n41P73J96j83m82L1N18m54k30K38M55k59m96o5
2387d42P43J3q72L64P67k55p76P1O31M9p53j79R54J34p20j11P30N7n44l99P56
$$ plain form
2408 218 374 -282 -499 44 246 -208 -664 -141 877 -129 -240 67 489 199 -205 -234 193 212 -436 -242
2428 -242 338 257 -360 -214 184 457 -311 -578 238 452 -99 -736 329 632 38 -290 207 360 -94 -343
2448 -343 2 573 -160 -307 -209 630 -105 -567 -110 524 178 -370 -72 531 208 -434 -238 357 219 -436
2468 -436 -270 138 350 -474 -105 278 401 -436 -487 253 356 -230 -402 344 285 -129 -422 187 580 -83 -544
2489 -544 75 346 -121 -449 13 426 -7 -435 -142 203 84 -302 82 322 33 -323 -311 418 183 -306
2509 -306 -317 182 391 -377 -427 163 266 -234 -25 341 395 -177 -216 282 204 17 -223 88 339 73 -145 126
2531 126 356 22 -540 -161 275 -6 -478 -144 371 -195 -582 -177 390 188 -530 -249 -59 288 -382 -371
2551 -371 460 233 -411 -332 82 157 -277 -484 199 650 -164 -462 213 383 -125 -465 79 156 -153 -391 83
$$ packed form
2408B18J56o56k17N43K02m54m56N23J018j006j11L07M22k90m04k9M27J9o48J94
2428b42N80q1o17J46L98K73p68k67Q16K14n51o37J065L03n94l28M97J53m54k49
2448c43L45N71p33j47R8Q39p35m62M57O34l46n48K98O03l23o42J96N95j38o55
2468d36J66M08K12q24L69L83J23q37n1P40J03n86j72P46n9m14k93O09L93o63m61
2489e44O19K71m67l28M62M13m33m28K93L45j19l86L84K40k89l56J2P29k35m89
2509c06j1M99K09p68n0N90J03n00K09L66N4n72l9M98p8j87k40L11K51k66k18K71
2531A26K30l34n62L79M36k81m72L34N15n66l87M05N67k02p18K81J90L47o70J1
2551c71Q31k27o44P9M14P5m34k07O83M51q14k98O75J70n08l40N44P7l09k38M74
$$ plain form
2572 83 436 20 -326 -33 537 0 -351 -168 331 269 -283 -275 351 140 -22 -93 555 293 -183 -377 103 216
2594 216 -199 -474 360 520 -296 -339 164 450 -221 -246 103 574 -169 -161 122 275 -129 -409 -13 240 156 -278
2616 -278 3 505 115 -359 -79 382 79 -534 -147 220 -5 -307 -273 190 138 -220 -299 220 74 -405 -266
2637 -266 165 234 -417 -617 227 178 -477 -332 -91 350 -257 -344 294 249 -128 -280 187 23 -114 -396 -42
2658 -42 179 197 -478 51 259 95 -168 85 314 290 -125 -95 463 62 -103 -423 478 49 -52 -133 74 386
2680 386 -22 -236 200 398 111 -268 392 649 -144 -445 125 250 -232 -293 -205 83 110 -106 -72 158 85 -546
2702 -546 -81 244 204 -488 -252 111 98 -452 -221 23 147 -335 -405 79 267 -235 -239 -71 227 -79 41 307
2724 307 445 20 -486 104 331 -135 -216 147 316 -88 -303 -312 426 135 -401 82 386 -8 -374 -72 374
$$ packed form
2572H3L53m16l46K93N70n37l51J83M99o2n52QO26k11j62p1O48k62m76j94M80J13
2594B16m15k75Q34J60q16m3N03K86o71k5L49M71p43QK83J53m04k80L96K53q4m34
2616b78K81N02l90m74K80M61l03o13L87L67k25l02L4M63n2l58p9N19j46m79J39
2637b66M31O9o51k00Q44m9o55J45K41M41o07q7O38m5l77j52M67j64j37k82L54
2658d2K21J8o75N29K08j64k63K53K29k4m15L0N58m01j65l20R01m29j01q1K07L12
2680C86m08k14M36J98k87l79O60K57p93l01N70J25m82o1Q8K88K7k16L4K30p3o31
2702e46M65L25m0o92K36L63j3n50K31K44J24m82p0M84J88n02mJ68K98l06J20K66
2724C07J38m25n06N90K27m66q1L63J69m04k15rP38k91n36M83L04l94l66L02M46
$$ plain form
2745 374 101 -25 74 349 315 -101 -238 102 110 -353 -224 302 301 -227 59 83 232 -124 -154 122 285 67 -16
2768 -16 191 184 -87 -364 -203 92 116 -477 -209 41 54 -358 -318 332 -91 -234 -260 172 258 -577 -145 278 125
2791 125 -250 -566 74 262 -237 180 252 305 -20 -158 11 26 -120 -237 232 101 -69 -267 199 228 7
2812 7 -45 -125 246 96 -160 288 438 202 -335 -211 371 440 -237 -248 326 143 -199 -165 211 57 22 -310 247
2835 247 493 -179 -212 23 298 -54 53 43 305 -35 -310 240 232 -49 -241 -106 370 -40 -81 -85 104 -100
2857 -100 -429 31 59 -136 -304 -10 256 -34 -361 -59 57 90 -191 -216 93 276 -297 -34 39 316 -208
2878 -208 45 181 361 -256 -308 92 11 -140 -298 -16 226 -95 -63 82 386 108 -326 148 284 -54 -228
2899 -228 -51 48 228 -369 -167 65 341 14 -28 449 36 -179 -143 422 152 -283 -34 91 -7 -83 -366 13
$$ packed form
2745C74k73j26R9K75l4m16j37L40Qm63J29N26jn28K86K4J49l56l0K76J63k18q3
2768a6K07pk71k77J61K95K4n93K68K50J3m12M0O50m23j43k6M32Q6q35M32M23j53
2791A25l75l16O40J88m99M17P2N3l25j38J69J5j46j17M69j31j70j98M66K9k21
2812Gn2q0L71j50k56M48J50k36n37J24N82O9o77j1N74j83l42L4L76j54l5l32N57
2835B47K46o72l3K35K75l52J07j0K62l40k75N50qk81j92J35M76m10m1mJ89k04
2857a00l29M60K8j95j68K94K66k90l27L02J16L3k81k5L09J83n73K63P3K77n24
2878b08K53J36J80o17n2M00q1j51j58K82K42l21L2J45L04k78m34M74J36l38j74
2899b28J77R9J80n97K02K32K76l27m2M77m13k15L6N65k70m35K49J25r8p6k83L79
$$ plain form
2921 13 237 -118 -342 74 -291 -76 -234 -103 -25 -127 -156 -77 104 170 -313 12 189 -12 -140 -38 83 47
2943 47 -277 -165 279 344 -114 -183 322 74 -138 -336 89 -79 -175 -261 192 229 -219 -110 171 296 -38 -161
2965 -161 41 414 80 -26 -55 157 202 -361 131 305 -3 -153 -22 155 131 -132 0 91 422 -370 -225
2986 -225 127 166 -30 -323 288 293 68 -52 219 328 -158 -358 -18 270 158 -146 63 38 -238 -28 -134
3007 -134 180 -83 -254 -45 256 -104 -100 -182 160 49 -237 -103 165 -81 -482 -27 227 133 14 -298 368
3028 368 333 -168 -190 151 92 -245 57 399 237 -27 -371 24 266 -150 -389 20 349 -243 -259 -232 -159 171
3050 171 -256 -413 294 -314 76 -496 51 401 -67 152 109 -78 -132 412 430 421 -688 56 -129 278 103
3071 103 -23 547 -673 -552 -32 144 -184 -310 -198 57 539 -649 -686 -250 315 -400 -511 163 -251 264
$$ packed form
2921A3K24l55k24M16l65K15j58J31P8j02k9P9J81O6m83L25J77k01j28J02J21l6
2943D7l24J12M44O5m58o9N05k48k12j98M25j68r6q6M53L7m48J09K81J25l34j23
2965a61K02L73l34j06k9K12M5n63M92J74l08j50J31J77k4k63J32R1L31p92J45
2986b25L52L9j96k93O11Nk25j20K71J09m86k00L40K88j12l04K09k5k76K10j06
3007a34L14k63j71K09L01l60Mq2L42j11k86J34K68k46m01M55K54r4j19l12O66
3028C68l5n01k2L41n9l37L02L42j62k64l44L95K42m16k39M09L29n92j6K7P3L30
3050A71m27j57P07o08L90n72N47L50m68K19m3j87n4N44J8rj109P44j85M07j75
3071A03j26N70j220J21N20J76l28j26J12K55M82j188l7M36N65p15j11O74m14N15
$$ plain form
3091 264 -261 623 869 474 370 432 273 -255 -660 -59 313 -90 -199 382 351 -85 58 -321 160 431 -9
3112 -9 -126 -191 -35 221 -250 -406 -464 -926 138 -395 60 -1 -2 188 319 -137 81 88 295 30 -189 -223 262
3135 262 -134 -170 -22 170 -7 -166 -147 221 142 -73 -41 -217 268 -194 -12 151 194 -256 -281 66 -84 -238
3157 -238 -287 -51 308 -93 -327 72 157 -172 -291 -13 105 -22 -163 -70 125 83 20 -186 105 -21 -203 -58
3179 -58 250 -102 -160 -161 196 -3 -78 113 203 114 -207 -60 101 162 -104 -11 20 263 -40 36 161 367 -186 -108
3203 -108 -8 222 127 -57 86 91 79 -115 -178 161 238 -107 -64 500 -70 -207 -83 109 68 -271 320 87 159
3226 159 -235 -228 153 59 -40 -189 218 52 -125 26 -113 -40 -220 -477 12 111 26 -67 21 14 -133 -279 60 178
3250 178 -47 -219 27 -1 191 -115 -161 -8 185 -114 -87 110 -53 11 -64 134 245 54 -344 267 -53 -125
$$ packed form
3091B64n25Q84K46l95j04O2j59n28m05O01L72m03j09N81l1m36J43l79M81K71m40
3112ij17o5J56K56m71j56n8m62J064n33M55o1jJ90J31m56K18PK07k65k19l4M85
3135B62l96l6J48J92j77j59J9L68p9k15L2j76M85m62J82J63M3m50k5L47j50j54
3157b38m9K36L59m01k34L99Q5l29j19K78J18j27j41R3J95m2o3k06K91j26j82J45
3179e8L08l52n8jL57j99p5J91R0q9l21J47J61O1k66R3L1K43l03P6J25K06n53P8
3203a08J00K30r5j84J43Nj2j94o3L39P7l45M3N64n70j37J24J92m1l39N91k33P2
3226A59l94PL81r4r9j49M07j66j77J51j39P3j80k57M89R9q5r3Q8pj47j46L39J18
3250A78k25j72K46k8J92l06m6J53J93k99K7J97j63O4p5J98J11j91l98O11l20p2
$$ plain form
3272 -125 57 214 -43 2 -115 -76 115 232 -102 40 22 216 43 12 198 -25 38 153 384 44 -227 -43
3294 -43 122 81 -110 -7 43 35 -278 122 -36 -83 -193 -313 6 200 140 -11 -55 184 -39 35 -4 108 -3
3317 -3 -254 -117 -45 -16 -204 146 27 -194 -149 -64 157 -113 -108 -59 58 -77 -142 -66 162 142 -224 -50 41 144
3341 144 42 -102 270 235 160 -223 56 -107 -39 145 99 164 -89 -179 217 75 56 -37 -28 -87 47 93 -120 230
3365 230 -202 -235 225 89 -154 -76 -30 89 74 -59 -31 215 283 -109 68 -15 377 -47 -368 -132 166 -157
3387 -157 -205 32 122 -105 -72 61 -16 -218 19 -67 -25 10 -233 83 133 214 11 -166 108 49 -60 148 111 119
3411 119 -335 -129 -208 -110 -113 -61 -67 209 -21 -224 -49 6 35 116 131 -13 -148 -269 99 178 -69 63 75 115 -49
3436 -49 -211 56 222 -161 -107 149 307 120 -158 -47 24 -58 30 37 107 -202 -176 -203 86 -162 -177 -117 -202 28
$$ packed form
3272a25J82J57k57M5j17L9J91J17l34J42j8J94j73l1J86k23O3J15K31l40k71J84
3294d3J65m1j91J03N0ql13M00j58m7j10j20L19J94o0j51m4K39k23P4l9J12j11
3317ck51J37P2K9j88L50j19k21M5Q5K21k70NM9J17j35o5P6K28k0l66J74R1J03
3341A44j02j44L72l5p5l83K79j63O8J84m6O5k53r0L96j42j9r3Rn9J34M6k13L50
3365B30m32l3M60j36k43P8M6J19j5j33K8K46O8l92J77q3L92m24l21K36K98l23
3387a57m8K37R0k27L3J33p7k02K37q6M2L5k43L16N0Q1k03j77K74n9j09K08l7Q
3411A19m54K06p9R8lN2oK76k30k03J75N5K9Q1J5j44j35j21L68P9k47J32J2M0j64
3436d9j62K67J66l83N4K56J58j87k78J11P1q2Q8PP0l09K6k7K89k48j5O0q5K30
$$ plain form
3460 28 -1 -328 168 -66 -114 -141 81 121 -191 -168 -6 -7 -21 -74 -56 -19 108 164 -69 308 -39 -179 -176 179 222
3485 222 136 -110 49 -111 22 -298 118 -216 -60 39 84 115 -201 -172 258 -194 -145 -69 68 -33 111 -98
3507 -98 239 263 -72 -24 -51 154 -92 98 50 173 174 29 -159 212 -114 -127 -42 128 -47 -475 48 143 25
3530 25 -148 -124 23 85 -115 -61 65 -161 -122 -182 -45 -6 -55 -276 -167 96 -85 -336 55 -98 -10 -132 253
3553 253 -15 60 -243 174 -136 2 182 65 304 -163 -310 -76 182 -45 0 -152 194 -103 -24 -68 -144 -54
3575 -54 -81 49 148 42 -146 -5 266 -113 -36 -60 182 145 -44 -296 252 219 37 -83 62 291 -35 -180
3597 -180 -180 289 179 116 -147 183 -18 1 102 177 52 -177 -100 96 -108 -336 76 75 14 -408 88 21 194
3620 194 -169 58 170 -160 -48 66 -157 106 8 -163 -42 -92 -74 -106 10 145 -38 -215 151 -23 -221
$$ packed form
3460B8k9l27M96k34m8k7K22M0l12K3J62jj4n3J8L7J27N6k33L77l47j40LL55M3
3485B22q6k46J59j60J33l20M16l34J56R9M5L1l16K9M30m52M9P6J37j01J44k09
3507i8L37K4l35M8k7K05k46J90m8J23Jj45j88L71l26j3Q5J70j75m28N23R5j18
3530B5j73K4J47O2k00N4J26k26L9o0J37L9m9k21J09K63j81k51L91j53Q8j22L85
3553B53k68P5l03M17l10J38J80j17K39m67j47K34K58k27M5j52L46k97P9m4p6R0
3575e4k7J30R9j06j88J41K71l79P7k4K42l7j89k52N48l3j82j20J45K29l26j45
3597a80%M69j10o3k63L30k01J9J01P5j25k29P7J96k04k28M12jo1m22M96o7J73
3620A94l63K27J12l30J12J14k23K63r8j71J21n0J8l2J16J35j83j77L66j74j98
$$ plain form
3641 -221 -106 48 153 281 -27 88 317 112 203 19 238 -25 -44 151 138 -80 259 -217 228 153 -68
3662 -68 -8 99 -151 -66 -2 135 107 83 15 -99 200 61 30 -60 -65 201 -171 168 -48 136 -285 -144 175 61
3686 61 254 -113 161 165 -93 117 158 45 -210 -244 61 -58 -23 -122 -156 163 -33 -105 -195 129 -149 -152 58 54 51
3711 51 16 323 -138 -127 -283 175 -19 55 102 -256 82 -4 25 -33 -10 -153 -19 -212 56 -11 -191 -82 -54 164
3735 164 72 -40 108 0 -1 24 101 130 -52 -241 -101 23 -173 -217 -39 129 370 66 5 92 -80 -178 -4
3758 -4 100 180 -104 72 111 -223 -103 -83 141 46 -101 -315 62 -17 -104 -42 -95 38 -91 -85 61 97 52 -2 9
3783 9 75 3 -41 -131 159 -105 -110 -14 110 81 -152 -58 66 -118 -76 -64 -72 -272 -106 193 -64 -21 -84 -72 -159 67
3809 67 -8 83 -36 -171 -115 -197 -68 86 -106 93 137 34 -71 41 -293 25 -96 5 150 -23 50 -438
$$ packed form
3641b21J15J54J05J28l08J15K29k05R1j84K19k63j9J95j3k18L39m76M45p5k21
3662f8O0J07k50Q5O4J37k8k4o8j14K99j39l1r0nK66l72L39k16J84m21J41L19j14
3686F1J93l67K74Mk58K10M1j13k55l4L05j19L5r9l4L19j96p2r0L24k78lK10ml
3711E1l5L07m61J1j56M58j94P4M7l58L38q6K9n8K3j43J34j93K68o7j80J09K8K18
3735A64r2j12J48j08jK5P7K9j82j89J40J24j96m4J78J68K41l04o1Q7j72r8J74
3758dJ04Q0k84J76L9l34J20K0K24r5j47k14L77p9q7O2n3J33j29OJ46L6m5n4J1
3783IO6p2m4r0K90k64nR6J24k9k33R4J24j84M2J2qk00J66K99k57M3o3J2q7K26
3809F7p5R1j19j35N6q2J29J54j92J99M4j03j05J12l34L18j21J01J45j73P3m88
$$ plain form
3831 -438 1 -123 -324 15 164 39 -18 -158 204 48 108 -2 -60 263 -37 -103 -189 -73 113 75 -125 17
3853 17 -71 -78 -93 -7 87 -267 -102 -20 -83 -7 -224 53 40 193 41 238 -12 -64 -188 -106 101 39 -9 -174 -10
3878 -10 38 178 -33 98 -55 -58 118 205 57 103 32 178 83 -51 -78 -145 167 67 137 52 168 8 48 -36 163
3903 163 -182 -1 -70 40 1 -103 -108 24 -97 8 122 -144 -87 -143 -80 82 43 -224 -193 -1 -185 -20 -240
3926 -240 35 69 -111 -82 -133 96 31 85 1 31 -65 -166 -61 -35 -51 -107 87 173 -47 -314 -163 55 28 166
3950 166 170 202 90 -105 -155 -70 -41 216 -89 -69 154 35 -153 157 -106 241 66 9 67 98 -41 -68 115 -150
3974 -150 -10 279 73 121 -193 -56 104 64 -3 37 13 -70 33 -93 135 97 100 -166 -25 -59 68 -153 -295
3997 -295 88 -177 46 52 83 39 13 -94 -15 -99 -8 71 -243 112 205 31 314 -6 -51 267 45 -76 89 113
$$ packed form
3831d38M39j24k01L39J49j25n7j40L62j56O0j10n8L23l00o6q6J16J86l8k00J42
3853A7q8pj5Q6R4l54J65Q2o3P6k17K77j3J53j52J97k50n2j24Q2K07o2m8j65J64
3878a0M8J40k11J31j53lJ76Q7j48M6p1J46r5j34k7o7L12j00P0q5J16j60M0q4J99
3903A63l45J81o9J10l9j04nJ32j21J05J14k66N7n6O3J62l9k67L1J92j84J65k20
3926b40K75L4j80K9n1K29o5N4q4L0r6j01J05K6j6n6J94Q6k20k67J51K18k7J38
3950A66ML2j12j95n0Q5K9K57l05K0K23j19j88L10k63L47j75n7N8L1j39k7J83k65
3974a50J40K89k06M8l14J37J60m0o7M0k4q3J03j26K28l8Lk66J41l4J27k21j42
3997b95L83k65K23OL1m4k6j07P9q4R1P9l14L55R3j74K83l20m5L18k22j21J65K4
$$ plain form
4021 113 -35 -103 208 9 -143 56 0 -29 98 51 -147 214 71 -9 22 8 341 -179 -61 -156 338 66 5
4044 5 -161 -199 101 -77 43 63 30 134 39 111 108 -149 -122 -157 40 9 -169 -21 122 -17 -167 62 -2 -108
4068 -108 38 47 36 -110 -146 19 21 -53 -234 -118 15 50 -173 3 175 -93 -22 250 -85 135 81 -223 165
4091 165 82 78 -210 124 152 -26 -48 201 -75 55 52 68 238 -190 80 141 92 -24 58 65 70 6 -101 20 82 3
4117 3 -112 -177 127 49 -22 -130 142 145 -53 -205 -12 -11 70 241 -60 -78 191 177 -83 63 -161 -87 -51 203 -266
4142 -266 58 -34 -288 150 26 40 -142 -50 85 -82 23 -120 -34 -152 -141 -154 -278 175 116 -49 -101 -110 -161 -118
4166 -118 41 -168 -79 91 -13 -8 -79 52 -231 -31 100 -16 41 157 75 -28 -58 48 229 -117 -1 -165
4188 -165 -70 96 -28 -16 316 33 169 15 -184 -29 -40 -120 -57 104 -54 8 16 -108 154 -36 -243 18 64
$$ packed form
4021A13j48o8L11j99j52J99n6k9J27m7j98L61j43q0L1j4L33n20J18r5M94k72o1
4044Ej66l8L00j78J20K0l3J04r5P2lk57K7l5J97l1j78J48J43j39j50K29o4j06
4068a08J46Rj1j46l6J65Kp4j81J16J33L5k23J76J72k68P1K72l35K20n4l04L88
4091A65q3mk88L34K8j78k2K49k76J30lJ6J70m28K70O1m9j16Q2PNo4j07J21O2p9
4117Cj15o5L04p8p1j08K72Lj98j52J93JQ1J71l01j8K69j4k60J46k24P4L6K54m69
4142b66L24r2k54M38j24J4j82R2J35j67J05j43Q6j18J1j3j24M53n9j65n2rn1M3
4166a18J59k09Q9J70j04Np1J31k83K00J31j16N7J16q2j03l0J06J81l46J16j64
4188a65R5J66j24J2L32k83J36j54j99J55j1q0O3J61j58O2Qj24K62j90k07K61M6
$$ plain form
4211 64 154 -44 55 337 -52 26 104 135 -115 26 -206 123 -132 -72 -45 -224 40 162 49 -27 -68 -110 21 -25
4235 -25 169 -52 -84 168 157 -58 229 -97 87 237 411 -71 92 83 294 -77 120 76 1 270 183 142 176
4258 176 229 196 -30 -126 91 128 -199 -142 -29 48 219 125 -70 -60 74 -57 396 -100 -139 -129 -80 -44 -80 -102 232
4283 232 -29 -103 -15 -16 112 -9 -19 -175 -77 0 56 81 25 -14 -117 -84 132 41 73 25 139 59 -16 4 3 16 83
4310 83 -95 32 -80 171 -148 -37 -60 -50 -149 51 26 -30 59 -13 84 78 -69 5 -5 165 42 -251 -29 83
4334 83 -212 -13 97 -107 -14 -118 -22 157 -130 -18 -100 83 -69 77 -132 -20 -58 -79 180 54 25 -33 -100
4357 -100 231 198 -116 -112 20 216 77 -13 17 -26 -44 -75 204 -30 -159 -184 18 -79 34 66 109 195 60 -141
4381 -141 29 -33 -89 -252 -168 50 130 45 14 -61 -6 -66 97 142 16 -209 75 -30 -211 -95 -96 186 12 65
$$ packed form
4211F4R0j98R9K82l89P8P8L1k50J41k32L29k55O0K7j79K64J22j13p6m1m2J31m6
4235b5J94k21l2K52j1k15K87l26J84J50J74m82J63rK11l71J97m4p5K69q7m1L4
4258A76N3l3k26r6K17L7l27N7J13P7J71r4j95J0J34j31M53m96l9J0M9L6l6k2L34
4283B32k61p4Q8jJ28j21j0j56R8P7N6K5n6l9j03L3K16r1L2m8J14q0p5K0jJ3O7
4310H3j78J27j12K51l19J11k3J0r9K00k5n6Q9p2R7oj47P4j0J70j23k93K22J12
4334H3k95J99J10k04R3j04R6J79k87J12q2J83j52J46k09J12l8k1K59j26k9n8o7
4357a00L31l3l14MJ32J96j39r0L0m3j8l1K79k34j29k5K02r7J13L2M3Q6j35k01
4381a41J70o2n6j63Q4K18Q0q5l1p5N5o0J63M5j26k25K84j05j81J16jK82j74N3
$$ plain form
4405 65 -196 92 -38 113 -3 66 -56 -73 39 -9 99 -149 20 -19 -3 -208 -45 -136 103 -100 176 -53
4427 -53 -38 -180 -164 258 75 -181 66 -148 69 167 73 -46 -121 -87 -82 57 112 103 -62 30 19 -162 -78 -82 -91 -246
4453 -246 -74 11 22 -53 -96 -232 -173 99 188 120 -229 -69 117 -180 -47 98 -99 12 -93 -108 -298 257 -309
4476 -309 37 -137 -38 68 133 45 51 167 65 67 -176 -15 89 37 165 79 -20 -18 5 37 -88 256 -57 73 173
4501 173 -201 45 -8 -139 119 -98 -8 137 -138 93 11 -462 -22 -59 -130 30 -111 178 -135 -76 -255 53
4523 53 144 184 -50 -7 117 10 49 28 42 -56 10 30 -12 -139 -145 2 93 3 11 96 -114 -241 105 283 142 -42
4549 -42 90 251 -21 -242 -2 -10 158 -74 -59 -89 -410 152 -100 -40 64 160 -27 -119 -136 121 5 88 66 328
4573 328 -12 75 -12 -30 184 94 106 -74 -69 179 172 26 159 83 47 -95 -24 170 74 236 -22 30 74 -33 209
$$ packed form
4405F5k61K88j30J51j16O9j22j7J12m8J08k48J69l9J6k05J63r1K39k03K76k29
4427e3J5j42J6M22j83k56K47k14K17R8r4j19p5L4NJ39N5rj65R2j1j81Q4mrj55
4453b46J72Q5J1p5m3j36N9K72Q9o8l49J60J86k97J33J45j97J11j05j5j90N55n66
4476c09L46j74R9J06O5q8OJ16j02Kk43J61J04n2J28q6r9KK3L2j25L44l13J30J00
4501A73l74K46n3j31K58k17R0J45k75K31q2m73M40l7p1J60j41K89l13N9j79L08
4523E3R1M0k34M3J24j07L9k1J4r8O6K0m2j27oJ47R1r0QQ5k10j27L46J78j41j84
4549d2J32J61k72k21K40qJ68k32J5l0l21N62k52O0J04R6j87r2j7K57j16Q3k2K62
4573C28l40Q7q7j8K14r0J2j80NK48pj46J33p6l6j42P1J94r6J62k58N2M4j07K42
$$ plain form
4598 209 42 94 -206 71 -17 51 -65 93 -61 -83 61 -189 31 13 60 160 194 1 -253 -200 -20 -157 209
4621 209 15 130 1 250 34 -45 40 -128 -137 -210 77 84 47 16 -28 187 -34 33 51 -149 -63 -100 -12 -211 7
4646 7 -86 62 -34 60 93 -103 -21 126 -134 -46 -97 85 -95 77 -100 159 -60 55 50 12 183 24 -79 -20
4670 -20 238 152 79 116 -66 51 -90 -77 2 187 -165 -183 -20 186 46 -191 -1 -214 136 -15 117 -16
4692 -16 -168 37 109 -68 -37 5 124 -11 88 192 -118 136 56 243 -15 -37 -20 -54 -301 34 -76 -5 73 70
4716 70 -120 -84 49 -45 -56 -43 -77 177 90 -118 31 135 10 20 342 20 16 -144 -86 106 125 -443 -186 52
4740 52 44 -11 -40 147 -169 52 -75 -2 130 -123 -44 -53 -40 -22 56 -16 -169 115 72 -128 323 74 130 -47 42
4765 42 -118 -67 371 -304 -132 161 17 102 84 -52 -185 56 -37 77 -33 207 -99 -189 62 -17 75 -248 120
$$ packed form
4598B09j67N2l00K77q8O8j16J58j54k2J44k50K20j8M7J00L4j93k54N3J80j37L66
4621B09j94J15j29K49k16p9Q5j68rp3K87Pl7l1m4K15k21O7J8k00Q6l7Q8j99K18
4646Gr3J48r6R4L3j96Q2J47k60Q8n1J82j80J72j77K59k19J15nl8J71j59j03N9
4670b0K58q6p3L7j82J17j41J3P9J85l52j8J63K06j40k37J90k13L50j51J32j33
4692a6j52K05P2j77L1M2J19j35R9J04l10K54q0J87k58k2J7l4k47L35j10P1P8l
4716G0j90L6J33r4j1J3l4K54q7k08J49J04j25J0L22l22mj60N8J92J9n68K57K38
4740E2qn5k9J87l16K21j27P3J32k53P9rJ3J8P8p2j53K84m3k00M51k49N6j77Q9
4765D2j60N1M38o75J72K93j44Q5j8j36j33K41r3J14j10K40l06r0K51p9R2l23L68
$$ plain form
4788 120 37 -87 -102 -21 -23 61 61 -174 -6 -51 95 39 13 -46 -36 72 -67 -296 -29 238 -144 -63 12 30 64 -173
4814 -173 -55 157 214 69 -63 170 161 -47 -80 -57 -117 -110 187 -31 -2 -20 -9 -94 -72 -85 -89 -240 37 18 -23 43
4840 43 32 -67 -31 -104 1 85 78 -217 64 108 -59 -86 -272 -8 -185 72 -2 153 -94 38 -31 -87 108 155 15
4865 15 -178 236 100 -69 -179 -67 76 -176 -31 77 19 -132 144 46 26 212 -116 -38 20 15 -25 -24 182 -4
4889 -4 -79 12 -398 -147 18 -127 -41 -92 -152 -173 -94 118 -133 138 142 -45 -72 -37 47 -77 -7 -76 103 -48 -29 284
4915 284 -75 -105 -271 -20 -192 144 179 85 68 202 -14 293 227 -178 20 148 268 95 114 267 -52 -291
4937 -291 183 -22 -221 3 -601 -448 -74 235 -30 -122 268 -564 -202 33 -297 -105 381 -146 -4 -205
4957 -205 -1 -191 -86 -43 203 -212 -346 13 32 -238 -76 5 -197 -9 -261 -274 -74 -10 87 -40 125 -119
$$ packed form
4788A20q3j24j5Q1kQ4%k35J68m5J46n6k6n9J0J08j39k29K67K67l82Q1P5J8L4k37
4814a73J18K12N7j45j32K33rk08l3K3o0PK97k18K9j8J1q5K2j3mj51K77j9m1O6
4840D3j1r9L6p3J05Q4pk95K81M4j67k7j86K64j77K57p4J55k47J32o9n6J95M7j40
4865A5j93M14j36j69j10J12J43k52J45J08n8j51K76r8k0J86l28P8N8nm0JK06j86
4889dp5R1m10K51J65j45Q6n1o0k1P9K12k51K71Mj87k7L5Q4j24P0o9J79j51J9L13
4915B84l59l0j66K51j72L36L5r4j7J34k16L07o6m05J98J28J20j73J9J53l19k39
4937b91M74k05j99K24o04J53L74L09k65r2L90q32L62K35l30J92M86n27J42k01
4957b05K04j90J05M3K46m15j34L59J9k70J62Q1k02J88k52j3K00O4R7j27J65k44
$$ plain form
4979 -119 -130 62 -88 -303 -130 264 69 48 102 -159 -253 -100 -78 -4 90 -250 230 -217 262 -158 -138 453 39
5002 39 -35 -118 -361 -87 -141 134 18 159 43 -412 -377 438 614 31 -9 233 -328 128 404 -417 338 -153
5024 -153 -223 96 -28 261 -40 56 -146 -570 -37 -43 75 415 -250 -326 49 18 -348 -679 287 403 -646 498
5046 498 46 142 401 -406 310 139 236 -289 10 116 142 -411 419 -107 101 455 241 -134 -290 38 76
5067 76 -233 -62 184 -116 32 -90 19 201 -59 5 -82 -199 168 -226 -144 -43 -46 -144 143 30 179 -82
5089 -82 270 -40 65 104 102 -61 4 314 162 -14 -134 -81 64 152 54 296 -26 -117 -65 -167 -85 -155 108 -137
5113 -137 -68 -145 -220 3 105 -119 -18 -113 136 -193 -10 -104 236 161 11 51 -23 124 -222 -98 -5 119 -58
5136 -58 34 253 -32 130 53 -54 39 -125 28 -56 106 -56 8 -94 245 -82 125 45 35 -64 -168 -165 47 -9
$$ packed form
4979a19j1J92j50k15J73L94j95k1N4k61r4J53K2P4R4l40M80m47M79m20K0N91m14
5002C9p4q3k43K74n4K75j16J41j16m55L5Q15J76n83m0K42n61M56K76q21P55m91
5024a53p0L19j24K89l01R6k02m24N33oJ18L40o65p6L75l1l66l31R66J16j049J144
5046D98m52R6K59q07P16j71R7n25K99J06K6n53Q30n26K08L54k14l75j56L28L8
5067G6l09J71K46l00J48j22J09J82k60O4q7j17L67l94Q2J01lr8K87j13J49k61
5089h2L52l10J05L9kj63O5L10j52j76j20N3J45Q8r8K42l22r1N2j02Q2p0K63k45
5113a37O9p7p5K23J02k24J01r5K49l29J83r4L40p5j50M0p4J47l46J24R3J24j77
5136e8R2K19k85J62p7j07R3j64J53q4J62j62O4j02L39l27K07q0j0r9j04LK12n6
$$ plain form
5160 -9 30 -35 -48 103 -165 182 16 199 332 236 -44 32 27 31 95 79 -116 40 118 -60 248 90 72 140 -150
5185 -150 -380 -221 192 -160 56 101 -30 9 154 4 -107 93 55 -272 56 -6 -199 34 -159 -47 -136 23
5207 23 10 -67 -45 -139 -33 89 -12 101 -184 -15 -246 -21 -67 -181 199 115 82 153 -4 -121 -4 109 -35
5230 -35 20 -51 348 51 87 3 -16 -62 8 -10 8 -90 11 22 135 2 -5 -126 112 -91 45 154 -40 -135 71
5255 71 6 -33 -154 -137 -211 -159 70 62 -140 -168 -60 -2 -159 -80 169 -151 -309 86 32 -146 10 -18 -126 32
5279 32 59 -146 -1 -152 225 -122 -122 -434 84 69 202 41 88 -9 99 23 47 59 -117 -136 -282 69 -67 -170
5303 -170 -70 -130 46 74 -14 64 123 19 -333 5 -58 -63 -187 -11 365 -99 12 -27 18 48 -152 -146 -2 43 165
5328 165 -170 5 47 -109 -3 81 107 98 -34 121 282 103 72 58 50 108 -186 66 149 74 -86 -138 -41 76 128
$$ packed form
5160iL9o5j3J51k68L47j66J83J33r6k80P6nMO4j6j95J56P8j78L08j58j8O8k90
5185a50k30J59M13l52K16M5j31L9J45j50j11K00l8l27L28o2j93K33j93J12q9J59
5207B3j3p7K2r4J06J22j01J13k85J69k31K25m6j14L80q4l3P1j57j17J17J13j44
5230c5N5p1L99k97L6q4j9m6P0j8J8r8J01J1J13j33pj21K38k03J36J09j94r5K06
5255G1o5l9j21J7p4N2K29qk02k8J08N8j57P9K49l20j58L95n4j78J56k8j08J58
5279C2K7k05J45j51L77l47%l12N18j5J33j61M7r7J08p6K4J2j76j9j46L51j36j03
5303a70J00o0J76K8q8P8N9j04l52L38o3nj24J76L76m64J11l9M5L0k00OJ44M5J22
5328A65l35J75M2j56J06Q4K6rj32J55J61j79l1j4qN8k94K52Q3p5j60n2R7J17N2
$$ plain form
5353 128 113 -85 -149 64 -63 -93 -83 -62 -324 -147 67 -42 78 153 -97 -22 100 195 -134 -33 368 8 -40
5376 -40 108 -89 -56 35 -48 -69 168 80 108 26 -11 -91 -117 -17 -185 210 -66 -31 -46 303 135 94 -78 22 -149
5401 -149 -58 77 -24 111 49 -142 35 47 107 -161 -152 91 -172 -62 -167 230 -7 -183 -118 286 -7 -117
5423 -117 -297 177 27 7 12 -66 -70 83 151 43 -140 103 -53 127 -294 109 -34 110 36 73 60 143 153 19
5447 19 73 -90 -148 262 61 81 -99 340 -242 223 -268 67 328 -571 -633 99 -235 -685 -562 -348 10 -395
5469 -395 -330 -452 319 -81 -204 -190 116 -161 148 -148 155 -94 130 8 149 6 -253 75 26 -259 -171
5490 -171 -118 7 -2 52 -198 83 -39 21 -198 14 293 232 -262 716 -302 -93 -249 921 257 -399 763
5511 763 13 166 263 -142 -186 30 59 71 -97 -40 -85 -81 -143 37 -7 106 132 236 -183 90 -164 116 -45 149
$$ packed form
5353A28j5j98o4K13j27l0J0K1k62J77K14j09J20P5k50P5J22R5l29J01M01l60m8
5376d0J48j97L3R1q3k1K37q8K8q2l7q0k6J00j68L95k76L5j5L49j68m1j72J00j71
5401a49R1J35j01J35o2j91J77J2O0k68RK43k63J10j05L97k37j76O5M04k93j10
5423a17j80M74j50k0Np8mJ53O8j08j83K43j56J80m21M03j43J44p4L7j3Q3J0j34
5447A9N4j63n8M10k01K0j80M39n82M65m91L35K61q99o2P32l34m50J23K14L58m05
5469c95O5j22P71m00j23J4L06k77L09k96L03k49K24j22J41j43k59L28m9k85Q8
5490a71N3J25rN4k50K81j22O0k19K12K79o1m94R78j018K09j56J170o64o56J162
5511G63p50J53R7m05m4K16K9J2j68N7m5Mo2J80m4J13K6J04m19K73k54K80j61J94
$$ plain form
5535 149 -63 23 -3 -53 -345 112 -101 45 240 -119 223 -286 -155 441 482 -722 28 359 -20 359 -297
5556 -297 -343 510 43 -83 239 -71 -500 99 239 -310 411 -220 597 107 692 -18 230 -18 -499 563
5576 563 27 -225 125 67 -25 -20 93 33 -149 46 -336 -91 2 -158 -122 114 79 105 140 40 -69 -51 -381 -305
5600 -305 21 -36 129 145 -163 75 -207 -324 167 64 -60 71 140 9 -179 87 45 96 -259 -126 -104 -137
5622 -137 111 88 97 41 60 -96 -31 145 -26 -70 -93 -13 -75 135 98 -192 -1 84 143 -63 -57 -150 226 23 76 -94
5648 -94 -297 -208 -62 -61 60 142 -110 254 198 -17 -27 5 -140 2 -33 244 -325 -102 -69 -275 -299 -319 139 496
5672 496 -1 598 -642 417 269 -822 -636 -63 -37 170 409 574 -334 84 -370 -87 669 357 689
5691 689 -231 692 -280 -250 -584 293 -263 -324 -221 161 115 -263 -141 176 188 -194 -508 16 -280 202 125 -292
$$ packed form
5535A49k12Q6k6n0k92M57k13J46J95l59L42n09J31N96M1j204P50L31l79L79o56
5556b97m6Q53m67j26L22l10m29N99J40n49P21o31Q17m90N85p10K48k48m81J062
5576E63n36k52L50n8r2NJ13o0j82J95l82K45R3j60L6K36l5K6L5j00j09J8l30P6
5600c05L26n7J65J6l08K38k82j17M91j03j24J31O9j31j88K66m2N1l55J33K2l3
5622a37K48k3Rn6J9j56O5J76j71m4k3Q0o2K10l7k90J91Q5N9k06Or3L76k03N3j70
5648i4k03Q9J46JJ21Q2k52L64n6k15j0L2j45J42l5K77n69K23L3k06k4k0M58L57
5672D96m97N99j240J059j48j091J86N73K6K07K39J65r08M18m54K83P56l12L32
5691F89r20R23r72L0l34Q77n56o1J03L82m6l78J22L17J2l82l14N24k96M82p7m17
$$ plain form
5713 -292 -9 28 -213 236 -19 -203 -105 -215 -115 -56 -66 139 -209 -7 66 -210 -84 -68 216 95 25 69 -291
5736 -291 64 111 101 -105 142 102 161 6 85 168 8 -44 -123 -73 34 -183 -172 -125 -117 3 92 -71 -153 223 -195
5761 -195 88 -131 -47 80 302 -48 187 -120 180 -110 -35 -40 -174 -143 -13 113 -64 231 -130 -15 -135 115
5783 115 198 -213 28 -75 -306 -40 9 -88 -118 -30 -175 -220 188 268 55 -457 3 205 286 208 -61 -55 135 -260
5807 -260 -394 -89 -463 -32 -285 -128 -55 300 -59 -31 36 23 -97 -176 62 -141 -204 -200 205 -239 -17 -87 84
5830 84 46 -64 109 205 49 -49 109 3 -171 -105 -1 -64 -83 -39 41 136 2 3 -28 -10 81 -102 109 39 -171
5855 -171 -61 -95 -68 -154 -81 65 61 -56 14 -18 -42 -98 108 35 236 84 25 57 -9 132 230 -165 -26 -74 -146 -112
5881 -112 27 151 209 -31 109 162 109 -76 -34 77 91 -220 -34 -100 118 -199 -208 81 59 126 -80 -29 16 -129
$$ packed form
5713b92K83L7k41M49k55j84R8j10J00N9j0K05l48K02P3k76J26J6K84j21p0M4l60
5736b91L55M7j0k06K47m0N9j55P9Q3j60n2p9N0J07k17J1M7QJ20Q9j63q2L76m18
5761a95K83k19Q4J27K22l50K35l07L00k90P5nj34L1J30J26j77K95l61J15j20K50
5783A15Q3m11K41j03k31K66M9r7l0Q8j45m5M08Q0k13n12M60K02Q1p8k69OJ90l95
5807b60j34L05l74M31k53J57P3L55l59K8O7j3j20p9K38k03o3MM05m44K22p0J71
5830H4l8j10J73R6j56r8J58j06j74O6J04o3j9M4Q0R5j34Jl1J8R1j83K11p0k10
5855a71J10l4K7q6P3J46mj17P0l2k4n6K06p3K01j52n9L2o6J41R8l95J39m8p2L4
5881a12J39J24N8k40J40N3n3j85M2J11J4l11J86o6K18l17rK89k2O7k06N1M5j45
$$ plain form
5905 -129 39 15 23 -35 -157 -28 -193 -68 -135 56 40 -128 63 171 -126 -42 -18 -234 -319 -124 131 111 -221
5928 -221 -31 -29 510 -124 451 -210 -495 -72 17 138 110 338 230 95 55 326 98 -13 -93 112 61 -51
5950 -51 285 -151 33 -608 138 102 56 -457 -13 8 -127 71 368 424 -247 608 -309 -146 420 313 -199 -230
5972 -230 412 372 438 -368 -97 -589 -104 150 -20 74 -50 145 -336 -154 -105 259 538 -427 -5 679 -656
5993 -656 -486 798 -83 178 355 -526 216 -95 -468 -209 357 -335 221 -303 -111 -498 -423 -194 -506 216
6013 216 537 74 -112 50 213 -311 -83 130 -69 129 321 -50 -165 -11 75 78 261 -413 -127 305 157
6034 157 87 -27 -101 53 35 -247 220 37 113 73 -26 351 -39 -82 -104 186 -68 -45 98 183 175 -91 -150 -221 182
6059 182 21 -300 -52 62 -52 -292 -41 42 -2 -162 274 -413 44 -311 -277 36 411 -52 287 -17 476
$$ packed form
5905a29J68k4Qn8j22J29j65J25o7J91j6j68J91J08k97Q4K4k16q5J95K55k0l32
5928b21J90KN39o34N75o61k85M23Q9J21k8K28j08j35m0K71k28j11q0K05n1j12
5950e1L36m36J84o41P46l6m6n13M44K1j35J98K97N6o71Q55r17J63N66j07n12l1
5972b30O42m0O6q06K71m92M85K54j70R4j24J95m81J82M9L64K79r65M22O84j335
5993f56J70J284q81K61J77q81P42l11l73K59N66o92N56n24J92l87P5K29l12P22
6013B16L21m63j86J62J63n24K28K13j99J98J92l71j15J54Q6LJ83o74K86M32j48
6034A57p0j14p4J54j8k82M67j83P6m0r9L77l90m3k2K90k54K3J43Q5qk66n9p1M03
6059A82j61l21K48J14j14k40K51Q3m4j60M36o87M57l55L4L13L75m63L39l04M93
$$ plain form
6080 476 -579 286 -60 50 -886 -48 -60 124 -191 -252 113 -227 206 -28 61 6 197 -231 39 -55 1 205
6102 205 42 -124 -155 -262 -57 -93 270 83 108 -426 117 298 314 110 -183 -11 -144 -3 -149 -275 -261 223
6124 223 153 -369 336 78 -50 173 29 271 -43 20 137 113 -162 -59 120 14 -61 -50 44 -111 83 268
6146 268 -190 -14 38 37 226 -124 78 -110 -86 30 23 -38 -45 -24 36 -45 -93 94 -12 189 107 222 151 -46 3
6171 3 195 -43 -28 -41 -50 -97 94 40 94 218 -6 8 151 132 76 164 -84 -15 16 34 154 -82 114 -77 -88 14
6197 14 39 22 122 -87 -67 -180 -166 -108 -47 45 -62 125 -219 201 -22 64 151 7 77 31 323 60 -12 104
6221 104 -36 -94 424 35 -155 -77 82 293 95 185 -122 92 -50 -119 143 86 87 17 -139 34 -154 12 83
6244 83 48 -253 11 140 2 36 101 44 127 -114 93 214 91 93 147 145 -19 5 7 218 -97 46 139 -118 56
$$ packed form
6080D76j055Q65l46J10r36Q38j2J84l15o1L65l40M33k34Q9n5J91m28K70r4N6K04
6102B05j63j66l1j07K05l6L63j87K5n34N43J81J6k04k93J72j33J41j46j26J4M84
6124B23p0n22P05k58j28K23j44K42l14O3J17k4k75J03J79j06p5J1R4j55J94J85
6146B68m58J76N2jJ89l50K02j88K4J16po1pK1O0q1m8J87j06K01q2J15p1j97M9
6171CJ92k38J5j3rm7J91n4N4J24k24J4J43j9n6Q8k48O9L1J8J20k36J96j91j1J02
6197A4K5j7J00k09K0j13J4N8O1R2j07J87l44M20k23Q6Q7j44P0m6K92k63p2J16
6221A04j40n8N18l89j90P8J59K11j98R0l07K14j42o9K62n7Jp0j56J73j88J66P1
6244H3l5l01K64J29j38L4O5n7Q3k41K07J21j23KN4kj64K4KK11l15J43R3k57J74
$$ plain form
6269 56 -63 94 -136 -37 -223 34 -318 -259 186 -18 -10 -121 126 115 140 108 75 -53 67 43 53 29 -38 -90 -42
6294 -42 65 -42 34 28 40 107 210 46 -49 75 -27 141 -218 123 -77 -107 -58 14 18 13 -93 -134 33 26 78 79 1
6321 1 -151 -86 47 95 122 -218 -16 -152 -88 -62 139 -14 61 150 -90 -191 107 134 -186 80 68 -16 18 -34 124
6346 124 -3 -79 3 142 -139 99 -80 2 -48 33 146 55 -62 -9 156 75 -105 28 57 81 -8 183 99 -218
6370 -218 -2 222 -120 19 -145 144 -53 156 35 -65 87 82 136 4 182 97 -116 42 -87 107 -19
6391 -19 103 8 -43 84 -235 111 -131 15 92 51 20 -92 201 171 -141 -168 -46 131 -66 -27 -21 103 169 -193
6415 -193 111 30 -11 -3 69 -188 -135 -34 224 56 112 53 85 100 94 -173 194 107 -4 -43 220 -104 71 189 98
6440 98 100 53 24 -29 -9 -242 -69 -86 -105 6 75 192 154 -376 76 156 -19 -246 -50 37 9 -238 -51 -135 -114
$$ packed form
6269E6j19J57k30R9j86K57l52N9M45k04Qj11K47j1K5l2l3j28J20k4J0k4o7n2M8
6294d2J07j07P6oJ2O7J03j64r5J24j02J68l59L41k00l0M9P2Mnj06m1J67pN2Jp8
6321Aj52O5J33M8K7l40K02j36O4K6K01j53P5Q9k40j01K98K7l20K66j2q4L4n2J58
6346A24j27p6Q2J39k81K38j79Q2n0Q1J13r1j17N3J65q1j80J33K9K4q9J91q4l17
6370b18K16K24l42J39j64K89j97K09j21j00J52nN4j32J78q5k13J58j29J94j26
6391a9J22r5n1J27l19L46k42J46P7m1l1j12K93l0l12k7J22J77j97L9OJ24O6l62
6415a93L04q1m1QP2k57N3J01K58j68N6n9L2J5ok67L67q7j11l9K63l24J75J18r1
6440I8Km7k9n3K0k33J73j7j9J11O9J17l8n30M52Q0j75k27J96Q7k8k47J87q4K1
$$ plain form
6465 -114 13 -193 103 36 249 118 104 54 214 46 207 52 56 60 72 87 134 58 -276 -176 -47 -2 -66 145
6489 145 -52 161 80 22 115 99 -149 84 -127 4 313 -72 127 -5 -155 76 35 -161 92 116 -149 -43
6511 -43 -212 -25 134 34 240 15 -26 239 99 -5 13 -76 181 -109 -103 -220 -12 68 -9 19 92 -66 102
6534 102 250 -45 -85 -194 -90 56 82 119 47 -35 -247 210 146 92 -19 8 -137 -7 31 245 188 -40 123
6557 123 -92 -19 -29 -69 -132 112 -15 -66 -12 119 -1 36 114 -92 223 -295 -44 -150 14 -27 -122 -46 -53 -4 -87
6582 -87 -33 60 86 -75 35 -48 135 -11 -137 87 125 -34 65 81 -16 -119 -139 -113 -9 -90 11 -65 11 25 181
6607 181 -135 58 -219 76 -45 231 20 -123 -101 -95 33 -79 -138 52 -73 97 75 -30 89 -95 9 -70
6629 -70 21 -40 -55 -17 414 -140 -51 44 -184 -257 -51 -162 -80 112 10 121 -69 5 80 69 -126 -57 -132 108 139
$$ packed form
6465a14J27k06K96o7K13j31j4n0J60j68J61j55MMJ2J5M7p6l34J00J29M5o4K11
6489A45j97K13q1n8R3j6k48K33k11J31L09l85J99j32j50K31m1j96K53K4k65J06
6511d3j69J87J59j00K06k25m1K65j40j04J8q9K57k90Oj17K08Q0p7K8P3j58J68
6534A02J48k95m0j09J04J46K6L7p2q2k12M57o4n4j11K7j45J30L8K14n7k28J63
6557A23k15P3j0m0o3K44j27n1N4J31j20L7P8k06L15n18K51j06J64m1r5P6pM9q3
6582h7N4R3K6j61J10q3J83j46j26K24L8j59R9J6r7j03k0K6J04q1J01p6P6J4J56
6607A81l16J93k77K95j21K76k11j43K2OJ28j12n9J90j25J70k2j05J19j84J04p9
6629g0R1o1j5L8M31n54Q9R5k28p3K06j11Q2J92j02J11j90P4P5j1j95O9p5K40L1
$$ plain form
6654 139 -67 -65 79 15 101 150 -161 -79 -52 28 -26 177 -174 4 -19 -85 101 -121 226 -7 -123 -30 146 98
6678 98 21 -104 3 -136 25 -88 87 246 98 -106 3 241 114 57 1 18 54 -117 43 -4 155 -83
6700 -83 -249 187 38 -99 147 59 40 44 -22 103 -69 129 -55 -29 -151 -185 205 69 96 142 -76 5 82 81 1
6725 1 -141 -202 200 -145 4 -119 -83 -16 -53 147 322 41 26 19 75 -343 -102 61 138 15 -72 46 -277 7
6749 7 -116 32 -2 -220 51 77 111 72 -7 -202 6 40 123 -177 21 95 57 65 -148 99 -66 12 95 -45 113
6774 113 -6 110 36 31 149 128 266 84 92 -10 -73 -48 54 42 -136 -62 41 -24 45 55 -184 -260 41 -5 -81
6799 -81 -224 56 178 140 -95 49 34 -84 143 41 -1 141 -38 101 71 -208 -83 -192 122 61 -115 100
6821 100 -309 55 141 -120 91 93 14 152 -16 52 51 -99 10 -157 -124 75 -154 155 151 -42 -238 -202 -242 225
$$ packed form
6654A39k06KJ44o4Q6M9l11Q2K7Q0n4K03l51J78k3o6J86k22L47k33j16R3J76m8
6678I8p7j25J07j39J61j13J75J59j48k04J09K38j27n7n6J7L6j71J60m7J59k38
6700h3j66M36j49j37K46q8j9Mo6J25j72J98j84K6j22l4L90j36K7M6k18Q1P7jq0
6725Aj42o1M02l45J49j23L6O7l7K00J75k81j5pN6m18K41J63P7j23q7J18l23K84
6749Gj23J48l4k18K71K6L4l9p9j95K08L4Q3l00J98P4l8Qk13K47j65P8Q3j40J58
6774A13j19J16p4nJ18k1J38j82Qj02o3K5J02j2j78P4J03o5O9J0k39p6L01m6p6
6799h1j43K80J22l8k35J44j5j18K27j02m2J42j79J39l0k79J25j09L14o1j76K15
6821A00m09L64Q6k61K11Kp9J38j68O8jj50J09j67L3J99k29L09mj93j96L6m0M67
$$ plain form
6845 225 -122 36 8 35 -91 82 40 -127 102 -122 75 1 196 -162 103 132 60 -68 23 66 -37 64 -60
6868 -60 -17 -37 54 12 37 -27 144 -168 55 184 136 -92 12 -11 -3 -46 -171 -43 -66 -93 -9 46 171 31 -181
6893 -181 -116 -39 -85 -16 -313 -189 16 38 -52 -85 -32 -123 70 5 -128 -93 84 -177 -31 -197 -51 -49 134 -180
6917 -180 -5 8 -413 58 44 -67 -328 49 127 -63 86 -126 -61 87 8 -59 1 146 155 -120 83 20 -16 -44
6941 -44 -109 -36 -201 -111 188 80 77 337 -63 -87 -108 -41 91 -83 30 -15 29 -28 -25 -66 -50 216 -25 -41 111 -99
6967 -99 18 -23 126 -130 -34 20 -26 -172 133 -61 -214 0 23 -202 -28 134 -92 -6 -131 196 -21 32 47
6990 47 -95 -74 -148 -228 -110 165 9 91 -56 141 -364 -4 174 -97 236 104 -206 -81 27 176 -42 20
7012 20 20 -165 -238 23 -104 195 218 -25 108 -40 18 -6 -19 347 3 -118 13 152 -168 53 45 -41 19 94
$$ packed form
6845B25l47J58k8K7j26J73m2j67K29k24J97p4J95l58K65K9p2j28R1M3j03J01j24
6868f0M3k0R1m2K5o4J71l12K23J29m8k28J04k3Qm3j25J28k3k7Q4N5J25j40k12
6893a81O5P7m6O9k97J24K05K2r0l3N3r1J93o5j33L5J77k61J46j66J46KJ83l14
6917a80J75J3m21M71j4j11k61L77P8j90J49k12O5J48p9o7O0J45Rk75K03o3l6k8
6941d4o5P3j65R0K99j08lK60m00k4k1O7J32j74J13m5M4n7Lm1J6K66k41j6J52k10
6967i9J17m1J49k56R6N4m6j46L05j94j53K14K3k25J74J62k26Q6j25L27k17N3J5
6990D7j42K1p4q0J18K75j56Q2j47J97n05L60J78k71L33j32l10J25J08J49k18O2
7012B0%j85p3K61j27K99K3k43J33j48N8k4j3L66l44j21J31J39l20K21qq6O0P5
$$ plain form
7036 94 19 10 -89 36 -20 17 73 -212 -150 -275 202 -203 0 -11 16 18 53 -47 -189 47 145 -9 -70 59 115 86
7062 86 121 167 -67 56 -6 99 170 10 -67 23 61 -19 69 -33 -268 -111 136 -10 144 88 -163 94 -52 13
7086 13 53 5 33 -180 -104 77 -20 -155 -132 -40 -142 139 131 228 -79 118 94 -111 199 6 103 207 238 -190 62
7111 62 -16 43 -105 -37 69 -85 202 -81 -74 -94 148 93 -131 -49 -12 97 -12 -27 -69 312 -204 160 14 39
7135 39 -158 142 198 245 6 -8 -17 -125 37 59 -57 -124 -31 -93 -182 320 35 98 128 -157 83 -121 122 -120
7159 -120 -56 -8 -210 86 67 -151 217 190 -118 106 175 -195 32 -184 -164 -131 111 -5 -5 111 193 75 -1 220
7183 220 42 -172 43 -14 -41 -71 88 -31 208 -97 -109 41 -58 -56 -175 17 -8 -183 196 -133 -52 45 157
7206 157 5 -45 -154 142 -169 -21 24 157 110 48 53 -97 57 152 84 182 -2 128 196 -183 15 -13 -142 -185
$$ packed form
7036I4p5rr9J25n6L7N6k85O2j25M77m05K03j1K7KL5j00j42K36R8j54o1J29N6k9
7062H6L5M6k34J23o2J05P1j60p7R0L8q0Q8j02k35J57K47j46J54n6k51K57j46O5
7086A3M0m8K8k13P6J81r7j35K3R2j02K81qR7l07J97k4k05L10j93R7J04L1m28K52
7111F2p8N9j48O8J06j54K87k83Pk0K42n5k24Q2L7J09j09j5m2L81n16L64j46K5
7135C9j97L00N6M7k39j4rj08J62K2j16o7R3o2q9N02k85O3L0k85K40k04K43k42
7159a20O4M8k02K96j9k18L68k7l08K24O9l70K27k16K0L3K42j16%J16Q2j18p6K21
7183B20j78k14K15n7k7l0J59j19K39l05j2J50r9Kj19J92k5j75L79l29Q1R7J12
7206A57j52n0j09K96l11J48M5J33m7o2Nj50J54R5o8R8j84J30O8l79J98k8j29m3
$$ plain form
7230 -185 -80 -217 20 -92 25 -129 -1 103 192 -83 60 -67 46 53 37 -34 -246 -78 -37 49 195 111 223
7253 223 35 -69 -115 -138 -196 104 12 3 -166 131 80 30 -227 -135 12 -100 14 81 0 128 -97 46 88 -205
7277 -205 11 10 -38 -95 102 223 74 -100 -74 156 -161 -53 -8 -106 -163 -74 -161 -213 46 -206 -109 58 -29 115
7301 115 91 -41 13 -50 164 206 -143 141 -59 26 16 -126 -13 -77 -4 -134 -131 114 -58 22 41 23 -88 181
7325 181 156 -166 -77 2 190 195 -155 126 -41 -184 118 24 -252 22 91 54 141 -70 120 -106 -63 30 17 205
7349 205 82 271 -69 -85 -119 79 -75 -63 97 65 -87 71 -82 284 -22 49 -95 -104 -117 58 17 -28 3 -77
7373 -77 10 150 79 -135 75 -59 123 -116 -46 -95 -98 5 173 -8 -68 -85 -74 -210 -73 209 -24 59 11 -25
7397 -25 -482 36 57 -127 82 15 111 111 63 7 -25 -16 -185 102 158 -28 -138 5 -23 -208 44 -6 213 69 1
$$ packed form
7230a85J05j37K37j12J17j54J28J04Q9k75J43j27J13Pj6p1k12J68M1Q6J46q4J12
7253B23j88j04m6k3n8L00r2rj69K97n1n0k57R2J47j12J14O7q1J28k25J43M2k93
7277b05K16jm8n7J97J21j49j74K6K30l17J08M5r8n7Q9q7n2K59k52R7J67q7J44
7301A15k4j32N4o3K14M2l49K84k00Q5j0j42J13o4P3j30LK45j72Q0J9j8j11K69
7325A81k5l22Q9P9J88Nl50K81j67j43L02r4k76K74O9l7Q7k11J90k26M3R3j3J88
7349B05j23J89l40j6l4J98j54J2J60l2j52J58j53L66l06P1j44rj3J75m1m5L1q0
7373g7Q7J40p1k14K10j34J82k39P0m9lJ03J68j81o0j7J1j36J37K82k33Q3m8l6
7397b5m57N18K1j84K09o7R6%m8n6l2Rj69K87N6j86j10J43k8j85K52n0K19j44o8
$$ plain form
7422 1 -115 -20 -18 -5 71 -12 147 152 -90 1 -28 14 -67 -134 -15 -22 -100 -83 -48 106 56 -46 -46 -147 -47 -275 -205 -122
7450 -122 68 188 -93 42 -40 -51 163 -4 -33 136 -42 47 -172 77 49 33 169 261 -181 2 260 -88
7472 -88 -103 -82 -180 -22 170 -28 -86 16 -6 -16 163 -140 -287 -28 -159 47 -69 -12 -208 -255 55 -51 180
7495 180 -104 -288 51 15 -81 -360 19 -44 27 -55 15 35 -30 -94 32 -55 100 10 -99 74 -14 -40 -167 -2
7519 -2 84 -114 -68 24 123 157 -162 178 164 -147 89 36 0 252 68 149 -152 -3 -18 -20 -103 -188 -155 -156 -74 152 -211
7546 -211 -61 139 130 -53 -122 -240 10 15 -96 128 48 79 -172 -63 151 183 59 -68 -133 97 30 -125 196
7569 196 -282 -8 -36 -38 -88 -69 81 2 247 32 57 9 -117 -156 116 -33 -256 -94 101 147 49 75 -82 -2
7593 -2 11 -65 -3 -133 -119 57 -20 266 -118 -69 -219 -77 103 -12 -57 34 74 -23 -67 -12 41 289 35 -17 -98 -30
$$ packed form
7422Aj16R5KJ3P6q3J59Nk42R1k9M2q1o7J19pp8J7L5J54n0j02%j01J00k28P0Q3
7450a22J90J20k81J35q2j1K14j67k9J69j78Q9k19K49k8j6J36R2m42J83K58l48
7472h8j5K1r8J58J92j98n8J02k2j0J79l03j47K59j31K06j16N7j96m7L10j06K31
7495A80k84j84L39l6r6k79L79o3P1q2P0K0o5o4J26q7J55r0j09J73q8k6j27J65
7519bQ6j98M6R2R9L4l19L40j4l11K36n3l6K52j84Q1l01J49j5kq3q5L3jQ2K26l63
7546b11J50K00rj83o9j18K50Nj11K24q0L1k51J09K14L2j24j27o5K30o7j55L21
7569A96m78K74k8kn0J9J50p9K45k15K5m8j26l9K72j49k23J62J95M6r8K6j57Q0
7593bJ3p6O2j30J4J76p7K86l84M9j50J42J80j15m5R1M0r7m4N5N3K48k54n2q1O8
$$ plain form
7619 -30 11 -74 217 -32 145 -155 -25 138 241 -129 5 39 170 -230 -49 6 75 -92 90 97 -190 8 -136
7642 -136 -97 -17 272 74 -129 -166 120 50 -27 -120 -195 -190 -180 -189 79 207 20 121 -82 -165 23 211 -168 66
7666 66 23 -7 -209 -34 -157 33 76 -49 54 -116 147 74 -99 95 4 73 122 -84 -47 -50 -81 -27 -135 -62 52
7691 52 68 56 230 58 29 84 -100 170 189 133 -51 -81 157 -178 11 144 -121 153 -106 8 55 111 -200
7714 -200 -155 -22 1 -223 232 -71 -42 77 37 203 -56 15 42 -195 13 -171 -129 230 38 -133 90 -162
7736 -162 -45 -52 -23 -43 248 56 -9 -298 -66 177 198 -316 -117 15 119 137 -188 -177 197 140 107 7 -168
7759 -168 187 -174 -24 11 -101 57 -180 -85 146 169 -194 -41 59 -38 -77 92 -156 -73 -131 40 12 -264 -85
7782 -85 -136 -33 23 -53 181 -55 116 -204 -52 11 -180 -120 108 109 85 -305 -216 -18 -71 -47 -204 -146 130 -216
$$ packed form
7619c0M1q5K91k49J77l00J30J63J03l70J34L4J31m00J81N5O9j67J82Pk87J98j44
7642a36L9Q0K89j98k03l7K86p0p7r3p5NJ0rK68J28j87J01k03q3J88J88l79K34
7666F6m3l0k02J75j23J90M3j25J03j70K63p3j73J94r1O9M9k06L7ll1N4j08P3J14
7691E2J6j2J74j72k9N5j84K70J9n6j84l0K38l35J89J33k65K74k59J14M7N6l11
7714b00M5J33K3k24M55l03K9J19m0J66k59P1K7k37K08j84M2L59j92j71K23k52
7736a62J17pK9k0K91j92o5k89K32K43K1n14J99J32J04J8l25J1L74n7l3j00j75
7759a68L55l61J50L5j12J58k37R5K31K3l63J53J00r7l9J69k48Q3n8J71k8k76J79
7782h5n1J03N6p6K34k36J71l20J52O3j91O0K28Jk4l90Q9J98n3K4j57N8K76l46
$$ plain form
7806 -216 51 -51 -22 -94 4 -114 100 37 -105 -193 -20 34 -105 294 12 -237 78 98 33 187 44 -183 -178
7829 -178 -59 -15 -38 0 -109 42 -174 34 146 57 10 86 -118 155 136 -8 62 -133 131 -87 -185 -202 -129 -73
7853 -73 -113 171 -33 17 -108 -71 -5 -100 -31 -1 62 -103 20 -12 -220 -19 51 -43 115 -82 76 -11 -2 -67 57
7878 57 -92 -45 79 1 -65 1 -107 39 38 31 78 31 38 -57 24 42 33 54 41 21 -25 139 260 -104 -90 22 -2 180
7906 180 -34 26 214 45 40 -61 -33 -48 -20 12 170 266 -131 180 152 9 -61 103 -159 -143 72 -220 -194 95
7930 95 -197 -94 31 58 -87 -93 83 271 -167 -223 -94 -248 -270 -116 -313 40 -193 50 73 43 -239 -146 299
7953 299 -343 2 171 -14 -40 56 -174 59 64 351 -150 -131 -6 84 -192 -83 -141 -140 116 219 -107 49 34
7976 34 85 -55 224 201 267 -49 29 -19 -126 65 170 -35 -98 86 21 60 67 -7 292 110 86 40 118 222 -13
$$ packed form
7806b16K67j02K9p2R8j18K14o3j42q8J73N4j39L99k82k49L15K0o5J54j43k27N
7829a78J19M4k3L8j09J51k16K08J12q9m7P6k04K73j9j44P0j95K64k18r8j7P3N6
7853g3m0K84k04N0j25L7O6r5O9L0O3j65J23l2k08K01P0r4J58j97J58q7Ro5J24
7878E7j49M7J24p8o6O6j08J46jpM7m7Pr5Q1J8rK1j3k0m6J64J21l64J4J12k4J82
7906A80k14O0J88j69nj01K8j5K8L2J58R6l97L11k8j43p0J64k62J6K15k92K6K89
7930I5k92J03J25K7j45oJ76J88m38n6J29j54k2J54j97L53k33K43K3l0k82R3M45
7953B99o42L45J69j85k6R6k30K33NK87n01J9J25R0k76J09n8JK56J03l26J56j5
7976C4N1j40K79k3O6l16P8m8j07J91J05k05o3J84o5L9Pp4K99j82k4m6P8J04k35
$$ plain form
8001 -13 182 189 144 -162 -73 187 -161 -226 29 131 -167 -192 -180 -211 30 146 -88 40 -15 29 183 -329 96 46
8025 46 6 -42 135 70 -37 -67 -20 -38 -53 -246 -14 234 70 120 5 -187 74 135 38 184 18 193 -16 -72
8049 -72 20 205 -45 -109 -89 -148 -4 138 53 -12 -138 22 253 54 -180 35 -35 -6 40 33 -30 127 -102 56
8073 56 -177 70 1 159 -51 85 -164 -13 -398 43 10 103 85 -238 -16 -35 102 27 80 -20 5 15 68 122
8097 122 -4 180 -253 174 250 280 22 120 -184 -6 107 113 -70 -58 9 2 -36 -128 87 -104 58 -25 -88 359
8121 359 -184 -13 0 -134 10 -77 -44 199 167 -101 72 -5 98 224 -59 127 -42 23 28 60 -86 -63 -80 97
8145 97 -91 -95 -15 -11 -269 -116 102 88 -83 75 -73 -89 -70 204 78 73 -256 -37 154 -42 -235 -115 -128 -117
8169 -117 246 -28 263 -12 21 -105 31 2 -31 216 14 -16 0 14 35 -105 -185 -128 54 172 34 192
$$ packed form
8001a3J95Pm5l06Q9K60l48o5K55J02k98k5J2l1K41J16k34J28n5M4J54n12M25n0
8025D6m0m8J77o5j07l0M7j8j5j93K32K48j64N0j15j92K61O1r7J46j66J75k09n6
8049g2R2J85k50o4K0n9J44J42q5o5j26J60K31j99k34K15p0K9M6po3J57k29J58
8073E6k33K47o9J58k10J36k49J51l85M41l3R3j8l23K22j9J37p5N3j00K5J0N3N4
8097A22j26J84m33M27P6L0k58R8l04J78J13Oj83J2O7pl8r2K15j91J62q3o3M47
8121C59n43J71J3j34J44q7L3K43l2k68J73p7J03J26k83J86j69O5NL2j46K3j7J77
8145I7j88mQ0Mk58J53K18j4j71J58j48j6J9K74j26nl29K19J91j96j93J20j3J1
8169a17L63k74K91k75L3j26J36k9l3K47k02l0J6J4K1j40q0N7J82J18j38J58
8191A92
$$ Imaginary data points
##PAGE= N=2
##DATA TABLE= (X++(I..I)), XYDATA
$$ plain form
0 0 0 0 0 0 0 0 0 0 0 0 0 0 0 8 -8 8 -8 8 -16 16 -24 24 -32 32 -40 48 -56 64 -72 87 -96 112 -127 144 -160
35 -160 183 -202 229 -255 285 -317 352 -391 433 -480 529 -585 641 -708 782 -860 947 -1043
53 -1043 1152 -1271 1408 -1563 1743 -1948 2193 -2484 2842 -3292 3879 -4679 5840 -7679 11061
68 11061 -19338 85869 51378 -126163 -25857 67900 60938 -64425 -78980 48669 98595
79 98595 -43262 -100317 36938 108112 -37953 -100435 28036 97596 -14185 -98397 -6948
90 -6948 101334 8477 -109933 -17371 104527 17727 -99706 -30268 93187 35313 -95095
101 -95095 -44710 87242 44625 -82688 -58148 74015 62302 -76782 -67490 70339 66282
112 66282 -60074 -72023 51123 76750 -49937 -79350 42763 76694 -33260 -79206 24195
$$ packed form
0@%%%%%%%%%%%%%Qj6J6j6J6k4L2m0M8n6O4p2Q8j04J20j36J59j83K08k39K71l04
35a60L43l85M31m84N40o02O69p43Q24r13J009j114J226j349J490j642J807j990
53a043K195k423K679k971L306l691M141m677N326o134P171q558J0519j3519J8740
68A1061l0399J05207l4491j77541J00306R3757o962j25363j4555J27649M9926
79I8595j41857n7055J37255P1174j46065o2482J28471O9560j11781q4212R1449
90f948J08282r2857j18410R2562J21898q6800j17433O9438J23455n7874j30408
101i5095N0385J31952m2617j27313K4540J32163j1713j39084R292J37829m057
112F6282j26356j1949J23146K5627j26687k9413J22113L3931j09954m5946J03401
$$ plain form
123 24195 84134 -18073 -83523 15313 84440 -5075 -80451 -344 83304 9348 -79537 -12167
135 -12167 78033 20857 -72251 -25673 74118 35116 -70638 -34992 69684 40261 -61162
146 -61162 -42941 59012 50822 -54394 -52222 49957 54685 -42026 -58312 37296 63397 -34307
158 -34307 -65001 28757 63444 -22590 -66429 15196 67704 -12591 -69574 6145 66223 -2251
170 -2251 -68303 -6017 65844 7481 -67559 -14536 61294 16148 -61390 -25071 57620 27380
182 27380 -57639 -32763 52045 34189 -49353 -40147 45488 42944 -43787 -45566 38330 46497 -33004
195 -33004 -50031 29414 53310 -25778 -53595 22443 54675 -15357 -54677 12253 58382 -6963
207 -6963 -55692 4589 56781 3094 -54224 -6020 56608 11593 -52990 -12777 53078 19600
$$ packed form
123B4195N9939j02207o5450R8836O9127q9515p5376Q0107Q3648p3956q8885O7370
135a2167R0200n7176r3108M6578R9791l9002j05754L5646J04676k9423j01423
146f1162J8221J01953q190j05216K172J02179M728r6711j6286R5608K6101r7704
158c4307l0694R3758L4687q6034m3839Q1625N2508q0295n6983P5719O0078o8474
170b251o6052O2286P1861n8363p5040N3023P5830m5146p7538L6319Q2691l0240
182B7380q5019K4876Q4808j7856q3542R206Q5635k544q6731j779Q3896Q167p9501
195c3004j7027P9445K3896p9088k7817P6038L2232p0032l9320O6930M6129o5345
207f963m8729O0281N2192n3687n7318M8204O2628m5015o4583M0213O5855l3478
$$ plain form
219 19600 -48858 -21906 49900 27140 -45816 -28169 44352 32918 -39947 -35763 38659 39112 -35255
232 -35255 -39800 31174 41669 -27336 -45122 22458 46072 -20787 -47432 15456 46897 -11772
244 -11772 -49642 6668 48958 -5512 -49874 123 46665 2660 -49083 -9293 46496 9600
256 9600 -47213 -14706 42937 16991 -43235 -22118 40871 23142 -39751 -26414 35324 28949
268 28949 -33515 -32856 30420 34520 -28270 -35605 25287 37790 -20997 -39460 19146 41727 -15215
281 -15215 -40641 12808 42645 -6990 -41978 5700 44327 -1048 -41504 4 42635 5867
293 5867 -40679 -7758 42101 11415 -38902 -12747 38425 17775 -35823 -19396 35785 22369
305 22369 -32812 -23759 30278 26768 -28022 -29389 25950 30388 -23901 -32029 19970 32930 -17560
$$ packed form
219A9600o8458K6952P1806k2760p2956J7647P2521j1434p2865M184P4422M53p4367
232c5255m545P0974J0495o9005j7786O7580K3614o6859k6645O2888L1441n8669
244a1772l7870N6310M2290n4470m4362M9997M6542m4005n1743L9790N5789l6896
256I600n6813L2507N7643k5946o0226K1117O2989j7729o2893J3337O1738o375
268B8949o2464O59O3276M100o2790p335O0892J2503n8787j8463N8606K2581n6942
281a5215k5426N3449K9837m9635l4988M7678L8627m5375m0456M1508M2631l6768
293E867m6546L2921M9859l0686n0317K6155N1172k0650n3598J6427N5181j3416
305B2369n5181R053N4037l510n4790j367N5339M438n4289q128N1999J2960n0490
$$ plain form
318 -17560 -35581 14732 35093 -13338 -36818 8077 35656 -6353 -37740 2283 36402 -1683
330 -1683 -37246 -3083 35259 5010 -36496 -9151 34323 9584 -34504 -13486 31611 15747
342 15747 -30992 -18803 29553 20050 -27652 -21688 25047 24028 -23230 -25910 21873 27347 -19477
355 -19477 -27569 17207 30161 -13213 -30283 12944 32204 -9089 -30626 7192 32530 -3105
367 -3105 -31722 2574 33174 1263 -30671 -2392 31568 7050 -29996 -7589 30635 10371
379 10371 -28443 -11842 27491 15152 -25943 -16608 25477 18334 -23222 -19820 20759 21958 -19478
392 -19478 -23728 17626 24103 -16355 -25600 12633 25676 -11561 -27936 8383 26980 -7952 -28512
405 -28512 3707 27230 -2814 -29059 -240 27637 810 -28058 -4786 26438 6353 -27227
$$ packed form
318a7560j8021N0313K0361m8431k3480M4895K7579m2009l1387M0023L4119l8085
330a683l5563L4163L8342l0249m1506K7345M3474k4739m4088K1018M5097j5864
342A5747m6739J2189M8356r503m7702N964M6735j019m7258k680M7783N474m6824
355a9477q092M4776J2954m3374j7070M3227J9260m1293k1537L7818K5338l5635
367c105k8617L4296L0600l1911l1934K8279L3960k4518l7046K2407L8224k0264
379A0371l8814J6601L9333j2339m1095R335M2085p143m1556L402M0579J199m1436
392a9478m250M1354O477m0458r245L8233J3043l7237j6375L6319J8597l4932k0560
405b8512L2219K3523l0044k6245K8819K7877k6827k8868K3272L1224k0085l3580
$$ plain form
417 -27227 -8704 25750 9822 -24778 -12316 22896 14281 -22403 -15814 21200 17037 -19314 -17717
430 -17717 17556 20431 -15581 -20553 15309 22361 -12168 -22100 10916 24332 -8083 -23705 7850
443 7850 25310 -4642 -24013 3569 25341 -345 -24469 -135 25132 2789 -23523 -4066
455 -4066 23907 6955 -22796 -7831 22682 9367 -20926 -10983 20103 12959 -19555 -14760 18098
468 18098 15163 -16949 -17151 14482 17671 -14398 -19394 11905 18955 -11152 -20712 8148 20271
481 20271 -7894 -22321 5166 20959 -4477 -22185 1199 21335 -881 -22295 -1601 20902
493 20902 2682 -21266 -4955 20246 6248 -20407 -7853 19359 9037 -18286 -10327 17613
505 17613 12158 -16047 -12951 15699 14428 -13427 -14643 13117 16794 -11077 -16480 10757 17635
$$ packed form
417b7227J8523L4454j5928l4600J2462L5212q615l6684O589L7014m163l6351J597
430a7717L5273K875l6012m972L5862P052l4529r932L3016J3416l2415j5622L1555
443G850J7460k9952j9371K7582K1772k5686k4124K4334K5267k2343k6312J9457
455d066K7973j6952k9751J4965L0513j3315l0293R943L1086p144l2514M795L2858
468A8098k935l2112k02L1633L189l2069m996L1299P050l0107r560K8860J2123
481B0271k8165j4427K7487J5793k5436j7708K3384K0136k2216k1414K0694K2503
493B0902j8220k3948J6311K5201j3998k6655J2554K7212j0322k7323P959K7940
505A7613n455k8205L096K8650j271k7855j216K7760L677k7871n403K7237O878
$$ plain form
518 17635 -7855 -17399 7126 19547 -4546 -18906 4526 19719 -2176 -18731 1351 19777
530 19777 1112 -18903 -1469 18847 3833 -17741 -5132 17776 6820 -17351 -7466 16487
542 16487 8743 -15755 -10305 14775 11352 -14300 -12570 12576 12485 -11518 -14436 9862 14405 -9669
556 -9669 -15617 7482 15194 -7130 -16701 4604 16247 -4544 -17278 2444 16319 -1791 -16757
569 -16757 -1155 16566 1265 -16985 -2665 15722 3690 -15848 -5337 15383 6343 -14816
581 -14816 -7192 13835 8254 -12960 -9143 12361 10982 -11353 -10650 11036 12086 -9159 -11989 8858
595 8858 13795 -6954 -13257 6855 14420 -4624 -14020 4311 15182 -2226 -14516 1896 14742
608 14742 158 -14445 -1058 14760 2012 -14152 -2932 14023 3835 -13436 -5087 12895
$$ packed form
518A7635k5490r544K4525J2421k4093j4360K3432J5193k1895j6555K0082J8426
530A9777j8665k0015J7434K0316j5014k1574J2609K2908j0956k4171R885K3953
542A6487p744k4498N450K5080l423k5652J730K5146r1k4003k918K4298M543k4074
556i669n948K3099P712k2324r571K1305J1643k0791j2734J9722J3875j8110j4966
569a6757J5602J7721j5301j8250J4320J8387j2032j9538J0511K0720r040k1159
581a4816P624K1027n581k1214L817K1504j379k2335P03K1686J050k1245k830K0847
595H858M937k0749o303K0112P565j9044r396J8331J0871j7408j2290J6412J2846
608A4742j4584j4603J3387J5818j2748j6164J1220J6955j0188j7271Q349J7982
$$ plain form
620 12895 6050 -12685 -7344 11407 7566 -10839 -8975 9757 9111 -9815 -10338 8040 10488 -7934
634 -7934 -11806 6442 11481 -6398 -12552 4422 11758 -3972 -13136 2336 12603 -1854 -13009
647 -13009 315 12609 322 -12597 -1697 12757 1938 -12335 -3199 11893 4551 -11409
659 -11409 -5213 11401 6176 -10448 -6288 9813 7591 -8518 -7826 8785 9201 -7441 -9028 7686
673 7686 10053 -5613 -10202 5681 10950 -4320 -10140 3865 11186 -2167 -10783 1703 11630 -591
687 -591 -11015 -11 11195 1413 -11000 -1802 11030 2364 -10695 -3356 9750 4278 -9841
700 -9841 -5070 9229 5507 -8925 -6407 7966 6835 -7765 -7851 6694 7671 -6961 -8669 5265
714 5265 8392 -5312 -9504 3814 9322 -3741 -9624 2348 9202 -1809 -9906 655 9830 -460
$$ packed form
620A2895o845j8735N341J8751l841j8405J864J8732o46j8926n23J8378K448j8422
634g934l872J8248N039j7879o154J6974P336j5730r164J5472J0267j4457j1155
647a3009J3324J2294j2287j2919J0900J4454j0819j4273R136J5092p342j5960
659a1409O196J6614n225j6624M160J6101k222j6109O92J6611M16j6642j587J6714
673G686K367j5666m589J5883N269j5270n820J4005P321j3353q616J2486R927j2221
687e91j0424J1004J1206r782j2413R198J2832q666j3059P339J3106n472j4119
700i841M771J4299l722j4432K518J4373j131j4600q6J4545R77j4632j708J3934
714E265L127j3704m192J3318N508j3063n883J1972O854j1011q097J0561R175j0290
$$ plain form
728 -460 -10042 -617 9563 1407 -9813 -1913 9427 2825 -9010 -3518 8573 4504 -8240 -4491
742 -4491 8330 5559 -6939 -5273 7011 6689 -5800 -6595 6287 7399 -5083 -7182 4831 8175
756 8175 -3577 -7954 3384 8413 -2194 -8231 1982 8275 -808 -8241 11 8768 211 -8339
770 -8339 -870 8227 1487 -8032 -2339 8033 2421 -7829 -3724 7228 3587 -7304 -4689 6189
784 6189 4485 -6411 -5399 5142 5505 -5533 -6405 4428 5912 -4550 -6930 3181 6820 -3424
798 -3424 -7119 2405 6931 -2017 -7342 1157 7277 -731 -7457 -52 7315 558 -7099 -732 7299
813 7299 2084 -6762 -1890 6790 2754 -6061 -2651 6166 3965 -5558 -3919 5881 4716 -4920 -4743
828 -4743 4791 5590 -4014 -5280 3988 6098 -2969 -5748 2807 6391 -2063 -6165 1899 6415 -1072
$$ packed form
728d60r582R425J0180q156j1220P900J1340o602j1835N492J2091m069j2744L749
742d491J2821k771j2498J666J2284l22j2489p95J2882J112j2482k099J2013L344
756H175j1752m377J1338N029j0607o037J0213O293r083p433Q252Q757q557q550
770h339P469R097o740r519N693J0372n612j0250M105J0952l641j0891K615J0878
784F189j704j0896J012J0541L63j1038q72J0833J484j0462k380J0111L639j0244
798c424l695R524M526q948n325Q499O120q008o726P405P367o757p657O367Q031
813G299n215q846M872Q680m036q815L410Q817k201r523J639R800j165r636J77
828d743R534P99r604j266R268K110r067k779Q555L584q454m102Q064M516p487
$$ plain form
843 -1072 -6341 627 6465 -145 -6424 -158 6278 853 -6276 -1524 5838 1749 -6091 -2512 5634
858 5634 2383 -5655 -3086 5086 3378 -5123 -4189 4318 3980 -4406 -4612 3611 4524 -3854 -5311 2718
874 2718 5033 -2594 -5691 2231 5376 -1464 -5657 1213 5540 -941 -5576 400 5464 261 -5568
889 -5568 -546 5363 1386 -5191 -1488 5113 1911 -4750 -2009 5139 2475 -4096 -2754 4543 3479
904 3479 -3955 -3268 3873 3953 -3186 -3977 3241 4477 -2515 -4479 2360 4774 -1915 -4806 1445 4739
920 4739 -894 -4867 537 4942 -469 -4847 -249 4619 425 -4817 -1290 4561 1168 -4851 -1816
935 -1816 4355 1953 -4503 -2396 3878 2297 -3677 -2908 3491 2988 -3426 -3247 2980 3178 -2881 -3751
951 -3751 2321 3712 -1878 -4014 1597 4310 -1458 -4310 804 4334 -554 -4327 252 4481 22
$$ packed form
843a072n269O968N838o610o279O266O436n425p129M752P362m089p840L579Q146
858E634l251q038K569Q172j708q501R34Q507l38q386k06Q223R13q378j457Q029
874B718K315p627l097P922L145o840m193O870M327o481m635N976N064n203n829
889e568N022N909l977o577L703O601l202o661K741P148k664o571J342P297j064
904C479p434O87P141Q0p139p91P218J236o992j964O839K414o689k891O251L294
920D739n633l973N404M405n411m378M598M868m194n242L527N851l393o019L035
935a816O171k402o456K107O274j581n974P69O399n03o414J79O227J98o059q70
951c751O072J391n590k136N611K713n768k852N114L530m888l773M579M229m459
$$ plain form
966 22 -4019 -349 4184 976 -4019 -1017 4061 1515 -3371 -1444 3756 1930 -3243 -1828 3351 2546
982 2546 -2806 -2493 3112 3216 -2690 -3119 2425 3287 -2026 -3334 1974 3442 -1575 -3499 1454 3768
998 3768 -897 -3595 418 3648 -162 -3537 -424 3534 235 -3614 -701 3367 893 -3374 -1357
1013 -1357 3246 1143 -3238 -1732 2678 1755 -3120 -2502 2629 2032 -2668 -2663 2062 2672 -2022 -2877 1905
1030 1905 2884 -1596 -2896 1267 3094 -1006 -3372 672 3312 -278 -3308 173 3104 240 -3116
1045 -3116 -256 3427 660 -2902 -1139 3150 1157 -2698 -1095 2775 1786 -2300 -1833 2809 2108 -2367
1061 -2367 -2263 2240 2292 -1568 -2448 1770 2705 -1467 -2471 1213 2619 -824 -2747 864 2947 -650
1077 -650 -2954 127 2846 17 -3081 -160 2800 266 -2985 -761 2685 522 -2592 -1154 2404
$$ packed form
966B2m041L670M533l208m995L002N078k546m886J927N200j826n173J415N179q05
982B546n352L13N605J04n906m29N544Q62n313j308N308J468n017j924M953K314
998C768m665k698M013L230l810l375L113L958l299l849K913M068k474m267K017
1013a357M603k103m381J506M410r23m875O18N131n97m700NM725O10m694q55M782
1030A905R79m480j300M163J827m100k366M044K640l590l030L481K931k864l356
1045c116K860L683k767l562J763M289j993l855J603L870r89m086M67M642p01m475
1061b367J04M503N2l860q80M218R35m172j004L684J406l443j923L611K083l597
1077f50k304L081K719k829l098K921K960k534l251K224L446k163l114J438L558
$$ plain form
1092 2404 1085 -2576 -1235 2035 1396 -2195 -1785 1843 1867 -1789 -2129 1419 1898 -1577 -2368 1395 2370
1109 2370 -1043 -2172 1043 2284 -585 -2428 251 2494 -190 -2571 96 2441 506 -2435 -370
1124 -370 2492 470 -2358 -762 2299 1043 -1966 -1199 2238 1390 -1952 -1354 1828 1594 -1683 -1491
1140 -1491 1494 1985 -1418 -1701 1412 2151 -902 -1796 955 2281 -629 -1934 387 2290 -333 -2192
1156 -2192 105 2266 34 -2422 -233 2074 382 -2209 -719 1958 693 -2152 -1000 1824 1095
1171 1095 -1924 -1351 1737 1062 -1597 -1406 1152 1722 -1557 -1979 1015 1775 -1019 -1586 813 1569 -839
1188 -839 -1938 753 1872 -370 -1977 302 2020 27 -1993 8 2287 294 -1727 -553 1826
1203 1826 549 -1864 -726 1584 1071 -1476 -925 1465 1218 -1260 -1376 1277 1592 -1249 -1391 1352
$$ packed form
1092B404j319l661J341L270o39l591M10L628K4l656l40L548M79l475p91L763R75
1109B370l413j129L215J241k869j843K679K243k684k381K667K345j935k941K065
1124c70K862k022k828J596L061j256l009P67L437q48l342N98L182k34l277J92
1140a491K985M91l403k83L113P39l053q94K751J326k910j305K321J903k623j859
1156b192K297K161k232k456K189K307j692k591J490K677j265k845J152K824p29
1171A095l019N73L088o75k659J91K558N70l279m22K994P60k794n67K399P56k408
1188h39j099K691J119k242j607K279J718j993k020K001K279j993k021J174K379
1203A826j277k413J138K310n13k547N51K390k47k478j16K653L15k841j42K743
$$ plain form
1219 1352 1688 -913 -1346 1026 1792 -661 -1720 587 1709 -453 -1550 451 1601 -57 -1562 -584
1235 -584 1809 170 -1481 -383 1435 209 -1722 -867 1522 714 -1678 -896 1459 936 -1558 -1153
1251 -1153 1195 1140 -959 -1343 887 1408 -932 -1307 647 1536 -843 -1567 446 1790 -377 -1614 168
1268 168 1625 -246 -1375 21 1581 90 -1471 -155 1626 548 -1390 -426 1425 538 -1432 -673
1284 -673 1481 927 -1237 -791 1506 1072 -960 -1203 854 1143 -845 -1247 873 1251 -603 -1282 520
1301 520 1460 -334 -1643 487 1293 -314 -1463 95 1549 83 -1606 -255 1521 289 -1629 -443
1317 -443 1141 380 -1587 -490 1155 827 -1391 -788 1045 1079 -1212 -1109 1065 1322 -1159 -1119 882
1334 882 1297 -669 -1112 374 1356 -404 -1306 540 1317 -326 -1310 169 1461 -48 -962 -111 1415
$$ packed form
1219A352L36k601m33K372P66k453j059K307J122k162j097K001J150j658j505R78
1235e84K393j639j651J098J818j226j931Q55K389q08k392P82K355n23k494M05
1251a153K348n5k099l84K230N21k340l75J954Q89k379p24K013J344k167j237J782
1268A68J457j871j129J396J560j491j561J316J781j078j938R64J851q87j970P59
1284f73K154n54k164M46K297m34k032k43K057K89j988m02K120L78j854o79J802
1301E20R40j794j309K130Q06j607j149J558J454j466j689J351J776j232j918J186
1317d43J584p61j967J097J645l28k218O03J833L4k291J03K174K57k481M0K001
1334H82M15j966m43J486R82j760r02J846P77j643r84J479J292j509r14Q51J526
$$ plain form
1351 1415 277 -1393 -372 1347 765 -1176 -440 1276 713 -1455 -699 1085 798 -1142 -731 1155
1367 1155 740 -706 -1065 556 1157 -522 -1140 616 1188 -372 -1382 457 1077 -481 -1173 357 1277
1384 1277 -79 -1313 102 1243 -6 -1423 -437 1071 392 -1238 -575 1214 579 -1268 -595 845
1400 845 609 -1069 -931 1024 987 -934 -1059 788 889 -863 -804 698 1129 -640 -981 720 1322 -306
1418 -306 -1241 116 1351 -164 -1220 117 1380 51 -1182 -13 1261 244 -1143 -103 1103
1433 1103 548 -1224 -466 1166 557 -991 -719 1189 874 -839 -678 715 867 -813 -775 700 1071
1450 1071 -609 -1097 497 1080 -506 -1297 219 1062 -211 -1373 80 1151 -231 -1117 -137 1147
1466 1147 176 -1192 -451 1230 305 -1157 -633 1058 467 -1104 -516 965 666 -871 -649 629 972
$$ packed form
1351A415j138j670J021J719n82j941P36J716n63k168P56J784k87j940M11J886
1367A155m15j446l59J621O01j679o18J756N72j560j010J839O20j558o92J530R20
1384A277j356j234J415J141j249j417R86J508o79j630O63J789o35j847O73J440
1400H45k36j678J38J955l7j921j25J847J01j752N9J502M31j769l41J701O02j628
1418c06r35J357J235j515j056J337J263j329j233J169J274j017j387J040J206
1433A103n55j772P58J632o09j548K72J908l15j713J61J393J52j680L8J475L71
1450A071j680m88J594N83j586p91J516Q43j273j162J453J071j382q86R80J284
1466A147r71j368P41J681r25j462N24J691n91j571N88J481k99j537K22J278L43
$$ plain form
1483 972 -684 -1071 689 1073 -533 -999 398 1012 -346 -1089 509 1136 -249 -1009 45 1271 -49
1500 -49 -1100 147 1055 338 -1012 -93 962 298 -1040 -332 1033 700 -929 -327 986 600 -825
1517 -825 -694 886 825 -871 -537 837 763 -620 -844 437 931 -561 -907 461 788 -272 -956 320
1535 320 1202 -117 -1149 106 1222 31 -927 -275 869 -69 -1136 -294 1097 194 -1253 -622 950
1552 950 389 -1028 -735 932 457 -872 -534 796 665 -713 -880 669 891 -585 -1145 648 1025
1569 1025 -379 -1039 162 1028 -181 -923 146 827 28 -728 -79 1108 151 -931 73 1184 201
1586 201 -903 -191 1000 301 -911 -603 847 595 -779 -490 797 587 -755 -441 554 833 -595
1603 -595 -771 555 635 -596 -983 485 1026 -264 -997 179 1079 -31 -1112 -6 978 -251 -1018
$$ packed form
1483I72j656l87J760L84j606m66J397O14j358p43J598O27j385p60J054J226j320
1500d9j051J247R08p17j350R19J055o64j338P08J365l33j629O02J313l86j425
1517h25J31J580o1j696L34J374p4j383k24J281M94j492l46J368L27j060o84J276
1535C20Q82j319j032J255J116j191r58O52J144r38j067Q42J391r03j447O31J572
1552I50n61j417K93J667m75j329L38J330j31j378j67J549K22j476n60J793L77
1569A025j404o60J201Q66j209p42J069O81p99p56O49J187r57j082J004J111r83
1586B01j104P12J191o99j212L08J450k52j374K89J287k10j342L14R95K79j428
1603e95j76J326Q0j231l87J468N41j290p33J176R00j110j081J106R84j229p67
$$ plain form
1620 -1018 -50 1077 -95 -1005 -571 969 118 -866 -393 972 192 -647 -458 774 377 -894 -792 552
1638 552 634 -723 -785 570 733 -656 -695 408 806 -420 -922 380 1109 -170 -1034 458 956 -150
1656 -150 -766 378 1172 -22 -798 -230 828 51 -697 -309 1095 -27 -1097 -254 821 707 -1024
1673 -1024 -466 962 805 -791 -738 476 415 -574 -689 288 675 -729 -886 493 732 -635 -1032 -48
1691 -48 720 -317 -938 45 748 -226 -1066 16 912 159 -1054 -277 819 198 -897 -386 587 260 -703
1710 -703 -446 788 358 -838 -621 772 770 -807 -611 481 831 -760 -991 590 904 -443 -808 305
1728 305 747 -117 -711 305 796 -20 -1086 27 888 169 -930 127 1009 104 -774 -91 979 85
1746 85 -936 -79 738 223 -892 -345 662 433 -556 -603 535 559 -329 -939 455 721 -739 -699 239
$$ packed form
1620a018R68J127j172r10M34J540q51r84M73J365p80q39J89J232l97j271J02J344
1638E52Q2j357o2J355J63j389l9J103L98j226n02J302P29j279q64J492M98j106
1656a50o16J144P94j194p76N68J058p77p48L88J404j122j070Q43J075j14j731
1673a024N58J428j57j596N3J214o1r89j15R77L87j404j57J379K39j367l97R84
1691d8P68j037o21R83P03r74q40J082Q96p53j213P77J096o21j095N11R73l27r63
1710g03K57J234m30j196K17J393kj577J96J092L50j591k31J581L14j347l65J113
1728C05M42q64n94J016M91q16j066J113Q61p19j099J057Q82r05q78O83J070q94
1746H5j021Q57Q17n15j115N47J007k29r89m7J138K4q88o10J394K66j460M0R38
$$ plain form
1765 239 711 -493 -855 431 1023 -97 -799 252 796 -36 -821 142 854 -207 -1020 71 767 55
1783 55 -959 -343 831 95 -849 -357 630 564 -779 -532 1050 529 -467 -510 595 744 -431 -549 515
1802 515 768 -385 -604 666 609 -69 -719 319 928 -78 -607 355 959 102 -751 37 1039 -15
1820 -15 -700 -126 922 523 -772 -6 744 385 -732 -164 803 418 -768 -431 481 353 -452 -408 522
1839 522 319 -408 -690 328 736 -539 -572 349 893 -273 -810 169 813 -237 -755 14 703 37 -871
1858 -871 102 755 -180 -720 -63 881 146 -938 -253 564 329 -772 -268 636 384 -349 -524 685 373
1877 373 -509 -480 605 344 -432 -499 490 665 -272 -511 399 684 -398 -774 230 732 49 -754 224 890
1897 890 233 -755 67 853 159 -625 -28 838 413 -716 -329 696 574 -680 -230 859 420 -702
$$ packed form
1765B39M72j204l62J286N92j120p02J051N44q32p85R63P12j061q13J091O96p12
1783E5j014O16J174p36r44M92R87o6j343K47J582n21r96m3J105J49j175j18J064
1802E15K53j153k19J270n7o78o50J038O09j006n29R62O04q57q53P88J002j054
1820a5o85N74J048l99j295P66P50l59j117N68R67l85j186L37R12j28q05M4R30
1839E22k03p27k82J018M08j275l3R21N44j166n37R79O44j050n18P69O89o66r08
1858h71R73O53r35n40O57R44p35j084O85Q17k35j101N04R04k52p33j75J209l12
1877C73q82K9J085k61p76o7R89J75r37k39R10K85j082l76J004N02o83q03R78O66
1897H90o57r88Q22P86o94p84N97Q66m25j129L87J025j22j254M50J089m39j122
$$ plain form
1915 -702 -817 513 535 -660 -584 356 367 -454 -975 434 597 -412 -565 201 655 -127 -936 8 745 -23
1935 -23 -716 38 456 -45 -859 -244 707 123 -888 -112 627 127 -673 -353 801 324 -396 -466 500 738
1955 738 -583 -447 520 680 -314 -456 311 539 -291 -432 319 693 -228 -606 102 653 -181 -652 185 593
1975 593 -137 -710 69 721 270 -564 32 537 81 -969 -266 678 112 -630 -409 576 253 -732 -463 373
1995 373 402 -412 -467 242 327 -495 -591 351 502 -119 -553 349 469 -431 -884 327 873 -53 -805 225 612
2016 612 -144 -635 75 586 95 -693 -20 707 200 -515 -290 696 333 -484 -153 566 480 -406 -403 331 423
2037 423 -666 -473 433 512 -304 -454 387 661 -263 -622 497 766 -294 -650 55 850 -142 -624 138
2056 138 770 -82 -575 -225 621 312 -721 -332 769 24 -638 -206 638 432 -525 -582 810 575 -374
$$ packed form
1915g02j15J330K2j195P6R40J1q21n21J409J63j009j53P66M54p82q09R44P37p68
1935b3o93P54M18n01q14O15R51n84j011P76P39n00q00L20J154m77p20p0R66K38
1955G38j321J36R67J60r94j42P67K28q30j41P51L74r21l78P08N51q34m71Q37M08
1975E93p30n73P79O52m51q34N96N05m56j050P03R44n66p42K21R85l23r85K69Q36
1995C73K9q14n5P09Q5q22r6R42J51o21m34R02J20r00m53J211N46r26p52J030L87
2016F12p56m91P10N11m91p88O73P27n07p15K25R86l63q17L31P19q6q86LP34R2
2037D23j089J93R06P9q16j50Q41K74r24l59J119K69j060l56P05P95r92m82P62
2056A38O32q52m93L50Q46l09j033L89J101p45o62M32Q44k06r57n7J392k35r49
$$ plain form
2075 -374 -547 131 494 -497 -580 423 468 -347 -485 218 429 -455 -738 163 441 -154 -767 324 537 10
2095 10 -669 5 542 -219 -597 23 629 293 -643 -158 711 2 -460 -128 650 352 -227 -308 664 357 -449
2116 -449 -480 574 514 -398 -528 492 574 -467 -569 390 435 -171 -603 132 810 -132 -645 279 711 -161
2136 -161 -683 -49 858 68 -568 -177 631 -76 -376 -83 664 356 -484 -243 606 284 -508 -450 331 511
2156 511 -270 -637 346 445 -428 -685 232 488 -367 -472 386 504 -132 -482 206 494 154 -737 187 736
2176 736 35 -570 -212 727 89 -318 -59 585 269 -663 -152 488 184 -503 -222 560 447 -531 15 412
2196 412 472 -431 -382 275 528 -200 -327 158 683 240 -619 433 547 -127 -616 26 501 56 -530 93
2216 93 387 -81 -713 20 487 74 -649 -168 466 298 -680 -392 304 209 -391 -492 184 148 -627 -753 239
$$ packed form
2075c74j73O78L63r91q3J003M5q15j38P03K11q84k83R01K78n95o13J091K13n27
2095A0o79O74N37p61l78O20O06l36r36M85Q69p09m62L32P78k98n79q1R72l07q06
2116d49l1J054o0r12j30J020Q2j041j02R59M5o06m32P35O78r42n13R24M32q72
2136a61n22O34R07p90o36L91Q08p07l00K93P47l08q40K41Q49l22p92N8P81J80
2156E11p81l67R83R9q73k57R17K56q55j05Q58J18o36l50O88K88l40q91R24N49
2176G36p01o05L58R39o38m07K59O44l16r32N11O40l04o87K81P82j13r78N46L97
2196D12O0r03M9O57K53p28j27M85N25m43q59J052J14o74m89O42M75m45n86O23
2216I3K94m68o32P33M67m13p23M81O34j68r78K88O96r5o00j01O76l6p75j26R92
$$ plain form
2237 239 476 -344 -416 211 487 -338 -378 75 496 -269 -724 106 643 -193 -459 60 488 111 -336 1 260
2258 260 51 -486 88 348 34 -446 -252 392 152 -500 -30 672 116 -392 -348 691 485 -312 -294 156
2278 156 490 -255 -263 373 500 -333 -488 365 356 -370 -477 84 576 7 -563 115 305 -143 -543 -182 631
2299 631 44 -404 -437 410 -53 -512 -328 613 329 -547 -186 655 375 -313 -682 416 379 -365 -499 345
2319 345 411 -538 -389 122 494 -356 -468 93 569 -83 -400 214 509 -188 -535 12 529 112 -558 184
2339 184 439 -10 -389 -130 320 235 -208 -31 501 185 -591 -251 434 481 -49 -368 427 380 -229 -304 366
2360 366 433 -425 -490 335 390 -168 -329 246 573 -172 -614 -6 766 -212 -246 1 542 -28 -573 -5 618
2381 618 -131 -652 -247 531 297 -820 -460 486 101 -586 -315 331 403 -431 -415 224 706 -290 -309 237 603
$$ packed form
2237B39K37q20p2O27K76q25m0M53M21p65m55Q30N37q36k66N19M28l77m47L37K59
2258B60k09n37N74K60l14m80J94O44k40o52M70P02n56n08M4J039k06p97J8M50
2278A56L34p45qO36J27q33j55Q53rp26j07N61M92n69n70O78J90m48m00L61Q13
2299F31n87m48l3Q47m63m59J84R41k84q76L61Q41k80o88l69J098l7p44j34Q44
2319C45O6r49J49N11L72q50j12N61M76o52l17O14K95o97l47N47N17m17o70P42
2339A84K55m49l79K59M50q5m43J77N32l16p76L40O85M7n30l19P95m7o09p5O70
2360C66O7q58o5Q25N5n58j61N75L27p45m42O08P72r78l4K47N41n70n45N68O23
2381F18p49n21M05P78k34j117L60R46l85o87K71O46P2q34J6O39M82r96j9N46L66
$$ plain form
2402 603 -113 -597 22 304 -441 -685 -198 558 150 -237 159 528 -83 -476 164 683 184 -140 -76 394
2422 394 268 -347 -69 316 347 -346 26 459 410 -255 -30 504 368 -388 -212 305 228 -166 -439 58 365
2443 365 -216 -315 44 341 -161 -851 24 468 -11 -507 -44 416 -56 -314 -133 387 -129 -116 -291 339 48
2464 48 -448 -99 214 260 -368 -363 511 337 -235 -388 273 425 -269 -355 173 263 -232 -287 169 179 -6 -372 121
2487 121 416 11 -283 315 613 -58 -217 -12 569 -57 -591 147 464 102 -433 -89 693 225 -283 -96
2507 -96 340 355 -146 -186 194 286 -268 -349 579 378 -426 -332 -35 504 -141 -203 181 199 -168 -521 205 377 -30
2530 -30 -413 126 316 -128 -571 -163 336 2 -340 24 208 111 -483 -481 486 159 -282 -155 85 247 -459
2551 -459 -295 181 181 -336 -115 235 522 -213 -445 126 255 -261 -292 307 688 -21 -511 290 316 72 -367
$$ packed form
2402F03p16m84O19K82p45k44M87P56m08l87L96L69o11l93O40N19m99l24O4M70
2422C94j26o15K78L85L1o93L72M33m9o65K25N34j36p56J76N17p7l94k73M97L07
2443C65n81r9L59K97n02o90Q75M44m79m96M63M60m72k58J81N20n16J3j75O30k91
2464D8m96L49L13M6o28NQ74j74n72j53O61J52o94q6N28R0m95n5M56J0j85l66M93
2487A21K95m05k94N98K98o71j59K05N81o26n34P38L17l62n35L44P82m68n08J87
2507i6M36J5n01m0L80R2n54q1R28k01q04R4K97N39o45o2L84J8l67l53P26J72m07
2530c0l83N39J90m44m43M08M99l34l42L64J84r7n94KR67l27m41J27K40J62p06
2551d59J64M76%n17K21L50K87p35k32N71J29n16l1N99L81p09m90Q01K6k44m39
$$ plain form
2572 -367 37 611 24 -511 28 283 -267 -221 -27 227 128 -317 -323 698 124 -447 -30 279 178 -147 -196
2593 -196 199 240 -350 -168 102 82 -314 -188 125 326 -58 -298 45 240 -373 -339 306 175 -211 -285 -142
2614 -142 391 -46 -162 -143 443 -69 -210 -113 498 40 -159 -231 184 196 -92 -548 555 110 -276 -184 120
2635 120 194 -87 -296 147 -29 -230 -234 75 512 -117 -239 31 311 21 -426 255 317 198 -50 121 335
2656 335 -38 -258 -119 299 192 -227 -90 303 125 -322 -182 278 93 -196 -396 460 183 -222 -40 182
2676 182 380 -269 -491 67 392 -277 -475 58 350 -130 -358 28 272 44 -496 -387 308 -89 -302 -55
2696 -55 173 133 -132 -73 66 31 -307 -34 -20 -59 -365 -11 276 60 -217 -180 50 105 -194 -247 283 347 -80
2719 -80 -449 170 523 -33 -381 201 308 -5 -137 119 345 -40 -308 206 401 69 -190 43 330 56
$$ packed form
2572c67M04N74n87n35N39K55n50M6J94K54r9m45oJ021n74n71M17L09j01l25m9
2593a96L95M1n90J82K70k0l96J26L13K01l84k40L43J95o13L4O45j31l86p4J43
2614a42N33m37j16J9N86n12j41R7O11m58j99p2M15J2k88m56J103m45l86R2L04
2635A20P4k81k09M43j76k01mL09M37o29j22K70K80k90m47O81O2j19k48J71K14
2656C35l73k20J39M18j07m19J37L93j78m47J40M60j85k89k00Q56k77m05J82K22
2676A82J98o49k22N58L25o69j98N33K92m80k28L86K44k28n40J09O95l97k13K47
2696e5K28m0k65N9J39l5l38K73J4l9l06L54K87k16k77L7K30N5k99n3N30O4m27
2719h0l69O19L53n56l48N82J07l13j32K56K26l85k68N14J95l32k59K33K87k74
$$ plain form
2739 56 -372 70 473 126 -228 41 172 86 -245 -106 422 285 -244 -312 346 360 -206 42 163 111 -246 -351
2761 -351 294 123 -101 -292 216 410 35 -318 -94 157 -20 -127 -244 247 -19 -308 -19 308 -32 -260
2781 -260 28 211 106 -351 -153 416 268 -404 -160 295 156 -220 -261 128 185 -203 -216 260 -50 99 -398
2802 -398 220 186 -101 -180 29 168 -23 -258 104 331 117 -300 -137 246 43 -354 5 173 193 -88 -233
2823 -233 318 158 -170 -214 55 248 -164 -277 322 166 -469 -275 28 138 109 -228 -7 94 -163 -174 48
2844 48 226 -80 -344 -180 134 -118 -363 -90 208 -56 -208 -148 234 -139 -101 -201 67 -74 -52 -128 269 222
$$ packed form
2739E6m28M42M03l47l54K69J31q6l31J39N28j37n29o8O58J4n66K48J21n2l57j05
2761c51O45j71k24j91N08J94l75l53K24K51j77j07j17M91k66k89K89L27l40k28
2781b60K88J83j05m57J98N69j48o72K44M55j39l76m1L89N7l88j3M76l10J49m97
2802c98O18l4k87p9K09J39j91k35L62K27k14m17J63L83k03l97L59J68K0k81j45
2823b33N51j60l28m4K69J93m12j13N99j56o35J94L03J10k9l37K21J01k57j1K22
2844D8J78l06k64J64L14k52k45K73K98k64j52O0L82l73L8j00K68j41K2p6L97m7
$$ [...]
8191A3
##END NTUPLES=NMR FID
##END=
