##TITLE=1H_SR52+5xAcCl
 CDCl3, 8 sc, 
 31.05.2021
##JCAMPDX= 6.0         $$ Bruker NMR JCAMP-DX V2.0
##DATA TYPE= NMR FID
##DATA CLASS= NTUPLES
##ORIGIN= UXNMR, Bruker Analytische Messtechnik GmbH
##OWNER= root
$$ XWIN-NMR		Version 3.5
$$ Mon May 31 11:52:57 2021 Russian Standard Time (UT+4h)  she@DPX200
##.OBSERVE FREQUENCY= 200.131506
##.OBSERVE NUCLEUS= ^1H
##.DELAY= (6, 6)
##.ACQUISITION MODE= SIMULTANEOUS
##.ACQUISITION SCHEME= undefined
##.AVERAGES= 8
##.DIGITISER RES= 18
##SPECTROMETER/DATA SYSTEM= spect
##.PULSE SEQUENCE= zg30
##.SOLVENT NAME= CDCl3
##.SHIFT REFERENCE= (INTERNAL, CDCl3, 0, 15.7039)
##AUDIT TRAIL= $$ (NUMBER, WHEN, WHO, WHERE, WHAT)
$$ ##TITLE= Audit trail, XWIN-NMR		Version 3.5
$$ ##JCAMPDX= 5.01
$$ ##ORIGIN= Bruker BioSpin GmbH
$$ ##OWNER= she
$$ F:/spectra/data/she/nmr/H-F/1/audita.txt
$$ ##AUDIT TRAIL=  $$ (NUMBER, WHEN, WHO, WHERE, WHAT)
(   1,<2021-05-31 11:51:44.87 +0400>,<she>,<DPX200>,
      <created by zg, POWCHK disabled, PULCHK disabled
       configuration hash MD5:
       00 E9 B6 7A A2 85 ED C7 34 08 36 98 17 FE 4E 26
       data hash MD5: 16K
       03 94 70 74 B8 1A DF 7D 78 45 E6 EC 44 92 3C A3>)
$$ ##END=
$$ 
$$ hash MD5
$$ FF 36 72 00 C2 53 3C EB 03 EB 1C 68 CF 85 61 38
##$RELAX= 
##$RELAX= 
##$RELAX= 
##$RELAX= 
##$RELAX= 
##$RELAX= 
$$ Bruker specific parameters
$$ --------------------------
##$DU= <F:/spectra>
##$EXPNO= 1
##$NAME= <H-F>
##$PROCNO= 1
##$TYPE= <nmr>
##$USER= <she>
##$AMP= (0..31)
100 100 100 100 100 100 100 100 100 100 100 100 100 100 100 100 100 100 
100 100 100 100 100 100 100 100 100 100 100 100 100 100 
##$AQSEQ= 0
##$AQ_mod= 1
##$AUNM= <au_zg>
##$AUTOPOS= <>
##$BF1= 200.13
##$BF2= 200.13
##$BF3= 200.13
##$BF4= 200.13
##$BF5= 200.13
##$BF6= 200.13
##$BF7= 200.13
##$BF8= 200.13
##$BYTORDA= 1
##$CFDGTYP= 0
##$CFRGTYP= 5
##$CHEMSTR= <none>
##$CNST= (0..31)
1 1 145 1 1 1 1 1 1 1 1 1 1 1 1 1 1 1 1 1 1 1 1 1 1 1 1 1 1 1 1 1 
##$CPDPRG= <>
##$CPDPRG1= <>
##$CPDPRG2= <>
##$CPDPRG3= <>
##$CPDPRG4= <mlev>
##$CPDPRG5= <mlev>
##$CPDPRG6= <mlev>
##$CPDPRG7= <mlev>
##$CPDPRG8= <mlev>
##$CPDPRGB= <>
##$CPDPRGT= <>
##$D= (0..31)
0 1.2 0 0 0 0 0 0 0 0.06 0 0.03 0 0 0 0 0.0002 0 0 0 0 0 0 0 0 0 0 0 0 
0 0 0 
##$DATE= 1622447504
##$DBL= (0..7)
120 120 120 120 120 120 120 120 
##$DBP= (0..7)
150 150 150 150 150 150 150 150 
##$DBP07= 0
##$DBPNAM0= <>
##$DBPNAM1= <>
##$DBPNAM2= <>
##$DBPNAM3= <>
##$DBPNAM4= <>
##$DBPNAM5= <>
##$DBPNAM6= <>
##$DBPNAM7= <>
##$DBPOAL= (0..7)
0.5 0.5 0.5 0.5 0.5 0.5 0.5 0.5 
##$DBPOFFS= (0..7)
0 0 0 0 0 0 0 0 
##$DE= 6
##$DECBNUC= <off>
##$DECIM= 32
##$DECNUC= <off>
##$DECSTAT= 4
##$DIGMOD= 1
##$DIGTYP= 9
##$DL= (0..7)
0 120 120 120 120 120 120 120 
##$DP= (0..7)
150 150 150 150 150 150 150 150 
##$DP07= 0
##$DPNAME0= <>
##$DPNAME1= <>
##$DPNAME2= <>
##$DPNAME3= <>
##$DPNAME4= <>
##$DPNAME5= <>
##$DPNAME6= <>
##$DPNAME7= <>
##$DPOAL= (0..7)
0.5 0.5 0.5 0.5 0.5 0.5 0.5 0.5 
##$DPOFFS= (0..7)
0 0 0 0 0 0 0 0 
##$DQDMODE= 0
##$DR= 18
##$DS= 0
##$DSLIST= <SSSSSSSSSSSSSSS>
$$ [...]
##$SUBNAM2= <"">
##$SUBNAM3= <"">
##$SUBNAM4= <"">
##$SUBNAM5= <"">
##$SUBNAM6= <"">
##$SUBNAM7= <"">
##$SUBNAM8= <"">
##$SUBNAM9= <"">
##$SW= 16.9725357007746
##$SWIBOX= (0..15)
0 0 2 0 0 0 0 0 0 0 0 0 0 0 0 0 
##$SW_h= 3396.73913043478
##$TD= 16384
##$TD0= 1
##$TE= 0
##$TE2= 300
##$TE3= 300
##$TEG= 300
##$TL= (0..7)
0 120 120 120 120 120 120 120 
##$TP= (0..7)
150 150 150 150 150 150 150 150 
##$TP07= 0
##$TPNAME0= <>
##$TPNAME1= <>
##$TPNAME2= <>
##$TPNAME3= <>
##$TPNAME4= <>
##$TPNAME5= <>
##$TPNAME6= <>
##$TPNAME7= <>
##$TPOAL= (0..7)
0.5 0.5 0.5 0.5 0.5 0.5 0.5 0.5 
##$TPOFFS= (0..7)
0 0 0 0 0 0 0 0 
##$TUNHIN= 0
##$TUNHOUT= 0
##$TUNXOUT= 0
##$USERA1= <user>
##$USERA2= <user>
##$USERA3= <user>
##$USERA4= <user>
##$USERA5= <user>
##$V9= 5
##$VALIST= <valist>
##$VCLIST= <CCCCCCCCCCCCCCC>
##$VD= 0
##$VDLIST= <DDDDDDDDDDDDDDD>
##$VPLIST= <PPPPPPPPPPPPPPP>
##$VTLIST= <TTTTTTTTTTTTTTT>
##$WBST= 1024
##$WBSW= 4
##$XGAIN= (0..3)
0 0 0 0 
##$XL= 0
##$YL= 0
##$YMAX_a= 291761
##$YMIN_a= -267096
##$ZGOPTNS= <>
##$ZL1= 120
##$ZL2= 120
##$ZL3= 120
##$ZL4= 120
##$ABSF1= 10
##$ABSF2= 0
##$ABSG= 5
##$ABSL= 3
##$ALPHA= 0
##$AQORDER= 0
##$ASSFAC= 0
##$ASSFACI= 0
##$ASSFACX= 0
##$ASSWID= 0
##$AUNMP= <proc_1d>
##$AZFE= 0.1
##$AZFW= 0.1
##$BCFW= 1
##$BC_mod= 2
##$BYTORDP= 1
##$COROFFS= 0
##$CY= 11.3945322036743
##$DATMOD= 1
##$DC= 2
##$DFILT= <>
##$DTYPP= 0
##$F1P= 15.9154993809931
##$F2P= -4.1035820241983
##$FCOR= 0.5
##$FTSIZE= 0
##$FT_mod= 4
##$GAMMA= 1
##$GB= 0.15
##$INTBC= 1
##$INTSCL= 1
##$ISEN= 128
##$LB= 0.24
##$LEV0= 0
##$LPBIN= 0
##$MAXI= 10000
##$MC2= 0
##$MEAN= 0
##$ME_mod= 0
##$MI= 1.114404
##$NCOEF= 0
##$NC_proc= 0
##$NLEV= 6
##$NOISF1= 3.799351
##$NOISF2= 2.8
##$NSP= 1
##$NTH_PI= 0
##$NZP= 0
##$OFFSET= 15.70392
##$PC= 1
##$PHC0= -11128.24
##$PHC1= 21.00099
##$PH_mod= 1
##$PKNL= yes
##$PPARMOD= 0
##$PSCAL= 0
##$PSIGN= 0
##$REVERSE= no
##$SF= 200.130013532006
##$SI= 16384
##$SIGF1= 3
##$SIGF2= 2
##$SINO= 400
##$SIOLD= 16384
##$SREGLST= <1H.CDCl3>
##$SSB= 0
##$STSI= 0
##$STSR= 0
##$SW_p= 3612.71676300578
##$SYMM= 0
##$S_DEV= 0
##$TDeff= 0
##$TDoff= 0
##$TI= <>
##$TILT= no
##$TM1= 0
##$TM2= 0
##$TOPLEV= 0
##$USERP1= <user>
##$USERP2= <user>
##$USERP3= <user>
##$USERP4= <user>
##$USERP5= <user>
##$WDW= 1
##$XDIM= 8192
##$YMAX_p= 0
##$YMIN_p= 0
$$ End of Bruker specific parameters
$$ ---------------------------------
##NTUPLES= NMR FID
##VAR_NAME=  TIME,          FID/REAL,        FID/IMAG
##SYMBOL=    X,             R,               I
##VAR_TYPE=  INDEPENDENT,   DEPENDENT,       DEPENDENT
##VAR_FORM=  AFFN,          ASDF,            ASDF
##VAR_DIM=   8192,          8192,            8192
##UNITS=     SECONDS,       ARBITRARY UNITS, ARBITRARY UNITS
##FACTOR=    0.0002944,     1,               1
##FIRST=     0,             0,               0
##LAST=      2.4114304,     0,               0
##MIN=       0,             -267096,         0
##MAX=       2.4114304,     291761,          0
$$ Real data points
##PAGE= N=1
##DATA TABLE= (X++(R..R)), XYDATA
0@%%%%%%%%%%%Qj6J6j6J6k4L2l2M0n0N8p1Q1r2J11j32J53j75K00k30K62k96L34
$$ 0 0 0 0 0 0 0 0 0 0 0 0 8 -8 8 -8 8 -16 16 -16 24 -26 32 -39 42 -50 61 -71 82 -93 107 -123 139 -157 177
34A77l77M26m78N34n98O68p43Q26r18J017j124J241j369J510j666J835k019K224
$$ 177 -200 226 -252 282 -316 352 -391 435 -483 534 -590 651 -718 792 -874 961 -1058 1166
52A166k452K706k989L311l677M096m586N162n854O704p777R175j1079J3845j8221
$$ 1166 -1286 1420 -1569 1742 -1935 2161 -2425 2737 -3117 3587 -4190 4985 -6094 7751 -10470
67a0470K6177m4963J63420P7318m78578J95040L50836l13099k22318M10801L0904
$$ -10470 15707 -29256 134164 211482 -267096 -72056 278780 -34319 -256637 154164 185068
78A85068m08119J38276L52636k95348k19527L77888O8124m02836R7072L51016
$$ 185068 -223051 -84775 267861 -27487 -247014 130874 198998 -203838 -106766 244250
88B44250k33765k50981L36289R9796l70389N9746L43120k11669k50395L19868
$$ 244250 10485 -240496 95793 195589 -174800 -115054 228066 16397 -233998 85870
98H5870J13873l70759M4847L45850j88781k58959K94403J26547l43523K5602L24960
$$ 85870 199743 -171016 -126169 219681 30900 -228059 66344 192891 -150632 -125030 199930
109A99930j68985k43698K70581J25624l21321Q312L16176j39565k54963K43795
$$ 199930 30945 -212753 57828 183452 -137869 -129557 186619 47054 -207909 35886
119C5886J49266l01737j8501L03859j13007k51138K21049J54183k87427k8751
$$ 35886 185152 -116585 -135086 168773 55766 -195372 25677 179860 -107567 -136318
129a36318K99565r9562k54426K06003J62686k70124m3943K82684p8679k40373
$$ -136318 163247 63685 -190741 15262 177948 -92176 -136119 146565 67886 -172487
139a72487J79195J59556k46447m9934K66203o1976k39535J62296J70783k32236
$$ -172487 6708 166264 -80183 -130117 136086 74110 -165425 -3129 167654 -64582
149f4582p1148K59402l9532k39564J42531J76081k19002p8597K52578l2543k38717
$$ -64582 -135730 123672 84140 -155424 -12893 163188 -55814 -134411 118167 85624 -153093
160a53093J36039J79026k10857q8527K47241j9255k33492J18617J78763j93864
$$ -153093 -17054 161972 -48885 -137412 109829 90574 -142918 -24301 154462 -39402
170c9402r3944K31748p456k25917J02898J81583j79178j06556K23335J2155k27609
$$ -39402 -133346 98402 90946 -134971 -32073 149510 -29668 -136224 87111 99266 -128343
181a28343Q5456J88196j65106j17577K16008K1744k24560P6442J90109j59342
$$ -128343 -42887 145309 -19797 -137374 78634 100378 -124182 -47740 142369 -16973
191a6973j19314K09048K8463k18547O5265J87039j44346j22058J93344L7718k06234
$$ -16973 -136287 72761 101224 -117323 -52058 134981 -9365 -131423 61921 99639 -106595
202a06595N1672J81923j28566j26315J81159N0045k01991L4997J87299j11947
$$ -106595 -54923 127000 -1566 -127881 53278 103323 -98668 -63671 123628 11681
212A1681j40940J73448O5878k01541K1799J91580j05891j45257J70659P0256k00433
$$ 11681 -129259 44189 110067 -91474 -69675 121905 16014 -129243 41416 111672 -88761
223h8761J7813J91283j00326j45906J62762P2531j89317R680J81184q7139j40719
$$ -88761 -70948 120335 20009 -125897 36865 109396 -79921 -70241 110943 23804 -116915
234a16915J45464P6771j75906j451J74398p1649j43070J30802Q7259j67205j5414
$$ -116915 28549 105320 -70586 -72037 102361 30712 -112358 18444 105703 -61502 -76916
245g6916J72697o0155j45653J23140R1815j63657j9849J71469n5149j46499J18889
$$ -76916 95781 35626 -110027 13113 104928 -58729 -78578 92891 37742 -108757 10132
256A0132R3440j57743k5205J66166m7018j44275J09317R4201j48426l0041J60548
$$ 10132 103572 -54171 -79376 86790 39772 -104503 4814 99015 -49411 -79452 81096
267H1096l8347j43057R8861J00024j41386l9576J58000k8357j44684Q9834J05503
$$ 81096 42749 -100308 -1447 98577 -42809 -82385 75615 47258 -97426 -7592 97911
278I7911j34680m6371J53826k1244j42815Q2969J06202j27842m9330J47504j4260
$$ 97911 -36769 -83140 70686 49442 -93373 -10404 95798 -32044 -81374 66130 51870
289E1870j38949P3102J05452j16219n4915J38498m387j35505O2194J08364j08566
$$ 51870 -87079 -13977 91475 -24744 -79659 58839 54452 -81053 -18859 89505 -19061
300a9061o0799J33793L450j34997N5320J10829j02420o6566J31404Q496j34827
$$ -19061 -79860 53933 57383 -77614 -22294 88535 -13885 -80451 50953 59449 -75378
311g5378N0991J12065r9582o8109J28677J1429j32056M5676J10480r2673o9774
$$ -75378 -24387 87678 -11904 -80013 48664 60093 -71963 -26287 84193 -8480 -78254
322g8254J20576J7867j26780L5624J10618q2344p5517J14282K6511j25476K6837
$$ -78254 42322 60189 -66591 -30967 79651 -2693 -78210 36072 62583 -62893 -36056
333c6056J13494p5599q0878J10550L2520j24198K1668J14510p2501q1641J07478
$$ -36056 77438 1839 -79039 31511 64031 -60167 -38499 76011 3510 -78131 29347
344B9347L3288j20838K0290J10707o8049p9322J01098L4528j14301J4952J05829
$$ 29347 62635 -58203 -37913 72794 4745 -74577 26521 61049 -53252 -38300 67529
355F7529n9374p9504R2268M0156j08973O502J06202n1249q4556Q7755M6705j07599
$$ 67529 8155 -71349 20919 61075 -47898 -41396 64806 13557 -70999 16756 63461 -44138
367d4138j196J09097m6700q8506Q5785N1034j07656l797J08554m3512q8716Q2055
$$ -44138 -45334 63763 17063 -71443 14342 65376 -42280 -46077 62477 18965 -69751 12304
379A2304N2369j03801o708J05030l8506q6344P4746N2927r6063j1756R9964l0509
$$ 12304 64673 -39128 -45836 59194 20688 -65656 9090 62017 -34046 -45802 54162 23653
391B3653q6266O7255N6990r1101j7880R8101k4448q7364O1973O0454q8489k1490
$$ 23653 -62613 4642 61632 -29469 -47349 50752 26304 -61060 913 61367 -27122 -48612
403d8612R6948k0703q7425N8277O1798q5389k3914R4753j7300q6388N4596O1786
$$ -48612 48336 27633 -59792 -1515 60283 -25106 -49020 45733 28433 -57955 -3359 58427
415E8427q0558k7345R1597j2308q5728M9119O4582p7048l1154Q9995p501q6748
$$ 58427 -22131 -49476 42121 29813 -55915 -6796 57786 -19262 -50416 39579 32078 -54670
427e4670M5313O6723p4384l3751Q8589n148q5306M2124O6352p0490l4645Q4215
$$ -54670 -9357 57366 -17018 -50769 37820 32672 -52634 -10510 55842 -14648 -49293 34922
439C4922j690q2390L6917O5880o4557l7191P9442L084p9875L1183O6280n9538
$$ 34922 33232 -49158 -12241 53639 -10918 -48109 31333 34417 -45458 -14275 52005 -7533
451g533m0224P6221P834p9727K6514O8483n6321m3680P5357J0491p9735K4742
$$ -7533 -47757 28464 36298 -43429 -16915 51568 -4753 -48433 26924 37415 -42320 -17578
463a7578O8448n4756m4127P3848J1221p7796K2812O6748n1302m3978O9389J3821
$$ -17578 50870 -3886 -48013 25835 37056 -40740 -17928 48820 -2482 -46460 22929 36750
475C6750p4587J8471O5493m5914m5947O5148J7916p2669J2921O6950m1430m9083
$$ 36750 -37837 -19366 46127 213 -45734 19414 37330 -35339 -22418 44532 3102 -45981
487d5981O2612K1791p2070R679O7618l9552n0019O1685K2157p0503Q471O6097
$$ -45981 16631 38422 -33648 -23969 43649 4097 -45922 15763 37920 -32583 -24112 41985
499D1985l7553m8791N8447K2210o6414O152O3264l3419m7983N3281K4950o3237
$$ 41985 4432 -44359 14088 36298 -30116 -23964 39300 5881 -42102 11179 36129 -27108
511b7108J994O2024k8014n0169N0033K8579o2182j734O3221k5593n2399M8251
$$ -27108 -25114 36910 8896 -41273 8760 37339 -24843 -26577 36644 11051 -41348 6903
523F903L1359o1819l682O3483k4569n2205M6887L1634o0340m800O1428k1892n1265
$$ 6903 38262 -23557 -27239 36244 11675 -40530 6357 37991 -22349 -27149 34279 12387 -38878
536c8878M4003L2006n6833p487N8925j8114m9764L8297L4269n3713j1215N7745
$$ -38878 5125 37131 -19702 -27189 31736 13622 -36142 2155 36424 -17289 -28504 29241
548B9241j3632n1666L6413L5733n1963j2474N6627j1814n1054L3405L5956m9677
$$ 29241 15609 -36057 356 36089 -15874 -28348 28279 16465 -34589 -1184 34772 -14905
560a4905j4986N6809r981n1133L1995L6360m6932j6628N4668p369n0966K9099
$$ -14905 -29891 26918 16937 -34196 -2201 34159 -12773 -29401 25267 17898 -33068 -3969
572c969L8085m5718j8109N3926n149n1654K7686L9453m5026j9840N3884m180n1437
$$ -3969 34116 -11602 -29711 24215 19066 -32588 -4902 34551 -10475 -30315 23569 19389 -32048
585c2048K6475L9272m3283k0446N2054k386n0148K3901L9123l9845k1727M8655
$$ -32048 -5573 33699 -9584 -30030 22024 19638 -30510 -6609 32514 -7331 -29058 19597
597A9597R25m8325J9407M0094l6741k3998M6936L942m8513J6862M1412l4984k6066
$$ 19597 20522 -27803 -8396 31698 -5043 -29041 17895 21837 -26676 -9814 31598 -3386 -29452
610b9452M6283O100m9209J5669M1932l3693k7425M5965O676m8415J4408M1773
$$ -29452 16831 22931 -26278 -10609 31323 -2370 -29795 16170 22846 -25569 -11161 30612
622C0612l2259k7231M3622P903m6623J2111M0954k9741k7924M1151J0428m5074
$$ 30612 -1647 -28878 14744 22647 -23976 -11865 29089 -652 -28576 12575 23003 -22071
634b2071Q394M2021k6591l0863M0035J3210m5744O630M2490k4930l1927L8837
$$ -22071 -13677 28344 1753 -29110 10925 24135 -21609 -14979 27511 2581 -29346 9491
646I491J4946m5422N268M2479k3415l1997L7069J5793m3612L587M1149k1187l1480
$$ 9491 24437 -20985 -15717 26762 3347 -28650 8419 24212 -19400 -15813 25336 4149 -27331
659b7331L4375J6944m1239M84M0975j8261l2774L2030J9093m0257j727M1198j5958
$$ -27331 7044 23988 -17251 -16767 24208 5947 -26827 5203 24296 -15961 -17688 23510 7552
672G552l4466L1015K1226m0396l481M2032j4953l5008K9854K2138l9710m622M1104
$$ 7552 -26914 4101 25327 -15069 -18550 23482 8529 -26479 3375 25513 -14197 -18819 22285
685B2285j3060l5208K8344K2718l7467o532L9870j0454l5183K5337K4239l5910
$$ 22285 9225 -25983 2361 25079 -12388 -18920 20950 10496 -24687 650 24889 -11021
697a1021q527L9026p999l5421K3076K5719l4387j0516L8436o225l5846K1970K5867
$$ -11021 -19548 19478 11479 -23942 -866 24853 -9534 -20050 18386 12161 -23685 -1715 24152
710B4152l2702j1652L7643m587l5534J9482K6779l0716j3494L6238j910l5909
$$ 24152 -8550 -20202 17441 12854 -22680 -3198 23581 -7135 -20629 15609 13699 -22210
722b2210J7491K8023k9018j5726L6119L21l6477J5466K9626k8448j7088L5629
$$ -22210 -4719 23304 -5714 -21440 14679 15000 -21477 -6011 23615 -4833 -21921 13708
734A3708J834l6151J4005K9869k7247j7809L4757K561l5053J2242K9264k4292
$$ 13708 15542 -20609 -6604 23265 -3982 -21791 12966 15527 -19526 -7284 21980 -2312
746b312j8531L2031M669l3458R510K8995k1922j9190K9468P219l2865P188K9859
$$ -2312 -20843 11188 15857 -17601 -8091 20904 -1018 -20208 9260 16479 -16386 -9198 20661
759B0661j9906k1322K8907Q816l2769N292L0736j8763k2442K8780R477l2367M665
$$ 20661 755 -20567 8340 17156 -15613 -10321 20415 1652 -20790 7990 17467 -14900 -10235
772a0235K9962j7484k2151K6966J0128l0828K990K8994j5084k2612K4750J1763
$$ -10235 19727 2243 -19908 7058 17186 -13642 -10652 18342 3258 -19354 5396 17159
784A7159k9653P97K9034j2986k3434K2634J3853k8483j911K9345j0770k4482K1359
$$ 17159 -12494 -11697 17337 4351 -19083 3551 17404 -11079 -12990 16355 5585 -18897 2462
797B462J5096k7826k881K8652r601k4030J9752J5377k6178l771K7257p659k3511
$$ 2462 17558 -10268 -13149 15503 5902 -18128 1624 17001 -9177 -12948 14309 6650 -16861
810a6861J7183J5862k3814n585K6132n575k3412J5368J7004k2821p169K5923m079
$$ -16861 322 16184 -7630 -13215 12917 7342 -16070 -702 16302 -6519 -13688 12235 8156
823H156k3625J3826J8008k1654q353K5136k792k3564J2666J8249k0586r080K4430
$$ 8156 -15469 -1643 16365 -5289 -13642 11494 8702 -14862 -2196 16053 -4533 -13613 10817
836A0817j439k3436J1424J7999j8654j0212K2788K97k2652R230J8720j7054j1327
$$ 10817 9378 -14058 -2634 15365 -3289 -13501 9287 9584 -13068 -3838 14882 -2172 -13499
849a3499K1817J717k2382P547J8935j5486j2137K0543L370k1950O322J8759j4233
$$ -13499 8318 10035 -12347 -4800 14135 -1351 -13488 7055 10425 -11525 -5203 13556 -677
862f77j2297J8982M172k0416M542J8222j2352j2799J7437N245j9356K630J8542
$$ -677 -12974 6008 10180 -10236 -5694 12528 176 -12623 4814 10059 -9297 -6667 11875
875A1875j0642j3590J6110O698j8956J373J8228q981j4425J5592P281j8664J191
$$ 11875 1233 -12357 3753 10451 -8505 -7132 11096 2115 -12310 3282 10563 -8101 -6910
888f910J7835q626j4164J4592P399j7342M2J7124p326j3408J2454Q137j5645j492
$$ -6910 10925 2299 -11865 2727 10126 -7216 -7174 9950 2624 -10784 1670 9807 -5838 -7330
902g330J5991n206j3429J0666Q961j4192k982J5208l456j3650R120R840j3141
$$ -7330 8661 3455 -9974 692 9653 -4539 -7521 7687 4231 -9419 -299 9541 -3600
915c600m548J5244k333j3977Q572J0247j2654m745J4394j546j3357P237R827j1384
$$ -3600 -8148 7096 4763 -9214 -642 9605 -3049 -7794 6600 5054 -8303 -1066 8761 -2623
929b623m663J3140j263j2083N926R898r962n799J2349K20j2042M445J0231q629
$$ -2623 -7286 5854 4591 -7492 -1566 8332 -1630 -7429 4920 5140 -6902 -2457 7774 -855
943h55o416J1343J410j1650L160J0359p376p161J0354K658j1606K697R906o458
$$ -855 -7271 4072 5482 -6168 -3008 7351 -25 -7186 3168 5826 -5780 -3083 6823 365
957C65p302R548K736j0431J533R704n237p390Q021M016r508J50R355m132p497
$$ 365 -6937 2611 5347 -5084 -3551 6153 916 -6474 1547 5563 -3945 -3795 5560 1428 -6069
972f069P002M778q789j209R438l426p457O155M923q216j280Q877k488p467N244
$$ -6069 933 5711 -3078 -4287 5151 1725 -5732 423 5346 -2870 -4150 4727 2239 -5228 16
987A6N300p587j933Q113j153p582M239N741o426k977P343K5p426L351N857n713
$$ 16 5316 -2271 -4204 3909 2756 -4826 -587 5154 -1272 -4249 3094 3119 -4307 -956 4901 -812
1003h12l563P007O76p189K257O227m831m300O678J311o844J331O335l704m743
$$ -812 -4375 2632 3308 -3881 -1624 4603 -228 -4528 2150 3461 -3383 -2052 4283 579 -4164
1018d164N716J656o022N97N738k845m861M945K992o102l74O236k170n140M057
$$ -4164 1552 3208 -2814 -2217 3521 676 -4185 760 3752 -2350 -2724 3512 1342 -3798 259
1033B59L643n634j516O400j341n600L656L843n162j767N948n48n670K827M656
$$ 259 3902 -1732 -3248 3152 1811 -3789 -133 3710 -1452 -3219 2729 2181 -3489 -662 3994
1048C994m848k561N363L78n459K076M545l925k899M899J073n553Q58N424k945
$$ 3994 -854 -3415 1948 2326 -3133 -1057 3488 -437 -3336 1563 2636 -2917 -2059 3365 420
1063D20m110M746K204n679M2N677k455m273M029L137n838m90N878k157m821L866
$$ 420 -3690 1056 3260 -2419 -2377 3300 845 -3428 601 3738 -2100 -2590 3288 1131 -3690 176
1079A76L461m999j502N760j148n390L211M160m733k405N808Pn986K840M876m649
$$ 176 3637 -1362 -2864 2896 1748 -3642 -431 3729 -1004 -3409 2399 2406 -3580 -740 4136 -513
1095e13l291O064N58o198K023N557m179m230O049J380o491J213O307l945m436
$$ -513 -3804 2260 2818 -3380 -1357 4200 21 -4209 1840 3220 -3271 -2058 4249 304 -4132
1110d132N648K158o396L98O395l247n286N368L066o555m50O808k470o133N335
$$ -4132 1516 3674 -2722 -2324 4071 824 -4462 906 3972 -2583 -3033 3775 1305 -4828 507
1125E07L799o775r65P382k142o622M917M402o385j916P627j645o936M557N121
$$ 507 4306 -2469 -3434 3948 1806 -4816 101 4503 -1882 -3798 3829 2184 -4752 -195 4926
1140D926o679k372P835j239p444M248N795o462l469Q117L2q171L716O451o369
$$ 4926 -1753 -4125 3710 2471 -4973 -725 5070 -1392 -4861 3256 3288 -4883 -1167 5284 -1085
1155a085m063Q210N37q343L146P074o084m880Q194J383q613K318P759n835m840
$$ -1085 -5148 3062 3599 -4744 -1598 5476 -608 -5488 2706 4089 -4524 -2206 5553 -282 -5122
1170e122P776J839q755J633Q217n139o003P836K404r048J265Q611m719o731P651
$$ -5122 2654 4493 -4262 -2629 5588 449 -5554 2282 4686 -4362 -3097 5514 795 -5936 1715
1185A715L791r869Q05R387m446p734Q121M039r753Q9R535m208p877P912M325r813
$$ 1715 5506 -4363 -3558 5829 1383 -6351 1770 5809 -3944 -3855 5680 1472 -6405 1507 5832 -3981
1201c981j73R843l847q146P104N405r638j338J0289l006q910O701O082r251k524
$$ -3981 -4154 5689 1842 -6304 800 6205 -3433 -4771 5518 2512 -6398 303 6385 -2866 -5390
1216e390J0457k009r678O044P382r538l180J0893j678r795N830P402r254l687
$$ -5390 5067 3058 -6620 -576 6806 -2732 -5912 4981 3303 -6492 -662 6740 -2514 -6201
1230f201J1006q39j0832N791Q035r030m141J0884n46j0643N145Q343q726m890
$$ -6201 4805 3966 -6866 -1075 6960 -2070 -6211 4673 4127 -6516 -1371 6972 -1754 -6644
1244f644J1134K25j1163M682R045q378n576J0902Q58j1340L768J0102q218o454
$$ -6644 4490 4715 -6448 -1766 7279 -1099 -6675 4227 5085 -6255 -2487 7615 -603 -7057
1258g057J1176J370j1782L606J0245p776o679J0127K398j1258K297J0594p031
$$ -7057 4119 5489 -6293 -2687 7558 -218 -6897 3230 5628 -5630 -3333 7261 230
1271B30p427J0123L385j1828J670J1090o538q548J0384M026j1980J463J1284o481
$$ 230 -7197 2926 6311 -5517 -3847 7243 705 -7843 2541 6567 -5413 -3950 7334 853
1285H53q370R777M384j2115R87J1563n624r226R749M915j1872L52J1385m754r686
$$ 853 -7517 2260 6644 -5471 -4484 7079 1455 -7771 1978 6893 -4979 -4627 6758 2004 -7682
1300g682R096N660j1504j105J2549m695j0181Q751O659j1980j468J2481l841j0919
$$ -7682 1414 7074 -4430 -5535 7014 2319 -7862 889 7548 -4432 -5900 6581 2740 -8179
1314h179R054O793j1796j689J2275l586j0740Q339P175j1319k325J2337k652j1203
$$ -8179 875 7668 -4128 -5817 6458 2872 -7868 471 7646 -3673 -5998 6339 3687 -7516
1328g516P294Q197j0996l258J2047j641j1618O750Q825j0550m322J2820j491j2280
$$ -7516 -222 7975 -3021 -6279 5768 4127 -7491 -741 8084 -2466 -6788 6032 4541 -7739
1342g739O704R455j0915m724J2890r12j2592O692R485j0850m586J2612n94j2273
$$ -7739 -1035 8420 -2495 -7219 5671 4759 -7833 -1141 8344 -2506 -7092 5520 4926 -7347
1356g347N783R646r953n567J2189K95j2318N291R722q796o569J2003J178j2561
$$ -7347 -1564 8082 -1871 -7438 4751 5046 -7272 -1981 7741 -1055 -7624 4379 5557 -7004
1370g004M296J0968r163p133J2250J787j2933L711J1293q646p630J1832K495j2685
$$ -7004 -2708 8260 -903 -8036 4214 6001 -6932 -3221 8072 -574 -8204 3628 6123 -6562
1384f562L072J1622q293p901J1609K821j2914K827J1757p978q335J1693L464j3031
$$ -6562 -3490 8132 -161 -8062 3547 6368 -6546 -3719 8038 60 -8275 3418 6882 -6149
1398f149J895J2207p450q601J1418L900j3118J659J2336p040r294J0918M600j2894
$$ -6149 -4254 7953 503 -8098 3320 7220 -5898 -4239 8097 1057 -8237 2681 7281 -5613
1412e613J045J2249o249r790J0410N468j2624K72J2502n696j0110R862O026j2652
$$ -5613 -4568 7681 1432 -8358 2052 7520 -5104 -4832 7670 1974 -8136 1726 7752 -4900
1426d900m64J2907n555j0541R955O375j2589j157J3338m742j1262R792O832j2720
$$ -4900 -5364 7543 1988 -8553 1402 7777 -4812 -5969 7369 2627 -8635 1157 7989 -4731
1440d731j421J3172m604j0825R172P032j2002j869J3042l972j1474Q843P709j1956
$$ -4731 -6152 7020 2416 -8409 763 7795 -4207 -6076 6966 2994 -8480 363 8072 -3884
1454c884k687J3423l211j2212Q470Q457j1815l719J4053k746j2765Q044R028j1717
$$ -3884 -6571 6852 3641 -8571 -101 8356 -3459 -7178 6875 4129 -8636 -592 8436 -3281
1468c281l929J3808k314j2399P485R353j1721m011J3349j861j2517O984R553j0957
$$ -3281 -7210 6598 4284 -8115 -630 8723 -2998 -7009 6340 4479 -8038 -1054 8499 -2458
1482b458m923J3150p86j2710O083J0365j0811n512J3269J6j3474N628J1105j0759
$$ -2458 -7381 5769 4983 -7727 -1644 8721 -2090 -7602 5667 5683 -7791 -2163 8942 -1817
1496a817o255J3467M63j3942N978J1165j0713o158J3200L90j3596N194J1386j0005
$$ -1817 -8072 5395 5858 -8084 -2106 9059 -1654 -7812 5388 5778 -7818 -2624 8762 -1243
1510a243p083J3063J254j3721M609J1758r310p833J2747K290j4012L721J2577
$$ -1243 -8326 4737 5991 -7730 -3121 8637 -673 -8506 4241 6531 -7481 -3760 8817
1523H817r180q241J2386K964j4075L384J2497q408r069J2588L042j3625L160J2427
$$ 8817 -363 -8604 3782 6746 -7329 -3945 8552 144 -8925 3663 6705 -6920 -3760 8667
1537H667q305r256J2413L904j3835K058J2968q046r408J1941M229j3614J315J3210
$$ 8667 362 -8894 3519 7423 -6412 -4354 8614 568 -8840 3101 7330 -6284 -4969 8241
1551H241o993r971J2101M686j4592J647J3042p029j0430J2340N116j4062J18J4156
$$ 8241 1248 -8723 3378 8064 -6528 -4881 8161 1132 -9298 3042 8158 -5904 -5786 8370
1565H370o594j0392J0767N838j3860k83J3594m924j1297J0390N821j2397q53J3910
$$ 8370 1776 -8616 2151 7989 -5871 -6154 7440 2516 -8781 1609 7430 -4967 -5820 8090
1579H090m898j2329J0267O923j2970j333J4057n104j2175J0308P458j3066j146
$$ 8090 3192 -9137 1130 8053 -4917 -6250 7807 2703 -9472 836 8294 -4772 -5918
1592e918J3749n046j1915R529Q264j3114k435J4137l668j2596R176Q865j2836
$$ -5918 7831 2785 -9130 399 8663 -4451 -6886 7251 3583 -9013 163 9028 -3808
1605c808l505J4282k902j2928Q577R584j2768m168J4421k108j3704Q112J0303
$$ -3808 -7313 6969 4067 -8861 -284 9300 -3468 -7636 6785 4677 -9027 -915 9388
1618I388j2671m673J4633j579j3918P712J0545j2027n203J3980q24j3616O519
$$ 9388 -3283 -7956 6677 5098 -8820 -1108 9437 -2590 -7793 6187 5363 -8253 -1734
1631a734J0889j1309o015J3929J50j3993N944J1504j1181o462J3826P21j4553
$$ -1734 9155 -2154 -8169 5760 5910 -8083 -2139 9365 -1816 -8278 5548 6269 -8284
1644h284N883J2200j1207p169J4304O98j4798N551J2151j0826p132J3963J219
$$ -8284 -2401 9799 -1408 -8577 5727 6425 -8373 -2822 9329 -1497 -8629 5334 6553
1657F553j4629N180J1984j0150p659J3374K055j4433M373J2448r658q375J3085
$$ 6553 -8076 -2896 9088 -1062 -8721 4653 6708 -7725 -3352 9096 -562 -8937 4148
1670D148K988j4493L374J3132r121r341J2949L748j4592K610J3355q308r878J2963
$$ 4148 7136 -7357 -3983 9149 28 -9313 3636 7384 -7208 -4598 8757 449 -9429 3534
1684C534L925j4404K297J3592q062j0289J2374M759j4208J564J3686p381j0595
$$ 3534 7459 -6945 -4648 8944 882 -9407 2967 7726 -6482 -4918 8768 1387 -9208
1697i208J2098N176j4297R74J4239p200j1232J1942N790j4453N26J4502p016j1071
$$ -9208 2890 8066 -6231 -5257 8982 1782 -9450 2492 8282 -6171 -5645 8857 1841 -9230
1711i230J1731N882j4365K51J4173o208j1538J0936O642j3417q13J3944n136j1773
$$ -9230 2501 8383 -5982 -5731 8442 2234 -9304 1632 8274 -5143 -5956 7988 2852 -8921
1725h921R985P941j3842j836J4501m257j2963R895Q716j3829k489J4916l738j3428
$$ -8921 1064 9005 -4837 -6673 7828 3571 -9392 503 9219 -4610 -7099 7817 4079 -9349
1739i349R826Q651j3648k778J4798l654j2922R230Q748j2940l689J4773l030j3354
$$ -9349 477 9128 -4520 -7298 7500 3846 -9076 154 8902 -4038 -7727 7046 4016 -9338
1753i338R037R234j2621l999J4429k183j3098P356J0417j2192n157J4580j078
$$ -9338 -301 8933 -3688 -7687 6742 4559 -8539 -1183 9234 -2958 -8115 6465 5387
1766E387j4506P542J1216j2347n571J4559p74j4145O962J1055j1750n837J4132
$$ 5387 -9119 -1577 9639 -2708 -8279 6280 5506 -8639 -1677 9378 -2372 -8209 5923
1779E923k72j4015O343J1385j1236o646J4068N59j4009N440J1976j1059o943J3798
$$ 5923 5651 -8364 -2021 9364 -1872 -8518 5550 6109 -7900 -2460 9516 -1543 -8486 5312
1793E312J189j4489N115J2247j0494p677J3640J964j4591M372J2791j0009q246
$$ 5312 6501 -7988 -2873 9374 -1120 -8797 4843 6807 -7784 -3412 9379 -630 -8876
1806h876J3424K312j4299L678J2890r554q196J2689L051j4517L089J3380r030
$$ -8876 4548 6860 -7439 -3761 9129 -425 -8621 4068 7119 -7398 -4309 9071 41
1819D1r118J2753L745j4486K203J3905q429r855J2564M484j4722J849J3766p819
$$ 41 -9077 3676 7421 -7065 -4862 9043 614 -9241 3323 7807 -6915 -5066 8700 881
1833H81j0090J2264M801j4327J357J3454o851j0673J1943N191j3745J65J3967
$$ 881 -9209 3055 7856 -6471 -5114 8340 1489 -9184 2759 7950 -5795 -5630 8337
1846H337o494j1308J1478O412j3868n22J4511n915j2003J1177O740j3910p17J4372
$$ 8337 1843 -9465 2013 8425 -5443 -5965 8546 2631 -9372 1805 8545 -5365 -6082 8290
1860H290n833j1917J1011P236j3766j364J4422m951j2099J0036P718j3280j955
$$ 8290 2457 -9460 1551 8787 -4979 -6343 8079 3128 -8971 1065 8783 -4497 -6452
1873f452J3945l944j2214R012Q477j2765l090J4192k817j3356Q897R364j2977
$$ -6452 7493 3549 -8665 347 8824 -3941 -7031 7161 4344 -9012 -115 9249 -3728
1886c728l847J4475k475j3355Q544R693j3045l962J4532k258j3290P583J0118
$$ -3728 -7575 6900 4425 -8930 -386 9307 -3738 -7700 6832 4574 -8716 -1133 8985
1899H985j2017m511J3630j803j2563P037J0065j1584n345J4179r23j3313O285
$$ 8985 -3032 -7543 6087 4284 -8279 -1242 8823 -2761 -8106 6073 5150 -8163 -1878
1912a878J0650j0848o191J3628K91j3763N798J1484j1015o421J3768O33j3951
$$ -1878 8772 -2076 -8267 5361 5652 -8111 -2313 9171 -1844 -8265 5503 6136 -7815
1925g815N203J1553j0317o852J3131J396j3739M448J1906r510p971J3048K229
$$ -7815 -2612 8941 -1376 -8228 4903 6299 -7440 -2992 8914 -596 -8567 4481 6710
1938F710j3599L501J2084q702q685J2749K928j3860L028J2541q516r148J2648
$$ 6710 -6889 -3388 8696 -6 -8691 4058 6986 -6874 -3846 8695 179 -8969 3679
1951C679L512j4017K697J2782q120r128J2035M001j3817J880J3098p662r617J1498
$$ 3679 7191 -6826 -4129 8653 533 -8595 3440 7441 -6376 -4496 8602 940 -8677 2821
1965B821M600j3509J256J2922o622j0440J1141N686j3441n0J3472n799j1139J0898
$$ 2821 7421 -6088 -4832 8090 1468 -8972 2169 7855 -5586 -5636 7836 2037 -9102 1796
1979A796O157j3612k40J3589n723j0719J0323O461j2908j090J3373m876j1177
$$ 1796 7953 -5659 -5899 7690 1967 -8752 1571 8032 -4876 -5966 7407 2531 -8646
1992h646R541P175j2697j663J3365m193j1390R076P469j2247k232J3379l320j2007
$$ -8646 895 8070 -4627 -6290 7075 2882 -8508 568 8037 -4210 -6442 6937 3617 -8390
2006h390Q360Q609j2425k945J3631l073j2304Q766Q108j1850l108J3423k997j1864
$$ -8390 -30 8579 -3846 -6791 6840 3767 -8537 229 8337 -3513 -6621 6802 3805 -8059
2020h059P931Q178j1145l660J2919j951j1884O890Q963j0957m460J2881p23j2653
$$ -8059 -128 8050 -3095 -6755 6164 4213 -7671 -781 8182 -2775 -7235 5646 4923 -7730
2034g730O417R722j0568n202J2825l59j2810O164J0014j0598n362J3019l65j2908
$$ -7730 -1313 8409 -2159 -7361 5464 5105 -7705 -1541 8473 -2125 -7487 5532 5167 -7741
2048g741O077R981j0251n677J2642K60j2541M952J0298r382o184J2140Q59j2381
$$ -7741 -1664 8317 -1934 -7611 5031 5291 -7250 -2298 8000 -1382 -7566 4574 5433 -6948
2062f948M415J0530q964o837J1939J670j2636L950J0750q388p823J2387K043j2703
$$ -6948 -2533 7997 -967 -7804 4135 5805 -6831 -2881 7869 -519 -8342 4045 6088 -6615
2076f615L442J1012p921p986J1391L063j2726L072J0884p311q031J0838L423j2417
$$ -6615 -3173 7839 -82 -8068 3323 6386 -6340 -3268 7616 305 -7726 3112 6535 -5882
2090e882J956J1520o706q455J0594L959j2482J431J1537o662q383R948M232j1981
$$ -5882 -3926 7594 888 -7567 3027 6986 -5496 -4065 7472 810 -7573 2375 6607 -5374
2104e374J052J1713o359q597R972M407j2174N97J1881n694q715Q741N321j1480
$$ -5374 -4322 7391 1032 -7565 2407 6814 -5360 -4763 7118 1424 -7291 1450 6771 -4709
2118d709l17J1952m929r700Q705O136j1615q43J1983m116j0606Q933O444j1526
$$ -4709 -5026 6926 1997 -7703 1002 7138 -4477 -5320 6663 2547 -8059 874 7318 -4208
2132d208j514J2216l789j0119P907O915j1066k168J1653k852j0433P623P087j0382
$$ -4208 -5722 6494 2705 -7414 493 7408 -3658 -5826 5827 2975 -7458 165 7252 -3130
2146c130k800J1578k124j0567O861P505r862l543J1535j599j0914O325Q108j0041
$$ -3130 -5930 5648 3524 -7043 -182 7323 -2539 -6082 5453 3854 -7060 -735 7373 -2668
2160b668l817J2019j101j1590O283Q604j0099m121J1702j007j1045N556Q776r307
$$ -2668 -6485 5534 4433 -7157 -874 7730 -2369 -6490 5212 4205 -6840 -1284 7492 -1815
2174a815m602J1373k62j1080M747R120q751n285J0877P93j1337L658R470p762
$$ -1815 -6417 4956 4694 -6386 -1639 7481 -1270 -6555 4322 5115 -6222 -2564 6906 -856
2188h56o131J0824J769j1521L067J0311p711o979J0764K237j1829L225J0096p353
$$ -856 -6987 3837 5606 -5915 -2848 7463 -248 -7227 3537 5774 -6055 -2830 7266 -87
2202h7p050J0454K169j1016K405R914o693o947R720K779j0745J552J0217n998
$$ -87 -7137 3317 5486 -5530 -3125 6789 96 -6851 2869 5648 -5097 -3545 6672 674
2216F74p691R407L667j1266J446J0791o055p884Q956M258j1171O36J0777n480
$$ 674 -7017 2390 6057 -5209 -3763 7028 973 -6911 2045 6303 -4868 -4232 6545 1065
2230A065p960Q598M586j0631n3J0741m384q789Q351M952j0365r98J0901l698r154
$$ 1065 -6895 1703 6289 -4342 -4395 6346 1962 -6827 1524 6476 -3889 -4887 6014 2316 -6838
2245f838P624N656r926j438J0898l218r595P390O134r972j826J0716k828r467
$$ -6838 786 6442 -3484 -4922 5976 2758 -6837 553 6687 -3285 -5111 5605 2777 -6690
2259f690O900O272r661k006J0545k429r360O437O675r366l001J0690j574r815
$$ -6690 210 6482 -3179 -5185 5360 2931 -6429 8 6683 -2683 -5684 5006 3432 -6383
2273f383N720P541r399l129J0435q43j0531N481Q106q915m093J0661p85j0131
$$ -6383 -663 6878 -2521 -5650 4785 3942 -6589 -1108 6998 -1917 -6010 4651 3866 -6265
2287f265N123P753q431m273J0296l22r909M686P760p607m993R965P80j0056L454
$$ -6265 -1142 6611 -1820 -6093 4203 3881 -6028 -1342 6418 -1189 -6182 3783 4563 -5493 -2039
2302b039Q563p410n330R821J199j0172L208Q674p324n279R626J158j0145L159
$$ -2039 6524 -886 -6216 3605 4804 -5368 -2160 6514 -810 -6089 3537 4695 -5450 -2291
2316b291Q968p165n999R405J700j0084L020Q983o794n771Q866K029r601K154Q797
$$ -2291 6677 -488 -6487 2918 4618 -5466 -2446 6537 -257 -6028 2838 4867 -4734 -2580 6217
2331F217n880o409Q523L011r730J052R235n087o937Q257L032r622O10R690m698
$$ 6217 337 -6072 2451 5462 -4268 -3216 6019 932 -6005 2252 5284 -4338 -3728 5962 1264
2346A264p502P937L825r436j56R696m405p839Q207M176r822J88R247m069p672
$$ 1264 -6238 1699 5524 -3912 -4068 5628 1223 -6616 1591 5767 -4055 -3867 5380 1311 -6361
2361f361P514M499r064j219R819l508p837O815N070r080j378J0008l966p447O823
$$ -6361 1153 5652 -3412 -4631 5188 1680 -6157 658 5728 -3352 -4730 5278 1312 -6135 688
2376F88N111r030j580J0004k872r195P051N749q289k230Q851j487q631N546O086
$$ 688 5799 -3231 -4811 5193 2321 -6874 177 5926 -2363 -4593 4258 2771 -5860 -314 5772
2391E772q015k588R396j496q985N552O454q332k707R452r54r320N175O571p621
$$ 5772 -2243 -4831 4565 3069 -5916 -364 6090 -2242 -4949 4503 3549 -5771 -596 5975 -1646
2406a646l409R260r01q962M880O953p934l395R111o20q796M195P234p323l763
$$ -1646 -5055 4205 3304 -5658 -778 6175 -1759 -5154 3957 3337 -5459 -1264 5970 -1353 -5116
2421e116Q569J61q747L383P561o708m634Q885N69r195L273P709o559m687Q648
$$ -5116 3453 3614 -5133 -1750 5811 -897 -5531 3354 3923 -5272 -1999 5710 -849 -5536 3112
2436C112R77r126L030P751o090n343Q594J300q988K502P740n499n496P845K062
$$ 3112 4089 -5037 -2007 5744 -346 -5689 2905 4205 -4783 -2281 5459 -40 -5536 2309 4371
2451D371q949K113Q008n112o145P778K699q747J133Q182m842o218P521K993r028
$$ 4371 -4578 -2465 5543 431 -5714 2064 4763 -3984 -2851 5331 489 -5729 1792 4785 -4243
2466d243R28Q632m630o351P620L070q763M69Q556m335o533P239L436q782J51Q407
$$ -4243 -3315 5317 687 -5664 1956 5026 -3737 -3268 5288 953 -5580 1659 5095 -3687 -3536 4871
2482D871l437o905O431M311q340l72Q414l294p052O159M592q105j236Q619k594
$$ 4871 1434 -5471 960 5271 -3069 -3441 4973 1679 -5373 786 5378 -2727 -3963 4656 2062
2497B062p711O126N040q246j507Q782k521p456N672N101p938j551Q419j937p708
$$ 2062 -5649 477 5517 -2729 -4236 4546 2025 -5431 241 5342 -2596 -4147 4272 2335 -5373
2512e373N223N324p590j863Q356j825p397M826N856p639k572Q462j058q107M983
$$ -5373 -150 5174 -2416 -4279 4077 2252 -5145 -319 5537 -2102 -4674 3788 2730 -5377 -394
2527c94N818p454k527Q638j209q010M344O193o990k814P999m74p741L675O338
$$ -394 5424 -2030 -4557 4081 2872 -5138 -794 5399 -1591 -4405 3594 3120 -4621 -946 5392
2542E392o745l295P974J11q098L254O787o316l866Q078L38q175L152P009o228
$$ 5392 -1353 -4648 3326 3437 -4661 -1407 5380 -936 -4802 3276 3614 -4561 -1409 5600 -628
2557f28m233P801Q99q279K720O961n694m190P341J056q196K696O815n592m563
$$ -628 -4861 2940 3839 -4440 -1720 5241 -453 -4643 2698 3754 -4442 -1746 5069 -523 -5086
2572e086P754J213p704J536P157m945n045P057K055p558J129P565m847n454P198
$$ -5086 2668 3881 -3823 -2287 4870 -75 -5120 1937 3992 -3566 -2437 5128 281 -5173 2025
2587B025K266q265J449P501m517n760O997K487p829R45P148l946n599O694K869
$$ 2025 4291 -3974 -2525 4976 459 -5301 1696 4183 -3646 -2701 4447 501 -5098 1596 4465
2602D465p833N05P376l490n822N818L432p669p4P558k843o510N943L633p430l32
$$ 4465 -3368 -2863 4513 1023 -4799 1019 4451 -3218 -3292 4266 1423 -5087 856 4489 -2941 -3273
2618c273P551k882o612N950L663p053o69P662k854o227N347L970p166r99P561
$$ -3273 4278 1396 -5216 734 4397 -2656 -3325 4337 1483 -4744 603 4573 -2593 -3592 3969
2633C969k204o608N142M084o588j453P275j532o446M491M612o659j994P601j345
$$ 3969 1765 -4843 299 4383 -2205 -3658 3617 2085 -4361 130 4742 -1917 -3911 3690 2345
2648B345p049M292N124o545k130P395j032o748L865N102n848k793P216p42o970
$$ 2345 -4704 -412 4712 -1833 -3963 3432 2400 -4348 -483 4619 -1229 -4022 3194 2452 -4518
2663d518L714N341n786l039P273k39p155L285N573n505l022P066k36p173L229
$$ -4518 -804 4537 -1249 -4288 2985 2746 -4409 -1124 4449 -1056 -4078 2988 2752 -4421 -1192
2678a192N575n414l130P032p8o815K683N918n276l484O508P36o896K371N740m659
$$ -1192 4383 -1031 -4161 2871 2793 -4022 -1339 4579 -697 -4181 2327 3063 -3833 -1462 4278 -381
2694c81l749O323J128p035K059N910m089m520O483J331p196K226N830m411m285
$$ -381 -4130 2193 3321 -3714 -1655 4255 166 -4354 2129 3460 -3736 -1510 4320 -91 -4376
2709d376O591J183o319J315O220n044l840O110J762o327P37O026l733m594N666
$$ -4376 2215 3398 -2921 -1606 4614 -430 -4270 1840 3602 -2725 -1988 4038 305 -4289 1377
2724A377K260o702O33O525l518n030N863K365o747L64O452l043n125N233K906
$$ 1377 3637 -3065 -2432 4093 575 -4455 1408 3773 -2974 -2610 3842 799 -4326 907 3813
2739C813o279m36O660k608n563N315L191o814J09O404k607n389N015K905o026
$$ 3813 -2466 -2902 3758 1150 -4413 902 4093 -2721 -2612 3792 1185 -4204 811 3716 -2310
2754b310m53O225k072n404M203L665n857j231O703j593n920M230L633n707j398
$$ -2310 -2763 3462 1390 -4014 189 3854 -2003 -3234 3469 1876 -4044 186 3819 -1888 -3286
2769c286O535j531n737L860M169n609j772O592j159n982M007M006n539j724O220
$$ -3286 3249 1718 -4019 -159 4010 -1599 -3371 3221 2062 -3920 87 4093 -1446 -3170 3050
2784C050p73o256L580M404n186k194O159o35n787L140M392n028k427O274l41o049
$$ 3050 2277 -3979 -399 4005 -1181 -3375 2784 2149 -3638 -498 3894 -1134 -3561 2713 2372 -3677
2800c677K968M723m940k702O012Q1o044K506N079m827k628N737M10o188K225N040
$$ -3677 -709 4014 -926 -3628 2384 2465 -3579 -1073 4006 -821 -3449 2288 2698 -3490 -1265 3775
2816C775m383l075N703P59o022K007M960m132l299N723R99o207J575N545l912
$$ 3775 -608 -3683 2020 2779 -3243 -1236 3724 -408 -3707 2016 3015 -3192 -1617 3928 16
2831A6l908N431J295n669J323N448l738m127N204J718n946R38N712l521l836N127
$$ 16 -3892 1539 2834 -2835 -1512 3936 198 -3929 1275 2993 -2953 -2015 3697 176 -3660 1467
2847A467J821n783N82N448l030m241M705K177n685L36N809k831m516M654K585
$$ 1467 3288 -2495 -1913 3535 505 -3736 969 3146 -2539 -2203 3606 775 -3741 913 3498
2862C498n750k46N890k415m690M690K314n451k29N820k569m353M224K793n329
$$ 3498 -2252 -2498 3392 977 -3713 977 3291 -2160 -2389 3431 862 -3491 733 3526 -1803
2877a803p14N556j871m648L843K845n142p14N378j414m963L855L343n047j491
$$ -1803 -2517 3039 1168 -3480 363 3208 -1934 -2648 2730 1316 -3647 208 3551 -1496 -2987
2892b987N898j435m928L470L548n323r99N816j380n171L417L694n027j496N523
$$ -2987 2911 1476 -3452 18 3566 -1757 -2756 3060 1680 -3491 -74 3620 -1407 -2903 2620
2907B620r03m956K972L848m709k055N445k78n182K659M004m357k236N574q6n475
$$ 2620 1717 -3239 -267 3581 -1128 -3183 2262 1984 -3198 -539 3465 -892 -3128 2446 2360 -3115
2923c115K424M428m365k580N423k56m689J979M334m293k102M607M59n135J910
$$ -3115 -691 3737 -628 -3208 2215 1959 -2730 -751 3583 -710 -2812 1795 2254 -2881 -971
2938i71M437l813k747M857O78n341J584M952l891k809M993N15n237J308M832l466
$$ -971 3466 -347 -3094 1763 2441 -2900 -1316 3636 -255 -3064 1929 2444 -2793 -1485 3347 -119
2954a19l171M633J554n532J289M489l174l226M450J378m888N41M910k816l466
$$ -119 -3290 1343 2897 -2635 -1346 3143 -31 -3257 1193 2571 -2317 -1776 3134 318 -3148
2969c148L953J641m489L29M719k490l850M052K162n008N1N040k353l852L941K406
$$ -3148 805 2446 -2043 -1714 3005 515 -3335 717 2879 -2129 -2078 2962 609 -3243 698 3104
2985C104n116P4M879k603l546L834K237m747k24M814j774m071L633K399m416o03
$$ 3104 -2012 -1938 2941 338 -3208 626 2863 -1884 -2108 2706 932 -3139 494 2893 -1523 -2126
3001b126M749j578m289L442K844m688o93N035j368m554L212L262m699r79M935
$$ -2126 2623 1045 -3244 198 3042 -1646 -2339 2696 1328 -3226 -14 3248 -1451 -2430 2505
3016B505j379m110K782L379m289j238M766j043m076K518L291m006j430M422m48
$$ 2505 1126 -2984 -202 3177 -1112 -2350 2416 1373 -2703 -185 3106 -900 -2330 2092 1644
3031A644m541K721L140l994j802M890m64m335K012L689l858k039M931l81m471
$$ 1644 -2897 -176 2964 -1030 -2832 2058 1594 -2741 -729 2960 -898 -2937 1994 1613 -2858
3046b858K161L423l291k051M396k1m392J698L919l426k148M123L99m264J291L847
$$ -2858 -697 2726 -565 -2616 1780 1759 -2633 -935 2984 -442 -2590 1533 1932 -2332 -1041 2806
3062B806l039k674L961J121m422J149L752k769k817M152J180m738Q66M026k583
$$ 2806 -233 -2907 1054 2175 -2247 -1098 2654 -115 -2932 1220 2400 -2338 -1472 2554 -29
3077b9k522L542J290m373R29L822k469k780L549J319m187O04L966k376k944L528
$$ -29 -2551 991 2281 -2092 -1163 2659 190 -2590 959 2278 -1909 -1305 2661 285 -2659 869
3093H69J570m292M3M603k294l207L435J529l951J0M323k152l000L008J891l741
$$ 869 2439 -1853 -1810 2793 499 -2708 727 2256 -1695 -1685 2638 486 -2514 494 2385 -1356
3109a356k67L721j568l241L143K019l744n03L922j191l411K693K368l855n56L826
$$ -1356 -1623 2098 530 -2711 432 2451 -1293 -1796 2126 935 -2476 217 2585 -1270 -1826 2000
3125B000j174l531K662K424l503p53M015j038l494K251K643l656p35L867q13l224
$$ 2000 826 -2705 -43 2381 -1122 -1875 2140 1102 -2392 -141 2502 -1154 -1889 1978 1165 -2059
3141b059J879K365l048j355M033n35l725K036K800l196j546L832k26l221J957
$$ -2059 -180 2185 -863 -2218 1815 1280 -2445 -409 2391 -805 -2351 1481 1255 -1966 -9
3156iK358k711j532L310l0l699J415L239k735j684L745J3l583J090L332k715j872
$$ -9 2349 -362 -1894 1416 1386 -2313 -898 2341 -394 -2078 1667 1680 -1903 -813 2519 -196 -2068
3173b068L271M27l411J158K986k444k023L248N28l460R25K928k037k154L168Q86
$$ -2068 1203 1630 -1781 -623 2363 -81 -2104 1144 1672 -1788 -863 2065 28 -2126 1042 1928
3189A928l568P89K836j994k075L027P84l158N49K917j771k485K978J093l087j4
$$ 1928 -1640 -851 1985 -9 -2084 943 1727 -1431 -882 2035 264 -2221 757 1850 -1237 -1251
3205a251L222j434k637K565J384l305K39K855j267k624K431J665l165Q8L144j322
$$ -1251 1971 537 -2100 465 1849 -1456 -1217 1638 371 -2253 178 1843 -1322 -1234 1910 588
3221E88k407K087J620l088j94L163j251k439K411J286k607j50K390l96k840J808
$$ 588 -1819 268 1888 -1200 -1394 1769 518 -1921 490 1776 -831 -981 1409 1013 -1827 -19
3237a9J585k430o27K746r40j489J611J624k653r32L346l46k964J784J407k406
$$ -19 1566 -864 -1491 1255 315 -1174 437 2061 -592 -1524 1822 1476 -1488 296 1703 -703
3253g03o72K715k84k831J610J884k221q94K805l20k719J270K218k419r04K654
$$ -703 -1375 1340 1056 -1775 -165 1719 -502 -1396 1409 1089 -1630 -360 1858 -561 -1465 1189
3269A189l30k149R27K004k224j029K337L59k700J380J692j892j227K443L61k692
$$ 1189 859 -1290 -363 1641 -583 -1612 725 1084 -1616 -236 1456 -436 -1663 780 1141 -1551
3285a551J109J990j845j320K314M40k484P89K129j747j355K287M50k440O87J860
$$ -1551 -442 1548 -297 -1617 697 1137 -1347 -558 1571 -176 -1531 756 1206 -1234 -547 1313
3301A313j403j269J861O75k202J53K321j466j503J977R49k456J06J994p80j695
$$ 1313 -90 -1359 502 1177 -1025 -872 1449 -17 -1520 457 1406 -1050 -944 1050 270 -1425
3317a425J910O57k145L74K013j253j441J652Q89k114r2K302j080j650J795Q34
$$ -1425 485 1142 -1003 -629 1384 131 -1310 342 1231 -883 -975 1327 247 -1403 392 1226
3333A226j908j83J941p44j815J600J073k041K47J593m15j959J600J084j843k17
$$ 1226 -682 -865 1076 332 -1483 117 1190 -851 -604 989 574 -1385 215 1299 -544 -761
3349g61J760m15j789J025J288j452n47J855k81j732Q99J462j733o88K004m59j525
$$ -761 999 584 -1205 -180 1108 -344 -891 964 683 -1049 -150 1312 -421 -1109 895 436 -1089
3366a089J065J210j563n87J565j5j656R71J251j287q06J802O3j924P90J658j110
$$ -1089 -24 1186 -377 -964 601 586 -1070 -99 1152 -135 -941 861 924 -1000 -210 1448 338
3383C38j444J906l25j190L78J287j182r21J603p6j015R0J497q61j096J329R95
$$ 338 -1106 800 475 -715 -337 950 -232 -1153 450 374 -641 -551 946 85 -1011 318 1313
3400A313k093N59Q75j299M33O95O4k101Q68J261p78q32R75O36j668N08J645n12
$$ 1313 -780 -221 654 -645 -212 483 547 -1554 -686 575 -203 -1035 -60 576 -1092 -584 1061 549
3418E49j590J235P72j228k17J533q70j067J124N78j243j29J249n73j083J146O39
$$ 549 -1041 194 966 -262 -479 1054 184 -883 241 819 -424 -553 696 123 -960 186 825
3435H25j366%J575o90j126R48P49j408j46J104q5j323J139N42j144j37J165m07
$$ 825 -541 -541 1034 344 -782 166 915 -493 -639 465 380 -943 196 738 -406 -543 622 215
3453B15j152J101L48j193K09J276n80q53J57J286j473L4Q74L15j425P82P70j085
$$ 215 -937 164 512 -681 -472 804 224 -629 -472 814 -659 -625 249 564 -861 -79 691 -394
3471c94QP79J18r16K81Q43q40m73J207p2j242L52J025j073k89J242l72n52L78
$$ -394 -386 393 511 -405 -124 719 -121 -594 613 541 -701 -349 676 -397 -686 556 184 -368 10
3490A0P27q56n26R76l0n98J81N60n91m87J064K8j357O10Q14n57l49Q72Q7j085
$$ 10 737 -119 -645 331 301 -297 -116 444 -147 -634 430 458 -899 -289 525 -32 -381 491 578 -507
3510e07j85J232m11o58O65L97o03nO19n17n73N55N04r45K38O78m71m96N71M68
$$ -507 -692 540 129 -529 136 533 -70 -75 544 27 -546 9 513 -432 -194 484 13 -483 88 556
3530E56r74K71O11l27p78P63L62o89r3O06k62o40P88Q7p07J42P61k83n00M59J51
$$ 556 -418 -147 464 137 -641 122 484 -205 -298 308 46 -594 194 281 -426 -284 477 194 -306 153 304
3551C04p72J99L75R2m43J25O89p47j09N68K13r72M75N59q43M6O69j01q17L58N33
$$ 304 -468 -269 106 198 -245 -120 569 -178 -287 281 494 -478 -3 556 -287 -241 428 327 -490 -132 401
3572D01p47j55O26R1o22K00N40k62n51R33j7p05r4P13k47m18M96J93o36q1O11
$$ 401 -346 -501 125 216 -406 -206 334 72 -479 454 437 -268 -362 351 104 -314 182 375 -261 -342 269
3593B69L9j059Q90K7j02q05R45L89n60J63J068p95n80J35j00o40P71P32j230L89
$$ 269 308 -751 139 166 64 -741 204 593 33 196 1264 469 -111 24 -76 -716 55 787 -443 -54
3613e4L87k82m54L89K54k93k13M82n5m46K31M65o18m9M50n2l61J51K37k25k51
$$ -54 333 51 -403 -14 240 -53 -266 216 161 -285 -54 411 -207 -256 194 142 -219 -68 169 -56 -307
3634c07P28r6o36K60M70o10j73M19N2k37k10N70k95k74N17J42p88J43N86k00l68
$$ -307 421 325 -311 -51 419 -191 -364 55 107 -130 -340 230 -65 -339 178 320 -468 -325 261 61 -307
3655c07L42L06m72j30N27k67k43K37L10n97K85J75P7q10N88M27n93j11O65q8p93
$$ -307 35 341 -131 -261 266 -1 -244 -7 303 -294 -9 166 243 -567 21 448 -145 -256 409 321 -472
3676d72M63L53m33k65O57k4p13M66K66k41m48N20J11n54K57L43n16k63P84n8n76
$$ -472 -9 344 -89 -354 303 279 -434 32 298 57 -391 129 240 -314 -57 286 -230 -493 291 233 -343
3697c43R5O83l76m13N61N5n50O4O07l69l55P14P8p59j03N92j62l41M51K88o82
$$ -343 -248 435 59 -354 207 262 -288 -224 383 14 -341 373 451 -308 -411 181 19 -322 129 417 -265
3718b65j20Q37l13m80M39K92q86J72P73k75p29Q33K05p17k74O52M4q56Q70L75
$$ -265 -385 452 139 -341 98 390 -496 -324 449 174 -555 278 483 -234 -508 144 188 -668 202 577
3738E77p89m1P72k71n76N53M19r82n5R29m73p79O21P86r73k01P49l08l82J5Q32
$$ 577 -212 -253 519 248 -328 225 644 -338 -393 536 63 -716 -95 691 -282 -483 266 -42 -424 -409 423
3759D23j029j60P72k8n44L04O36n21l26P04M19j585J310L23r92o26N49J51j059
$$ 423 -606 -766 6 -22 -566 -262 374 -147 -473 231 650 -935 375 698 -294 -920 -371 -220 -1279
3778a279N18J242n19j038K174m76j168K52M84m11m79J070J39j136M08R69l45j226
$$ -1279 -761 481 -38 -1076 1098 622 -546 -294 190 -221 -700 370 509 -627 -219 750 405 -821
3796h21J184M24j325J19J206q52r38J457k15o13L46O28n95r63J338K46j127M4
$$ -821 363 787 -538 -419 787 -65 -1003 454 239 -374 -28 600 5 -958 380 626 -501 -457
3814d57J141p16o90R44M18j154P9R09k90q26R89J07r33j06J253l25j410J268N21
$$ -457 684 -32 -722 222 640 -514 -435 474 184 -642 347 454 -479 -585 668 343 -1067 201 722
3833G22j042k70J291l82j144Q52O68j062j24J094l66j222J088Q22j381l43J720
$$ 722 -320 -590 701 319 -825 27 695 -367 -491 603 237 -985 103 925 -456 -799 921
3850I21l85j373Q19Q43j133m41J516m37j163O85R93r67m97J378k04j344P17Q31
$$ 921 536 -837 -18 825 -308 -749 767 330 -833 -148 845 -122 -619 759 555 -789 -72 759
3868G59j047n07J165L81j689N04J400j502k34J649n69j459N50J293o39r35J416
$$ 759 -288 -795 370 751 -938 -434 966 -536 -770 879 310 -1149 -599 694 55 -880 536
3885E36J88j454K53J449j004q95J356O1j253K46J405r16l46O70J90j447M06J136
$$ 536 724 -730 -477 972 -32 -927 429 490 -763 -517 888 -28 -374 296 486 -961 -555 581
3903E81m66j079J676J24j702M12J475o20j304J526q3m71l8M18o57p73Q86J554
$$ 581 115 -964 712 836 -866 -454 1021 401 -903 623 540 69 31 449 -208 -981 -95 1459
3921A459k252N90Q09K67j657M97J068j080o71J806J09k144J408R23j453n86J352
$$ 1459 -793 -203 606 873 -784 -287 781 -299 -970 836 945 -1199 209 1132 -321 -907 445
3938D45p43j133J395R48j096m32J160L04j897N57K073k001k72J419j034k79J190
$$ 445 -298 -1431 -36 912 -184 -616 544 848 -1049 -492 1581 -420 -692 727 -307 -586 604
3955F04K77j636k77J745p34j363J528R21j456m16J656m19j339R32J118j459p37
$$ 604 881 -755 -1032 713 -21 -1384 144 1065 -391 -807 849 430 -909 23 1141 -318 -1055
3972a055J976l23j712Q20J243j149n42J363j4j747Q64J573j507p80J848k72j792
$$ -1055 921 598 -1114 -294 949 -200 -742 621 607 -1140 -276 1297 -210 -990 858 586 -1206
3989a206J050J402j603n24J544J22j685M74J662j330j050J789J4j732O55J507
$$ -1206 -156 1246 -357 -881 663 785 -900 -426 1236 -94 -1144 645 659 -1073 -418 1089
4005A089j068j021J315N06j611J46J880j268j038J639L49k093O08J705j208j212
$$ 1089 21 -1000 315 821 -790 -644 1236 -32 -1070 569 918 -1175 -567 1138 -70 -1282
4021a282J794L27j828M31J625j129j219J702N57j768j5J965r91j362J414J095
$$ -1282 512 839 -989 -558 1067 -62 -1281 421 978 -790 -805 1160 169 -1193 221 1316
4037A316k002J6J932j066j258J440Q24k045L37J675q79j535J289J032j611k40
$$ 1316 -686 -670 1262 196 -1062 378 1202 -843 -506 1169 290 -1245 44 1076 -535 -775
4053g75J803p01j579J359Q01j593r6J706m55j678J326R42j592m38K207o25j856
$$ -775 1028 327 -1252 107 908 -685 -781 925 470 -1208 118 1060 -532 -970 1237 612 -1244
4070a244J325J369j780q52K163m64k009J407J457k056j90J891m75j606R43J335
$$ -1244 81 1450 -330 -1182 981 517 -1492 -85 1372 -684 -874 1017 542 -1064 -121 1214
4086A214j704m36J789k0k266J531R77j611o93J989j43j807J001J733j457j297
$$ 1214 -490 -926 863 843 -1423 108 1085 -526 -1219 770 627 -1180 -179 1554 97 -1200
4102a200J790K11k076Q81J751j839r29K070K88j965O80J721j286j061J633L18
$$ -1200 590 801 -1275 -394 1357 -482 -1411 659 947 -1018 -338 1383 97 -964 669 987
4118I87k301R20J588j470r84J973K63j875K94J721j292j016J689P43k345K30K187
$$ 987 -1314 -394 1194 -276 -1260 713 976 -899 -605 1116 -176 -1192 497 1240 -1105 -875 1312
4135A312j242j592J841O64k081L32K169j405j152J757O04k276L31K078j111j487
$$ 1312 70 -1522 319 983 -1098 -766 1403 -2 -1154 603 1207 -1069 -738 1340 229 -1258
4151a258J602R08k015n1K150q14j758J501P31j631j53K171j126j729J669J006
$$ -1258 344 1252 -763 -814 1336 522 -1236 265 996 -635 -788 1383 257 -1472 197 1203
4167A203j932n6K176j102j885J974O90j913j73K054n79j759J471J103j946k81
$$ 1203 -729 -785 1391 289 -1596 378 1068 -845 -1018 1036 457 -1302 169 1272 -674 -955
4183i55K019n43j733J171J278j908l82J846l2k610J666J822k264QJ816l98k478
$$ -955 1064 521 -1212 -41 1237 -671 -1053 793 761 -1849 -183 1639 -625 -617 1199 801 -1677
4200a677J516J235j526j133K151j54j956J354K049j767j231K085p12j486P02J858
$$ -1677 -161 1074 -452 -1585 566 412 -1544 -190 1859 92 -1139 946 234 -1252 -550 1308
4216A308k044q8K220q02j777J232J770k091j103K818o84k250J650J114j593j318
$$ 1308 -736 -824 1396 594 -1183 49 1819 -272 -1375 1443 759 -1491 159 1273 -320 -1638
4232a638K580m57j761P34J667j681r16K073L02j573q89K845j714j213J995L18
$$ -1638 942 485 -1276 -542 1125 -556 -1472 601 903 -670 -1559 1286 -428 -1641 354 672
4248F72k139M78J979o81k089K813K28k989M19K837k422l12J436J154l299J654
$$ 672 -1467 -989 990 309 -1780 1033 1261 -1728 -1309 1528 -894 -1206 230 1384 -1915 -261
4264b61J440j008j682L387n48k882R81K239j579j187J419Q25k540L71K232l52
$$ -261 1179 171 -1511 1876 1328 -1554 -573 1666 87 -1100 319 1144 -1396 -1025 1207 855
4280H55k089J620P47k805P66K102r22k158K391J432k895Q5K194j170j570J609
$$ 855 -1234 386 1133 -1672 -906 1196 274 -1884 507 1939 -956 -871 1323 153 -1417 192
4296A92J446k867K74K119q65j736J386J347k453K31K205j009j795J866J262k642
$$ 192 1638 -1229 -955 1164 299 -1437 -51 1296 -1157 -926 1279 270 -1525 341 1603 -1039
4312a039M57J718n03k304J833J054k216O0K259q49k055K026R46k062o62K546p18
$$ -1039 -582 1136 633 -1671 162 1216 -1000 -940 1319 470 -1585 441 1387 -675 -1337 1209 491
4329D91k113J637J133j505r71K614n03k024J035J994k140j213K395J78k262Q77
$$ 491 -1622 15 1148 -357 -1328 1286 783 -1241 -206 1788 -352 -1565 830 1008 -1254 -377
4345c77K394k393p43K591q49k222R46K403k420l68K118j76k379J392J206j714
$$ -377 2017 -376 -1119 1472 623 -1599 -653 1750 -670 -1038 1080 904 -1475 -83 1123 -591
4361e91n74J978L55k258N44J598j525m60J845M01k165N37J291j484o22K205L0
$$ -591 -1165 813 1168 -1090 -546 1052 -473 -933 912 1313 -852 -315 976 -508 -1130 1075 1105
4378A105k427J310J565j958q78K487J0k403O76K205j638j865L121L67l411J312
$$ 1105 -1322 -12 1553 -405 -1283 1204 1214 -1189 -513 1692 54 -1811 1310 1677 -1734 -422
4394d22K456k523l63J732K16k183Q15J831j384k055K902P78l110J62J966j067
$$ -422 2034 -489 -852 880 1096 -1087 -272 1559 175 -1880 1022 1800 -1310 -1148 818 -249
4410b49j599K226N60k223M75K172j179k307K114J539k975Q38K012j494j183K046
$$ -249 -1848 378 938 -1285 -810 1362 183 -2124 -10 1529 -1446 -608 1404 -90 -1273 773
4426G73O62k547m14K827j343j056J397J162k377K16K210n70k007J093J684j898
$$ 773 1435 -1112 -1526 1301 -42 -1098 299 1461 -916 -700 1510 940 -1067 26 1710 -188
4442a88m9J046k73k184K211Q67k807J038J829r88k031J072J298j767r4K002l57
$$ -188 -237 809 536 -1648 563 1430 -1377 -339 1490 502 -1529 -457 841 -926 -1020 982 625
4459F25j724J054K007k944o6K210r61k061J676J638k292n77K707o03j869J186
$$ 625 -1099 -45 1962 -982 -1048 1162 201 -1860 -184 1454 -838 -1415 1292 689 -1180 6
4475FJ654k352m78K068l37k062J441J519k009p75K499n33k046J005J817j952q20
$$ 6 1660 -692 -1170 898 561 -1501 -60 1459 -550 -1325 1174 641 -1405 -400 1417 -535 -1355
4492a355K680l51k348J204J814j988j003K280n6k412J295J841j813j099K243k23
$$ -1355 1325 974 -1374 -170 1644 -344 -1347 933 877 -1535 -240 1601 -212 -1311 932 709
4508G09j979J018K025j970j363K152M21k492J007K070j762j341K311K55k554R78
$$ 709 -1270 -252 1773 -197 -1560 592 1013 -1479 -472 1598 -164 -1505 806 1061 -1493 -515
4524e15K009j719j410K577J82k296N91K144j766j097J805O52k417P42K196j721
$$ -515 1494 -225 -1635 942 1124 -1172 -581 1563 -203 -1300 505 1157 -1260 -518 1678 -43
4540d3j325J859O13k379M37K182j328j371J724Q99k453L40K369j324j556J846
$$ -43 -1368 491 1104 -1275 -838 1344 16 -1355 369 1268 -1185 -845 1524 200 -1356 490
4556D90J015k429O5K314j065j685J646J161k757L92K404j367j596J885P93k276
$$ 490 1505 -924 -859 1455 390 -1295 351 1512 -1245 -853 1551 184 -1412 473 1266 -1010
4572a010K75K124j173k001K092J037k211J41K059j036j747J793J041k173m71K384
$$ -1010 -735 1389 216 -1785 307 1344 -867 -726 1333 297 -1450 343 1384 -789 -1260 1124
4588A124n94j779J498J300k164n35K436o41k028J534J148j758n90K113j25k668
$$ 1124 530 -1249 249 1549 -615 -1150 1286 645 -1383 151 1299 -459 -1049 1064 939 -1729
4604a729J512J783k091n57K293m23k218J348J479j776r59K419k83k139J431J334
$$ -1729 -217 1566 -525 -1082 1211 788 -1430 -82 1397 -379 -1338 1081 798 -1341 90 1424
4620A424j836n68J868q6k229J134J771j933o96K156k35k095J120J793k076o78
$$ 1424 -412 -980 888 802 -1427 -293 1478 -455 -1151 1005 770 -1325 -205 1588 -488 -1166
4636a166J868K03k220P90J931k010p17J902K61k208Q07J710j216j104J893K91
$$ -1166 702 905 -1315 -525 1406 -604 -1321 581 842 -1366 -559 1151 -65 -1169 724 1015
4652A015k086O90J502j258j046J968J25k168O40J748j188j084J780N60k591Q29
$$ 1015 -1071 -381 1121 -137 -1183 785 910 -1258 -618 1130 -58 -1142 638 1198 -1393 -564
4668e64J849j342j169J771P18k099P2K030j127j453J957L61k031K24K041r90j474
$$ -564 1285 -57 -1226 545 1263 -836 -764 1266 139 -1314 643 1004 -1027 -803 1238 248 -1226
4685a226J803P30k380K67J987j145j408J736Q87k140n1K095o95j888J760Q15j834
$$ -1226 577 1307 -1073 -806 1181 36 -1372 364 1251 -889 -940 1155 460 -1428 332 1147 -687
4702f87k74K299r80j585J588O70j630k45J958q79j422J358R68j803k39J888n36
$$ -687 -961 1338 358 -1227 361 1031 -599 -844 1114 235 -1187 171 1139 -664 -903 985 449
4719D49j614J164J243j849m7J585n47j573J154J155j653l01J898n51j644J091
$$ 449 -1165 -1 1242 -607 -654 931 384 -1189 -35 1120 -533 -834 1064 513 -1131 -40
4735d0J030j325o03J721k79j418R63R76j531m67J960o23j717J406J427j828o42
$$ -40 990 -335 -938 783 504 -914 49 1025 -506 -973 987 364 -1353 53 1480 -348 -990
4752i90J709J25j950Q93J282j355o71J470K82j743Q04J046j220r39J944J94j872
$$ -990 719 844 -1106 -213 1069 -286 -957 513 795 -948 -144 902 -318 -1257 687 881 -991
4769i91Q92J271j408p72J601J96j847P38J421j205p58J538Lj604M27J837j730
$$ -991 -99 1172 -236 -1008 593 789 -1058 -320 1101 -104 -862 676 679 -925 -498 1339 -391
4786c91p34J841J09j777P19J313q20j354J658M07j850M15J413q66j276J368N60
$$ -391 -1125 716 825 -952 -233 1080 260 -1094 564 971 -879 -464 949 83 -1193 175 735
4803G35j500K74J660j032j088J446L54j749L54J780j046j084J331L07j324j9J321
$$ 735 -765 -491 1169 137 -951 495 849 -900 -546 1234 188 -896 435 742 -582 -601 720
4820G20p67q28J241N90j704J02J540o92j170R44R81j496Q3J298q39q60J131O88
$$ 720 -47 -875 366 956 -748 -646 894 202 -968 -24 957 -539 -456 842 3 -857 274 962
4838I62j632J64J332o66j268J069Q81j529K05J387o43j277J054N95j276j4J579
$$ 962 -670 -506 826 160 -1108 -39 842 -687 -482 905 262 -1015 39 634 -642 -656 923
4855I23o60j260J091P75j381l52J832n74j553J200R25j287m49J555k91j421Q36
$$ 923 263 -997 94 869 -512 -864 968 394 -1159 41 966 -321 -770 785 494 -927 -91
4872i1Q82j251j75J490m24j303R65R70j409m33J397l99j169J052O64j238j16J055
$$ -91 791 -460 -635 855 431 -872 93 1063 -346 -779 618 219 -950 102 766 -472 -588 467
4890D67o7j324P32R88q46o92J432j50j242N34J137j175m94J136K35j360M79R70
$$ 467 400 -924 -192 796 -50 -742 690 540 -702 -168 969 -206 -700 436 671 -689 -210 760
4908G60j113j41R14J36j418O66J092j189m81J387K8j358M06R96q62p17J044M85
$$ 760 -353 -494 420 556 -862 -196 896 -293 -774 613 641 -717 -311 685 -177 -894 150 635
4926F35j243L28J028o39j009J145K16j047M46J122r42p95J285K2j227L58J118
$$ 635 -608 -280 748 109 -900 245 461 -586 -140 982 40 -755 530 552 -675 -317 801
4943H01q76q31J311L88j595M72J135r08o42J074K37j428M31J164q74p50J315K67
$$ 801 -75 -906 405 793 -802 -330 805 -103 -745 329 566 -862 -431 733 -141 -891 424 691
4961F91j237l2J117m44r72J198K47j075R0J129m30j063Q91O30j175j02J041l43
$$ 691 -546 -578 539 95 -877 321 568 -507 -417 712 282 -781 110 740 -435 -537 504 161
4979A61p39R23o6n53m04J319l16q09N70M95j023n9R75l27r92Q94O48j028n27J687
$$ 161 -578 345 279 -274 -678 641 325 -484 86 581 -442 -501 474 147 -845 49 697 -331 -858 829
4999H29m51j097Q70O50j035k33Q96k10r72Q00M04n90j79J017k65j216Q05O45j010
$$ 829 378 -719 151 801 -234 -467 429 219 -753 47 451 -139 -318 699 434 -782 23 668 -342
5018c42j89J147l00j153Q96P03j090j95R68l09r42J026M62r66m03J336p2j199
$$ -342 -531 616 316 -837 59 762 -328 -523 445 136 -806 220 682 -284 -687 649 577 -622
5036f22O62N39q28k73Q47o2q84O96P31r65l11J096m1j362P00Q23r85l74R46K20
$$ -622 40 579 -249 -522 325 263 -621 75 806 -159 -470 626 585 -777 -77 746 -239 -613 333 553
5056E53j148L27R97q08m65J165j20j184K90Q22n86l28R30o5r26L79R49q65p26
$$ 553 -595 -268 729 -79 -544 621 501 -683 -393 429 -157 -485 445 380 -546 -167 782 -83 -809
5075h09J122J98j104N62Q25q98l29R08n0r00R8J144o99o64J063P6p60p3O19n05
$$ -809 313 511 -593 -31 794 -104 -433 475 425 -475 -377 767 68 -596 467 543 -217 -290 329 -176
5095a76o44J170J49q83R6R98o31j011J030M31j092K01P85m16o95J181j60r49L29
$$ -176 -820 350 499 -384 -288 710 79 -932 98 529 -563 -362 423 7 -688 493 333 -616 -287
5114b87R99o27o29R57j28r68L30J137o77p65R24J99q87J5J004o64o80J003M22
$$ -287 712 85 -544 413 285 -683 -353 784 107 -658 266 465 -422 -407 597 -67 -747 256 678
5133F78j114K42M57m53n70Q89N27j026j71R08j85q45R09L01j018O6R97l22p92
$$ 678 -436 -194 263 -190 -760 129 656 -370 -541 367 182 -663 246 547 -471 -405 592 270 -522
5152e22P23L29r02j85J128m95p16P27N09r57J14P90k69p95N65K58n84j83J021
$$ -522 201 530 -372 -557 571 76 -640 87 596 -361 -247 543 274 -521 44 302 -282 -465 556
5171E56l48n05L16O98q92k83J012j91j005O29N57p79j91Q58j64p96M66L94o63
$$ 556 208 -297 19 717 -175 -458 554 363 -642 -13 544 -235 -426 432 268 -528 -62 332 -331
5190c31j96J079l9q80J39N05n47j64P58p3o93L12P11r24m06J203k02r00O08L83
$$ -331 -527 552 513 -367 -228 277 -270 -434 324 251 -442 -130 581 -343 -749 454 252 -648 -40 343
5210C43p69P2O65P0p32K69M02k94n23Q39Q6r17L09N88n69n12O42N98p52j51R17
$$ 343 -426 -354 311 381 -351 -82 320 26 -497 342 428 -489 -180 408 -161 -673 -31 567 -185 -336 581
5231E81m94M6j24O11q60J19M52n40k95N25K68n41K63M59n80L20p0J66m34M3J70
$$ 581 87 133 9 620 -240 -121 331 -209 -504 21 289 -252 11 470 -110 210 140 306 -128 -85 85
5252H5J13J86J12K22m28r99J280r96k02J027m18m25N28P71r44j46J24L75n44N5
$$ 85 198 384 496 718 290 -709 571 -425 -627 400 -18 -443 85 856 -88 -234 -110 265 -279 -224
5272b24K52M12p48K33L41o87L3Q34j38m48K30L14m36R6J38m8o68N71L71q58J55
$$ -224 28 440 -308 -75 266 -421 -388 446 308 -140 90 404 -32 64 202 154 -514 57 428 -430 -275
5293b75P00l98j70J69J60l91k40R07k72m90M70Q0m47j55P99n56jL59M3n09O0L54
$$ -275 425 27 -143 26 186 -205 -445 462 190 -300 170 250 -197 -352 447 -109 -110 249 292 -217 -157 197
5315A97%m92L23k58O1K11M0K62o38R8M47k09k30O44m26m81O79J25m66P1Q5K87
$$ 197 197 -295 28 -230 -169 42 82 344 -294 -196 251 42 -188 456 30 -451 228 353 -113 -42 43 330
5337C30p47M62M12j97K23j85m53r3J81O52n80j69M55k54k36K83K94o07j80J57
$$ 330 -417 45 457 260 483 298 -155 -248 -67 585 5 -164 291 37 -199 84 378 -229 -409 -252
5357b52j70j09j68R09n83Q59r7j13q24O53P33j093m57J648o26m38J58L68p2p46
$$ -252 -422 -531 -699 210 -373 486 389 276 -548 105 838 -255 -712 936 310 -128 30 398 326 -420
5377d20O13o9j74J42L74j01j30k91L14k89J17K13l65m41O48j36l31J065m71l49
$$ -420 193 124 -50 92 466 365 235 -56 258 -31 86 299 -66 -507 141 5 -326 739 268 -81
5397h1j17J58K1j12J82j32l7RK93k31j76J85K09k00o2K79l99K09P5J05k83MK94
$$ -81 -198 -40 -19 -131 51 -81 -118 -109 184 -47 -223 -38 171 -29 -91 188 -211 -2 73 178 -105 -101 193
5420A93Nl28K26l2q9J03J13j91l30M13rr8P8J63l21RK73k30j89K74L46m86m4J82
$$ 193 198 -130 96 64 -25 78 191 0 -330 83 74 -24 54 217 -104 -95 178 -52 -241 33 379 -107 -151 31
5444C1K5l32K97K31k03j70m5K47l93M41M6m08J41K87l03k00M31L2l62N7L84k09
$$ 31 56 -276 21 252 49 -121 -166 81 -312 129 175 -233 -92 195 -108 -308 123 155 -207 -150 234 25
5466B5o0kK8k60Q6K54j71j43K17L39l68q5K08Jj60J26K16k66l24N13J01n96K05
$$ 25 -35 -37 -9 -269 -183 71 -100 -243 -26 313 -55 -140 68 69 -91 35 251 -15 -339 174 275 -321 -116
5489a16K58l27QL89j99l76K17N31n72l8K95n2j24l7K54r6l89N45J85p22M28J35
$$ -116 142 -185 -177 212 13 -363 -146 385 -187 -225 70 18 -106 -143 111 15 -374 171 356 -366 62 197
5511A97k28j89M21Q0p06K83L53j79l56L19L68p64J49O44m14l60L94J55n06K47
$$ 197 -31 -220 201 281 -425 -142 211 32 -324 -5 363 -401 -252 392 -22 -382 12 167 -339 -92
5531i2M44m70m42O59Q7n90L56M41n33j27O61p6o47J80O50j80q76P75Q5p32L68
$$ -92 352 -118 -560 99 186 -404 -48 393 -140 -267 394 318 -329 -149 501 321 -555 220 305 -427 -59
5552e9L86o06j07P23J43r62M16K66j00n54M52L47m89J72L48l27m22N90J3p64L03
$$ -59 327 -279 -386 337 480 -482 -66 200 100 -454 -2 345 -144 28 376 49 -373 217 230 -534 -231
5573b31O75m30l85O03J85p06j28R66m07m51M39K91r08J84Q67n05m48L88L22q46
$$ -231 444 14 -371 232 417 -289 -417 549 142 -309 130 421 -487 -303 564 59 -389 -1 321 -525
5593e25K88N79j91n46M19O00r29K0Q29l58n70M76L26r41K1J025n00n98O75M89
$$ -525 -237 342 151 -395 24 624 -305 -285 544 186 -384 92 418 -523 -502 523 23 -575 100 589
5613E89q60p3Q06k50p86N28N78n96k06Q10l71p87Q40M94p73r0N76r8p20M34N86
$$ 589 -271 -344 462 212 -574 -46 532 -64 -270 540 169 -618 222 716 -57 -147 429 331 -389 45 631
5634F31r58J58O94o3q70M04N77q25j3P48j93p18K63O26n93m21Q64j51o25J76P64
$$ 631 -327 -169 525 462 -408 -4 573 -252 -265 483 290 -428 -165 461 -132 -553 311 160 -465 -289 475
5655D75n64l46P79j00p80O09M83p06l66J006j36q69M29Q21q12n68J140r3j041
$$ 475 -89 -435 344 244 -536 73 556 -150 -516 490 354 -515 -86 735 -77 -645 495 402 -639
5674f39N57Q40p88o04R57k3o57R5P63l53r76J089L38q79M9N27k33o04P30J43p26
$$ -639 -82 758 -30 -634 323 300 -357 -262 501 148 -828 261 599 -280 -231 296 63 -541 189 332 -394
5695c94KJ052p11o68R33J65p46j23J209p65l01N52K57j078L00R95m93p65Q06m
$$ -394 -392 660 -51 -719 214 379 -367 -490 719 -46 -347 205 462 -616 -316 679 186 -579 227 223
5715B23p37K96R50m94q25J095o4q16m6Q11k08q32O98M70j095J74J004m15p64O45
$$ 223 -514 -218 732 238 -587 508 444 -372 -418 393 185 -647 51 521 -574 -400 604 189 -575 70
5735G0N95j057l39J474p40n92P17M40q33k76J262k94j085O12P77r85l37J169k95
$$ 70 665 -392 -731 743 3 -589 128 568 -265 -541 721 427 -658 -46 731 -254 -591 578 283
5754B83r82P67Q19j279j60J108j68j042M66O04n93l00J022j46j257Q80P65r00
$$ 283 -699 68 887 -392 -552 556 388 -654 -188 416 -177 -477 545 399 -858 22 787 -113
5772a13m16R87j52r56R21O76j098l13Q70j00q34N24O32q37k70Q26N8j010L80J176
$$ -113 -529 458 306 -650 271 947 -151 -464 406 306 -528 -4 628 -209 -479 347 405 -605 -225 951
5792I51j085m71R76n1p54l1J276o83j035J154M6p03Q4J062r13l76Q19N0q92K24
$$ 951 -134 -605 371 320 -434 -465 811 128 -907 247 293 -410 -326 736 -177 -553 266 316 -576 -352
5812c52J065o83o64R91K97j252K83R21o68l95O63K27r24K48P40o62m06R29K53
$$ -352 713 30 -634 357 654 -598 -315 606 -62 -457 206 433 -491 -243 497 -165 -571 358 611
5831F11j224M11R97q87o57J004L66j108nJ321p60n82M96N13j057K28J073q05n66
$$ 611 -613 -202 795 -92 -749 255 621 -487 -492 829 69 -513 -17 496 -561 -333 740 -65 -631
5850f31O70O99j338l7J456n02r69Q79M62q64k88P57o2q48P93N12j043j19R47l6
$$ -631 39 738 -600 -637 819 317 -652 227 689 -175 -463 294 232 -616 177 689 -354 -473 474 438
5870D38j112O36P60j052l32J110l59j034J091N33p61o20J107l20o89N61P04j197
$$ 438 -674 -38 722 -330 -662 448 89 -945 146 679 -82 -702 405 85 -604 -43 661 -536
5888e36O1J045l47r29Q34O59j087k63R97p6q03N30N81q02m21J238k85j032M47
$$ -536 -475 570 223 -706 128 787 -300 -563 434 358 -445 85 666 -136 -557 681 396 -636 -189
5907a89R67j008o78J149K62j209O24J031j059l25J015l44q31P36N50r12m80J257
$$ -189 778 -230 -908 241 503 -706 -82 949 -110 -435 580 236 -595 141 691 -221 -701 556
5925E56k8j089M38R18q97o67J283M7j397N23J135q56o99J272j05j116L07J276
$$ 556 528 -561 -123 795 -102 -769 514 561 -836 -313 822 -34 -733 539 434 -682 -375 901
5943I01q90p73J244L8j113L60R55o86o60R32O9r70L44J054q07q15J120K96j196
$$ 901 11 -762 482 520 -593 -233 722 36 -624 308 377 -593 -249 805 -2 -817 303 599 -597
5962e97L60J018r52n20P75M94j138J99Q81o64o89J052L96j099J05J156p05p07
$$ -597 -237 781 -171 -691 84 578 -560 -361 520 -144 -833 219 615 -484 -379 777 72 -635
5980f35Q31K24j149L11R42n56p60J041L61j063P9J030l67q31P54M85j289J00R63
$$ -635 196 420 -729 -418 524 -32 -792 249 610 -453 -374 656 289 -542 212 697 -592 -492 471
5999D71l07q12R88M40j406M6J288o22r05J149M91j211%J077n95q81J178L28j135
$$ 471 164 -648 340 780 -626 -580 708 86 -819 330 821 -390 -390 687 92 -789 389 717 -418
6018d18o4Q92l35o85O38N12r15J09Q36l84r15O77N91p27k13R21k12j087J001O90
$$ -418 -482 410 75 -610 28 540 -375 -266 570 186 -729 -52 539 -188 -401 520 308 -779 222 912
6038I12j354m4R57j31j083M23R72q61n69J383l26r09M32P88p70l81J138P7j369
$$ 912 -442 -486 471 340 -743 -320 652 -209 -778 605 279 -630 -198 590 -180 -561 577 654 -715
6057g15P49O00r68l08J075K89j241L56J022q02q01J221k46p50L37R18q05m01J067
$$ -715 34 634 -334 -642 433 722 -519 -163 859 57 -744 477 231 -519 -182 736 -69 -470 597
6076E97j01j224L57J165j028l45J044j17j250O18J246j022n64J013K64j263L56
$$ 597 496 -728 -371 794 -234 -579 465 348 -902 -284 962 -60 -624 389 653 -610 -254
6093b54R97n77j053J311o2r31q9J486q65n56R56L15j279L10J036n86j048J236
$$ -254 743 166 -887 424 362 -569 -658 828 -37 -593 363 678 -601 -291 745 159 -889 347
6111C47Q8p94K50N22l03p69J003K25j220Q7J276o35p14R68L39j199J25R87o67
$$ 347 435 -359 -109 413 110 -659 344 569 -651 -564 712 77 -637 331 670 -529 -404 583 -84
6130h4q27J125M01j078k62J468o99q87J208M13j385L68J155o80q66P83M96j012
$$ -84 -911 214 615 -463 -725 743 44 -843 365 778 -607 -239 916 236 -630 153 649 -363
6148c63j69J365o96p64Q42L37q78q7J043n28q09R44M29j010l22J364n7j396J042
$$ -363 -532 833 137 -627 215 552 -326 -413 630 102 -707 237 666 -344 -666 698 641 -755 287
6167B87M82j281K5J175m34j107Q96R51j279m66J290j98j122Q73P71j467K01J061
$$ 287 769 -512 -487 688 254 -853 43 994 -285 -751 539 341 -781 92 863 -604 -403 658
6185F58m21j121N96Q40r37k90J339l13j250J018O49q28q64J662l06j155M21J176
$$ 658 237 -884 -288 552 -385 -675 664 351 -899 119 768 -60 -924 738 432 -723 -302 874
6203H74j152l91J083n8r51M73J156j384k86J118Rj212N14J041j008l04R88O5j246
$$ 874 -278 -669 414 356 -595 -122 1034 -350 -636 482 491 -721 -207 834 -174 -478 510 575 -671
6222f71L23J219r92o46J096J79j170K60J363j127n45J169J65j202J24J281r61
$$ -671 -348 871 -121 -767 329 508 -662 -402 961 -166 -711 458 623 -579 -455 826 -135
6239a35o25J210K4j271K79J470j078p00J125J30r17J7J165n49j098J216M01j366
$$ -135 -760 450 474 -797 -518 952 -126 -826 299 429 -488 -471 694 145 -953 263 664 -702
6257g02J55J365m34j149J238L3j178J9J626r11q32J055P37j475K8J116l35j280
$$ -702 -547 818 384 -765 473 506 -672 -653 973 62 -770 285 1022 -453 -425 691 356 -924
6275i24J142M05j304P0J267o75r52J340L95j273J1J254n05j098R25P32j213j97
$$ -924 218 623 -681 -611 656 -19 -971 369 764 -509 -498 756 251 -847 78 810 -403 -600
6293f00J306m27r98R93N98j608J45J476n04j090O21R94j405J51J283n66j198O98
$$ -600 706 279 -719 274 872 -736 -591 885 381 -709 -88 906 -499 -348 935 369 -829 -131
6311a31J009j546j94J462k24j112N36Q08p60n33J306m11j124R21P63j121m22J457
$$ -131 878 -668 -862 600 376 -736 -200 608 -152 -685 621 210 -914 7 770 -351 -773 684
6329F84j11j396Q68R07j068n54J332j37j243O12R78j277k72J264K3j211L94J242
$$ 684 573 -823 45 952 -116 -670 662 525 -718 -106 872 -405 -677 587 610 -601 -207 1035
6347A035j382m13J227J62j353O27J057j165n93J784k66j450M61J183r55q70J402
$$ 1035 -347 -760 467 629 -724 -97 960 -205 -798 986 720 -730 -269 914 -41 -911 491
6364D91p9j138M10J161j053q21J547j14r05K62J073o19j029J076L51j374L05J301
$$ 491 412 -726 -316 845 -208 -1029 518 404 -501 -239 834 215 -814 262 613 -761 -456 845
6382H45r13o50R51N94j497K83J029m45j000J094L84j315J78J291r34p37J329N26
$$ 845 -68 -718 233 827 -670 -387 642 197 -803 291 675 -640 -462 829 -105 -842 487 1013
6400A013j536J7J420r41r20J110M70j559L79J740j199r71R35K45p41N59M99k32
$$ 1013 -523 -506 914 -27 -947 163 633 -926 -547 1193 -6 -977 -42 203 -538 21 520 288
6418B88j227M89J108r71k77J343j49k007J425N39j037j81J234j34j560J007J071
$$ 288 -939 -450 658 -313 -590 753 604 -1403 22 561 -476 -657 577 443 -1117 -110 961
6435I61j358m30J514j81j410R30Q80j426m21J551p2j463Q18J053j167p12J418
$$ 961 -397 -827 687 506 -904 26 906 -520 -941 610 538 -925 -107 946 -221 -933 485
6452D85j64j010P15Q33r43p78J400Lj149M68R40r92p75J419k7r87K58J006q56
$$ 485 321 -689 26 859 -84 -862 538 541 -608 -140 800 -192 -967 452 425 -562 -304 702 -154
6471a54n99J187Q6j165L48J132r59q63J470J3j140L21J001p89n36J095J22r63
$$ -154 -753 434 520 -645 -297 835 -124 -987 483 496 -644 -323 678 -111 -647 448 570 -393
6489c93K3J134p69p73J249K33j347L97R74l88j093J125M43j614L77J414p81j115
$$ -393 -370 764 -5 -778 471 704 -643 -246 728 340 -753 372 815 -799 -422 992 211 -904
6507i04J248J84j264K80Q74j49r13N94O98j127n0J117l24j690J530N88j227Q2
$$ -904 344 528 -736 -456 418 269 -644 -50 648 -479 -529 588 264 -1426 104 692 -535 -453
6525d53R60o14n61O85R62j670N66R85m71j255J419J15q31n9P79j78j398J240R50
$$ -453 507 -107 -668 17 979 -691 -125 860 389 -866 553 668 -163 -222 557 379 -1019 221 1171
6544A171j136m04N19P1p10N04Q68r35n36J735n82j005k23J182p16o36Q08K39o84
$$ 1171 35 -369 150 221 -489 15 883 -52 -588 1147 565 -440 -663 519 -197 -833 -25 214 -470
6563d70M93O93q76J2O29rj158O38O63q97k65J193L0j412O86Q80j140l95J024R1
$$ -470 23 716 -160 -148 481 472 -686 -48 615 -282 -547 646 676 -736 -50 830 -310 -705 319 410
6583D10j162N48J070j233k90J120J79j280K36J171p06q60J203K08r03J39R60j002
$$ 410 -752 -204 866 -367 -657 463 642 -638 -402 769 63 -797 406 614 -289 -150 810 -192
6601a92p17J229j3r64N12Q20p58o42J234M2r20K93P00j026k34Q61K08r29j84J482
$$ -192 -909 320 307 -657 -145 675 -83 -725 509 551 -369 -76 624 -402 -636 225 433 -496 -680 802
6621H02o00r38P82O58j277J26J131l06p82O42L88j308K48J083m02p88R55J43r50
$$ 802 202 -736 46 704 -573 -447 684 378 -404 238 626 -682 -434 649 247 -541 414 557 -393
6640c93l9J115m95q56O68O37j104L85Q50m54r95P92O11p28m93J215j086p10J095
$$ -393 -432 683 188 -668 0 637 -467 -82 768 314 -681 111 722 -6 -499 716 -370 -1080 15
6659A5L07o97l03J512o86q09R01L27r18J06Q39l32k35J71O21j185r5J068m19r02
$$ 15 322 -375 -678 834 148 -661 240 567 -351 -245 594 262 27 198 819 -366 -461 607 188 -714
6679g14L08P82r66j18J495j95p08J212j46l77m27L63r68k37N31R70q51l54K77
$$ -714 -406 376 -590 -708 787 592 -116 1096 950 573 146 509 -459 -696 -165 805 -46 -400 -123
6698a23N73j490Q31R49r81K60l98Q35r10K93L85m18o3R74j24j604O19J024j075
$$ -123 450 -1040 -209 740 -241 19 -379 456 -454 -161 224 -194 -257 717 593 -1011 -392 632 -443
6717d43Q9J452p22p71L65J230q86n95L17P25j318O73P05o03n86L92K30q33L67
$$ -443 -354 1098 376 -395 -30 1200 314 -281 36 761 -557 116 821 218 -368 24 254 -579 -212
6736b12P77m59m42M71J61o95q9R02k8p37K80M29o65k74R34k14q12P58L47j043
$$ -212 565 106 -336 135 296 -399 -488 414 386 -351 -71 358 -307 -581 353 139 -673 85 432 -611
6756f11J80R25n98l46P03L34j125K84R51n35n87N37L70n34l74R06k25q90P06M38
$$ -611 -431 494 -104 -450 253 587 -538 -254 697 162 -425 112 482 -52 -426 480 255 -635 71 509
6776E09j013q1J119o73k67N44K96p81j14J047m42o85N83N17j044j12Q67k87m25
$$ 509 -504 -585 534 -139 -406 138 434 -347 -461 586 144 -541 42 559 -485 -597 270 -17 -442
6795d42P92O4p19m1Q40l57q43P08N96r95Q5R34j18r46M78O80r61j82Q34j30q79
$$ -442 350 414 -305 -346 494 137 -706 2 598 -397 -312 622 504 -442 36 716 -245 -427 407 277 -602
6816f02N27O80q25K1M71J57r04P84K34o54j72O02k16m81J67N41o68q5Q73q7p19
$$ -602 -75 605 -220 -199 272 429 -475 309 543 -111 -283 319 103 -378 -211 330 -338 -423 450 363 -356
6837c56R1Q06o18j04O05N9j063N04P39q20l81P79J08q14K28O38m75j25M48j84
$$ -356 -265 541 -77 -181 424 483 -580 -76 663 -157 -538 241 349 -465 -237 401 -74 -199 249 65
6857F5l30J16O94p29l71P98N4p90M29O73o82k53O43R8p69K15P68q25j80M42K99
$$ 65 -265 -149 545 -184 -555 243 297 -493 -64 609 -73 -326 317 415 -354 -139 629 -196 -376 66 365
6878C65r28L62P69m35m79N74J73o74j12P06j51n96O17O1o85K11M59j96n54O83
$$ 365 -563 -201 568 133 -346 228 401 -273 -385 321 170 -426 191 252 -433 -222 237 41 -513 170
6898A70R5n72J64M89k02o31M04O06p89N6Q63o23n72N57L09n60j45P61k47m64L04
$$ 170 265 -307 -143 346 144 -487 -83 523 -266 -210 653 30 -542 15 324 -236 -381 380 133 -331 -27
6919b7K58k51l59O11j05n73N74P0l95k38P36ko49K46L27m37j87O95M2o27J5P23
$$ -27 231 -20 -379 232 127 -446 128 198 -197 -435 301 299 -350 -104 223 -214 -401 294 336 -291 -276 447
6941D47o98l7O23j78l28J55L76n11L6M24k1n21K94M42o75o7M34P2o48J98M27m44
$$ 447 -251 -288 335 157 -171 -16 360 -151 -115 309 288 -233 61 503 -172 -239 195 267 -381 -183 244 -200
6963b00j91O07O9n44K52M29n55l15O31mk99nO59n58k53M47J84o70j55J038k38
$$ -200 -391 216 285 -259 -7 422 -133 -448 183 179 -120 -125 534 -24 -277 170 354 -316 -471 567 329
6984C29q79P80L85p93J50M77k35n26M36K98o80K5M47l9n05L60M79q13pP42l60
$$ 329 -550 230 615 -178 -28 449 214 -312 124 422 -258 -233 214 175 -330 30 509 -304 -311 431 71
7005G1m97N18J59m38M6N26k91n76N70L53q46J51Q89l63o61M67N00q66OO72l99
$$ 71 -426 92 251 -187 -141 385 94 -482 88 441 -405 -254 635 272 -389 78 578 -288 -282 390 -9
7026ik65O49k4n64J85K10Q5n34L97J00m44Q5M58j59o61L27M96n46o4M23J20n18
$$ -9 -274 375 351 -213 -28 182 267 -267 130 230 -214 -129 329 170 -491 -164 332 -214 -278 145 265 -253
7048b53K70M22n67l05O61M0o68K73M19k84k1J24j07l89N27K52o43j05M73J26n50
$$ -253 17 439 -128 -433 228 268 -400 -127 292 8 -13 111 4 -385 142 394 -249 -354 119 245 -305
7069c05K16L00l74k27P91q8r85N46M68k40k88L53K52o10N2L17k62l21L41M03n35
$$ -305 -89 211 -163 -390 401 313 -672 -126 342 102 -186 167 419 -191 -139 178 -84 -405 -64 339 -196
7090a96J35M72l92m30L31L61m92j4O38m66k70K71K73p18K64L97J14n21L15L70
$$ -196 -61 411 19 -411 -80 281 -211 -225 413 -53 -323 -52 221 -497 -233 164 278 -243 72 442
7110D42n24J00K81l92l96O94l8l57J50M44m09j95K34N21o16m0K00Ml59K23L41
$$ 442 -82 18 299 -93 -489 205 167 -190 -40 404 -5 -200 34 555 -61 -101 99 103 -256 -33 308
7131C08l49k2L08M0n48K32M08n43j32N63p6o83M00K48l12p5M72J25p98N17K70
$$ 308 -41 -63 245 285 -263 -31 377 -166 -298 265 189 -494 -94 154 -158 -233 239 364 -434 83 353
7152C53m05k05O21j08l60J67L65m33j00L33j77m72J73N99n17M6L62O0n74L06J66
$$ 353 -52 -257 364 256 -104 63 428 -5 -105 228 51 -421 -248 351 -166 -120 242 302 -272 34 200
7173B00k18k65M13J57n15L55K29n17p6L79J30l22m8L49k56m66M33K33o00K76N62
$$ 200 -18 -283 130 287 -228 127 356 -161 -237 142 272 -50 -98 251 -5 -471 -38 195 -405 -129 433
7194D33l52k96L05J53k09k83N44l32j54K58J62m90m9O98n25M4p6M34p37L90j00
$$ 433 81 -215 90 243 34 -249 295 -37 -191 67 229 -261 -310 388 -137 -93 -169 265 -472 -82 -182
7215a82k09M73j89L51k38k54L52j24l99M43K65n96j10P09p2k58J29J47l51k58
$$ -182 -391 82 -107 244 6 -248 104 -20 -419 24 289 -307 -417 292 220 -38 91 238 -113 -371
7235c71M31L59o20J98L21n54L5L27n5l95K76QJ67m25N94j14n11k17Q73l83n50
$$ -371 60 419 -201 -3 318 -236 -201 126 71 -324 -48 -40 127 -298 296 182 -329 -546 327 -56 -606
7256f06Q78K58n26K28p6j84l91J097o9j153N07P8l02l66N88O37r91K17N27l35
$$ -606 272 530 4 232 156 -28 -419 678 609 -544 -37 41 -261 -627 -39 598 -393 -176 351 16
7276A6k87L37M5p5k4m8K87m66M36Q4m26m2M59k83k39K72J03l39j38N23O6p85M51
$$ 16 -271 66 111 36 12 -36 251 -215 221 305 -121 -163 296 13 -226 46 149 -190 -328 195 261 -524 -73
7299g3O4j94p62J709k69j059P08k08J53m08M12K04l78L9L77l77j42J77K60m41
$$ -73 -9 -203 -965 744 475 -584 124 -84 69 -339 73 277 -101 -62 315 -62 -204 -27 233 -208
7319b08l8N45k90l16N22m3k59R3K61k06k37M37O3l71J3K14k36l14N28J06m59O1
$$ -208 -246 299 9 -307 215 172 -87 6 267 61 -176 261 324 -47 -34 180 -56 -370 158 264 -195 -134
7341a34N78j83n48L61J37m88J8L40k47q2J49M72n72M2N15r7n25L60J39n26J2M91
$$ -134 444 261 -287 74 211 -277 -259 81 -166 -248 -99 373 -199 -157 358 261 -264 96 235 -291 -279 212
7363B12o5n61L36N37m14m09M98J33n61R4M69n82M3L22N0n57M61L73m10j50L76
$$ 212 147 -414 -78 459 45 -364 134 267 -294 -200 269 -313 -270 52 102 -455 6 379 -31 -181 195
7384A95j23l39P3N27n73l7M36J7l60n4Q14m42o14N46O3n00J22O78l70j89L74j41
$$ 195 72 -267 -194 333 -240 -277 159 176 -184 -238 576 134 -480 66 129 -371 -249 429 59 -130 244 103
7406A03m23J71N16l50k80K86J25l70q8P12n30j63L73N7m37K28M35n80L5M05J71
$$ 103 -320 -149 367 17 -263 23 148 -222 -310 402 -128 -291 82 139 -298 -70 365 -215 -180 225 396
7427C96l02l59O91l84j20J01K31n21K48R0k26n6K33O8k82j13N32j74l38M24J59
$$ 396 94 -265 426 42 -78 23 254 -267 -19 71 -155 -211 22 90 -192 -305 227 53 -285 139 298
7448B98l97j35N42j51m36K89J32m08J96K11q9j51J21L14m38P7L00j59l57M04K56
$$ 298 -99 -234 308 157 -279 10 142 -266 -70 141 52 -99 22 336 -102 -25 275 116 -241 163 419
7469D19n39j63L51Q9l66J96M52m58j76J22J78r8r9L95l69j12N02q1n60O48K46
$$ 419 -120 -283 68 157 -209 -13 439 -19 -195 -73 105 7 -92 303 -66 -178 324 243 -317 331 577
7490E77o23j73N60k33m77M22L36l33n11R10l39l17K7L92l53m34P53P6p04L52L18
$$ 577 -46 -219 341 108 -369 53 389 56 -455 455 116 -201 -174 218 -135 -569 184 260 -444 -92 226
7511B26k54m41M71K68n53K61N56l29o16N70M5m88J5O36l62m99N48M16q68L25L45
$$ 226 -28 -469 2 270 -283 -22 534 205 -411 159 204 -284 -269 367 5 -494 54 470 -398 -73 272
7532B72j80l00P4N10o70J38M46m6o53M44L03o74Q8N86k57o92Q70K75o32k91P91
$$ 272 92 -208 -134 376 -294 -156 290 244 -409 35 338 -336 -248 338 81 -611 259 534 -98 -389 402
7553D02l27o59M40N18n62l61R00k74l07K12O01q19PL61K69r02M96M52l73l78N90
$$ 402 75 -584 -144 374 -188 -549 351 77 -230 -18 583 -236 -229 132 401 -501 -5 447 74 -304 286
7574B86p5p02M99N01n07m06O12p0m69Q5O79l92m10M92K18q54J56Q63n41k72O32
$$ 286 211 -491 8 509 2 -404 208 138 -331 -246 433 41 -369 123 341 -513 -357 506 -35 -307 325
7595C25j02p44L87M50n30k11P01O5n12J58M01m12o62P89L82o11k74Q34n56k62
$$ 325 223 -521 -134 316 -214 -425 276 341 -171 -13 388 -24 -686 103 485 -126 -400 434 -122 -384
7615c84N87R7n93J20P79n46n29P43o4m42p9Q38q12J10M70P19j396l62J482m34
$$ -384 203 300 -293 -173 606 60 -469 274 210 -232 -311 527 -285 -175 295 1014 -382 -744 738 304
7635C04n80N53J44q03N0O57k51o95P58J46o37R6Q73o64m74N22N23n73k45J020
$$ 304 -276 277 421 -382 -332 325 74 -621 137 283 -354 -258 615 -49 -523 -1 522 -51 -296 724
7655G24o98o10N61N91q22k7O14l61l11N73L5m19m7M30k33o26O71K77p00oJ016
$$ 724 26 -584 -23 568 -254 -281 333 -28 -339 234 269 -150 -197 233 0 -626 45 322 -378 -384 632
7676F32j20j110P67j8n15j09Q87j85p15M20P29p38n92J026j06p80N51K93m23l35
$$ 632 512 -598 169 151 -364 -473 414 229 -486 -66 663 -75 -667 359 253 -527 24 317 -106 -441
7696d41P29K69r18M09N27q30j79O31N5p73N43K54k45m68O88K20j021L17P93o52
$$ -441 288 557 -361 48 575 -255 -434 197 252 -521 22 276 31 -437 251 471 -550 -233 560 -92
7716i2m07P94N1p95M84L44l76n77Q41j6p14L26N74l83n42O96K09p55K72O89o26
$$ -92 -499 295 346 -449 35 379 3 -574 267 251 -463 -137 437 54 -488 208 417 -338 -66 623 -3
7737cm07P71K56p21k55Q03m19p04Q60L77j037N7J099p12n69P05L87q58j7J227
$$ -3 -410 361 617 -104 -359 444 25 -679 181 558 -479 -422 677 -35 -604 101 488 -370 -387 840
7757H40o21q71P13N42r23k15J093m62q53Q49N51q70k20Q76k6r64N23O00q29J52
$$ 840 219 -652 61 603 -320 -535 558 96 -757 92 643 -227 -447 429 403 -561 -38 562 -267 -115
7777a15O82l09o70L55O58p79j50O73lj021R27K31p22j07Q50M4r73M22N77o86k32
$$ -115 567 258 -412 -57 601 -178 -328 345 342 -679 248 479 -243 -350 500 544 -429 -7 570 -116 -348
7798c48Q59q4j010O48O87r65j94P83J25q68J93Q10r10o3P07m5q08L31P39o07p05
$$ -348 511 427 -583 65 752 -213 -407 376 501 -367 -174 636 -274 -337 370 325 -483 -152 587 -20 -725
7819g25J184or49M51O33n83n74R28K08j028K01Q10o79l95P24J69r92L78Q40o71
$$ -725 459 453 -496 -45 588 5 -569 359 567 -461 -260 550 -129 -524 200 369 -623 -245 595 -76
7839g6l51Q69o6r49K98R59m04r45J027Mp38j10J195p29o61R19K06j015J06R67
$$ -76 -427 442 376 -573 -275 684 280 -665 362 366 -372 -482 713 -16 -677 242 448 -567 -461 506
7859E06l68q78J008M19j247N55P32n26r59R59N22q43j00R51p64q45J284K30j119
$$ 506 138 -740 268 687 -560 -5 727 201 -758 201 723 -120 -220 731 -33 -878 406 636 -483
7878d83J49R12l90o88M31O86q98k41J127o02q42R87L91q16JR77l03o58K60N42
$$ -483 -334 578 188 -500 -69 617 -281 -522 605 3 -839 148 539 -277 -276 701 398 -260 0 542
7898E42p10l59R17j60r31O34P48r29l80J138O5j206P76N37p37o56J941o99j717
$$ 542 -168 -527 390 230 -701 -67 681 -248 -628 510 575 -631 145 682 -55 -711 1230 531 -1186
7917a186J220L47j63q26J289j25j563J205J74r51K85Q98k89r53O65O64p22n73
$$ -1186 34 381 218 -608 681 556 -1007 198 372 -579 -294 604 315 -638 27 691 -31 -604
7935f04R14J3q85N04P06r71j99Q46j81p82N40R19q69o27R71M28j078O3R00q43
$$ -604 310 323 -562 -58 648 -323 -522 324 143 -639 -99 820 -49 -676 295 723 -355 -292 608 -235
7955b35m34R50J98j032L57J148r65p22R08K13p96M8R38n39o23M59N02r74L45R81
$$ -235 -669 281 479 -553 -196 952 -13 -735 173 386 -410 -362 576 37 -586 -127 375 -599 -254 727
7975G27j099q5P13M21j150K2R52k91r36Q83M05j031L8J148l92r63J007J38p75
$$ 727 -372 -457 256 677 -473 -451 501 210 -726 157 562 -469 -431 717 325 -638 369 507 -268
7994b68k30J249p06q21J164N3q05k26J263l34j075P71P23j192j06Q86j54q57Q12
$$ -268 -498 751 45 -776 388 441 -364 -590 673 339 -736 35 758 -434 -540 346 192 -665 147
8013A47N17j091j37J317k66j072O57M98r47k46J217n04p62P39P22j038m04J430
$$ 147 664 -427 -564 753 487 -585 72 570 -377 -623 594 90 -672 67 789 -249 -653 777
8031G77l14j213P40P04q15n03J193p9j188O96M52q27j40J038n0j207M56R32p39
$$ 777 463 -750 -10 694 -121 -624 569 490 -698 -2 450 -377 -517 521 471 -736 -280 652 -87
8050h7o66J321j51r26M15Q90j067m26J096P1j022J36J123r82k53Q57J53j025K20
$$ -87 -753 568 417 -509 -94 796 -271 -697 399 470 -552 -416 707 -275 -528 329 482 -543 -323
8069c23J209q90o41R65K17j303O76Q41p78p08J170M09j159M0Q64n88p30R51K24
$$ -323 886 -4 -645 320 537 -766 -90 751 -27 -735 435 844 -315 -275 589 1 -729 222 446
8088D46j053J61J116n99q48J254R9j025J4J151n73r65J108O18j617L18J039n81
$$ 446 -607 -446 670 71 -777 477 576 -449 -435 716 143 -822 286 904 -713 -395 644 63
8106F3r50R87O99j419K73R86m70p17O97M40q99j51J223m52r88Q10K06p63NJ129
$$ 63 -887 100 799 -620 -347 639 169 -548 149 589 -310 -461 762 310 -678 132 338 -425 -420 709
8126G09n09j110J078P61j544K13Q83k49j008P58O87q37k67J006l35r41O08R94
$$ 709 200 -910 168 929 -615 -402 481 232 -776 -18 669 -168 -435 571 236 -705 -97 897
8144H97j203j11J076l16j032N29R39j077j76J106l63j116P58Q84j076m22J336
$$ 897 -306 -417 659 343 -689 -160 779 -298 -474 632 269 -847 -89 795 -281 -703 633
8161F33l24j135P31J041j224o20J308K7j012M04R08r87o15J368k9j130L58J148
$$ 633 309 -826 -95 946 -278 -898 410 437 -575 -171 737 -250 -865 503 474 -656 -298 850
8179H50r84n87J294k14j177N64J120j012o76R46M99j026
$$ 850 -134 -721 573 359 -818 -254 866 -146 -822 124 623 -403
8191d03
$$ Imaginary data points
##PAGE= N=2
##DATA TABLE= (X++(I..I)), XYDATA
0@%%%%%%%%%%%JrJ6j6J6k4L2l3M1n3O2p4R0j06J22j46J70j94K25k58K95l35L79
$$ 0 0 0 0 0 0 0 0 0 0 0 0 1 -8 8 -8 8 -16 16 -17 24 -29 33 -41 49 -57 65 -81 89 -105 120 -138 157 -178 201
34B01m31M87n47O16o89P69q59R56j062J179j306J446j596J760j943K142k359K597
$$ 201 -230 257 -290 326 -363 406 -453 503 -559 620 -686 760 -836 924 -1019 1123 -1236 1361
52A361k860L152l480L847m260M729n267N895o635P525q617R994j1798J4271j7891
$$ 1361 -1499 1653 -1827 2020 -2240 2489 -2778 3117 -3518 4007 -4610 5384 -6414 7857 -10034
67a0034K3763l5311R7003k68081L4656M49765k80730k77485L58419J39662m28325
$$ -10034 13729 -21582 75421 -192660 -158004 291761 11031 -266454 91965 231627 -196698
78a96698O2708L81766k15583k97950L48560J41633l94376J2386L87437j73136
$$ -196698 -133990 247776 32193 -265757 82803 224436 -169940 -157554 229883 56747
88E6747l04345K89317J80513l63293j7817L62699j37236l05158K73482J85140
$$ 56747 -247598 41719 222232 -141061 -158878 203821 66585 -238573 34909 220049
98B20049l52621l5760L67543j21705l08588K47411J98253l27880n0016L42434
$$ 220049 -132572 -168332 199211 77506 -231082 16329 214582 -113298 -163314 179120
108A79120j01397k90688K27061J87557l03040n8290L24830p4924k93164J96777
$$ 179120 77723 -212965 14096 201653 -101387 -159677 165153 90229 -202935 -6158
118f158K07913k80675q4361L09796m8886k83269J71150K07215k60100r3991L01033
$$ -6158 201755 -78920 -163281 146515 97629 -185640 -14490 192725 -67375 -161366 139667
129A39667l6629k83691J58074K13216k44853j05331K83440j7690k67861J32490
$$ 139667 103038 -180653 -22579 190637 -54216 -159547 123893 106203 -161658 -29168
139b9168K04736k19427j07350K61575m311k59689J14898K10669k02102j24966
$$ -29168 175568 -43859 -151209 110366 106055 -153634 -38736 171933 -30169 -155135
149a55135K52489J6300k56299R3802K11783j85077j30122K41546K3689k51534
$$ -155135 97354 113654 -142645 -48843 162940 -22137 -152259 89287 112976 -138558
159a38558Q5253K14311j78048j36982K34096L5557k45326P0184K10883j59844
$$ -138558 -53305 161006 -17042 -154024 80072 115629 -129697 -59513 151370 -8474
169h474j38942K18259M3239k34289N6371K08395j43920j47922K06225O0736k31226
$$ -8474 -147416 70843 114082 -120207 -63836 144559 639 -147283 58942 119678 -111548
180a11548L7046K13874j27002j58274J95911P0744k25253K8629K12055j21489
$$ -111548 -74502 139372 12370 -145904 50007 120751 -104502 -75873 136182 14693
190A4693j58200J89464P5213k19385K0426K05823j07435j56791J73956P9379k03090
$$ 14693 -143507 45957 121170 -98215 -77789 128034 20599 -136192 37764 117143 -85947
201h5947P776J98250r2211j57436J57848R0526j95850p566J98479p4483j67466
$$ -85947 -78171 120079 27868 -129568 28280 118806 -77044 -84610 113869 39386 -128080
212a28080J45307J05978j91930k1866K01238o6839j71739J42181J09824j89802
$$ -128080 17227 123205 -68725 -90591 110647 43808 -127931 14250 124074 -65728
222f5728k6713K00557o0598j72708J34671J11218j80290l1904J89766n0124j64362
$$ -65728 -92441 108116 47518 -125190 9481 120699 -59591 -91495 98271 48147 -116215
233a16215J19040J10578j64878l9237J79049l6651j61707J04203J17272j53716
$$ -116215 2825 113403 -51475 -90712 88337 51686 -110021 -5818 111454 -42262
243d2262n1739J74499k3951j62932R4554J21355j46968n7749J72271j8559j62742
$$ -42262 -94001 80498 56547 -106385 -11831 109524 -37444 -95193 77078 58519 -104223
254a04223Q8907J23153j42023n9818J65845j1963j58314Q0427J21612j32358o3505
$$ -104223 -15316 107837 -34186 -94004 71841 59878 -98436 -18009 103603 -28755 -92260
265i2260J58420m144j55240P0480J24481j22883p1379J53187O010j55100O0777
$$ -92260 66160 62016 -93224 -22744 101737 -21146 -92525 60662 66672 -88428 -27651
276b7651J27384j14539p7350J47972J2608j52064N3400J27880j08349p9177J40682
$$ -27651 99733 -14806 -92156 55816 68424 -83640 -30240 97640 -10709 -89886 50796
287E0796J8183j47074M5032J25337r7341q1450J30310K5285j39828L3380J25103
$$ 50796 68979 -78095 -33063 92274 -5067 -86517 43793 69078 -70750 -37370 87733
298H7733q7356q6772J24630L2606j37928K6264J26365q1298r0701J19841L8765
$$ 87733 377 -86395 38235 70841 -67087 -40823 85542 4244 -86457 33384 72149
309G2149j36925K1403J27572p7705r2538J17023M0259j33396J7500J24827p0852
$$ 72149 -64776 -43373 84199 6494 -86044 30979 71238 -62158 -44658 80169 9317
320I317r2773J09189M4616j27043R379J21819o0542r5587J00859N2168j22491
$$ 9317 -83456 25733 70349 -56694 -47315 74504 13962 -81625 19234 71402 -51089
331e1089M8J22230n2375r9604R5380N8164j20343m940J21655m7868j00646R2316
$$ -51089 -51041 71189 18814 -80790 14590 72754 -47589 -52529 69126 21258 -79388 12928
343A2928N9057j16899o662J18327m5143r6866Q6820N8131j10634r403J12575l8473
$$ 12928 71985 -44914 -51576 66751 21608 -75258 11562 69693 -40941 -50344 62231 23758
355B3758r4511P7644O1236j02951j7195J10234k9686r7549P1194O7241j00207
$$ 23758 -70753 6891 68127 -34824 -52019 58215 28529 -69020 2174 69415 -30792
366c0792k4495J11199k3618j01148O7678P1920r9743k7451J10807k0612j01157
$$ -30792 -55287 55912 32294 -68854 -1176 70744 -28999 -56450 54357 33745 -67412
377f7412O4257P2503r5651k9931J06833j6462r8148N8065P1648q7715l3277J00457
$$ -67412 -3155 69348 -26303 -56234 50599 34137 -64011 -5946 65702 -22013 -55290 45167
389D5167j0069r4919N0156P2872q0875l8531R7121l513r5074M4177P5575p6829
$$ 45167 35098 -59821 -9665 63207 -17668 -56199 40922 37409 -57665 -13488 62087 -14742
401a4742m1811R4784L17r4373M0479P6399p3766m3690R2382L486r3144L6992P5847
$$ -14742 -56553 38231 38548 -55825 -15346 61053 -12713 -56403 35979 39465 -53679 -16687 59160
414E9160o8605m5943Q8206P700r1200L1814P7080o4908m8700Q5573J1896r0435
$$ 59160 -9445 -55388 32818 40518 -50682 -18868 58212 -6696 -55396 30177 42073 -48362
426d8362K7272P8725o1454n1414Q3528J4695q9247K4415P7710n7836n1634P9594
$$ -48362 -21090 57635 -3819 -55233 28295 42990 -46257 -21842 55868 -1968 -53602 25992
438B5992J6917q5847K0386P5723n2255n2564P3815K0446q1788J4714P4622m6263
$$ 25992 42909 -42938 -22552 53171 916 -51648 22167 42613 -39175 -24461 50161 3898
450C898n4522O9095K4916p9764R387P5935m2685n7414O7234K8101p9714P349P6165
$$ 3898 -50624 18471 43387 -36377 -26990 48945 6260 -51154 16080 44181 -35533 -28184 47981
463D7981m0872n7884O6085K8046p7439N721P4233l8297n6423O1861K9081p3558
$$ 47981 7109 -50775 15310 43356 -34083 -28362 45871 7574 -48849 13012 42093 -31465
475c1465K589P1482l2553n7694N7139L2563p0219k511P1031k7817n9195N3199
$$ -31465 -28876 42606 10053 -47641 9498 42061 -28158 -30669 40362 12545 -46650 6549
487F549L6630o9173o307P1847k5259o0858N2565L6821o7670o962P0109k3783n8746
$$ 6549 43179 -25994 -32301 39546 14287 -46571 5994 42815 -24855 -31817 38292 14509 -44237
500d4237M9153L6227o3786p881O6196k0192n6921M4336L7466n9652j1406O3757
$$ -44237 4916 41143 -22643 -30524 35672 15480 -41441 2895 40361 -19291 -30697 33060
512C3060j5352n7496L9971M0205n6953j6158O4326j1972n9179L7795M2768n6401
$$ 33060 17708 -39788 183 40388 -16565 -32723 31603 19631 -39548 -1753 41015 -15386
524a5386j8260O4427j0422n9805L6763M3162n5095j8629O2457q513n8002L3319
$$ -15386 -33646 30781 20359 -39446 -2683 40479 -14616 -33245 29212 20699 -37303 -3984
536c984M3044n1616k0294N9575n861n6235K9031M3868m7972k2481N6793j971n6245
$$ -3984 39060 -12556 -32850 26725 20864 -35371 -6340 37528 -10444 -32925 23868 21897 -34348
549c4348K6189M4657m4780k4962N5804L79n5665K3969M5174m3382k6137N3963
$$ -34348 -8159 36498 -8282 -33244 22560 22939 -32726 -8757 36417 -6965 -33102 20861
561B0861K393n4383K1452M4821m0756k6941N1552N032n4612J9040M6179l8640
$$ 20861 23254 -31129 -9677 35144 -5612 -32553 18999 24031 -30581 -11541 34638 -4002
573d002k9045N1048P431n4538J6904M6719l7066l0570N0611Q379n4567J5546M7605
$$ -4002 -33047 18001 25432 -29106 -12202 34517 -2549 -33119 17492 25871 -28696 -13150 34455
586C4455l6212l0283M8436R142n2350J3338M5822l2722l0478M5077J1325m9707
$$ 34455 -1757 -32040 16396 25538 -26812 -13474 32348 -374 -30852 14225 25550 -24157
598b4157R707M4712k8161l2811M2415J4329m8673O195M6285k6285l4983M1640
$$ -24157 -14450 30262 2101 -30710 11705 26034 -22639 -16444 29841 3556 -31427 10213
610A0213J6654m9062N126M6898k5958l5071M0724J7398m8302L757M6234k4347
$$ 10213 26867 -22195 -17069 29829 3871 -31200 9524 26922 -21380 -17623 28611 4264
622D264l5015L9052J8168m6435K111M4818k1574l5500L6656J9968m4732r29M4764
$$ 4264 -30751 8301 26469 -19966 -17855 26963 5389 -30111 6545 26513 -18219 -19148 25616
635B5616j7712l7263L3555K3033m3952l626M5464j6161l8407L2791K4305m3273
$$ 25616 7904 -29359 4196 27229 -16723 -20349 25115 8954 -29453 3338 27643 -15630
647a5630n178M5407j4959l8270L1500K4093m1309o051M3461j2585l7434K8592
$$ -15630 -20808 24599 9640 -28630 2870 26963 -14346 -20397 23064 10479 -26955 1637
659A637K4280l8362p998M1964j0069l7330K5663K6577l6935j0837M1584o839l8784
$$ 1637 25917 -12445 -20443 21521 11452 -25878 -215 26362 -10573 -21410 20174 13335 -25449
672b5449K4024K8526l6666j2455M1843n634l9871K3216K9260l5443j3777M1132
$$ -25449 -1425 27101 -9565 -22020 19823 14189 -25682 -2466 26794 -8649 -22426 18706
684A8706m255l9000K0986K9563l3567j5018L9794k161l8522J8423L0325l1207
$$ 18706 14451 -24549 -3563 26000 -7567 -22585 17209 15048 -23474 -5051 25274 -5933
696e933j7083L8424K87l8328J6435L1025k9763j8058L7219J845l7906J4359L1532
$$ -5933 -23016 15408 15695 -22633 -6198 24827 -4936 -22994 14225 16070 -21836 -7477 24055
709B4055k7692j9283L6119L366l7366J2451L1827k5868k0559L4666N883l6787
$$ 24055 -3637 -22920 13199 16565 -20801 -8350 23477 -2391 -22950 11716 17599 -19188
721a9188R697L2455k3755k2163L3317Q157l6740P654L3894k2683k3735L2777R364
$$ -19188 -9491 22964 -791 -22954 10363 18520 -18220 -10566 23328 645 -23090 9687 19051
734A9051l6804O493L4088k1260k4192L1232J0528l5517N070L2510j8760k4302
$$ 19051 -17753 -11260 22828 1568 -22624 8608 19136 -16381 -11311 21199 2439 -21863
746b1863K9198J1486l3522K970L1415j5823k4704K6072J4028l2353J7L2064j3689
$$ -21863 7335 18821 -14701 -11731 19684 3861 -20843 5229 19257 -13096 -13079 18985 5296
759E296k6077K4614J5633l1763j822L2708j2545k7106K4437J6207l1099k659L1675
$$ 5296 -20781 3833 19466 -12297 -14119 18589 6044 -21062 3375 19582 -11517 -14176 17499
772A7499j1333k6496K3088J6137k9821l083L0264r517k6182K0636J7176k7705
$$ 17499 6166 -20330 2758 18895 -10926 -14009 16255 6738 -19444 1192 18368 -9337
784i337n462K9653o694k6680J8208J8709k6295p565K9299m550k7458J6811J9709
$$ -9337 -14799 14854 8160 -18520 -312 18397 -7898 -15463 13836 9286 -18172 -1361 18348
797A8348k5023r091K8755l315k7291J5354K0263k3478r999K7341k001k6013J3414
$$ 18348 -6675 -15766 12989 9674 -17617 -2263 18000 -5478 -15477 11864 9863 -16150 -2736
810b736J9873k1356j0749K5607r4k5589J0992K0526j9391j2403K5030J400k5316
$$ -2736 17137 -4219 -14968 10639 10545 -15044 -4052 16474 -2917 -15320 9710 11110 -14206
823a4206R270K1431j8345j3548K4327K843k5196P966K1508j7463j3655K2837M195
$$ -14206 -4936 16495 -1850 -15398 8929 11772 -13424 -5458 16050 -1413 -15068 7769 11964
836A1964k4782O391K1519j5559j4182K1354N104k3199M510K1210j3452j5247J9625
$$ 11964 -12818 -6427 15092 -467 -14649 6705 11809 -11390 -6880 14330 878 -14369 5256
849E256O735k2329K711K1256j2149j6020J8695P793k1510J753K0363j0189j5870
$$ 5256 11991 -10338 -7627 13629 1480 -14540 4155 11948 -9562 -7809 12554 2365 -13505
862a3505J6983Q330k0221J47K0036q891j5858J5148R529j9128r92J9167o793j6328
$$ -13505 3478 11808 -8413 -8266 11770 2879 -12979 2169 11698 -7430 -8422 10745 3952 -12376
876a2376J3756J0337j8169k734J9242n428j6844J2841J1239j7508l504J8663m401
$$ -12376 1380 11717 -6452 -9186 10056 4628 -12216 625 11864 -5644 -9148 9515 5114
889E114j6760J1665J1343j6260l821J7400l597j5527R970J1279j4426m930J5905
$$ 5114 -11646 19 11362 -4898 -8719 8681 5084 -10443 -473 10806 -3620 -8550 7355
902G355j810j4877P742J1517j2713n619J4762mj5074O486J2027j1391p350J4438
$$ 7355 5545 -9332 -1590 9927 -2786 -8405 6357 6353 -8721 -2235 9792 -1599 -8949 5489
916E489J002j5025N620J2367j0615p721J4109J179j3942M416J1869r588p566J2550
$$ 5489 6491 -8534 -2914 9453 -1162 -8883 5226 6405 -7537 -3121 8748 -840 -8406 4144
930D144K091j3156L483J1414q191p761J1161L102j2233K062J1525p132q439J0355
$$ 4144 6235 -6921 -3438 7976 -215 -7976 3185 6287 -5946 -3884 7641 509 -7930 2425
944B425M015j1793Q79J1373n655q669Q975M979j1093q3J0927m746q310P936N212
$$ 2425 6440 -5353 -4474 6899 1244 -7425 1550 6529 -4564 -4647 6280 1534 -6776 1160 6372
959F372j0265o74J0180l395q675O743N886r109k033J0071k509q518N894N777p886
$$ 6372 -3893 -4567 5613 2218 -6457 286 6172 -2937 -4970 5101 2592 -5926 -32 5745 -2141
974b141k808R181j114q537M815O064p294l155Q857n07q394L992O586o397l863
$$ -2141 -4949 4232 3118 -5419 -604 5460 -1834 -4989 3868 3361 -5033 -1041 5545 -852 -4715
989d715P822N19p823K619O735n299m635P137J572p981J624P190m581m918O727
$$ -4715 3107 3626 -4197 -1578 5157 -142 -4777 2360 3932 -4049 -2425 4765 184 -4734 1993
1004A993J988p291P70P005l728n311N661K845o729K17O638k995n334M967L390
$$ 1993 3981 -3310 -2540 4465 737 -4574 1087 3932 -2797 -2580 4058 1063 -4271 696 4086
1019D086o394n28O194j684n721L875M162n802j524O100n74n916L057M699n030
$$ 4086 -2308 -2836 3358 1674 -4047 -172 3990 -1812 -3336 2764 2190 -3726 -669 4030 -1000
1034a000k412N994K01o303K416M943m244l018N496Q47o109J632N352m138l141
$$ -1000 -3412 2582 2783 -3520 -1104 3839 -405 -3423 2073 2920 -3189 -1557 3795 -343 -3484
1049c484N096J450n873J226N085l038m069M765K127n471K04N325k075n017L990
$$ -3484 1612 3062 -2811 -1585 3500 462 -3607 1158 3285 -2186 -1982 3343 1268 -3749 241
1064B41L297n355q70N699j214n235L342L772n073j729N610o21n376K881M702n187
$$ 241 3538 -1817 -2687 3012 1798 -3437 -95 3677 -1396 -3125 2485 1864 -3512 -631 4071 -1116
1080a116k246N797k3n892K363M941m063l343N663R11o071J379N401l472m066N264
$$ -1116 -3362 2435 2412 -3480 -1117 3824 -239 -3582 2081 2992 -3079 -1700 3701 229 -3837 1427
1096A427J841o121P47N992l176m824N316K362o151j96O377k505n325M971L178
$$ 1427 3268 -2853 -2106 3886 710 -4114 1202 3564 -2587 -2783 3594 1089 -4236 735 3913
1111C913o198q84O633j638o147M420M153o264j570P024j323o554M159M890o008
$$ 3913 -2285 -3169 3464 1826 -4321 99 4252 -2012 -3582 3442 2119 -4435 -276 4614 -1394
1126a394k672P488p46p155L546N718n901l329P535k0p381L075O342n851l800P271
$$ -1394 -4066 3422 2676 -4479 -933 4785 -1116 -4445 3090 3070 -4311 -1236 5106 -745 -4545 2726
1142B726R00p848K701O583n451m474P256J795q622K131P392n021n141P224K245
$$ 2726 3626 -4222 -1521 5062 -389 -4863 2393 4188 -4434 -2303 5089 68 -5073 2151 4396
1157D396q512J413Q100m695o140P314K999q932R12Q356m361o504P227L617q984
$$ 4396 -4116 -2703 5397 702 -5438 1876 4875 -4057 -3145 5211 850 -5654 1573 5190 -3794
1172c794M54Q618l993o751O575M293q670n96Q632k889p629O417N329r022j709
$$ -3794 -3340 5278 1285 -5466 1109 5402 -3268 -3864 4768 1879 -5750 667 5996 -3026 -4735
1187d735R743k456q883O485N834r119j614R912k284r206O304O226q836k761J0285
$$ -4735 5008 2552 -6331 154 5988 -3131 -4745 5167 2883 -6323 -19 6207 -2629 -5390 4895
$$ [...]
8191i12
##END NTUPLES=NMR FID
##END=
