##TITLE=1H_SR52+5xAcCl 1n
 CDCl3, 8 sc, 
 31.05.2021
##JCAMPDX= 6.0         $$ Bruker NMR JCAMP-DX V2.0
##DATA TYPE= NMR FID
##DATA CLASS= NTUPLES
##ORIGIN= UXNMR, Bruker Analytische Messtechnik GmbH
##OWNER= root
$$ XWIN-NMR		Version 3.5
$$ Mon May 31 13:44:23 2021 Russian Standard Time (UT+4h)  she@DPX200
##.OBSERVE FREQUENCY= 200.131506
##.OBSERVE NUCLEUS= ^1H
##.DELAY= (6, 6)
##.ACQUISITION MODE= SIMULTANEOUS
##.ACQUISITION SCHEME= undefined
##.AVERAGES= 8
##.DIGITISER RES= 18
##SPECTROMETER/DATA SYSTEM= spect
##.PULSE SEQUENCE= zg30
##.SOLVENT NAME= CDCl3
##.SHIFT REFERENCE= (INTERNAL, CDCl3, 0, 15.7039)
##AUDIT TRAIL= $$ (NUMBER, WHEN, WHO, WHERE, WHAT)
$$ ##TITLE= Audit trail, XWIN-NMR		Version 3.5
$$ ##JCAMPDX= 5.01
$$ ##ORIGIN= Bruker BioSpin GmbH
$$ ##OWNER= she
$$ F:/spectra/data/she/nmr/H-F/1/audita.txt
$$ ##AUDIT TRAIL=  $$ (NUMBER, WHEN, WHO, WHERE, WHAT)
(   1,<2021-05-31 13:43:15.93 +0400>,<she>,<DPX200>,
      <created by zg, POWCHK disabled, PULCHK disabled
       configuration hash MD5:
       00 E9 B6 7A A2 85 ED C7 34 08 36 98 17 FE 4E 26
       data hash MD5: 16K
       39 52 5D 90 E3 CB B5 A7 39 9B 71 1D A7 E6 58 02>)
$$ ##END=
$$ 
$$ hash MD5
$$ 92 9F 42 3E 4D 77 95 5C ED 7F 47 2E 41 34 C7 95
##$RELAX= 
##$RELAX= 
##$RELAX= 
##$RELAX= 
##$RELAX= 
##$RELAX= 
$$ Bruker specific parameters
$$ --------------------------
##$DU= <F:/spectra>
##$EXPNO= 1
##$NAME= <H-F>
##$PROCNO= 1
##$TYPE= <nmr>
##$USER= <she>
##$AMP= (0..31)
100 100 100 100 100 100 100 100 100 100 100 100 100 100 100 100 100 100 
100 100 100 100 100 100 100 100 100 100 100 100 100 100 
##$AQSEQ= 0
##$AQ_mod= 1
##$AUNM= <au_zg>
##$AUTOPOS= <>
##$BF1= 200.13
##$BF2= 200.13
##$BF3= 200.13
##$BF4= 200.13
##$BF5= 200.13
##$BF6= 200.13
##$BF7= 200.13
##$BF8= 200.13
##$BYTORDA= 1
##$CFDGTYP= 0
##$CFRGTYP= 5
##$CHEMSTR= <none>
##$CNST= (0..31)
1 1 145 1 1 1 1 1 1 1 1 1 1 1 1 1 1 1 1 1 1 1 1 1 1 1 1 1 1 1 1 1 
##$CPDPRG= <>
##$CPDPRG1= <>
##$CPDPRG2= <>
##$CPDPRG3= <>
##$CPDPRG4= <mlev>
##$CPDPRG5= <mlev>
##$CPDPRG6= <mlev>
##$CPDPRG7= <mlev>
##$CPDPRG8= <mlev>
##$CPDPRGB= <>
##$CPDPRGT= <>
##$D= (0..31)
0 1.2 0 0 0 0 0 0 0 0.06 0 0.03 0 0 0 0 0.0002 0 0 0 0 0 0 0 0 0 0 0 0 
0 0 0 
##$DATE= 1622454195
##$DBL= (0..7)
120 120 120 120 120 120 120 120 
##$DBP= (0..7)
150 150 150 150 150 150 150 150 
##$DBP07= 0
##$DBPNAM0= <>
##$DBPNAM1= <>
##$DBPNAM2= <>
##$DBPNAM3= <>
##$DBPNAM4= <>
##$DBPNAM5= <>
##$DBPNAM6= <>
##$DBPNAM7= <>
##$DBPOAL= (0..7)
0.5 0.5 0.5 0.5 0.5 0.5 0.5 0.5 
##$DBPOFFS= (0..7)
0 0 0 0 0 0 0 0 
##$DE= 6
##$DECBNUC= <off>
##$DECIM= 32
##$DECNUC= <off>
##$DECSTAT= 4
##$DIGMOD= 1
##$DIGTYP= 9
##$DL= (0..7)
0 120 120 120 120 120 120 120 
##$DP= (0..7)
150 150 150 150 150 150 150 150 
##$DP07= 0
##$DPNAME0= <>
##$DPNAME1= <>
##$DPNAME2= <>
##$DPNAME3= <>
##$DPNAME4= <>
##$DPNAME5= <>
##$DPNAME6= <>
##$DPNAME7= <>
##$DPOAL= (0..7)
0.5 0.5 0.5 0.5 0.5 0.5 0.5 0.5 
##$DPOFFS= (0..7)
0 0 0 0 0 0 0 0 
##$DQDMODE= 0
##$DR= 18
##$DS= 0
##$DSLIST= <SSSSSSSSSSSSSSS>
$$ [...]
##$SUBNAM2= <"">
##$SUBNAM3= <"">
##$SUBNAM4= <"">
##$SUBNAM5= <"">
##$SUBNAM6= <"">
##$SUBNAM7= <"">
##$SUBNAM8= <"">
##$SUBNAM9= <"">
##$SW= 16.9725357007746
##$SWIBOX= (0..15)
0 0 2 0 0 0 0 0 0 0 0 0 0 0 0 0 
##$SW_h= 3396.73913043478
##$TD= 16384
##$TD0= 1
##$TE= 0
##$TE2= 300
##$TE3= 300
##$TEG= 300
##$TL= (0..7)
0 120 120 120 120 120 120 120 
##$TP= (0..7)
150 150 150 150 150 150 150 150 
##$TP07= 0
##$TPNAME0= <>
##$TPNAME1= <>
##$TPNAME2= <>
##$TPNAME3= <>
##$TPNAME4= <>
##$TPNAME5= <>
##$TPNAME6= <>
##$TPNAME7= <>
##$TPOAL= (0..7)
0.5 0.5 0.5 0.5 0.5 0.5 0.5 0.5 
##$TPOFFS= (0..7)
0 0 0 0 0 0 0 0 
##$TUNHIN= 0
##$TUNHOUT= 0
##$TUNXOUT= 0
##$USERA1= <user>
##$USERA2= <user>
##$USERA3= <user>
##$USERA4= <user>
##$USERA5= <user>
##$V9= 5
##$VALIST= <valist>
##$VCLIST= <CCCCCCCCCCCCCCC>
##$VD= 0
##$VDLIST= <DDDDDDDDDDDDDDD>
##$VPLIST= <PPPPPPPPPPPPPPP>
##$VTLIST= <TTTTTTTTTTTTTTT>
##$WBST= 1024
##$WBSW= 4
##$XGAIN= (0..3)
0 0 0 0 
##$XL= 0
##$YL= 0
##$YMAX_a= 293797
##$YMIN_a= -268544
##$ZGOPTNS= <>
##$ZL1= 120
##$ZL2= 120
##$ZL3= 120
##$ZL4= 120
##$ABSF1= 10
##$ABSF2= 0
##$ABSG= 5
##$ABSL= 3
##$ALPHA= 0
##$AQORDER= 0
##$ASSFAC= 0
##$ASSFACI= 0
##$ASSFACX= 0
##$ASSWID= 0
##$AUNMP= <proc_1d>
##$AZFE= 0.1
##$AZFW= 0.1
##$BCFW= 1
##$BC_mod= 2
##$BYTORDP= 1
##$COROFFS= 0
##$CY= 11.3945322036743
##$DATMOD= 1
##$DC= 2
##$DFILT= <>
##$DTYPP= 0
##$F1P= 15.9154993809931
##$F2P= -4.1035820241983
##$FCOR= 0.5
##$FTSIZE= 0
##$FT_mod= 4
##$GAMMA= 1
##$GB= 0.15
##$INTBC= 1
##$INTSCL= 1
##$ISEN= 128
##$LB= 0.24
##$LEV0= 0
##$LPBIN= 0
##$MAXI= 10000
##$MC2= 0
##$MEAN= 0
##$ME_mod= 0
##$MI= 1.114404
##$NCOEF= 0
##$NC_proc= 0
##$NLEV= 6
##$NOISF1= 3.799351
##$NOISF2= 2.8
##$NSP= 1
##$NTH_PI= 0
##$NZP= 0
##$OFFSET= 15.70392
##$PC= 1
##$PHC0= -11120.49
##$PHC1= 11.40099
##$PH_mod= 1
##$PKNL= yes
##$PPARMOD= 0
##$PSCAL= 0
##$PSIGN= 0
##$REVERSE= no
##$SF= 200.130013532006
##$SI= 16384
##$SIGF1= 3
##$SIGF2= 2
##$SINO= 400
##$SIOLD= 16384
##$SREGLST= <1H.CDCl3>
##$SSB= 0
##$STSI= 0
##$STSR= 0
##$SW_p= 3612.71676300578
##$SYMM= 0
##$S_DEV= 0
##$TDeff= 0
##$TDoff= 0
##$TI= <>
##$TILT= no
##$TM1= 0
##$TM2= 0
##$TOPLEV= 0
##$USERP1= <user>
##$USERP2= <user>
##$USERP3= <user>
##$USERP4= <user>
##$USERP5= <user>
##$WDW= 1
##$XDIM= 8192
##$YMAX_p= 0
##$YMIN_p= 0
$$ End of Bruker specific parameters
$$ ---------------------------------
##NTUPLES= NMR FID
##VAR_NAME=  TIME,          FID/REAL,        FID/IMAG
##SYMBOL=    X,             R,               I
##VAR_TYPE=  INDEPENDENT,   DEPENDENT,       DEPENDENT
##VAR_FORM=  AFFN,          ASDF,            ASDF
##VAR_DIM=   8192,          8192,            8192
##UNITS=     SECONDS,       ARBITRARY UNITS, ARBITRARY UNITS
##FACTOR=    0.0002944,     1,               1
##FIRST=     0,             0,               0
##LAST=      2.4114304,     0,               0
##MIN=       0,             -268544,         0
##MAX=       2.4114304,     293797,          0
$$ Real data points
##PAGE= N=1
##DATA TABLE= (X++(R..R)), XYDATA
0 0 0 0 0 0 0 0 0 0 0 0 0 8 -8 8 -8 8 -16 16 -16 24 -28 32 -40 47 -56 64 -73 82 -97 110 -125 142 -162 182
34 182 -207 232 -260 289 -323 361 -402 446 -494 547 -604 667 -733 812 -895 984 -1084 1193
52 1193 -1316 1456 -1608 1782 -1981 2213 -2484 2802 -3192 3675 -4291 5110 -6248 7948 -10746
67 -10746 16121 -30026 138085 215732 -260006 -46840 287851 -42017 -244188 167285 171735
78 171735 -226212 -79571 246667 -42756 -234664 117119 167595 -195052 -91863 228313
88 228313 6641 -221246 105246 199040 -166215 -106002 236883 19223 -234440 90907
98 90907 192425 -185650 -120295 219604 1500 -237535 86103 178641 -173848 -103612 213334
109 213334 13109 -201803 83131 174806 -138070 -104834 187071 31968 -201550 45593
119 45593 170629 -133383 -133139 169881 41626 -207130 33013 184274 -120300 -131530 184572
130 184572 56689 -196243 45919 185127 -114363 -120908 170081 45869 -187435 28630
140 28630 159707 -106760 -123958 143155 51954 -169451 13964 163037 -75441 -123063 140302
151 140302 80615 -159991 3559 175899 -68721 -138503 136258 79326 -174717 -7298
161 -7298 168885 -77771 -142578 132479 75920 -165820 -342 166420 -63248 -124101 125193
172 125193 81743 -143322 -11389 153929 -47129 -133265 98413 86106 -144696 -38121
182 -38121 149285 -38198 -146622 93267 100979 -142397 -37902 163774 -30067 -142165
192 -142165 102316 101896 -140440 -34287 153141 -36114 -139513 86680 87699 -133716 -42013
203 -42013 135703 -24935 -130792 72283 98820 -110211 -50055 138603 2173 -133117
213 -133117 63238 116541 -109296 -67431 141933 3142 -149673 57468 117068 -118502
223 -118502 -70863 143820 1878 -143202 64099 116366 -105254 -57510 137789 9462
233 9462 -126155 52949 109110 -90854 -67573 116841 17061 -127985 29099 109928 -81264
244 -81264 -82708 114219 33664 -129973 26525 126024 -76226 -84004 123051 36295 -132524
255 -132524 27491 120616 -81869 -86658 112205 28158 -130968 19515 110585 -73678 -83740
266 -83740 102066 38452 -116131 11046 115070 -53388 -88773 95310 53225 -117569 -3614
277 -3614 118097 -52397 -103058 90282 54876 -123986 -7360 120092 -51578 -98135 94022
288 94022 56598 -112866 -280 116197 -42144 -88873 84018 56150 -103126 -12184 105504
299 105504 -34485 -94422 69036 61542 -99188 -23781 109083 -22407 -98905 71126 75907
310 75907 -97971 -23970 118367 -21641 -101928 72470 71852 -102457 -26138 110000 -26203
321 -26203 -100547 64108 66298 -93703 -27735 102514 -13491 -92397 55146 74521 -79649
332 -79649 -36711 100274 -1304 -99102 43630 80090 -82803 -50396 99571 -683 -107879
343 -107879 42000 82728 -84346 -47245 103476 -119 -100002 46782 80132 -76653 -42311
354 -42311 94242 2149 -93890 34135 74337 -69126 -51318 83320 11351 -93568 22784
365 22784 82755 -59564 -59078 88490 25263 -96944 22911 93860 -60288 -62917 92156
376 92156 22861 -101721 22405 88554 -64814 -61150 87152 19071 -94207 21348 83392
387 83392 -52727 -55331 79129 28325 -83192 11896 83939 -41753 -63848 70488 35265
398 35265 -87674 -437 85907 -41066 -72880 70888 39416 -90846 867 91289 -40688
409 -40688 -69407 74850 38887 -87267 2679 85508 -39433 -68376 65106 36130 -83549
420 -83549 -5969 79088 -32035 -71018 56741 44664 -78178 -13245 85505 -21923 -75184
431 -75184 57749 53084 -79853 -16632 87539 -23402 -78933 55595 49471 -81510 -17039
442 -17039 83271 -23089 -73460 52889 49279 -70397 -16304 79059 -12477 -68444 44771
453 44771 53967 -63495 -25494 76501 -6122 -75667 37444 58885 -65974 -32684 80386
464 80386 -3286 -79119 40828 63542 -66358 -29009 83333 -3861 -75671 41127 59219
475 59219 -63336 -29800 74266 -3620 -73292 31072 56141 -56142 -35336 68485 6095
486 6095 -71832 23718 64231 -49871 -41993 71124 13180 -76560 21105 67477 -53350 -46218
498 -46218 70860 9928 -79147 21154 64193 -52969 -42451 67885 10950 -70963 19767
509 19767 61939 -43168 -40823 61318 17263 -66693 10054 62349 -37536 -49679 56675 23811
521 23811 -70748 3855 68541 -35311 -54319 61425 28836 -72391 7249 72550 -36423
532 -36423 -51708 61953 25946 -69856 6556 65882 -34919 -50132 53640 25039 -63573
543 -63573 587 62502 -25111 -50695 47778 33942 -58905 -5964 65916 -19008 -56141 45700
555 45700 38080 -63266 -11252 66991 -21029 -60294 45832 36784 -63986 -9631 66084 -20151
567 -20151 -55957 44370 36502 -57667 -10661 62218 -14541 -55509 36802 38727 -54771 -19304
579 -19304 60013 -9179 -60566 31790 44629 -53969 -23478 64399 -4930 -62016 33934 48220
591 48220 -53798 -22047 63792 -5703 -59805 31264 44303 -50845 -23041 57464 -3236 -56387
603 -56387 25195 44710 -42677 -26022 55175 5848 -55561 20744 50594 -39655 -31756 56473
615 56473 9116 -60473 18427 53215 -42867 -34776 58092 7572 -61626 20019 52344 -41752
627 -41752 -31388 56382 8665 -56185 17214 49660 -35871 -33041 48798 12812 -54662 7914
639 7914 49927 -30840 -39966 45781 19354 -56603 3564 55233 -28533 -42976 48909 21858
651 21858 -57953 4655 55788 -29991 -42655 46810 19064 -56762 3575 50852 -27670 -40273
663 -40273 41489 20596 -50004 -663 50311 -19103 -41581 37810 27593 -48465 -6352 53149
675 53149 -16229 -47424 36841 30895 -52460 -8909 55933 -16939 -48652 39016 31534 -51488
687 -51488 -6466 55594 -15904 -44632 36936 30439 -46731 -8185 50073 -11724 -44207 29128
699 29128 31692 -42890 -14406 48461 -5677 -46913 26504 36741 -42192 -17562 51802 -3694
711 -3694 -49216 26858 38015 -43694 -18251 51114 -5862 -49277 25524 35245 -42310 -18104
723 -18104 47513 -3531 -46173 21797 36252 -36731 -20857 45753 2472 -46972 17153 39815
735 39815 -35545 -26508 45757 4986 -50660 15278 42174 -36251 -27609 47268 5573 -49044
747 -49044 16781 41943 -33518 -24905 44749 6581 -45198 13289 39201 -29154 -26920 39313
759 39313 10159 -43582 7533 40836 -24289 -30866 38876 16060 -44967 5699 45670 -23970
771 -23970 -33418 41344 16475 -47606 5750 45103 -26073 -32985 40393 14220 -45936 5692
783 5692 41963 -23125 -31193 36094 16621 -41306 1497 41156 -17503 -33631 31789 20959
795 20959 -41313 -4747 42739 -15223 -38810 30644 23945 -43578 -5978 45455 -15491 -38578
807 -38578 32395 23536 -42346 -3944 43238 -14973 -35935 29463 21955 -38713 -6148 39280
819 39280 -11581 -35783 24602 24626 -35415 -10962 40257 -5818 -37930 23132 29999 -35735 -13525
832 -13525 43317 -4759 -40861 23796 30522 -37571 -13381 43197 -6119 -39702 23363 28908
844 28908 -34746 -12515 40135 -3080 -36249 19751 29377 -30003 -15520 37271 1143 -37628
856 -37628 14826 31699 -28682 -20441 37512 3833 -40137 13726 34060 -29138 -20953 39245
868 39245 3926 -39963 14303 33295 -28628 -20430 36519 3568 -38446 11430 31307 -25772
880 -25772 -21801 32944 6488 -37267 7359 33595 -22394 -24995 33182 10937 -38557 5992
892 5992 36351 -22091 -27396 33901 11515 -39831 5415 35955 -22692 -26278 33137 11073 -37013
905 -37013 5154 34254 -18547 -24833 29216 13103 -33111 1294 33404 -14098 -27394 26161
917 26161 17066 -33788 -2765 36119 -12833 -30942 27107 19757 -35537 -2628 38241 -13647
929 -13647 -30710 28587 18769 -35635 -1834 36397 -13449 -29147 25868 17364 -32597 -4073
941 -4073 33078 -10162 -29100 21309 20628 -29607 -8288 33813 -5767 -31984 19776 23974 -30546
954 -30546 -11073 35370 -5545 -34490 19926 24021 -31992 -10484 35044 -6182 -32369 19790
966 19790 22952 -29142 -9787 32531 -4012 -30198 16184 23274 -25575 -12775 30493 -288
978 -288 -31432 12937 26204 -25086 -15992 32481 2132 -33614 13347 28641 -25950 -16230 34026
991 34026 1816 -33685 14071 27624 -25291 -15404 31894 1817 -31605 11809 26306 -21773
1003 -21773 -16533 28507 5219 -30169 7880 27886 -18692 -19525 27698 8426 -31689 5660
1015 5660 29482 -18740 -21867 28348 8533 -32943 5691 29454 -19397 -21078 27829 8151
1027 8151 -31091 5298 28169 -17268 -20463 25457 9368 -29326 2212 27657 -14511 -23010
1039 -23010 23282 12426 -29983 -564 29891 -12872 -25113 24113 14632 -30988 -477 31132
1051 31132 -13358 -25061 24320 13702 -29852 -444 29160 -12266 -23557 21316 13726 -26665
1063 -26665 -2376 27441 -8486 -23432 18834 16654 -24701 -5569 28635 -5452 -26001 17624
1075 17624 19359 -26034 -7398 30247 -6219 -27982 18827 19310 -27184 -6399 30160 -6399
1087 -6399 -26083 18315 18036 -25073 -6695 27679 -4788 -25236 14668 18510 -22500 -9632 25854
1100 25854 -1268 -26343 11729 21269 -21566 -12843 27390 634 -28110 11696 23070 -22122
1112 -22122 -13261 27844 71 -28238 11681 21593 -21681 -12324 26015 240 -25981 10073
1124 10073 20618 -18568 -13110 23854 3404 -25352 7299 22634 -16562 -15637 23822 5918
1136 5918 -26782 5677 24767 -17167 -17272 25139 6348 -27789 6418 25279 -17021 -16725 24808
1149 24808 6286 -26358 6260 23649 -14963 -16223 21790 7168 -24381 2498 23013 -12040
1161 -12040 -18360 19898 10155 -24534 548 25087 -10794 -20167 20477 11786 -25408 -131 25777
1174 25777 -11575 -20778 20232 10937 -25413 -196 24241 -11032 -19464 18386 11020 -23181 -1666
1187 -1666 23095 -8292 -20083 16155 13226 -22301 -4443 24061 -6480 -22527 15655 15348 -23416
1200 -23416 -5417 25645 -6453 -23008 16637 15379 -23223 -4662 25020 -6002 -21582 15549
1212 15549 14688 -20716 -5168 22838 -4111 -20724 12080 15416 -18606 -7965 22088 -772
1224 -772 -21845 10304 18401 -18113 -10192 23776 382 -23575 10835 19090 -19541 -10275 24327
1237 24327 -759 -23525 11437 18417 -19049 -9438 22720 -280 -21434 9206 17236 -16052
1249 -16052 -10468 20381 2279 -21266 6410 18670 -14252 -13376 20178 4476 -23040 4852
1261 4852 20405 -14823 -14467 21078 4735 -23399 5613 20554 -15067 -13624 20540 4010 -22075
1274 -22075 5063 19068 -13198 -13397 18226 5317 -20549 2708 19382 -10945 -14844 17392
1286 17392 7653 -20523 1167 20875 -10039 -16254 17834 8890 -21949 1008 21478 -10787
1298 -10787 -16658 18132 8576 -21643 1040 20066 -9375 -15791 16336 8535 -19115 -316 19445
1311 19445 -6815 -15513 13637 10613 -16942 -2983 19536 -5176 -17101 13139 12443 -19511 -3531
1324 -3531 21300 -4834 -18022 14118 11274 -19399 -3143 20601 -6448 -17241 13290 11445
1336 11445 -18341 -3828 18910 -4904 -17147 10998 12227 -16754 -5495 19263 -2706 -18283
1348 -18283 10234 13998 -16854 -7152 20110 -2292 -19609 10296 14832 -17562 -7013 20198
1360 20198 -2279 -18961 10886 13840 -16161 -6447 18751 -1651 -17109 8892 13973 -13964
1372 -13964 -7302 17277 1019 -17477 6507 15209 -12966 -9731 17917 2302 -18808 6411
1384 6411 16635 -13706 -10793 19239 1948 -19571 7192 15867 -14137 -9654 18321 1392 -18308
1397 -18308 6350 15003 -12779 -9547 16311 2511 -17071 3961 15352 -10658 -11230 15080 4963
1410 4963 -17931 2573 16939 -10154 -12869 15801 5606 -19147 2442 17327 -10535 -12893
1422 -12893 16038 5470 -18103 2522 16454 -9890 -12019 14515 5398 -16767 1421 15734
1434 15734 -7905 -12635 13149 7362 -16409 -276 16950 -7089 -13998 13241 8541 -16947 -841
1447 -841 17892 -6513 -14594 13590 8629 -17419 -600 17509 -7002 -13978 12837 8386 -15952
1460 -15952 -1072 16369 -5505 -13574 11184 9478 -14402 -2947 16598 -3347 -14786 10122
1472 10122 10874 -15028 -4371 17085 -3204 -15604 10260 11090 -15668 -4260 17113 -3425 -15452
1485 -15452 10432 10438 -14773 -4085 15674 -3002 -14563 8813 10246 -13344 -5367 15099 -1254
1498 -1254 -15393 7004 11812 -12747 -7001 15723 -218 -16337 7040 12978 -13314 -7246 16747
1511 16747 -402 -16267 7463 12584 -13008 -6798 15687 -294 -15334 6750 12316 -11306
1523 -11306 -6882 14049 1079 -14399 4836 12789 -9862 -8451 13643 3201 -14774 3739
1535 3739 14242 -10148 -9854 14673 3215 -16190 4254 14371 -10773 -9471 15060 2973 -15719
1548 -15719 4382 13547 -10218 -8666 13520 3015 -14520 2923 13098 -8485 -9561 12052
1560 12052 4750 -14513 1094 14007 -6984 -11293 12154 5843 -15126 635 14902 -7557
1572 -7557 -11891 12374 5779 -15410 693 14457 -7328 -11006 11760 5809 -14084 62 13933
1585 13933 -6061 -11046 10436 6904 -13070 -1396 14086 -4653 -12241 9960 8064 -13839 -2355
1598 -2355 14686 -4555 -12916 10450 8560 -13758 -1832 15167 -4538 -12421 10244 8056 -13271
1611 -13271 -2046 14076 -3769 -12248 8793 8256 -11909 -3330 13467 -2229 -12498 7465 9925
1624 9925 -11741 -4854 14094 -1343 -13743 7552 10397 -12348 -5052 14499 -1650 -13981 7446
1637 7446 9980 -12274 -4666 13836 -1929 -12751 6965 9381 -10915 -5018 12804 -248 -12737
1650 -12737 5400 10290 -9938 -6651 12537 1066 -13749 4778 11692 -10090 -7509 13554 1117
1663 1117 -14233 5283 12046 -10236 -6919 13465 808 -13584 5003 11023 -9398 -6347 12089
1676 12089 1603 -12226 3695 10964 -7921 -7724 11177 3501 -12473 2108 12196 -7503 -8671
1689 -8671 11459 3931 -13423 2090 12784 -7909 -9234 12297 3930 -13803 2649 12690 -7835
1702 -7835 -8724 11563 3373 -12797 1759 11619 -6815 -8673 10247 4275 -12287 406 11888
1715 11888 -5508 -10455 9552 5695 -12719 -784 12803 -5173 -10799 10017 6386 -12943 -554
1728 -554 12896 -5384 -10715 9802 6070 -12235 -847 12287 -4655 -10173 8622 5994 -11309
1741 -11309 -1762 11682 -3208 -10549 7885 7491 -10766 -2792 12721 -2397 -11531 8105 8277
1754 8277 -11592 -2675 13085 -3133 -11302 8258 7910 -11466 -2470 12427 -2568 -10956 7374
1767 7374 7799 -10333 -3258 11568 -1290 -10869 5762 8768 -9389 -4842 11947 -282 -11725
1780 -11725 5450 9671 -9808 -5628 12366 -72 -12224 5505 9684 -9915 -5244 12194 -334
1793 -334 -11862 5326 8925 -9171 -5187 10830 325 -11012 4042 8988 -8051 -6099 10336
1806 10336 1717 -11480 2897 10329 -7719 -7299 10837 2442 -12162 2900 10868 -7931 -7069
1819 -7069 11198 2268 -11826 3316 10449 -7311 -6832 10398 2634 -10840 2335 9797 -6243
1832 -6243 -7277 9217 3552 -10304 928 10520 -5296 -8369 9270 4965 -11022 233 11273
1845 11273 -5257 -8836 9381 4820 -11662 709 11451 -5621 -8495 9384 4426 -10983 394
1858 394 10512 -5075 -8235 8537 4970 -10207 -806 10359 -3720 -9024 7419 6037 -10050
1871 -10050 -1984 10798 -2820 -9930 7141 6866 -10707 -2193 11291 -2685 -9893 7287 6391
1884 6391 -10166 -1944 10788 -2601 -9558 6550 6253 -9099 -2663 10152 -1606 -9254 5626
1897 5626 7147 -8950 -3492 10431 -951 -10158 5227 7922 -9127 -3821 11139 -780 -10535
1910 -10535 5759 7956 -8961 -3466 10640 -1023 -9941 5157 7692 -8200 -3964 9945 -51
1923 -51 -9451 3941 7968 -7288 -5039 9482 795 -10130 2827 9016 -7248 -5999 9874 1680
1937 1680 -10742 3091 9289 -7236 -6057 9977 1237 -10458 3399 8749 -6888 -5668 9115
1950 9115 1426 -9920 2225 8463 -5799 -6078 8242 2629 -9576 1095 8893 -5185 -7322
1963 -7322 8351 3572 -10031 996 9683 -5124 -7326 9058 3474 -10633 1149 9816 -5481
1976 -5481 -7054 8619 3276 -9585 824 9322 -4252 -6882 7307 3824 -8737 -282 9027
1989 9027 -3488 -7608 6579 5145 -9055 -1178 9574 -2885 -8294 6702 5244 -9136 -1115
2002 -1115 9927 -3179 -8194 7258 5050 -9202 -780 9561 -3418 -7898 6293 4994 -8371
2015 -8371 -1444 8676 -2306 -8050 5217 5387 -8194 -2612 8895 -1623 -8519 5163 6391
2028 6391 -8138 -3065 9405 -1337 -8975 5150 6245 -8099 -3014 9225 -1257 -8550 4941
2041 4941 6197 -7470 -3081 8786 -564 -8101 4191 6574 -6814 -3987 8272 265 -8513 3575
2055 3575 7223 -6616 -4437 8844 853 -9086 3581 7783 -6867 -4436 8837 419 -8849 3747
2069 3747 7198 -6400 -4032 8194 584 -8270 2640 6870 -5499 -4579 7725 1589 -7945 1910
2083 1910 7456 -5023 -5670 7612 2605 -8919 1794 8258 -5332 -6133 8055 2347 -8979 1807
2097 1807 7857 -5452 -5734 7687 1718 -8335 1174 7246 -4607 -5426 6809 2461 -8053 717
2111 717 7493 -3832 -6143 6476 3559 -8029 -148 8295 -3508 -6920 6625 3885 -8578 47
2125 47 8473 -3831 -6856 6825 3732 -8038 330 7949 -3147 -6211 6078 3727 -7378 -547
2139 -547 7583 -2538 -6463 5281 4666 -7078 -1496 7978 -1734 -7053 5030 5225 -7388 -1611
2153 -1611 8297 -2102 -7545 5462 4986 -7644 -1638 8085 -2005 -6810 5104 4577 -6792 -1717
2167 -1717 7558 -1594 -6864 3975 5219 -6172 -2739 7148 -788 -7492 3638 5623 -6436 -3512
2181 -3512 7553 -258 -7649 3625 6008 -6602 -3185 7528 -362 -7345 3508 5857 -5909
2194 -5909 -3181 7109 -56 -7206 3079 5820 -5087 -3728 6768 988 -7074 2328 6226 -4998
2208 -4998 -4168 7093 1551 -7578 2165 6930 -5099 -4236 7191 1320 -7713 2231 6546 -5091
2222 -5091 -3984 6895 1232 -7038 1988 6018 -4238 -4269 6161 1588 -6854 778 6495 -3673
2236 -3673 -5215 5885 2688 -7102 294 7179 -3631 -5604 5963 2610 -7685 711 6944 -3878
2250 -3878 -5212 6177 2107 -7150 895 6797 -3523 -4952 5645 2154 -6550 318 6364 -2894
2264 -2894 -5123 5075 2932 -6824 -319 6870 -2432 -5962 5047 3992 -6951 -821 7287 -2687
2278 -2687 -6207 5782 3642 -6734 -430 7069 -2296 -5411 4835 3518 -6049 -788 6549 -1899
2292 -1899 -5661 4305 3975 -5536 -1601 6547 -1366 -5912 3936 4547 -5736 -1974 6917 -1203 -6163
2307 -6163 4241 4614 -6270 -1694 6830 -1112 -6332 4067 4123 -6067 -1802 6467 -918 -6237 3580
2322 3580 4296 -5467 -2232 6032 -420 -6350 2945 4835 -5302 -3031 6446 95 -6527 2753 5324
2337 5324 -5371 -2891 6628 10 -6528 2999 5284 -5154 -3044 6182 129 -6276 2597 4816
2351 4816 -4584 -3138 5782 649 -5878 1730 5440 -4122 -3799 5760 1226 -6364 1386 5766 -4136
2366 -4136 -3859 6009 1119 -6637 1808 5710 -4302 -3696 6251 1181 -6486 1858 5782 -3960 -3561
2381 -3561 5493 1379 -5897 1129 5670 -3281 -4131 4950 2353 -6121 511 6061 -2797 -4752 5171
2396 5171 2749 -6325 479 6187 -3199 -4637 5403 1946 -6299 387 6005 -3204 -4326 4934 2356
2411 2356 -6044 230 5563 -2448 -4272 4459 2462 -5484 -546 5815 -1888 -4897 4015 3121 -5766
2426 -5766 -880 6408 -1740 -5202 4315 3300 -6043 -806 6145 -2104 -5155 4306 3195 -5660 -740
2441 -740 6111 -1759 -4903 3679 3395 -5040 -1113 5476 -1172 -5248 3155 3998 -5093 -1911 6020 -571
2457 -571 -5669 3173 4329 -4998 -1931 6238 -975 -5877 3419 4006 -5114 -1978 5542 -892 -5345
2472 -5345 3024 3924 -4650 -2162 5345 -471 -5498 2392 4216 -4337 -2557 5228 425 -5692 2002
2487 2002 4729 -4472 -3255 5436 595 -5927 2091 4669 -4304 -3008 5545 392 -5420 1964 4777
2502 4777 -3806 -3087 5187 1006 -5300 1632 4612 -3236 -3215 4801 1545 -5715 932 5043 -3342 -3887
2518 -3887 4892 1854 -5754 958 5270 -3288 -3843 5215 1433 -5439 1168 4946 -3385 -3454 4641 1366
2534 1366 -5400 696 4939 -2681 -3807 4126 2187 -5058 -156 5104 -2222 -4335 4136 2570 -5448
2549 -5448 -465 5731 -2223 -4761 4450 2668 -5405 -251 5329 -2213 -4313 4249 2433 -5200 -298
2564 -298 5130 -1871 -4075 3459 2635 -4876 -828 4962 -1177 -4529 3161 3179 -4679 -1087 5224 -919
2580 -919 -5158 3442 3579 -4876 -1237 5810 -725 -4928 3293 3310 -4746 -1180 5298 -907 -4604 3071
2596 3071 3534 -4542 -1573 5063 -482 -4716 2653 3715 -3778 -2146 5018 -45 -4857 2169 4247
2611 4247 -3813 -2245 5256 -17 -5378 2014 4152 -4366 -2159 5200 -108 -5035 2121 4123 -3993
2626 -3993 -2778 4631 176 -4825 1630 4157 -3406 -2888 4288 917 -4990 1445 4445 -3087 -3071 4670
2642 4670 807 -5178 1415 4641 -3464 -3392 4568 976 -5061 1275 4683 -3003 -2963 4286 1132 -4802
2658 -4802 802 4397 -2507 -3315 4007 1531 -4597 253 4622 -2319 -3825 4220 2392 -4985 276
2673 276 5077 -2465 -3873 4289 2090 -4946 377 4906 -2366 -3556 3841 1888 -4630 -68 4455
2688 4455 -1784 -3477 3412 2334 -4306 -411 4521 -1337 -4177 3195 2834 -4397 -1111 4832 -1171
2703 -1171 -4270 3003 3086 -4665 -1049 4967 -1389 -4577 3078 2735 -4668 -648 4886 -1192 -4226 3082
2719 3082 2770 -3874 -810 4394 -761 -3998 2526 3088 -3997 -1592 4606 -307 -4576 2394 3749
2734 3749 -3866 -1892 4964 -202 -4579 2460 3720 -3880 -1604 4994 -162 -4242 2057 3508 -3848
2749 -3848 -1743 4426 99 -4209 1716 3632 -2998 -2310 4248 497 -4371 1376 3887 -3243 -2473
2764 -2473 4537 731 -4646 1367 3989 -3211 -2843 4374 617 -4714 1580 3728 -2900 -2432 4178
2779 4178 663 -4363 1046 3657 -2829 -2775 3707 1054 -4313 538 4271 -2356 -3267 3646 1521 -4658
2795 -4658 408 4590 -2497 -3359 4146 1491 -4439 664 4368 -2436 -3349 3711 1394 -4187 472
2810 472 3998 -1878 -3141 3611 1661 -3782 -26 4181 -1515 -3310 3343 2133 -4086 -405 4807
2825 4807 -1478 -3589 3336 2488 -4525 -204 4497 -1417 -3707 3110 2123 -4221 -11 3990 -1658
2840 -1658 -3392 2674 2271 -3827 -929 3941 -1083 -3627 2316 2442 -3802 -1501 4094 -485 -4039
2855 -4039 2322 2878 -3635 -1759 4467 -562 -4022 2417 2928 -3941 -1308 4260 -680 -3788 2145
2870 2145 2723 -3437 -1402 4008 -438 -3834 1777 2833 -3199 -1896 3852 45 -3901 1588 3438
2885 3438 -3166 -2001 3982 384 -4125 1562 3269 -3068 -1879 4228 348 -3982 1627 3209 -2946
2900 -2946 -1938 3968 407 -3791 1372 3417 -2482 -2244 3549 554 -3880 891 3775 -2344 -2611
2915 -2611 3443 1112 -4277 966 3832 -2494 -2613 3995 829 -4129 996 3643 -2593 -2464 3472
2930 3472 957 -3838 843 3466 -2175 -2528 3292 1142 -3880 394 3512 -1973 -2933 3259 1623
2945 1623 -3865 213 3736 -1875 -3190 3366 1607 -4016 274 3800 -1919 -2980 3175 1590 -3849
2960 -3849 326 3771 -1836 -2783 2892 1603 -3421 -544 3528 -1054 -3080 2634 2233 -3598 -459
2975 -459 4018 -1030 -3584 2654 2335 -3586 -603 3940 -1121 -3260 2723 2101 -3439 -535 3862 -818
2991 -818 -3221 2535 2201 -3219 -839 3532 -758 -3115 2042 2400 -3030 -1358 3361 -399 -3417 1926
3007 1926 2839 -3133 -1527 3598 -37 -3832 1924 2788 -3226 -1254 3865 -268 -3700 1915 2637 -3109
3023 -3109 -1428 3635 -178 -3488 1674 2809 -2735 -1430 3482 295 -3803 1305 3136 -2701 -1986
3038 -1986 3575 353 -3615 1022 3261 -2631 -1977 3430 377 -3609 1119 3177 -2571 -1802 3355
3053 3355 341 -3540 1047 3013 -2205 -2022 3044 696 -3315 774 3193 -2110 -2436 2765 1111
3068 1111 -3595 416 3366 -2031 -2696 3169 923 -3950 625 3300 -2138 -2638 3061 1042 -3282
3083 -3282 497 3228 -1951 -2387 2703 1227 -3157 169 3199 -1677 -2663 2474 1488 -3179 -170 3509
3099 3509 -1347 -2839 2609 1623 -3655 -78 3710 -1406 -2958 2562 1650 -3418 -136 3507 -1195
3114 -1195 -2685 2390 1748 -2903 -499 3216 -1007 -2495 2121 1961 -2992 -700 3196 -401 -3100
3129 -3100 1698 2234 -3237 -911 3440 -788 -3143 2329 2226 -3249 -421 3466 -716 -3177 2008
3144 2008 2129 -2889 -706 3116 -473 -2717 1768 1910 -2418 -1355 3067 -74 -3230 1176 2488
3159 2488 -2638 -1760 3205 27 -3371 1318 2639 -2834 -1387 2883 94 -3276 1505 2403 -2719
3174 -2719 -1306 3103 39 -2970 1322 2566 -2324 -1599 2866 385 -2803 1126 2674 -2085 -1921
3189 -1921 2825 412 -3070 1127 2754 -2004 -2001 3139 777 -3239 1029 2879 -2170 -1617 2816 488
3205 488 -3240 861 2631 -1870 -1939 2451 821 -3087 658 2861 -1481 -2207 2457 1099 -3218 291
3221 291 2900 -1510 -2391 2622 1004 -3034 487 2908 -1693 -2203 2659 1009 -3254 392 2736 -1537
3237 -1537 -2238 2343 975 -2889 70 2820 -1055 -2269 2207 1332 -2657 -182 3012 -1191 -2659
3252 -2659 2411 1701 -2909 -482 3257 -1158 -2801 2497 1622 -2907 -293 3048 -942 -2525 2162
3267 2162 1419 -2719 -117 2705 -690 -2416 1786 1941 -2275 -555 2849 -348 -2529 1715 1939 -2622
3283 -2622 -960 2997 -283 -2698 1735 2138 -2722 -899 3120 -674 -2721 1639 1831 -2537 -801
3298 -801 2863 -35 -2650 1455 1848 -2323 -1002 2609 -194 -2845 1314 2335 -2048 -1114 2632 235
3314 235 -2947 1047 2433 -2353 -1428 2813 365 -2949 969 2423 -1981 -1230 2737 52 -2866 1438
3330 1438 2223 -2151 -1123 2611 245 -2761 717 2136 -1617 -1537 2506 463 -2985 802 2350 -1751
3346 -1751 -1738 2519 545 -2815 582 2397 -2008 -1673 2798 660 -2803 808 2476 -1823 -1778 2600
3362 2600 691 -2704 564 2500 -1463 -1728 2272 934 -2667 116 2702 -1405 -2146 2332 1258
3377 1258 -2613 286 2640 -1294 -2221 2211 935 -2869 239 2598 -1398 -2116 2214 941 -2737
3392 -2737 119 2497 -1000 -1781 1789 1104 -2471 -283 2515 -949 -2433 1829 1393 -2504 -209 2714
3408 2714 -853 -2488 1941 1547 -2845 -383 2706 -809 -2433 2064 1424 -2575 36 2559 -699
3423 -699 -2173 1804 1333 -2162 -571 2490 -560 -2302 1412 1748 -2150 -827 2684 -400 -2408 1433
3439 1433 1742 -2100 -939 2778 -201 -2821 1340 1908 -2270 -945 2606 -444 -2239 1571 1592 -2267
3455 -2267 -1147 2489 -149 -2425 854 1943 -2187 -980 2251 34 -2485 960 2107 -2019 -1295
3470 -1295 2505 186 -2610 923 2391 -2142 -1284 2630 -27 -2745 964 2152 -1838 -1180 2616
3485 2616 459 -2673 715 1999 -1532 -1500 2073 322 -2427 836 2033 -1622 -1528 2480 568 -2602
3501 -2602 669 2214 -1468 -1710 2396 492 -2534 724 2329 -1558 -1729 2404 614 -2594 520
3516 520 2105 -1364 -1601 2006 968 -2371 136 2266 -1045 -1989 1982 1090 -2312 -121 2682 -1161
3532 -1161 -2134 1887 1152 -2486 -14 2552 -1155 -1949 2037 986 -2384 77 2220 -1065 -1886 1738
3548 1738 935 -2073 -164 2236 -808 -2043 1462 1104 -2118 -307 2352 -889 -2271 1564 1451 -2426
3564 -2426 -487 2597 -529 -2370 1713 1459 -2293 -609 2290 -431 -2043 1367 1218 -2210 -713
3579 -713 2495 -369 -2148 1269 1513 -2097 -634 2407 -201 -1907 1268 1922 -1791 -1036 2466 -22
3595 -22 -2377 1253 1783 -2016 -815 2372 -290 -2331 1117 1648 -1643 -973 2149 -337 -1929 1023
3611 1023 1618 -1723 -1202 2070 132 -2246 682 2012 -1819 -1267 2129 23 -2221 802 2005 -1662
3627 -1662 -1442 2278 119 -2553 617 1950 -1737 -1277 1876 -89 -2230 712 1837 -1402 -1460 1911
3643 1911 400 -2209 566 1988 -1137 -1454 2020 618 -2213 352 1990 -1186 -1503 1985 537
3658 537 -2362 489 2136 -1282 -1382 2058 525 -2190 395 2008 -1151 -1385 1717 701 -1884 356
3674 356 2095 -880 -1804 1708 783 -1761 -116 2210 -851 -1916 1809 1103 -2256 -49 2069 -884
3690 -884 -1730 1756 796 -2112 12 1808 -948 -1887 1639 997 -1737 -175 1904 -665 -1828 1143
3706 1143 1168 -1916 -365 1945 -512 -1996 1120 1293 -1810 -185 2215 -234 -1666 1575 1402 -1985
3722 -1985 -487 2211 -382 -1949 1290 1331 -1864 -352 2067 -300 -1838 1088 1241 -1785 -556 2006
3738 2006 -233 -1839 759 1316 -1689 -817 2031 -203 -1987 785 1646 -1734 -1038 2192 24 -1902
3754 -1902 910 1600 -1722 -757 2326 -77 -1674 922 1455 -1692 -1129 1863 -37 -1840 802 1408
3770 1408 -1238 -1081 1789 277 -1942 357 1833 -1251 -1056 2032 427 -2125 635 1726 -1353
3785 -1353 -1110 1974 247 -1510 642 2031 -1186 -960 1953 610 -2002 1186 1370 -1419 -949 1610
3801 1610 955 -2033 -478 1710 -1032 -1561 1540 697 -1965 456 1779 -1082 -1302 1566 920 -1627
3817 -1627 284 1998 -1250 -1503 1373 908 -1768 8 1582 -974 -1434 1440 857 -1838 79 1774
3833 1774 -612 -1668 1395 977 -1888 -83 1887 -570 -1579 1592 960 -1554 203 2030 -667
3848 -667 -1294 1579 891 -1789 47 1674 -708 -1531 988 1032 -1554 -304 1825 -342 -1696 1102
3864 1102 1242 -1673 -241 1960 -504 -1660 1086 1466 -1453 -447 1810 -240 -1743 1130 1273 -1378
3880 -1378 -477 1666 -406 -1639 871 1000 -1583 -350 1525 -59 -1629 1035 1351 -1358 -763 1790
3896 1790 167 -1837 668 1207 -1341 -581 1562 -146 -1722 786 1327 -1615 -497 1662 -140 -1548
3912 -1548 936 1280 -975 -786 1765 66 -1633 477 1351 -1206 -925 1718 206 -1849 533 1462
3928 1462 -1192 -1248 1654 238 -1567 475 1700 -1230 -1171 1825 367 -1752 364 1595 -1191 -1133
3944 -1133 1380 335 -1694 415 1496 -735 -1126 1363 494 -1639 -9 1565 -973 -1319 1492 745
3960 745 -1771 323 1660 -891 -1344 1284 569 -1754 213 1708 -761 -1319 1343 665 -1748 -73
3976 -73 1701 -638 -1095 1192 774 -1417 28 1697 -574 -1349 1029 1011 -1654 -315 1703 -270 -1513
3993 -1513 1051 1536 -1788 232 1293 -779 -1198 1268 999 -914 -569 1489 -802 -1192 1101 1035 -1135
4010 -1135 -135 1626 -694 -1460 1097 1674 -1145 -509 1521 -447 -1255 573 1134 -1119 -118 1795
4026 1795 -315 -1242 771 800 -1278 -495 1176 -200 -1678 1055 998 -1191 -463 1700 -12 -1552 722
4043 722 1068 -1208 -886 1479 183 -1781 794 1204 -996 -936 1591 67 -1775 688 1289 -1073 -910
4060 -910 1202 -22 -1463 485 1197 -1035 -621 1409 172 -1612 1021 1267 -999 -811 1215 296
4076 296 -1593 231 1326 -877 -1018 1430 374 -1841 153 1480 -1099 -746 973 428 -1369 382
4092 382 1940 -835 -952 1552 403 -1266 -79 1333 -414 -728 1374 416 -1513 463 1225 -522
4108 -522 -1274 1405 304 -1792 4 1485 -879 -1408 1299 371 -1381 109 1711 -701 -1213 1192
4124 1192 463 -1423 129 1421 -835 -1279 1118 510 -1324 315 1482 -900 -1328 1370 1051 -1301
4140 -1301 -356 1638 -226 -1697 1374 535 -1504 -108 1550 -634 -1174 849 699 -1718 -534 1765
4156 1765 -619 -1071 780 855 -1434 -332 1004 -461 -925 948 1084 -1409 -475 1122 -326 -1519
4172 -1519 981 874 -1194 -639 1327 -57 -1706 289 971 -1157 -559 1463 -167 -1281 430 1380
4188 1380 -1469 -720 1390 363 -2002 906 885 -519 -754 1296 -76 -1409 820 1011 -1011 -656
4204 -656 1388 219 -1690 784 1096 -1079 -621 1484 70 -1521 701 972 -1289 -749 1341 -75
4220 -75 -1376 485 1128 -979 -769 1411 192 -1634 555 1296 -886 -960 1325 282 -1595 297 1501
4237 1501 -1142 -1110 1318 265 -1519 117 1277 -978 -1138 1243 319 -1302 466 1494 -800 -880
4253 -880 1224 367 -1360 171 1508 -644 -1085 1360 477 -1256 21 1431 -478 -1087 983 683
4269 683 -1435 3 1308 -776 -1189 1575 708 -1481 573 1535 -885 -1606 1315 832 -1363 768
4285 768 1257 -312 -1000 867 557 -1557 -767 1314 -850 -1888 1341 1330 -1263 -398 1667 455 -1448
4302 -1448 1191 463 -1129 -225 1467 -568 -1197 1483 793 -1068 -80 1405 -443 -1380 946 826 -977
4319 -977 -464 1477 -419 -1313 775 982 -1504 -307 1260 46 -1511 796 1245 -1403 -463 1420
4335 1420 -224 -1253 796 1409 -1290 -597 1265 -179 -1439 677 974 -886 -471 1300 94 -976
4351 -976 545 988 -1406 -300 1159 433 -1518 369 1062 -1232 -395 1627 733 -1580 521 1074 -1264
4368 -1264 -1163 1245 622 -903 574 1167 -923 -589 1923 165 -1072 794 1208 -712 -902 1961
4384 1961 354 -1748 713 1369 -725 -1233 2317 660 -1133 -26 1453 -582 -656 1388 447 -1178
4400 -1178 -24 1654 -818 -856 1306 304 -1852 -387 1703 -878 -778 1280 237 -891 -510 1498
4416 1498 -856 -1780 754 417 -1144 -387 1452 -951 -1145 1336 -430 -1818 -140 1589 -784 -1544
4432 -1544 1116 1037 -795 -560 1193 -203 -1573 1031 786 -1785 217 1638 -382 -1071 693 799
4448 799 -1744 -125 1471 -744 -972 929 683 -1642 275 1307 -173 -1466 984 575 -1198 -460
4464 -460 1379 -501 -1122 1017 729 -1093 -101 1408 -60 -1403 1140 929 -983 -244 1458 -40
4480 -40 -1235 791 845 -1104 -821 1633 -212 -1414 673 1360 -1426 -597 1397 -22 -1404 924 541
4497 541 -1183 -658 1499 -67 -1221 -599 1235 -854 -1248 1662 -402 -1654 834 2047 -996 -93
4513 -93 1222 -277 -1537 572 1293 -1150 -315 1094 298 -1222 268 1396 -1257 -560 1117 319 -1587
4530 -1587 862 1042 -1000 -997 1077 434 -1538 170 1643 -909 -731 1370 535 -1289 563 1494 -907
4547 -907 -1143 1502 357 -1834 1088 1422 -732 -1100 1385 312 -1436 276 1411 -686 -821 1274
4563 1274 564 -1405 289 1502 -530 -1304 1075 397 -1528 102 1467 -589 -1502 1244 684 -1286
4579 -1286 323 1611 -778 -1176 1088 373 -1384 2 1249 -604 -1364 1161 403 -1193 -89 1140
4595 1140 -241 -1249 1122 600 -983 -241 1426 -283 -1599 1031 561 -1208 -154 1499 -467 -1333
4611 -1333 1046 918 -1187 -465 1419 -525 -1387 1037 895 -1219 -399 1283 -234 -1405 833 1009
4627 1009 -1147 -287 1424 19 -1224 466 1144 -884 -666 1821 326 -1473 824 1372 -1380 -221
4643 -221 1084 -99 -1389 635 771 -1287 -449 1483 -4 -1352 848 830 -834 -263 1321 80
4659 80 -1529 422 1495 -1165 -597 1338 335 -1803 257 1339 -820 -458 1029 340 -1129 374
4675 374 1009 -1100 -794 1366 -144 -1507 557 1268 -1183 -1235 1394 112 -1194 262 1613 -1327
4691 -1327 -1036 1235 597 -1460 421 1496 -609 -1029 874 1034 -1318 -256 539 -459 -726 1696 -1
4708 -1 -874 677 1701 -1108 -925 1019 933 -1398 477 1735 -824 -858 1083 160 -278 876 1432 -679
4726 -679 -939 1647 46 -1076 -819 1328 -290 -969 697 864 -1250 177 1431 -214 -1028 1036
4742 1036 1102 -1129 -329 1351 -487 -1240 1105 1008 -840 -475 1540 -246 -1322 739 1237 -1308 -215
4759 -215 1644 -12 -1588 871 1141 -1283 -406 1535 -251 -1175 1149 911 -1397 -347 1355 -226
4775 -226 -1400 605 1281 -1064 -353 1349 -227 -1283 710 1001 -1002 -546 1317 208 -1482 594
4791 594 1125 -1238 -655 1446 -23 -1603 524 1341 -1375 -534 1319 32 -1488 619 1283 -1072
4807 -1072 -847 1275 -130 -1461 376 1419 -1044 -954 1250 242 -1452 264 1509 -1139 -868 1260
4823 1260 383 -1559 646 1335 -959 -863 1226 435 -1384 325 1367 -777 -1060 1148 444 -1482 101
4840 101 1209 -579 -1155 1007 435 -1526 -24 1313 -604 -878 1424 533 -1330 45 1722 -1015
4856 -1015 -1361 1208 496 -1462 245 1619 -861 -1093 1051 613 -1451 100 1354 -641 -1023 1114
4872 1114 679 -1456 -285 1453 -613 -1342 930 835 -1218 -272 1388 -510 -1215 956 1026 -1328 -213
4889 -213 1470 -323 -1366 1015 753 -1403 -189 1199 -431 -1200 1015 1007 -1174 -372 1541 -23 -1380
4906 -1380 1017 837 -1236 -518 1447 -223 -1561 680 1159 -1061 -523 1514 -469 -1444 890 1081
4922 1081 -1209 -329 1449 -244 -1163 705 785 -1178 -545 1557 -134 -1292 366 1220 -1268 -810 1059
4939 1059 52 -1328 480 1331 -1112 -990 1404 161 -1413 527 1298 -1079 -760 1466 195 -1451
4955 -1451 554 1092 -885 -710 1325 192 -1556 573 1238 -971 -811 1208 462 -1403 166 1471
4971 1471 -812 -1126 1233 230 -1559 333 1574 -960 -551 1395 836 -900 319 1344 -562 -637
4987 -637 263 381 -848 626 1835 480 -1211 1334 383 -770 -235 1468 -373 -1033 1060 274 -1332
5004 -1332 194 1547 -32 -708 890 901 -1494 -366 1133 -290 -1390 1530 424 -983 -126 1374
5020 1374 -301 -973 1063 910 -1183 -316 1310 -358 -1203 775 886 -1172 -390 1557 -364 -1154 822
5037 822 1067 -1495 -69 1507 -237 -1316 761 846 -1192 -444 1146 -394 -1367 776 782 -1149 -490
5054 -490 1108 -97 -1175 598 1129 -1183 -854 1387 222 -1411 319 1191 -1321 -757 1447 216
5070 216 -1636 676 1031 -1099 -552 1234 -118 -1358 495 1315 -921 -718 1263 482 -1416 302
5086 302 1200 -1072 -708 1166 220 -1494 159 1444 -592 -776 1222 372 -1426 212 1298 -965
5102 -965 -787 1255 269 -1483 397 1637 -778 -1036 931 285 -1349 327 1031 -635 -911 1083 559
5119 559 -1292 -39 1138 -698 -1131 1085 580 -1298 120 1575 -726 -1123 981 543 -1178 43
5135 43 1418 -559 -1064 1082 536 -1014 -118 1062 -436 -1136 1115 683 -1361 -293 1368 -446 -1046
5152 -1046 809 800 -1272 -378 1580 -460 -1358 968 994 -1240 -145 1331 -471 -1203 1025 799 -1333
5169 -1333 -295 1232 -221 -945 609 762 -1118 -225 1372 -63 -1092 612 1133 -1040 -597 1520
5185 1520 -14 -1280 423 1041 -1438 -518 1537 -210 -1226 668 1159 -1027 -564 1326 -82 -1261
5201 -1261 594 992 -1147 -558 1311 -79 -1229 407 989 -1107 -659 1135 204 -1327 534 959
5217 959 -917 -693 1193 174 -1445 451 1275 -895 -775 1253 -74 -1386 401 1131 -752 -590
5233 -590 980 451 -1134 192 1210 -735 -658 980 554 -1185 60 1346 -739 -1007 1098 422 -1368
5250 -1368 287 1436 -651 -894 1173 597 -1448 311 1031 -547 -976 967 242 -1250 -3 1030
5266 1030 -476 -868 927 488 -1062 -3 1118 -211 -834 1107 596 -1337 -106 1240 -310 -1187
5282 -1187 737 779 -917 -343 1306 -388 -1188 816 383 -1185 -166 1066 -407 -924 789 690 -1174
5299 -1174 -269 1266 -50 -1129 832 883 -998 -272 1111 -211 -1054 820 643 -1271 -441 1278 -61
5316 -61 -1151 683 927 -932 -528 1201 -6 -930 555 750 -1080 -392 1182 -169 -879 513 942
5333 942 -751 -500 915 40 -1149 286 803 -956 -467 1098 88 -990 369 1172 -668 -415 934
5350 934 -32 -1263 535 1219 -734 -486 975 25 -1252 381 942 -936 -843 1018 374 -1364 103
5367 103 1263 -637 -791 985 297 -868 130 986 -551 -743 977 371 -706 94 1150 -810 -757
5384 -757 835 214 -1236 -3 1038 -734 -554 1081 461 -1077 -133 1037 -359 -917 783 399 -1010
5401 -1010 -48 1070 -220 -985 795 623 -1247 -249 1055 -244 -895 830 571 -1216 -2 1003
5417 1003 -518 -907 822 341 -974 -246 1251 -222 -1169 588 642 -1122 -311 1071 -188 -829 676
5434 676 669 -1256 -256 968 -325 -1155 632 814 -1077 -53 924 -189 -935 545 689 -860 -282
5451 -282 1192 -134 -1047 495 795 -947 -512 1196 -6 -1008 244 995 -817 -670 1117 120 -1374
5468 -1374 674 874 -691 -453 1165 26 -1171 251 760 -877 -432 1039 217 -1078 330 767
5484 767 -755 -626 1087 224 -1305 208 1021 -803 -909 1011 331 -935 328 942 -668 -826 939
5501 939 368 -1197 271 896 -482 -764 852 223 -1047 199 1020 -466 -790 862 364 -941 134
5518 134 943 -293 -839 790 592 -770 77 1048 -288 -955 967 373 -1185 -34 1064 -674 -634
5535 -634 1031 512 -1098 114 1012 -312 -904 470 546 -780 -51 1082 -176 -809 839 641 -807
5552 -807 -3 1139 -122 -828 555 745 -999 -72 900 -177 -1050 716 541 -1085 -165 946 -287
5569 -287 -795 726 511 -969 -267 1015 -359 -1011 567 561 -770 -556 894 5 -1192 392 808 -839
5587 -839 -331 1033 -176 -1144 606 663 -883 -342 877 -153 -1042 579 823 -586 -693 798 -133
5604 -133 -848 216 951 -239 -899 817 357 -830 514 1067 -874 -435 1204 -65 -867 670 1449
5621 1449 -881 -1040 1174 601 -753 331 1026 -773 171 1273 -281 -684 316 559 -181 -678 340
5638 340 -112 -818 488 633 282 -309 950 339 -1746 -321 1703 -229 -1158 1319 282 -1086 -361
5655 -361 909 -152 -669 671 300 -1314 -309 900 -399 -408 583 422 -795 -247 1257 342 -667
5672 -667 358 646 -1063 -234 932 -571 -1079 777 472 -749 4 1078 -130 -1026 832 328 -614
5689 -614 -188 574 -250 -936 794 698 -821 -277 801 -99 -1320 526 742 -609 -205 586 -86 -857
5707 -857 608 906 -822 -424 1129 40 -906 360 532 -728 -338 1071 -57 -892 419 968 -456
5724 -456 -395 1066 -1 -788 404 839 -425 -457 837 225 -950 155 637 -641 -489 479 247 -1027
5742 -1027 94 708 -606 -502 680 -194 -801 158 800 -375 -494 991 341 -1111 307 305 -558 -701
5760 -701 751 753 -49 -303 784 829 -1237 889 407 -1056 -329 857 -822 -413 -22 154 -835 -134 751
5779 751 -623 -758 25 294 -768 -319 1259 -190 -467 520 534 -782 -498 476 -507 -203 756 424 -638
5798 -638 -30 871 -517 -1043 850 1127 -143 39 798 -115 -959 554 698 -1220 -53 960 -339
5815 -339 -1281 708 255 -727 -202 -94 -419 -1375 244 25 -257 210 1199 59 -445 830 929 -858 -416
5834 -416 512 -300 -544 1 265 -1009 -327 802 -356 -413 -121 548 -616 -634 227 -600 -572 457 470 -410
5854 -410 51 1046 -369 -691 -272 693 -1020 -262 543 533 -427 352 330 -1154 117 630 120 -1285 -130
5873 -130 9 -795 -291 1068 118 -597 -478 639 -931 -554 752 109 -781 -300 716 -391 -527 995
5891 995 54 -905 22 814 -676 -362 1174 -346 -902 256 1385 -790 -360 286 -954 -574 -1177 1165
5909 1165 -677 -539 1269 470 -590 -771 1357 686 172 1040 685 -365 412 1044 139 -965 116
5926 116 283 -1232 -295 258 -384 -1218 -15 261 -844 -98 632 -188 -545 732 711 147 -110 497 -481
5945 -481 -421 392 -397 71 -520 820 -839 -1111 590 731 224 -808 217 -485 -1122 477 220 -1015
5963 -1015 -545 397 -574 -578 192 346 -1474 -109 670 -272 -446 497 641 -1017 -464 712 -32 -903 -45
5982 -45 791 -425 -328 707 664 -666 296 64 -679 -10 1243 283 -1562 78 1123 -903 -689 705
6000 705 365 -247 -615 97 -233 -301 -731 -319 -320 179 702 -328 -843 1460 -757 -341 320 -24 -533 -665
6020 -665 807 -224 -622 795 231 310 332 648 142 -785 191 -170 -512 -1016 415 -94 -514 134 671
6039 671 -34 -538 348 280 -1317 -446 832 -731 -272 -599 -598 -1214 -34 565 45 -260 153 -134 -110 -298
6059 -298 681 -839 -969 461 113 -756 -229 359 -99 -987 602 181 -1087 -195 403 -151 -244 760 46
6078 46 -448 -178 514 -408 -346 60 447 -485 -21 735 -614 -734 402 193 -953 -367 721 -130 -524
6097 -524 403 399 -460 9 424 151 -727 379 671 -488 -198 620 5 -936 366 624 -616 -327 847
6116 847 -225 -631 234 282 -428 -429 761 -139 -433 373 492 -653 -435 779 224 -686 189 493 -434 -288
6136 -288 459 15 -570 234 704 -476 -324 510 32 -469 159 498 -427 -59 339 156 -713 97 638 -574
6156 -574 -422 764 176 -461 380 534 -241 -358 550 65 -662 56 440 -427 -336 381 119 -795 110 602
6176 602 -177 -492 462 63 -601 84 589 -401 -363 374 499 -374 380 496 -185 -506 319 444 -453 81
6196 81 -265 -670 -1034 665 773 -878 89 356 -418 -847 414 203 -268 196 506 -214 -435 177 559
6215 559 -404 -137 399 -160 -321 131 396 -582 -365 497 -124 -562 393 171 -433 -237 424 -99 -354 393
6235 393 467 -549 -144 446 -178 -701 443 437 -450 4 632 38 -667 483 218 -356 -378 718 -110 -514
6255 -514 185 194 -353 -271 444 16 -616 361 522 -543 -268 118 260 -723 475 279 -137 -144 879 43 -57
6276 -57 234 119 -1086 -332 807 238 -396 349 397 -158 -194 585 -294 -526 168 295 -258 -413 531 164
6296 164 -630 315 514 -508 -413 399 323 -485 179 531 -353 -362 445 322 -713 252 307 -275 -334 217 87
6317 87 -464 52 448 -270 -578 501 97 -573 46 580 -340 -363 551 319 -571 106 533 -383 -578 303
6337 303 227 -523 68 310 -332 -490 342 298 -501 -156 383 -151 -332 330 529 -375 -34 393 -200 -461 479
6358 479 222 -518 70 336 -362 -325 478 369 -361 147 507 42 -771 275 72 -841 -13 557 -79 -496
6378 -496 147 16 -442 -100 580 83 -589 305 446 -568 -375 358 -5 -550 163 78 -366 -320 585 151
6398 151 -547 288 248 -360 187 231 -194 -299 449 387 -458 -221 448 -54 -362 438 457 -259 -285 466 8 -682
6420 -682 219 340 -327 -403 460 -63 -471 176 367 -50 -241 333 83 -473 118 498 -487 -356 272 279 -564
6441 -564 47 422 -463 -233 403 286 -804 -85 393 -118 -352 90 251 -331 -66 285 -148 -396 300 263
6461 263 -530 98 525 -238 -536 301 237 -538 237 456 -218 -391 498 118 -347 -83 235 -297 -252 343 328
6482 328 -597 -117 558 -326 -445 311 35 -330 22 448 65 -426 305 387 -389 -76 440 -192 -404 167
6502 167 577 -318 -276 313 -193 -428 215 234 -281 -179 710 -288 -384 256 259 -286 -68 446 -115 -215 401 150
6524 150 -478 -254 538 115 -484 139 385 -402 -84 349 -53 -571 6 337 -474 -233 381 151 -523 160
6544 160 238 -342 -146 238 23 -254 183 307 -311 -196 497 -85 -397 369 266 -405 -321 344 108 -503 1
6565 1 275 -271 -262 87 47 -641 31 287 -310 -533 487 34 -435 17 350 -26 -33 534 70 -586 173 443
6587 443 -266 -423 493 26 -247 -241 396 -336 -220 252 315 -455 60 537 -346 -350 491 152 -494 61 536 -271
6609 -271 -326 184 256 -477 -82 508 -225 -186 380 318 -514 303 198 -189 -379 335 35 -518 37 420 -47
6630 -47 -385 309 523 -272 215 502 -17 -539 311 374 -457 -192 692 64 -418 319 397 -408 -48 267 -41
6651 -41 -308 47 239 -255 -315 357 -199 -492 203 437 -426 -77 139 71 -736 135 597 -216 -217 358 -224 -516
6673 -516 352 272 -219 -310 274 211 -184 140 87 -213 -235 194 26 -430 180 287 -231 -337 362 169 -453 274
6695 274 340 -275 -374 303 173 -461 58 345 -295 -468 418 64 -363 -184 311 -195 -454 567 86 -733
6715 -733 142 321 -1 -238 510 199 -619 38 429 -142 -333 271 97 -416 -68 214 -463 -380 488 156
6735 156 -235 -198 519 -337 -343 74 129 -317 -3 568 -254 -365 138 164 -323 -196 292 -294 -549 197 237 -431
6757 -431 -44 350 -81 -384 336 517 -292 -147 367 -114 -386 218 367 -668 -315 471 6 -257 277 394
6777 394 -317 -111 545 54 -488 473 466 -528 -252 153 -267 -289 200 327 -482 50 325 96 -409 67 139
6798 139 -360 -183 433 41 -421 132 255 -168 -215 375 140 -467 224 344 -489 -408 513 -47 -422 236 33
6819 33 -439 -292 336 32 -543 299 235 10 73 156 -13 -84 -66 268 -18 -157 516 97 -425 348 253 -265
6841 -265 -354 233 47 -366 160 514 -276 -247 456 68 -626 25 233 -194 -141 154 79 -445 215 398 -77
6862 -77 -315 278 63 -512 -227 301 -150 -495 -14 290 -381 156 297 -198 -220 407 307 -473 -147 417 -434
6883 -434 -437 159 208 -383 23 378 -22 -288 334 143 -389 -297 197 -47 -417 306 -120 -625 70 723 -310
6904 -310 -281 195 113 -199 -407 1081 -401 -249 485 144 -464 -425 399 -216 -168 368 456 -35 211 839 0
6925 0 -433 -102 6 175 -394 555 -218 -798 177 303 -601 -463 433 -333 -658 -135 132 -391 -348 577 159
6946 159 -599 -99 -125 -19 -234 750 117 65 -242 728 -268 -898 131 -131 81 -482 677 -336 -961 374
6966 374 -107 -419 422 538 -94 -279 439 210 -293 -75 466 -191 -304 451 415 -574 -136 446 -264 -368
6986 -368 158 134 -309 -36 211 -97 -415 346 182 -367 188 399 -381 -232 309 303 -351 -19 470 -153 -183
7007 -183 441 254 -223 -71 479 -90 -479 359 72 -275 -68 367 -142 -345 335 238 -641 -84 256 -154
7027 -154 -373 240 159 -527 -153 185 -76 -514 166 504 -257 -201 227 274 -231 13 294 -357 -331 389 -151
7048 -151 -386 148 226 -270 -388 282 53 -450 249 385 -359 -396 329 27 -484 157 469 -305 -100 397 -106
7069 -106 -102 115 509 -124 -68 334 17 -201 87 174 -185 -308 247 127 -303 209 312 -101 -384 402 126
7090 126 -448 45 413 -80 -340 217 27 -213 -149 265 -144 -211 482 -56 -196 67 245 -219 -547 171 39
7111 39 -256 -234 233 -224 -199 263 289 -238 -84 221 -206 -337 271 109 -334 4 130 -315 -144 424 137
7132 137 -352 -169 270 4 -238 240 264 -413 107 364 -146 -283 171 278 -346 -187 263 0 -166 39
7152 39 -15 -344 -396 229 -22 -354 307 383 -400 5 239 -163 -327 18 238 -321 -184 193 78 -291 414
7173 414 120 -455 5 132 -196 -274 373 262 -463 127 347 33 -445 194 257 -294 -380 205 -132 -408 119
7194 119 355 -345 -137 135 -116 -409 337 239 -328 -114 222 -40 -379 72 270 -261 -324 265 60 -370 157
7215 157 456 -259 -253 335 287 -338 38 91 -300 -300 409 129 -461 92 401 -428 -177 455 48 -240 130 257
7237 257 -310 -84 277 397 -67 48 377 -264 -359 412 186 -188 54 236 -126 -281 428 167 -217 20
7257 20 281 -181 -240 354 248 -334 -208 363 53 -235 386 141 -354 -14 527 114 -423 248 39 -123 -93
7278 -93 365 -7 -325 263 225 -55 -112 131 -15 -370 176 327 -299 -222 451 -178 -75 249 182 -312 -206 356
7300 356 -69 -263 142 289 -152 -150 541 18 -255 108 481 -212 -30 249 146 -286 115 19 -455 -159 187
7321 187 -73 -233 234 95 -165 -74 372 -257 -373 56 191 -209 -61 195 206 -285 -42 271 -269 -11 272
7342 272 122 -194 178 381 -199 -422 268 278 -395 -7 462 -122 -20 386 77 -525 -217 355 -220 -308 236
7363 236 142 -196 -91 124 -352 -299 175 72 -175 24 96 -406 -254 115 90 -539 -71 202 -46 -428 185
7384 185 89 -132 8 351 -217 -200 111 213 -301 6 435 -302 -289 251 66 -197 182 175 -92 -294 125 223
7406 223 -311 33 366 -259 -264 34 194 -215 7 348 -86 -323 89 233 -226 98 395 15 -227 83 318
7427 318 -387 -231 560 -36 -382 202 241 -240 -47 241 -30 -359 -78 139 -220 67 232 -15 -302 193
7447 193 407 -165 -113 319 87 -310 174 446 -100 41 320 -70 -299 16 420 -247 37 315 -66 -60 61
7468 61 316 -175 -218 76 -22 -323 76 194 -185 81 257 102 -533 -64 -113 23 -170 317 33 -367 -90
7489 -90 343 -68 -106 373 27 -449 64 234 -12 -176 180 -40 -224 84 164 -295 206 -50 295 -316 41
7510 41 258 -90 -470 333 88 -120 -189 387 -54 -382 20 -49 -158 -75 245 43 -240 -8 -165 -276 136
7531 136 234 -50 -115 -9 72 -233 -237 171 -75 58 111 3 -100 -107 459 99 -437 179 12 -201 -234 115 -97
7554 -97 -108 376 113 -26 155 246 -109 -308 241 368 -290 -38 222 -82 -304 128 180 -244 -142 343 59
7575 59 -342 546 248 -163 -52 313 55 -187 23 -10 -149 -230 283 153 -240 167 77 -253 -202 62 -34 -224
7597 -224 427 245 -37 -136 121 -27 -344 282 72 -150 -23 285 14 -50 131 342 33 -304 222 133 -278
7618 -278 -10 414 184 24 -15 -311 -210 264 402 -226 -302 111 289 -153 -235 290 -125 -372 113 49 -484
7639 -484 141 502 -29 -107 -23 10 -10 154 140 -235 64 143 137 -21 -124 346 -153 -98 276 203 -163 8 192
7662 192 -5 -125 145 122 -324 -101 206 -182 -239 224 328 -151 73 152 14 -90 -15 85 -131 -19 182
7683 182 -237 -112 198 340 -119 -59 161 129 -313 40 288 -3 -26 240 134 -217 -28 99 -153 10 176
7704 176 -54 -426 -78 42 -133 -229 123 70 -387 -95 -11 -36 -106 339 -219 -142 100 -79 -138 -292 386 114
7726 114 -250 18 205 -273 -239 112 22 -180 -49 169 -232 -283 150 -56 -166 -163 312 -141 -145 206 242 -114 -201
7749 -201 249 -100 -121 52 45 -188 -49 273 63 -196 139 64 -40 -174 246 -128 -94 -70 268 -277 -102 287
7771 287 -153 -199 230 121 -303 158 -11 -237 62 36 333 -406 -54 403 -68 -145 90 212 -295 116 282
7792 282 -56 -92 143 246 -100 -114 422 -10 40 102 48 -198 -150 296 -16 -158 125 19 -106 -21 73 230 -85
7815 -85 186 180 -142 236 248 75 -148 -105 181 -160 -78 130 194 -198 -12 138 -259 154 334 -54 -237 103
7837 103 265 -49 -208 304 -158 -248 -9 219 -162 -150 346 -58 -162 63 248 127 -81 11 43 -34 134 274
7859 274 -280 -45 178 -195 -119 -92 197 -91 -99 142 36 -260 -131 292 -59 -2 186 -2 -379 -316 201 -191
7881 -191 86 39 272 -85 4 383 19 -272 151 167 71 43 251 -129 -235 116 80 -245 84 145 3 -246
7903 -246 46 264 53 27 40 -31 -76 -117 -12 -239 24 -125 -44 -56 71 155 -374 -120 4 -135 -33 44 172
7926 172 -92 -222 261 37 -257 133 110 -278 41 328 42 -195 -101 -27 94 -161 169 -99 -156 -82 -30 86
7948 86 -178 0 -54 -266 201 186 -335 -137 37 -10 -318 -84 190 35 -39 269 277 -48 37 181 -322 -410 183
7971 183 11 -339 -35 -43 -140 26 261 20 -258 -47 177 -127 -286 -51 -85 -179 -53 -124 -194 51 148 81 -82
7994 -82 37 30 17 -41 50 102 -397 -20 263 98 27 210 -48 -171 5 195 -127 -286 11 43 22 -123 148
8017 148 -64 -122 150 179 -73 13 254 24 -382 91 82 -343 39 65 1 125 -34 283 -57 -32 192 -46 -160
8040 -160 -189 -39 -180 124 156 41 -65 151 125 -57 -138 282 32 70 362 83 -89 -151 -75 -243 -233 139 -79
8063 -79 -74 -32 -76 -83 -59 -152 245 -214 -85 -31 -54 -223 2 293 110 -133 228 98 -164 -147 -43 -48 44 28 33 -172
8089 -172 15 176 -169 -97 146 -55 -373 156 108 -141 -40 137 68 -103 56 81 -254 -98 105 256 -331
8110 -331 83 -69 -13 -250 194 -175 -149 37 174 -246 -6 -136 -6 -70 -134 227 -135 102 107 329 -220 -132
8132 -132 137 30 50 56 241 -277 78 296 -91 -131 96 131 46 84 151 -130 -187 -28 70 -324 -73 32 78 -219
8156 -219 -148 306 -74 44 179 -54 -251 83 -60 8 145 238 39 -252 79 -20 -7 0 -102 172 -278 -128
8178 -128 76 131 28 50 175 84 15 -87 -139 -27 116 -88 -19
8191a9
$$ Imaginary data points
##PAGE= N=2
##DATA TABLE= (X++(I..I)), XYDATA
0 0 0 0 0 0 0 0 0 0 0 0 0 1 -8 8 -8 8 -16 16 -20 24 -32 34 -41 49 -57 68 -81 93 -105 122 -141 160 -183 206
34 206 -234 265 -298 331 -371 415 -464 514 -569 632 -699 773 -854 939 -1037 1142 -1259 1385
52 1385 -1527 1685 -1860 2057 -2279 2536 -2829 3175 -3584 4082 -4701 5492 -6547 8024 -10260
67 -10260 14063 -22187 79452 -187508 -145831 293797 -9372 -268544 97292 211049 -212543
78 -212543 -130124 233927 16984 -250215 85249 204783 -154442 -128743 222433 54745
88 54745 -223416 52448 217897 -139603 -157843 201513 59926 -249241 29620 211076
98 211076 -148709 -166940 203889 58833 -235616 44328 215818 -130934 -139992 203035 62581
109 62581 -210059 38932 191655 -114935 -145042 161501 64897 -203509 1612 186124
119 186124 -95078 -157390 154629 90995 -190230 -917 205406 -72605 -156808 161592
129 161592 101167 -192681 -2971 196368 -83354 -158249 143723 81908 -185966 -10276
139 -10276 176003 -70657 -143846 129818 92638 -155589 -14027 174524 -40762 -141525
149 -141525 113395 106671 -152071 -40237 170381 -39104 -164868 101146 108226 -162899 -46904
160 -46904 174599 -36758 -159756 108933 113872 -150954 -35913 172680 -30904 -147192
170 -147192 97503 103637 -139673 -50146 147808 -22931 -151204 69760 107777 -127297 -66109
181 -66109 148915 31 -150728 68523 129474 -118026 -69387 159399 5650 -156606
191 -156606 67888 124361 -126966 -72066 147769 -4568 -152703 61427 114181 -113920
201 -113920 -65337 139327 10464 -132653 53824 120518 -88991 -72405 129667 29319
211 29319 -137636 30971 127387 -89062 -96408 126904 35037 -151110 26869 137116 -89314
222 -89314 -95220 137173 40038 -144331 36008 135933 -84850 -86928 125841 33795 -135741
233 -135741 21210 117902 -76364 -93061 102970 40525 -126696 4756 120759 -55984
243 -55984 -98087 100976 61282 -123515 -2691 132359 -52101 -108224 101295 60001 -133755
254 -133755 -7286 126649 -59538 -109048 96542 56227 -126288 -4682 123544 -47213
264 -47213 -97531 91258 63834 -109456 -12148 118899 -32246 -104309 75151 71611 -110364
275 -110364 -31244 118952 -26030 -114482 72086 81089 -109366 -30523 127520 -20217 -109234
286 -109234 77960 82272 -103948 -26750 119114 -20905 -104708 64428 72846 -96954 -35931
297 -35931 105223 -12621 -102491 52843 80438 -84431 -41844 108232 3478 -104603 49361
308 49361 91572 -85611 -51055 111138 690 -114625 46657 86792 -91980 -52207 107281
319 107281 -2150 -108816 46144 84990 -80778 -46823 101242 7811 -98657 35434
329 35434 85323 -69273 -57766 90519 16463 -104365 20248 89598 -66677 -68915 92162
340 92162 25055 -106557 22115 98977 -63814 -65358 98342 25525 -103182 25119 92417
351 92417 -63780 -62500 87050 21372 -97368 15651 84740 -53227 -64027 78148 32747
362 32747 -88847 7474 92540 -39498 -70420 77461 45278 -93486 -390 98283 -42731
373 -42731 -80919 77826 43220 -100556 -1013 97407 -44872 -76827 78673 41846 -91786
384 -91786 2967 92206 -36942 -69886 68178 42766 -82947 -8663 83949 -28471 -76897
395 -76897 55345 48782 -82450 -19734 87539 -21651 -82044 57065 57975 -82323 -19552
406 -19552 94268 -21139 -82398 59183 54804 -84064 -19234 87193 -23400 -80541 51988
417 51988 51671 -77103 -22286 82904 -12942 -75889 46196 60318 -67389 -28545 84850
428 84850 -3226 -81660 41094 66164 -70584 -36208 85358 -4250 -86310 40237 65899
439 65899 -70075 -33442 85349 -2056 -78525 40828 64408 -61839 -31353 78101 2514
450 2514 -74944 29588 62307 -55615 -41365 70626 9414 -78422 21543 68986 -52789
461 -52789 -46582 75485 16158 -81067 23631 74375 -54391 -47027 76741 12303 -82257 21952
473 21952 67508 -55102 -46823 69246 11943 -76506 16938 65364 -45219 -46403 63831 21698
485 21698 -71123 8997 69702 -37285 -54683 61465 27849 -76844 2568 72973 -39196
496 -39196 -59589 62800 28521 -77432 6065 73970 -37664 -53522 63121 28251 -70105
507 -70105 5925 68766 -31966 -52206 53651 29298 -65458 -3842 65662 -24419 -57101 47716
519 47716 38080 -63875 -9887 72260 -18676 -61831 50722 44097 -67673 -10073 75135 -22112
531 -22112 -63750 50398 39313 -68589 -10164 68786 -22224 -59625 45478 38525 -59930 -12123
543 -12123 64657 -12597 -56881 37380 43488 -54426 -20801 63290 -7349 -63550 31822 47201
555 47201 -56900 -26438 65858 -6093 -66224 33842 49511 -56463 -23622 66996 -5189
566 -5189 -62130 33554 47177 -52557 -24338 60972 -2829 -60941 25697 47319 -47138 -30035
578 -30035 58510 5227 -61346 21276 54648 -43100 -34000 61892 10538 -63856 20495 57171
590 57171 -44859 -36012 60401 8305 -63574 19114 53168 -42359 -34090 55850 10660 -57348
602 -57348 15367 52334 -33752 -35201 50861 17305 -55902 7858 54491 -30788 -42614 48748
614 48748 20529 -60668 4012 58137 -31826 -45431 51905 21988 -61482 6456 58634 -31596
626 -31596 -42829 50261 20151 -57949 4220 53441 -28199 -42898 42291 22544 -53710 -3409
638 -3409 52734 -20283 -46242 38826 30303 -52305 -7851 57593 -15764 -50406 39677 33407 -55297
651 -55297 -9290 58067 -18188 -51095 38979 31082 -53455 -7931 55201 -15994 -45990 36008
663 36008 31702 -45873 -9822 51869 -8890 -46106 29610 35611 -43842 -17599 52242 -4882
675 -4882 -51533 27340 40293 -45580 -20507 56034 -3528 -53085 29660 42053 -45876 -18447
687 -18447 55649 -4988 -51118 27249 37847 -43263 -19803 48924 -2425 -48748 20623 38044
699 38044 -36940 -23821 46458 4826 -48573 16005 43195 -34714 -28416 47949 6887 -52426
711 -52426 15128 44042 -37347 -29583 47774 5826 -52086 15724 42669 -35283 -27303 46026
723 46026 7648 -47704 13345 42446 -29735 -29166 41933 11981 -47595 7054 44198 -26842
735 -26842 -34397 41379 16143 -49348 5856 48110 -25823 -35128 43497 17676 -48807 6288
747 6288 47139 -25577 -33520 40390 16046 -46034 3677 43129 -21914 -33804 35043 19038
759 19038 -41967 -1023 43566 -15456 -36043 32873 24601 -42635 -5106 46636 -15232 -40693
771 -40693 33224 25116 -46237 -5951 47108 -17229 -40442 33728 23769 -44559 -4483 44939
783 44939 -15074 -37247 30466 24461 -39724 -7994 41675 -9947 -38849 24329 27314 -37792
795 -37792 -13529 42363 -5670 -42176 23316 32129 -37976 -15336 45828 -4716 -42861 24982
807 24982 32067 -38422 -13670 43993 -5818 -40700 23053 29459 -35292 -14070 40100 -2297
819 -2297 -38247 18781 31225 -30163 -17478 39357 3226 -39580 15141 35397 -29705 -22359
831 -22359 40529 4705 -43168 14640 36659 -31865 -22425 41859 3778 -42527 15712 35627
843 35627 -29561 -20859 38479 4823 -38915 11744 33368 -25651 -23252 33991 8103 -38549
855 -38549 6294 34829 -22395 -27093 33571 12128 -39928 5054 37842 -22032 -28317 35015
867 35015 12647 -40659 5365 37005 -22774 -27923 33109 11513 -38789 3749 35281 -19254
879 -19254 -27316 30235 14518 -35545 793 36531 -14837 -29589 28603 18458 -36669 -2349
891 -2349 38638 -14296 -32568 28618 19998 -37845 -3061 39154 -14339 -31529 28820 19459 -35157
904 -35157 -2225 36559 -11828 -29468 25010 19673 -31852 -5969 34055 -7761 -31183 20637
916 20637 22851 -30752 -10436 35694 -4746 -34195 20439 26063 -32164 -11523 37658 -5743
928 -5743 -35483 21545 24918 -33128 -10624 36374 -6572 -34056 19644 23425 -30381 -11156 33565
941 33565 -3181 -31892 15910 25393 -25988 -14874 32333 1065 -34040 12671 28527 -26090
953 -26090 -18435 33731 2642 -36235 12726 30004 -26882 -17790 34465 2176 -34097 13541
965 13541 28370 -24970 -16315 31984 2732 -31849 10365 27158 -21591 -18126 28684 6417
977 6417 -31464 6830 29744 -18811 -21330 29653 9851 -33368 6243 32086 -19836 -22844 30571
990 30571 9341 -34663 6299 31477 -20404 -22298 29276 8908 -32461 5090 29563 -17232
1002 -17232 -21647 25955 10997 -29970 1430 29363 -13520 -24476 23492 14245 -30525 -2197
1014 -2197 30894 -12768 -26903 24151 15107 -31737 -1871 31848 -13121 -25947 24354 14865
1026 14865 -30379 -1389 30431 -11804 -24943 21634 14922 -28139 -3998 29008 -8330 -25942
1038 -25942 19328 18177 -27002 -6436 30804 -6012 -28050 19054 20625 -28090 -7839 32174
1050 32174 -6433 -28373 19444 19816 -27902 -6981 30271 -5750 -26688 17707 18874 -24278
1062 -24278 -7880 27991 -2561 -25666 14265 20796 -21905 -11392 27189 -88 -28213 11758
1074 11758 23355 -22666 -13912 28987 709 -29860 12839 24089 -23677 -13308 29483 -211
1086 -211 -29011 12524 22667 -22367 -12863 26812 378 -27303 9532 21592 -19289 -14628 24529
1099 24529 4093 -26736 6621 24423 -17022 -17383 25030 6950 -28448 5487 26065 -17570
1111 -17570 -18655 25748 6792 -28932 6087 25514 -17356 -17121 24356 6359 -26368 5457
1123 5457 24232 -14724 -17037 21794 8551 -25067 2253 24530 -11930 -19469 20686 11403 -25563
1136 -25563 -35 26688 -11307 -21294 21642 12519 -27023 67 27549 -12082 -21276 21644
1148 21644 11743 -26075 71 25453 -10873 -20568 18826 11859 -23574 -2566 24143 -7799
1160 -7799 -21535 16324 14474 -22765 -5206 25377 -5740 -23275 15750 15907 -23585 -6127 26074
1173 26074 -5939 -23903 16102 15902 -23650 -5590 25393 -5570 -22249 15145 15450 -21219 -6286
1186 -6286 23781 -3265 -22310 12464 17091 -19783 -9063 23693 -1022 -23819 11231 19294
1198 19294 -19784 -10640 25171 -249 -24610 11960 19635 -20016 -10134 25228 -636 -23372
1210 -23372 11350 18519 -18635 -9991 22276 719 -21834 8539 18678 -15321 -11660 20749
1222 20749 3836 -22343 5782 20813 -14484 -14964 21522 5307 -24415 5129 21921 -15759
1234 -15759 -15251 22227 5002 -24651 5984 21207 -15550 -14194 21338 4401 -22754 5111
1246 5111 19574 -13624 -14347 18561 6218 -21580 1777 20140 -10826 -16442 17397 9117 -22214
1259 -22214 141 22281 -10263 -17924 18254 9949 -22747 484 22645 -10535 -17354 18111
1271 18111 9012 -21849 566 21114 -9550 -16306 16287 9661 -19656 -1210 20544 -6755
1283 -6755 -16899 14383 11922 -19479 -3086 21550 -5573 -19060 14425 12802 -20507 -3769
1295 -3769 22340 -6014 -19361 14921 12717 -19774 -3643 21657 -5528 -18418 13741 12159
1307 12159 -18163 -4391 20020 -3501 -17630 10618 13688 -16742 -7263 19652 -1269 -19535
1319 -19535 8696 15277 -17054 -8363 20431 -1652 -20224 10319 15316 -17717 -7972 20469 -1572
1332 -1572 -19855 9478 14206 -16305 -7604 18754 -787 -18264 8459 14950 -14256 -9165 18514
1345 18514 1617 -19001 6637 16939 -13723 -10886 19009 2678 -20465 6432 17728 -14144
1357 -14144 -11079 19509 2761 -19900 7214 17218 -13742 -10077 17915 2447 -18214 5304
1369 5304 15975 -11530 -11085 15750 4431 -17901 2739 16694 -10289 -12508 15959 6342 -18545
1382 -18545 1957 17979 -10500 -13642 16989 6361 -19504 2297 17673 -11265 -13364 16284
1394 16284 5405 -18891 2461 16835 -10002 -12720 14762 6118 -17164 1065 16598 -7910
1406 -7910 -13666 12841 8168 -17167 -1470 17955 -6461 -15463 13437 9683 -17926 -1870 18887
1419 18887 -6640 -15400 13861 9423 -17556 -1285 18042 -6267 -14338 12618 9037 -15951 -2101
1432 -2101 16722 -4759 -14429 10770 10224 -14784 -3705 17109 -3072 -15529 10169 11817 -15220
1445 -15220 -4600 18121 -3133 -16494 10789 11886 -15899 -4657 17769 -3107 -16203 10393
1457 10393 11368 -14819 -4797 16523 -2191 -15308 8305 11573 -13377 -6292 15463 -252 -15837
1470 -15837 7000 13043 -12861 -8011 16033 620 -16860 6894 13554 -13342 -8011 16727 226
1483 226 -16685 6796 13252 -12714 -7356 15578 332 -15471 6244 12656 -11370 -7939 14620
1496 14620 2256 -15527 4434 13665 -10030 -9739 14703 3747 -16437 4025 15066 -10511
1508 -10511 -10585 15255 3755 -16730 4232 14963 -10432 -9829 15030 3545 -15554 3873 13968
1521 13968 -9227 -9660 13303 4308 -14459 1712 13876 -7374 -11100 12121 6094 -14844 294
1534 294 15055 -7113 -12404 12365 6730 -15998 489 15759 -7509 -12265 13109 6113 -15819
1547 -15819 918 14758 -7782 -11485 12118 5807 -14551 -156 13823 -5902 -11628 10380
1559 10380 7311 -13649 -1692 14509 -4472 -13129 10054 8869 -13981 -2834 15349 -4109
1571 -4109 -14074 10250 9155 -14080 -2440 15354 -3959 -13086 9907 8771 -13105 -2463 14459
1584 14459 -3151 -12443 8551 9084 -12209 -4109 14014 -1757 -13155 7586 10723 -12142 -5353
1597 -5353 14746 -822 -14228 7696 11126 -12445 -5396 15036 -1287 -14258 7690 10668 -12046
1610 -12046 -5205 14072 -827 -13410 6347 10293 -10845 -5942 13088 363 -13495 4814
1622 4814 11335 -10149 -7495 13107 1786 -14255 4456 12547 -10365 -7839 13772 1511 -14393
1635 -14393 4796 12280 -10300 -7281 13383 1667 -14026 4538 11514 -9008 -7507 12313 2437
1648 2437 -12944 2903 11988 -7840 -8603 11725 3877 -13626 2105 12860 -7648 -9454 12275
1661 12275 4618 -14117 2145 13354 -7892 -9402 12376 4130 -13926 2366 12734 -7410
1673 -7410 -8953 11154 4265 -12537 1295 11939 -5732 -9690 9887 5912 -12119 -686 12442
1686 12442 -4881 -10783 9639 6566 -12929 -1141 13689 -5184 -11331 10111 6446 -13529 -577
1699 -577 13375 -5545 -11116 9868 6059 -12676 -703 12421 -4458 -10572 8612 6571 -11385
1712 -11385 -2200 12080 -2926 -11282 7891 8183 -11392 -3367 13219 -2365 -12191 7459 8850
1725 8850 -11825 -3247 13336 -2540 -12217 7853 8435 -11366 -3476 12655 -1956 -11480 6793
1738 6793 8469 -10084 -3888 11843 -686 -11363 5831 9517 -9532 -5546 12087 258 -12552
1751 -12552 5616 9998 -10136 -5573 12789 -227 -12527 5870 10006 -10108 -5560 12120 -46
1764 -46 -12002 5145 9446 -9180 -5866 11264 1016 -11535 3631 9899 -7835 -7093 10702
1777 10702 2418 -12131 2657 10982 -8027 -8124 11217 2917 -12813 2709 11349 -8173 -7821 11287
1791 11287 2467 -12191 2978 10434 -7519 -7235 10376 2648 -11216 1764 10483 -5928 -7441
1804 -7441 9474 3973 -11285 741 11177 -5507 -9026 9748 5013 -11988 432 12017 -5573
1817 -5573 -9491 9884 5065 -12048 688 11764 -5510 -8728 9175 4836 -10916 -48 10580
1830 10580 -4199 -8544 7822 5376 -10237 -1242 10789 -3080 -9521 6995 6691 -10271 -2617
1843 -2617 11590 -2890 -10504 7459 7063 -11204 -2178 11788 -3304 -10467 7612 6458 -10526
1856 -10526 -2041 10756 -3007 -9694 6653 6578 -9384 -2860 10397 -1520 -9990 5378 8001
1869 8001 -8799 -3933 10684 -439 -10653 5269 8528 -9006 -4799 11248 -538 -10950 5282
1882 5282 8587 -9039 -4320 10731 -191 -10371 4944 8316 -7921 -4252 10091 503 -9958
1895 -9958 3979 8531 -7279 -5408 9881 1386 -10558 3248 9344 -7249 -6223 10294 1613
1908 1613 -11053 3304 9585 -7675 -6015 10370 1380 -10766 3180 8949 -7128 -5873 9051
1921 9051 1871 -10024 2130 8949 -5734 -6749 8367 2968 -10136 1226 9484 -5162 -7627
1934 -7627 8615 4075 -10611 757 10025 -5675 -7939 8804 3657 -10366 930 9815 -5315
1947 -5315 -7337 8476 3563 -9444 413 9145 -4216 -7425 7579 4495 -9077 -676 9657
1960 9657 -3348 -8146 7221 5737 -9281 -1406 10319 -3122 -8886 7170 5925 -9729 -1258
1973 -1258 10375 -3358 -8569 7268 5418 -9259 -1250 9622 -2673 -7914 6176 5553 -8108
1986 -8108 -2160 9144 -1567 -8345 5059 6397 -7992 -2864 9564 -1073 -9149 5146 7057
1999 7057 -8533 -3467 9865 -1243 -9430 5599 6779 -8441 -3096 9480 -1234 -8884 4840
2012 4840 6535 -7635 -3206 8707 -493 -8823 3864 6818 -6878 -4316 8654 355 -9208 3494
2026 3494 7741 -6644 -4690 8859 908 -9130 3391 8076 -7020 -4983 9185 776 -8878
2039 -8878 3445 7697 -6527 -4580 8465 1156 -8597 2418 8049 -5388 -5039 7965 2242 -8465
2053 -8465 1769 8218 -5165 -6043 8218 2615 -9162 1707 8701 -5466 -5936 8203 2196 -9197
2067 -9197 1939 8092 -5173 -5683 7565 2356 -8423 1171 7724 -4356 -6363 6675 3252 -8017
2081 -8017 8 7897 -3226 -6939 6291 4230 -8654 -550 8783 -3547 -7369 6772 4421 -8782
2095 -8782 -246 8651 -3642 -6902 6464 3550 -8088 -411 8272 -3209 -6500 5970 4115 -7134
2109 -7134 -1121 7677 -2053 -6968 5370 5095 -7216 -1648 8355 -1470 -7860 5472 5471 -7899 -2183
2124 -2183 8780 -1737 -7733 5323 5089 -7503 -1736 8306 -1855 -6961 4930 4943 -7024 -2355
2138 -2355 7749 -982 -6951 3956 5534 -6112 -2918 7678 -61 -7586 3563 6394 -6444
2151 -6444 -3638 7852 25 -8041 3602 6181 -6707 -3483 8189 -467 -7839 3672 6080 -6239
2165 -6239 -3261 7488 -55 -7434 2908 6100 -5583 -3669 6983 996 -7700 1935 6724 -5114
2179 -5114 -4768 7272 1764 -8132 1998 7031 -5052 -4774 7305 1468 -7519 1856 6993 -4888
2193 -4888 -4539 6743 1878 -7093 1284 6446 -4087 -4669 6102 2313 -6921 532 6962 -3456
2207 -3456 -5481 6135 3125 -7362 123 7398 -3702 -5742 6344 2903 -7878 394 7489 -3631
2221 -3631 -5771 6027 2560 -7194 367 6533 -3166 -5553 5346 3085 -6568 -530 6737 -2146
2235 -2146 -5881 4895 3893 -6627 -1109 7273 -2268 -6414 4690 4056 -7183 -1083 7453 -2520
2249 -2520 -6402 5121 3919 -6742 -858 7112 -2203 -5973 4772 3740 -5991 -1160 6527 -1637
2263 -1637 -5606 4062 4570 -5710 -2060 6952 -1118 -6480 3994 5024 -6369 -2215 7319 -816
2277 -816 -6654 4114 5123 -6351 -2100 7373 -1098 -6613 4023 4612 -5686 -2306 6488 -497
2291 -497 -6178 3329 4900 -5010 -2697 6101 287 -6323 2741 5369 -5107 -3406 6649 270 -6801
2306 -6801 2713 5768 -5151 -3448 6880 149 -6998 2719 5293 -5514 -3086 6440 317 -6382
2320 -6382 2305 5354 -4688 -3450 5945 969 -6283 1811 5512 -4168 -4036 5960 1497 -6509 1381
2335 1381 6094 -4034 -4359 6017 1671 -6891 1401 6130 -4203 -4279 6030 1680 -6376 1405 5931
2350 5931 -3613 -4357 5437 1999 -6124 427 5761 -3174 -4511 4957 2621 -6122 373 6214 -2970
2365 -2970 -4946 5232 2786 -6601 306 6190 -3140 -5048 5171 2212 -6381 425 5941 -2928
2379 -2928 -4580 4620 2539 -5785 -223 5606 -2294 -4964 3984 3067 -5791 -1045 6096 -1578 -5566
2394 -5566 4021 3722 -5888 -1166 6453 -1869 -5733 4268 3599 -6104 -990 6466 -1775 -5402 4069
2409 4069 3381 -5647 -878 6063 -1425 -5230 3635 3486 -5190 -1569 5781 -985 -5481 3482 4302 -5104
2425 -5104 -2047 6001 -649 -6115 3569 4524 -5333 -2083 6220 -749 -5900 3550 4098 -5185 -2135
2440 -2135 5957 -564 -5406 2921 4206 -4414 -2370 5583 138 -5609 2318 4387 -4165 -3100 5617
2455 5617 412 -6036 1927 5110 -4407 -3313 5819 594 -6012 2066 4876 -4252 -2862 5565 560
2470 560 -5505 1892 4982 -3788 -3235 5218 796 -5614 1352 4908 -3271 -3637 4999 1519 -5729 966
2486 966 5174 -3415 -3877 4999 1835 -5995 854 5703 -3248 -3958 5049 1715 -5778 810 5237 -2822
2502 -2822 -3779 4600 1957 -5047 320 5143 -2390 -4057 4502 2527 -5458 -209 5200 -2257 -4628
2517 -4628 4136 2617 -5762 -264 5517 -2345 -4523 4348 2776 -5409 -153 5470 -2123 -4602 4137
2532 4137 2594 -4955 -443 5049 -1537 -4522 3297 3012 -4558 -1429 5035 -1194 -5255 2916 3656
2547 3656 -4664 -1504 5684 -976 -5324 3116 3702 -5051 -1345 5694 -965 -4948 3417 3577 -4875
2562 -4875 -1199 5412 -831 -4489 3080 3665 -4205 -1749 5077 -350 -4769 2409 4153 -3787 -2308
2577 -2308 5264 164 -5334 2340 4391 -4152 -2365 5414 216 -5531 2464 4050 -4079 -2391 5110
2592 5110 125 -5103 2132 4309 -3652 -2623 4618 540 -5053 1420 4434 -3309 -3130 4641 1253
2607 1253 -5163 1218 4695 -3403 -3583 4905 1348 -5215 1067 4805 -3262 -3490 4881 1201 -5205
2622 -5205 1037 4569 -3005 -3435 4454 1386 -4699 543 4666 -2538 -3581 4023 1744 -4791 73
2637 73 4702 -2074 -4094 4247 2035 -5036 -5 5294 -2279 -3991 4278 2214 -5094 178 5118
2652 5118 -2070 -3979 4052 2049 -4808 -209 4576 -1723 -3854 3491 2615 -4499 -815 4887 -1152
2667 -1152 -4274 3466 2922 -4583 -651 5276 -1063 -4509 3346 2797 -4666 -916 5141 -1642 -4503
2682 -4503 3169 2557 -4502 -925 4679 -1139 -4427 2800 3043 -3956 -1289 4522 -586 -4536 2083
2697 2083 3605 -3982 -2007 4645 -173 -4878 2136 3734 -4026 -2035 4773 -225 -4821 2314 3759
2712 3759 -3781 -1829 4907 -341 -4717 2131 3434 -3800 -1938 4263 52 -4286 1622 3769 -3270
2727 -3270 -2372 4341 628 -4543 1564 4066 -3156 -2733 4363 832 -4862 1589 4112 -3243 -2690 4542
2743 4542 724 -4674 1269 3936 -2911 -2638 3981 1009 -4585 1053 4004 -2491 -2926 3900 1418
2758 1418 -4522 572 4047 -2318 -3280 3844 1509 -4524 214 4424 -2745 -3426 4086 1669 -4664
2773 -4664 319 4179 -2552 -3196 3598 1650 -4420 200 4387 -2093 -3415 3212 1977 -4287 -325
2788 -325 4281 -1584 -3880 3224 2273 -4368 -580 4704 -1603 -3865 3193 2554 -4512 -437 4645 -1304
2804 -1304 -3757 3077 2499 -4086 -461 4374 -1123 -3489 2649 2601 -3721 -1012 4368 -739 -4046 2298
2820 2298 3019 -3784 -1377 4388 -438 -4134 2513 3259 -3777 -1170 4476 -847 -4215 2568 3119 -3754
2836 -3754 -1124 4168 -666 -4006 2046 3087 -3318 -1707 3943 48 -3743 1559 3144 -2987 -2150
2851 -2150 3876 516 -4287 1121 3731 -3197 -2522 4006 513 -4397 1409 3874 -2935 -2446 4269
2866 4269 703 -4128 1648 3462 -2987 -2190 3897 604 -3735 1334 3502 -2482 -2445 3669 818 -4072
2882 -4072 760 3633 -2538 -2666 3627 995 -4524 643 3923 -2348 -2729 3491 1236 -4106 706
2897 706 3717 -2199 -2742 3624 1276 -4015 476 3713 -1889 -3093 3017 1678 -3765 -144 3762
2912 3762 -1510 -3256 3260 1844 -3962 -211 3878 -1495 -3339 3150 1839 -4033 -89 4053 -1799
2927 -1799 -3090 3016 1676 -3893 -151 3787 -1566 -2903 2855 2092 -3510 -350 3737 -933 -3336
2942 -3336 2582 2437 -3455 -797 3930 -936 -3649 2790 2476 -3708 -715 4049 -1066 -3660 2571
2957 2571 2382 -3431 -674 3744 -770 -3346 2678 2473 -3166 -960 3789 -652 -3169 1926 2625 -3148
2973 -3148 -1510 3658 -223 -3746 1710 3129 -3295 -1406 3860 -131 -3787 2060 2842 -3237 -1570
2988 -1570 3823 -450 -3492 1658 2634 -2865 -1247 3582 111 -3504 1289 2892 -2495 -1875 3394
3003 3394 493 -3635 1093 3236 -2516 -2207 3748 632 -3850 1045 3264 -2524 -2225 3672 449
3018 449 -3807 1267 3327 -2306 -2190 3192 670 -3717 838 3321 -2504 -2327 3145 876 -3063 458
3034 458 3256 -1866 -2602 3251 1466 -3597 394 3586 -1912 -2755 3126 1283 -3594 394 3576 -1720
3050 -1720 -2682 3146 1455 -3438 375 3265 -1684 -2483 2721 1299 -3448 -56 3463 -1467 -2764
3065 -2764 2385 1990 -3397 -438 3549 -1267 -3224 2390 1828 -3557 -479 3683 -1515 -3142 2588
3080 2588 1851 -3360 -528 3359 -1120 -2863 2602 1918 -3020 -145 3132 -672 -2875 2098 2138 -2849
3096 -2849 -952 3421 -541 -3109 2116 2229 -3181 -1085 3836 -493 -3261 2311 2241 -3168 -797 3412
3112 3412 -611 -2963 2174 1946 -2707 -862 3360 -361 -2739 1869 2340 -2616 -1163 3048 -136
3127 -136 -3203 1363 2574 -2580 -1509 3537 -29 -3605 1530 2633 -2427 -1391 3282 -190 -3204
3142 -3204 1629 2513 -2741 -1323 3187 80 -3100 1233 2642 -2181 -1635 2918 609 -3167 882
3157 882 2866 -2186 -1942 3077 701 -3289 614 3032 -2087 -2093 3161 769 -3516 769 2903 -1944
3173 -1944 -2027 3027 782 -3297 741 2598 -1767 -1810 2515 770 -2932 467 2897 -1676 -2269 2787
3189 2787 1247 -3155 202 3181 -1321 -2275 2573 1187 -3222 66 3242 -1804 -2443 2510 1181
3204 1181 -3127 206 2810 -1445 -2611 2141 1029 -2831 -323 2972 -1116 -2340 2280 1696 -2747
3219 -2747 -496 3232 -730 -2874 2229 1761 -2830 -432 3025 -1113 -2989 2294 1696 -2858 -398
3234 -398 3089 -1092 -2434 1979 1641 -2713 -488 2866 -895 -2627 1719 1837 -2335 -828 2865 -439
3250 -439 -2807 1636 2168 -2586 -778 2941 -482 -3036 1671 2434 -2671 -938 3198 -209 -2781 1799
3266 1799 2266 -2396 -955 2901 -398 -2678 1314 2143 -2333 -1156 2509 11 -2774 917 2360
3281 2360 -2124 -1370 2912 320 -3212 916 2440 -2142 -1475 2886 101 -3119 1133 2228 -2344
3296 -2344 -1533 2762 120 -2895 925 2396 -1885 -1388 2620 340 -2622 845 2687 -1874 -1868 2623
3312 2623 655 -3006 559 2773 -1853 -1829 2911 1005 -3078 583 2377 -1992 -1839 2421 787 -2777
3328 -2777 641 2504 -1781 -1649 2401 766 -2797 383 2464 -1354 -1803 2277 1096 -2395 260
3343 260 2657 -1162 -2172 2217 1064 -2609 149 2980 -1258 -2142 2393 1239 -2849 104 2621
3358 2621 -1427 -2025 2138 1087 -2540 187 2854 -1146 -2129 2011 1464 -2681 -719 2635 -968 -2385
3374 -2385 1758 1885 -2498 -471 3060 -1052 -2381 1881 1798 -2741 -271 2754 -791 -2315 1946 1491
3390 1491 -2590 -558 2612 -565 -2369 1451 1542 -2200 -479 2491 -415 -2475 1339 1890 -2388 -760
3406 -760 2467 -132 -2594 1365 1976 -2108 -1005 2735 -250 -2569 1640 2128 -2345 -931 2635 -65
3422 -65 -2482 1218 1745 -1878 -879 2529 114 -2387 1088 1992 -1897 -1227 2539 115 -2670 961
3438 961 2157 -2062 -1509 2596 230 -2705 1137 2289 -1940 -1415 2392 76 -2703 1091 2386 -1962
3454 -1962 -1515 2084 288 -2474 675 2282 -1567 -1565 2147 592 -2585 440 2506 -1686 -1715 2328
3470 2328 770 -2461 244 2663 -1391 -1759 2470 718 -2677 597 2517 -1489 -1652 2111 798
3485 798 -2319 434 2200 -1192 -1478 2156 814 -2470 87 2189 -730 -1828 2021 995 -2423
3500 -2423 -120 2587 -937 -2129 2014 1001 -2340 -63 2681 -1308 -1888 1677 1214 -2481 -152
3515 -152 2557 -907 -1905 1545 1188 -2163 -272 2429 -888 -2106 1487 1305 -2188 -477 2359 -659
3531 -659 -2200 1643 1715 -2236 -679 2652 -693 -2202 1697 1436 -2386 -409 2377 -679 -2256 1230
3547 1230 1329 -2191 -573 2190 -27 -2083 1199 1527 -1787 -1027 2490 75 -2140 1233 1752 -2075
3563 -2075 -1054 2382 31 -2436 1332 2008 -2019 -766 2506 -237 -2219 878 1719 -1624 -1124 2299
3579 2299 221 -2373 942 1832 -1677 -1133 2268 247 -2455 747 1817 -1580 -1501 2166 551 -2388
3595 -2388 605 2048 -1602 -1481 2064 418 -2553 790 2166 -1563 -1275 2024 575 -2170 581
3610 581 2064 -1335 -1308 1918 464 -1917 382 2158 -1198 -1470 1951 722 -2303 259 2417 -1527
3626 -1527 -1597 2050 776 -2513 260 2147 -1170 -1591 1713 914 -2159 330 2069 -1249 -1642 1727
3642 1727 651 -2020 90 1776 -691 -1671 1748 888 -1850 -308 2300 -810 -2100 1626 1121 -2308
3658 -2308 13 2207 -734 -1659 1526 1166 -2283 -280 1910 -611 -1891 1567 1250 -1780 -162 2013
3674 2013 -676 -2036 1320 1430 -1895 -619 2118 -510 -2197 1275 1402 -1862 -434 2106 -459
3689 -459 -2048 1261 1451 -1898 -446 2216 -365 -1936 1227 1210 -1567 -389 2044 -336 -2011 778
3705 778 1292 -1490 -736 2213 -101 -1897 989 1539 -1784 -865 2232 54 -2330 1103 1855 -1635
3721 -1635 -893 2242 41 -2105 881 1715 -1484 -958 2218 -112 -2015 935 1599 -1534 -1041 1909
3737 1909 132 -1864 933 1811 -1320 -1304 1790 392 -2004 495 1661 -1315 -1204 1745 483 -2036
3753 -2036 679 1710 -1376 -1315 1943 505 -1766 484 1754 -1213 -1135 1586 346 -1984 434 1700
3769 1700 -835 -1302 1521 795 -1773 225 1870 -937 -1487 1815 693 -2015 335 2268 -1048 -1380
3785 -1380 1639 710 -1901 366 1672 -789 -1387 1575 546 -1868 237 1993 -1265 -1126 2213 1533
3801 1533 -1566 -214 1979 -551 -1281 1606 970 -2192 -117 2064 -834 -1693 1376 968 -1885 -213
3817 -213 1920 -917 -1492 1211 1066 -1809 -384 1673 -431 -1543 1068 1071 -1424 -689 1779 -274 -1776
3834 -1776 1201 1246 -1698 -473 1995 -378 -1869 940 1310 -1687 -627 1986 -185 -1949 1003 940
3850 940 -1657 -353 1800 -42 -1606 1039 1398 -1469 -828 1632 -207 -1939 879 1197 -1456 -949
3866 -949 1821 229 -1644 893 1458 -1480 -1041 1801 -173 -1770 618 1501 -1228 -728 1743 -75
3882 -75 -1687 666 1303 -1010 -777 1476 99 -1655 415 1421 -866 -1184 1459 523 -1679 330
3898 330 1772 -1285 -986 1554 616 -1859 346 1584 -1178 -1033 1771 383 -1750 214 1414 -1087
3914 -1087 -1133 1432 352 -1789 367 1765 -921 -1246 1381 477 -1432 207 1817 -936 -1312 1560
3930 1560 596 -1758 -148 1662 -753 -1511 1475 649 -1788 54 1357 -699 -1267 1315 656 -1641
3946 -1641 38 1544 -533 -1308 1345 801 -1538 -229 1654 -540 -1211 1149 943 -1633 -39 1513
3962 1513 -550 -1588 1211 992 -1548 -117 1594 -597 -1595 1202 861 -1436 -440 1848 -515 -1545
3978 -1545 638 1023 -1398 -625 1437 5 -1776 932 1224 -1457 -368 2072 -585 -1755 779 1222
3994 1222 -1557 -894 1334 -67 -1287 631 1594 -1585 -492 1536 -246 -1004 1223 1590 -869 -606
4010 -606 1517 -658 -1020 1066 1544 -805 -144 1321 87 -2135 776 2140 -1647 -298 1642 -156
4026 -156 -1870 444 1184 -1236 -772 1622 225 -1788 725 1355 -1113 -911 1302 -17 -1625 665
4042 665 1481 -1048 -1206 1358 55 -1364 178 1453 -1036 -1101 1552 621 -1699 231 1671 -877
4058 -877 -1181 1271 247 -1549 268 1473 -1180 -1085 1453 329 -1397 346 1277 -877 -953 1180 655
4075 655 -1935 328 1279 -610 -1389 1329 279 -1522 -2 1525 -915 -1606 1388 740 -1397 187
4091 187 1584 -733 -1032 900 960 -1281 -475 1703 -440 -1116 1142 436 -1649 -279 1267 -628 -978
4108 -978 842 852 -1308 -212 1426 -430 -1332 1038 1133 -1467 -84 1711 -541 -1314 1004 918 -1473
4125 -1473 -169 1418 -370 -1235 1066 957 -1322 -438 1780 -175 -1307 895 1323 -1230 -599 1741
4141 1741 279 -1521 1064 1440 -972 -337 1687 -691 -965 1175 1033 -1310 -584 1476 -431 -1405
4157 -1405 723 1377 -1124 -402 1280 23 -1435 640 1038 -714 -994 1217 293 -1005 668 1051
4173 1051 -689 -738 1352 228 -1355 864 1698 -1005 -903 2229 143 -1644 376 326 -1198 -1009 1067
4190 1067 -106 -878 1183 847 -630 -623 1335 328 -1555 216 1303 -710 -1022 1534 206 -1599
4206 -1599 161 1313 -974 -995 1449 526 -1529 205 1434 -837 -686 1456 413 -1280 534 1282
4222 1282 -687 -879 1277 446 -1243 263 1262 -603 -1240 1271 717 -1296 244 1347 -691 -1207
4238 -1207 1297 873 -1653 54 1487 -712 -1146 1141 599 -1529 117 1190 -654 -1025 1272 748
4254 748 -1184 -302 1382 -325 -1172 1058 768 -1408 -496 1691 -193 -1305 1142 952 -958 -388 1523
4271 1523 -653 -1540 981 1036 -1196 4 1774 -373 -1645 568 142 -1450 -370 1524 -360 -1632
4287 -1632 748 596 -819 -873 1060 -44 -1278 1038 956 -1093 -643 1396 -11 -1259 1103 1137 -1054
4304 -1054 -763 1724 -106 -1415 657 1130 -1205 -464 1466 24 -1248 680 1150 -1109 -440 1358
4320 1358 229 -1324 570 1236 -1002 -748 1376 247 -1390 570 1326 -1089 -866 1560 107 -1650
4336 -1650 537 1321 -1169 -820 1097 211 -1593 138 1470 -1077 -692 1245 354 -1385 751 1458
4352 1458 -873 -386 1252 455 -1569 -217 1095 -823 -1521 1005 1017 -1617 -2 1747 -427 -1103
4368 -1103 1217 987 -1199 -131 1755 -1110 -1163 1672 1154 -1726 419 1675 -197 -181 1703 872 -1150
4385 -1150 404 1364 -207 -1960 1011 26 -2171 474 1767 -668 -1603 1180 423 -820 -192 1046
4401 1046 90 -1277 1046 701 -1411 177 1449 -552 -699 -395 457 -1118 -430 1346 -613 -798 579
4418 579 775 -1073 -362 1697 -239 -1077 1420 618 -1304 -256 1649 45 -1981 719 532 -1105
4434 -1105 -389 767 -602 -1367 1301 946 -1301 -454 1104 -41 -1641 831 1316 -1108 -675 1181
4450 1181 83 -1265 1075 1356 -1319 -856 1431 295 -1132 1017 966 -1362 -646 1566 -240 -1137
4466 -1137 325 1070 -1265 -527 1446 -293 -1396 602 1312 -1062 -786 1178 350 -1556 351 1154
4482 1154 -1073 -979 1398 89 -1396 619 951 -1513 -1115 1399 -166 -1290 532 1382 -1061 -1019 1653
4499 1653 397 -1516 -572 1144 -832 -260 1219 621 -1806 -242 821 -586 -1164 707 404 -993
4515 -993 636 1553 -901 -1129 1313 386 -1698 268 1599 -805 -1291 1229 105 -1501 -201 1421
4531 1421 -798 -1097 683 385 -782 -17 940 -692 -1547 777 292 -1488 -169 1945 -371 -954 1050
4548 1050 825 -1574 242 1420 -674 -943 1110 547 -1422 -440 1648 -508 -1347 1251 559 -1352
4564 -1352 -238 1691 -482 -1557 464 644 -1394 -162 1364 -386 -1260 789 1081 -1026 -320 1352
4580 1352 -281 -1204 953 1228 -1421 -227 1470 -297 -1327 628 936 -1267 -396 1634 -490 -1186
4596 -1186 772 1358 -1280 -351 1353 -61 -1475 504 941 -921 -445 1566 204 -1667 569 1158
4612 1158 -1232 -585 1577 -443 -1629 627 996 -1221 -651 1319 30 -1238 582 1063 -889 -580
4628 -580 1324 299 -1293 237 1254 -911 -930 1520 -414 -1531 650 1747 -1088 -576 1345 -87
4644 -87 -1144 500 827 -1127 -992 960 387 -1347 533 1205 -922 -1007 966 623 -1212 -369 1430
4661 1430 -751 -1364 1214 566 -1827 -12 1197 -485 -1136 1194 489 -1484 16 1333 -838 -1316
4677 -1316 1466 576 -1124 366 1181 -295 -896 1102 585 -1243 -238 1274 -359 -953 1245 623
4693 623 -1255 181 1488 -817 -1547 1104 862 -1160 432 1047 -661 -1201 546 754 -1572 -171
4709 -171 1713 -752 -1427 899 499 -984 624 1267 -366 -1436 880 1260 -1566 -602 1010 -966
4725 -966 -1353 571 721 -1229 -316 1959 -474 -1361 1443 807 -1177 -810 1606 -155 -2033 862 785
4742 785 -1372 -954 2074 -286 -1260 639 1293 -781 -473 1215 94 -1429 727 1328 -1299 -591 1531
4759 1531 240 -1361 717 1289 -1410 -797 1461 30 -1428 608 1210 -1107 -672 1319 29 -1595
4775 -1595 570 1144 -881 -840 1120 186 -1428 434 1386 -1106 -1039 1360 376 -1250 254 1513 -943
4792 -943 -1036 1187 234 -1654 223 1542 -944 -1095 1437 261 -1608 317 1244 -738 -801 1296 194
4809 194 -1395 -66 1407 -766 -1269 1081 546 -1677 -49 1265 -734 -1070 1223 826 -1580 -23
4825 -23 1701 -617 -1191 1084 496 -1151 -102 1454 -713 -1018 1068 314 -1183 -263 1449 -468 -1179
4842 -1179 930 639 -1512 -201 1508 -420 -1337 1239 876 -1525 -387 1512 -420 -1323 1016 821
4858 821 -1572 -124 1546 -391 -1272 942 792 -1090 -19 1170 -575 -1232 838 967 -1238 -283
4874 -283 1599 -130 -1560 716 939 -1171 -470 1389 -102 -1812 841 1203 -1347 -586 1505 -147
4890 -147 -1306 793 1035 -1281 -438 1346 -173 -1276 600 773 -871 -670 1337 -13 -1454 580
4906 580 1137 -1021 -861 1475 150 -1451 562 1147 -1234 -772 1346 435 -1393 570 1440 -1060 -804
4923 -804 1611 23 -1242 614 1253 -924 -574 1422 349 -1136 378 1176 -876 -852 1105 562 -1405
4940 -1405 198 1193 -1030 -924 1158 265 -1324 254 1235 -823 -1195 1177 483 -1600 570 1300 -681
4957 -681 -1061 1232 661 -1376 -151 1441 -490 -1159 1175 670 -1441 82 1084 -559 -1495 1239
4973 1239 565 -1270 -34 1497 -463 -1035 838 549 -1386 174 942 -218 -1208 917 411 -1246
4989 -1246 -221 874 -390 -1387 755 706 -889 -1196 1902 -431 -607 359 1301 -1265 -808 1674 -290
5006 -290 -1274 391 1233 -1743 -1085 1505 -250 -1323 512 465 -1196 -269 1538 -138 -1476 778 1055
5023 1055 -1051 -263 1352 -22 -1488 544 1143 -1030 -664 1432 0 -1366 408 1056 -1089 -972
5039 -972 1406 -25 -1554 655 1129 -932 -665 1431 154 -1346 409 1017 -1036 -708 1392 190
5055 190 -1397 187 1303 -753 -818 1257 454 -1502 362 1472 -1129 -844 1293 69 -1537 259
5071 259 1415 -750 -1017 1225 377 -1297 308 1416 -786 -938 1359 341 -1291 117 1392 -740
5087 -740 -1075 992 414 -1387 145 1248 -564 -1137 1274 811 -1021 33 1481 -672 -1211 1126
5103 1126 638 -1290 -100 1413 -695 -1093 1156 770 -1127 -86 1236 -489 -1148 864 859 -1102 -11
5120 -11 1357 -213 -1311 837 861 -1431 -439 1357 -220 -1411 862 924 -1098 -297 1212 -218 -1130
5137 -1130 1087 730 -1193 -386 1554 -193 -1311 990 1074 -1026 -571 1318 230 -1194 730 883
5153 883 -1042 -557 1366 -148 -1335 561 1371 -885 -613 1409 -215 -1354 854 1151 -1327 -556
5169 -556 1296 -76 -1086 367 1176 -1027 -444 1162 -62 -1093 493 1121 -882 -733 1181 143
5185 143 -1330 307 1188 -925 -929 1202 352 -1331 437 1328 -868 -663 1009 284 -1511 358 1115
5202 1115 -638 -774 1105 295 -1047 -37 1214 -528 -1015 1187 503 -1339 275 1220 -442 -932
5218 -932 886 466 -1151 -54 1391 -673 -1116 1126 614 -1197 106 1579 -513 -667 1034 671
5234 671 -1223 100 1010 -400 -791 1092 659 -1130 -124 1192 -539 -1154 922 532 -1287 -72
5250 -72 1257 -443 -1230 1011 690 -1278 -198 1479 -649 -1003 938 622 -1363 -192 1359 -351
5266 -351 -959 672 810 -1102 -406 1264 -109 -1160 752 857 -864 -263 1541 -17 -1286 624
5282 624 792 -1014 -473 1154 -88 -1061 913 759 -1035 -414 1252 221 -1263 688 813 -1072 -421
5299 -421 1065 53 -926 490 1071 -730 -755 1081 160 -1254 294 1011 -999 -695 1156 137 -1379
5316 -1379 580 1065 -601 -671 1139 81 -1155 345 1178 -781 -540 1040 -11 -1225 191 1014
5332 1014 -690 -761 1034 468 -1339 31 1504 -324 -1316 1115 632 -826 157 673 -821 -832 1193
5349 1193 391 -1067 212 720 -617 -1077 1070 253 -1239 91 1058 -719 -1005 778 596 -905 -229
5366 -229 904 -473 -906 890 641 -1106 -293 1362 -542 -1163 997 663 -1296 -257 1097 -449
5382 -449 -1172 785 642 -1144 -242 1082 -211 -1019 788 566 -786 13 1241 -359 -1087 549 842
5399 842 -999 -433 1026 -278 -1179 918 826 -1012 -171 1377 -219 -1150 799 902 -1016 -255 1210
5416 1210 -61 -886 645 805 -1015 -407 962 -126 -1208 646 908 -1175 -388 1127 232 -1021
5432 -1021 568 1087 -968 -585 1338 187 -949 551 930 -671 -593 1310 157 -1104 598 897
5448 897 -905 -557 1038 128 -1149 502 971 -781 -730 940 231 -1002 297 1014 -666 -803 972
5465 972 196 -1071 379 1085 -829 -634 1077 116 -1186 265 980 -572 -767 967 62 -1204 236
5482 236 693 -665 -758 894 123 -1065 178 858 -431 -1018 845 520 -1081 -104 1217 -236 -842
5499 -842 649 779 -1241 -18 990 -553 -995 900 526 -898 -113 940 -202 -1058 696 645 -1004
5516 -1004 -89 967 -156 -949 626 611 -881 -336 972 -342 -1231 769 654 -1136 -348 885 -63
5533 -63 -884 444 863 -892 -134 1384 -18 -836 536 555 -940 -261 987 -32 -809 714 767 -758
5551 -758 -225 1119 96 -837 359 943 -783 -480 1079 -109 -1028 448 984 -876 -543 1084 -191
5568 -191 -982 412 1115 -769 -531 716 52 -922 435 887 -909 -554 691 344 -1120 393 1075
5585 1075 -401 -627 1171 187 -977 234 771 -710 -412 1023 125 -1108 376 624 -558 -736 804
5602 804 256 -747 153 867 -136 -777 692 314 -908 -62 624 -613 -1125 530 442 -874 312 1179
5620 1179 -308 -574 523 579 -1554 343 1217 -152 -1096 819 285 -454 6 511 253 -776 233
5637 233 469 -1676 -121 955 -384 -1199 338 1224 -1075 -49 955 153 -682 21 -284 -726 23
5654 23 1282 -371 -1200 147 -383 -1023 -262 68 27 -401 102 507 -1038 -32 813 -935 -662 474
5672 474 565 -1158 -69 707 -288 -1119 -105 1044 -869 -416 1035 135 -838 408 702 -782 -536 865
5690 865 18 -926 119 574 -507 -421 820 200 -776 233 877 -377 -547 887 161 -865 336 758
5708 758 -759 -699 933 208 -1056 281 951 -607 -435 900 30 -943 -11 812 -417 -380 725 160
5726 160 -951 500 883 -351 -394 881 297 -682 384 814 -291 -777 888 418 -844 132 910 -285
5744 -285 -652 1105 389 -1077 28 793 -375 -496 931 786 -903 69 658 -304 -454 586 1212 -603
5762 -603 -691 110 -154 -712 576 703 -956 278 1163 -467 -1076 611 838 -733 24 778 -40 -1140
5780 -1140 366 488 -885 -171 774 47 -889 916 625 -1119 -634 1122 32 -958 1075 291 -671
5797 -671 -603 1362 -248 -556 574 627 -1029 -843 611 -86 -780 224 491 -392 -177 734 -180 -614 347
5816 347 464 -737 -99 811 139 -488 -727 173 -804 -629 628 -187 -1069 1117 1170 -472 202 543 278
5835 278 -877 302 282 29 -843 553 159 -1041 -203 792 -96 -620 654 1069 -579 -547 976 -512
5853 -512 -318 940 283 -390 275 341 -487 -468 1652 462 -1003 114 896 -427 -451 841 -268 -364 239
5872 239 916 -322 74 463 -1 -795 -306 1344 -308 -450 -168 507 -1402 -159 950 -502 -463 677
5890 677 -89 -887 131 1378 37 -574 582 1028 -617 -335 706 -649 -350 1222 1820 -134 -103
5907 -103 736 -519 -680 1233 401 -785 582 1645 -561 -1642 890 -69 107 92 547 1057 -757
5924 -757 846 225 -423 -268 1402 -490 -707 829 47 -728 155 908 363 -323 768 776 -557 246 447
5943 447 413 -767 741 661 -769 -605 496 -91 -1184 209 557 -909 -220 308 149 -147 -118 584 -36
5962 -36 -256 504 80 -1237 998 412 -573 -177 691 673 -797 673 634 -55 -773 137 877 -184 293
5981 293 77 -396 -422 1266 331 -237 297 -421 -152 -766 783 85 -419 391 92 -719 -366 666 677 -1285
6001 -1285 -191 911 -512 466 1261 -148 -1521 -114 1089 489 -628 840 778 -549 266 744 -696
6018 -696 326 995 1008 -115 122 1976 -339 -1009 632 193 -1197 1357 858 -321 -365 724 -83 -329
6036 -329 -69 434 129 -593 486 27 -407 238 731 -83 -344 443 288 62 -1197 457 -501 -333 906
6055 906 827 -2 -4 453 -298 -583 -78 810 -644 -179 332 -489 -349 220 386 -473 -545 452 -118 -422 -160
6076 -160 555 -445 -223 654 -97 -700 482 544 8 -70 351 307 -500 256 586 -523 -308 594 169 -516
6096 -516 457 480 -476 -434 730 73 -724 255 467 -475 -447 709 240 -448 141 357 -397 -168 529 9
6116 9 -610 143 792 -205 -410 485 75 -904 -120 642 -439 -287 539 215 -495 290 584 -68 -408 397
6136 397 96 -603 33 546 -155 -261 547 -3 -518 34 529 -331 -224 554 550 -389 -72 497 -449 -341 348
6157 348 247 -665 256 594 -125 -513 435 610 -609 -282 490 -158 -459 355 319 -786 -47 623 27 -697
6177 -697 420 425 -651 276 640 -108 -563 254 87 -384 -92 306 -118 -664 344 278 -242 -115 987 -191
6197 -191 -526 -63 83 -127 -239 909 271 -481 7 730 -405 60 231 -116 -454 362 220 -271 -281 639
6217 639 -62 -722 489 498 -375 -17 454 -264 -579 208 484 -247 50 487 -61 -334 125 502 -468 -384 653
6238 653 197 -626 534 201 -467 -280 459 -30 -492 123 401 -251 -109 467 6 -466 205 334 -265 -167
6258 -167 204 125 -466 195 250 -425 -73 724 346 -765 303 302 -770 -618 -287 38 -657 3 325 -530
6278 -530 -780 141 596 -750 -174 432 -147 -539 385 320 -537 2 617 -240 -785 371 362 -737 10 622
6298 622 -507 -349 502 87 -416 30 548 10 -47 528 390 -579 -58 468 -339 -605 192 196 -913 -149
6318 -149 425 -227 -535 213 287 -442 156 781 -33 -393 390 331 -278 -201 410 -127 -586 381 427 -401 -194
6339 -194 620 -179 -399 342 386 -177 -302 519 -168 -448 261 399 -197 -318 542 52 -420 362 432 -391 13
6360 13 462 -232 -298 258 503 -512 29 530 19 -428 214 331 -367 -285 569 -9 -572 203 531 -390 -291
6381 -291 623 119 -610 167 514 -301 -356 697 -307 -643 324 373 -506 -134 430 -67 -631 97 538 -315
6401 -315 -335 717 67 -481 -91 300 -477 -51 448 214 -332 234 610 -276 -506 427 160 -499 173 485
6421 485 -166 -353 514 -167 -572 52 770 -183 -372 390 89 -438 185 392 -70 -248 493 458 -516 12
6441 12 678 -178 -440 664 193 -618 -99 457 -325 -343 235 240 -480 -21 507 -312 -430 197 296 -694 -31
6462 -31 549 17 -178 493 282 -346 41 570 -45 -562 227 255 -454 -255 805 -192 -359 391 368 -706
6482 -706 -286 412 -101 -358 22 348 -473 -74 550 -112 -364 376 223 -491 -149 387 -142 -468 38 497
6502 497 -343 -282 267 79 -540 165 625 -485 -91 583 70 -565 203 603 -424 -197 524 120 -491 142
6522 142 231 -408 -305 575 230 -289 119 300 -477 -396 355 128 -358 294 227 -543 -246 701 130 -433 37
6543 37 419 -391 -243 224 202 -323 141 323 -240 -359 311 71 -299 -32 437 13 -163 413 270 -342 95
6564 95 517 -397 -270 462 382 -673 -126 594 -83 -619 191 219 -296 -27 471 -301 -334 155 321 -399 107
6585 107 431 79 -452 230 324 -589 -48 533 151 -439 315 281 -532 -265 221 -363 -359 440 179 -497 12
6606 12 510 -242 -458 273 201 -547 -119 516 -73 -312 296 280 -487 -201 654 156 -535 318 439 -152 -8
6627 -8 321 -221 -537 34 486 -231 -106 350 -14 -458 221 440 -417 -218 360 50 -357 245 428 -324 -239
6648 -239 628 31 -521 53 435 -160 -175 429 -67 -585 206 401 -265 -177 603 252 -514 10 336 -140 -180
6669 -180 164 90 -420 80 320 -117 -414 413 178 -522 46 308 7 -192 277 80 -535 -23 297 -281
6689 -281 -559 292 124 -561 -86 588 -276 -186 188 9 -351 -47 315 -173 -316 355 349 -259 -28 450 -295
6710 -295 -458 296 426 -377 -142 342 -38 -368 409 494 -400 25 331 -116 -154 348 256 -495 123 521 -125
6731 -125 -513 339 463 -340 -66 529 -59 -277 368 199 -242 -121 591 215 -576 242 631 -515 -228 405
6751 405 79 -217 253 416 -417 234 689 -35 -476 192 524 -263 59 565 -57 -414 411 422 -164 -202 177
6772 177 -185 -610 98 544 -186 -352 321 -29 -461 157 381 -352 -362 487 94 -562 220 487 -230 -235 444
6793 444 112 -282 164 192 -270 -374 464 48 -472 157 362 -158 -445 226 157 -412 -19 311 -332 -124 190
6814 190 343 -243 180 168 -384 -733 301 85 -582 260 241 -29 -325 276 91 -252 -74 370 -150 -317
6834 -317 494 -11 -358 -73 737 -356 -306 22 273 -354 1 511 -339 -436 304 180 -392 69 338 -163
6854 -163 -539 286 195 -771 9 660 -371 -599 303 344 -436 -189 289 -127 -477 389 177 -307 -50 287
6874 287 65 -477 395 433 -416 101 371 -170 -273 118 246 -249 -209 364 80 -262 140 206 -338 288 557
6895 557 -270 -601 -272 900 71 -175 278 -180 -344 93 363 -322 -156 321 193 -608 115 365 -317 -549
6915 -549 344 -197 -237 -212 75 -705 -258 95 151 -394 -15 476 -703 -414 541 112 -708 -239 632 -517
6935 -517 -478 281 -126 -443 -297 590 -290 -38 -301 287 -501 -289 405 -745 262 53 -70 -657 -59 -385
6955 -385 -459 -828 466 800 -726 -411 32 -405 439 173 213 -40 270 550 322 -376 123 431 -123 171
6975 171 374 -313 -378 95 407 -396 25 365 -128 -220 200 88 -119 2 346 58 -416 216 69 -445 -229
6996 -229 339 -133 -495 617 322 -156 -33 314 -120 -250 382 325 -384 161 122 -234 -308 42 359 -430 15
7017 15 299 -83 -664 197 298 -380 -230 366 -102 -370 142 326 -249 -257 400 -205 -446 72 275 -520 -234
7038 -234 447 147 -503 153 342 -301 -99 489 -201 -314 120 480 -209 -213 284 285 -392 42 311 -121 -282
7059 -282 234 -20 -382 90 379 -113 -294 488 187 -67 275 322 -448 -76 39 135 -404 -24 286 -225 -473
7080 -473 206 68 -590 139 547 -186 -400 360 241 -503 2 213 -199 -277 362 75 -313 174 338 -219
7100 -219 -388 346 119 -342 -24 335 -198 -197 362 252 -601 51 417 -75 -429 242 104 -312 -149 240 18
7121 18 -338 191 349 -463 4 594 -220 -267 151 330 -167 -99 235 -143 -520 50 343 -46 -102 273 86
7142 86 -257 123 233 -213 -264 381 -12 -308 68 356 -290 -224 294 -78 -167 300 275 -174 -157 462 120 -471
7164 -471 122 216 -244 -11 203 127 -475 207 313 -413 -145 555 284 -351 91 357 -254 -104 404 342 -305
7185 -305 39 411 -463 -364 328 -224 -318 92 338 -346 -276 387 50 -462 -4 190 -202 -46 271 109 -391
7206 -391 100 350 -36 -56 326 -141 -404 7 288 -135 -70 258 165 -408 7 450 -275 -253 96 73 -209 -133
7228 -133 588 -298 -212 9 8 -184 21 521 -233 -92 358 117 -424 90 477 -216 -267 202 135 -660 104 542
7250 542 -163 -357 124 285 -355 -116 346 -5 -375 233 13 -261 142 128 -57 -398 -18 -93 -166 -131 256
7271 256 -11 -472 195 239 -478 -124 402 -24 -370 263 212 -529 -101 367 -134 -380 166 141 -164 -106 206
7292 206 133 -113 265 77 -295 -243 139 225 -468 86 269 -65 -170 282 -46 -317 26 143 -206 -98 342
7313 342 0 -481 78 264 -203 -102 165 33 -313 -63 379 -124 -229 171 -114 -543 43 549 81 -279
7333 -279 273 101 -385 17 247 -193 -289 159 -82 -186 18 321 -103 -435 546 -32 -347 -184 234 -162
7353 -162 -284 161 132 -407 -86 243 -123 -37 236 58 -481 -22 420 -68 -369 102 304 -346 -23 211 111
7374 111 -344 -12 418 -170 -30 428 -108 -428 205 54 -279 -65 327 -50 -316 145 323 -154 -184 316
7394 316 -118 -273 235 72 -226 -54 185 -112 -186 6 376 -264 -130 154 -15 84 298 230 -377 -253 301
7415 301 63 -521 147 301 -346 -100 512 103 -311 270 101 -621 -84 237 105 -325 119 347 91 -265
7435 -265 232 62 -241 27 -14 -126 -208 262 -35 -93 -267 164 -151 -301 163 44 -178 93 137 -231 -277 -98
7457 -98 -137 -492 -103 209 -152 -106 360 308 -179 -94 538 -451 -14 186 153 -362 -73 121 -215 -86 126 124 -299
7480 -299 81 174 -96 -2 247 -31 -228 11 346 -202 -144 319 347 -85 60 265 -95 -257 33 195 -150
7501 -150 93 396 -147 -196 153 -77 -381 -210 307 -106 -242 176 196 -342 -168 325 104 -325 44 332 -352
7522 -352 -76 310 28 -366 57 220 -287 -49 271 -156 -185 238 138 -174 -141 347 -116 -386 126 51 26
7543 26 -472 220 -77 -493 -55 387 -336 -146 374 -258 -384 41 260 -304 -218 305 111 -239 176 279 -288
7564 -288 -227 228 130 -166 -81 392 -125 -222 159 32 -218 -113 199 -81 -20 58 53 -225 166 329 -209 -182 377
7587 377 105 -77 -30 118 -67 -149 -54 -95 -113 35 94 -55 -216 418 112 -166 -99 256 -148 -292 111 -104
7609 -104 -351 53 275 -13 39 72 189 -386 -216 20 -258 -136 155 157 -207 -92 308 -215 -86 130 355
7630 355 -283 -167 139 -217 -332 6 242 -274 -60 179 -103 16 99 247 55 6 324 -108 -33 318 244
7651 244 26 -162 326 23 -110 321 68 -198 12 114 -163 -205 -53 449 -288 -134 294 19 -77 201 129
7672 129 -182 -180 353 50 -349 1 124 -129 -93 551 180 -144 59 99 -236 -117 156 66 -88 65 386 -203
7694 -203 -15 203 15 -247 -67 525 -223 -167 19 48 31 -137 269 -288 -100 -81 83 -487 416 3 -191
7715 -191 -166 75 67 -271 -190 53 -222 -199 -78 85 -212 102 164 -56 -20 158 -16 -110 117 375 -72 -412 176
7738 176 122 109 -109 263 -139 28 94 98 -266 -150 107 127 -515 247 265 -257 122 158 187 -28 -16 -52 -64 120
7762 120 214 -84 -225 5 262 -284 -53 463 63 -177 106 193 -187 -232 175 -127 -318 99 235 -157 21
7783 21 64 -98 -16 98 143 -45 -105 189 88 32 -350 122 -61 61 149 -126 -183 130 107 -86 156 203 -128
7806 -128 -273 -59 260 -28 -309 83 11 -369 -32 67 -210 -129 153 343 -264 86 178 -215 -361 243 16
7827 16 -198 5 236 -339 92 264 170 -108 177 248 -125 -89 242 25 -374 -93 64 -43 -79 243 174 5
7849 5 -152 200 56 -66 160 23 -323 98 331 -114 -323 128 60 -157 -278 16 -320 34 72 45 -54 92
7871 92 314 -219 -147 -28 -1 -98 -44 261 -40 -214 74 184 -376 -172 134 -79 -216 78 53 -132 -9 39
7893 39 -165 -497 113 135 -288 -139 230 -119 -221 142 182 -78 -10 373 -88 -121 -84 -116 -398 40 103 -125 -254
7916 -254 -4 78 -69 8 306 -36 -75 67 159 -175 -228 257 63 -88 130 -19 -124 -50 213 102 -285 146
7938 146 -19 -77 -244 146 67 -153 67 150 -22 -46 236 -208 -241 95 181 -216 -5 248 114 -5 -118 166
7960 166 -136 95 402 -13 -166 -1 208 12 -99 253 176 -50 -241 201 -279 -45 40 103 38 84 193 119
7982 119 -33 112 232 13 -76 151 -85 -322 149 111 -245 21 38 -236 -123 17 34 -208 -17 -136 -62 -40
8004 -40 119 184 -101 -49 239 79 -126 21 52 -253 -311 37 177 -304 61 135 142 55 222 3 -244 -84 -37
8027 -37 -86 -47 32 -25 -67 103 259 -164 -47 20 49 -320 76 -68 -61 -207 86 -72 27 15 190 -141 -110 178
8051 178 13 109 -49 184 -150 -54 175 -193 -105 -72 120 -212 -182 110 -48 -95 -72 198 -68 -227 134 110 -7
8074 -7 -251 68 -155 4 96 -120 -110 -97 308 -62 -45 299 11 -121 -15 153 -192 -50 207 84 -259 11
8096 11 33 273 -319 40 5 -36 84 124 -287 -218 -78 79 -189 82 299 -123 -154 -9 200 -150 138 204 -124
$$ [...]
8191C4
##END NTUPLES=NMR FID
##END=
