##TITLE=1H_SR50_rmk
 CDCl3,8 sc, 
 30.03.2021
##JCAMPDX= 6.0         $$ Bruker NMR JCAMP-DX V2.0
##DATA TYPE= NMR FID
##DATA CLASS= NTUPLES
##ORIGIN= UXNMR, Bruker Analytische Messtechnik GmbH
##OWNER= root
$$ XWIN-NMR		Version 3.5
$$ Tue Mar 30 13:16:04 2021 Russian Standard Time (UT+4h)  she@DPX200
##.OBSERVE FREQUENCY= 200.131506
##.OBSERVE NUCLEUS= ^1H
##.DELAY= (6, 6)
##.ACQUISITION MODE= SIMULTANEOUS
##.ACQUISITION SCHEME= undefined
##.AVERAGES= 8
##.DIGITISER RES= 18
##SPECTROMETER/DATA SYSTEM= spect
##.PULSE SEQUENCE= zg30
##.SOLVENT NAME= CDCl3
##.SHIFT REFERENCE= (INTERNAL, CDCl3, 0, 15.7039)
##AUDIT TRAIL= $$ (NUMBER, WHEN, WHO, WHERE, WHAT)
$$ ##TITLE= Audit trail, XWIN-NMR		Version 3.5
$$ ##JCAMPDX= 5.01
$$ ##ORIGIN= Bruker BioSpin GmbH
$$ ##OWNER= she
$$ F:/spectra/data/she/nmr/H-F/1/audita.txt
$$ ##AUDIT TRAIL=  $$ (NUMBER, WHEN, WHO, WHERE, WHAT)
(   1,<2021-03-30 13:14:22.57 +0400>,<she>,<DPX200>,
      <created by zg, POWCHK disabled, PULCHK disabled
       configuration hash MD5:
       00 E9 B6 7A A2 85 ED C7 34 08 36 98 17 FE 4E 26
       data hash MD5: 16K
       6E 0B 1B D8 5A B3 B4 13 62 AE 01 72 EE DA 4F 06>)
$$ ##END=
$$ 
$$ hash MD5
$$ 53 8E 11 79 26 57 8E E6 55 36 20 04 44 27 15 16
##$RELAX= 
##$RELAX= 
##$RELAX= 
##$RELAX= 
##$RELAX= 
##$RELAX= 
$$ Bruker specific parameters
$$ --------------------------
##$DU= <F:/spectra>
##$EXPNO= 1
##$NAME= <H-F>
##$PROCNO= 1
##$TYPE= <nmr>
##$USER= <she>
##$AMP= (0..31)
100 100 100 100 100 100 100 100 100 100 100 100 100 100 100 100 100 100 
100 100 100 100 100 100 100 100 100 100 100 100 100 100 
##$AQSEQ= 0
##$AQ_mod= 1
##$AUNM= <au_zg>
##$AUTOPOS= <>
##$BF1= 200.13
##$BF2= 200.13
##$BF3= 200.13
##$BF4= 200.13
##$BF5= 200.13
##$BF6= 200.13
##$BF7= 200.13
##$BF8= 200.13
##$BYTORDA= 1
##$CFDGTYP= 0
##$CFRGTYP= 5
##$CHEMSTR= <none>
##$CNST= (0..31)
1 1 145 1 1 1 1 1 1 1 1 1 1 1 1 1 1 1 1 1 1 1 1 1 1 1 1 1 1 1 1 1 
##$CPDPRG= <>
##$CPDPRG1= <>
##$CPDPRG2= <>
##$CPDPRG3= <>
##$CPDPRG4= <mlev>
##$CPDPRG5= <mlev>
##$CPDPRG6= <mlev>
##$CPDPRG7= <mlev>
##$CPDPRG8= <mlev>
##$CPDPRGB= <>
##$CPDPRGT= <>
##$D= (0..31)
0 1.2 0 0 0 0 0 0 0 0.06 0 0.03 0 0 0 0 0.0002 0 0 0 0 0 0 0 0 0 0 0 0 
0 0 0 
##$DATE= 1617095662
##$DBL= (0..7)
120 120 120 120 120 120 120 120 
##$DBP= (0..7)
150 150 150 150 150 150 150 150 
##$DBP07= 0
##$DBPNAM0= <>
##$DBPNAM1= <>
##$DBPNAM2= <>
##$DBPNAM3= <>
##$DBPNAM4= <>
##$DBPNAM5= <>
##$DBPNAM6= <>
##$DBPNAM7= <>
##$DBPOAL= (0..7)
0.5 0.5 0.5 0.5 0.5 0.5 0.5 0.5 
##$DBPOFFS= (0..7)
0 0 0 0 0 0 0 0 
##$DE= 6
##$DECBNUC= <off>
##$DECIM= 32
##$DECNUC= <off>
##$DECSTAT= 4
##$DIGMOD= 1
##$DIGTYP= 9
##$DL= (0..7)
0 120 120 120 120 120 120 120 
##$DP= (0..7)
150 150 150 150 150 150 150 150 
##$DP07= 0
##$DPNAME0= <>
##$DPNAME1= <>
##$DPNAME2= <>
##$DPNAME3= <>
##$DPNAME4= <>
##$DPNAME5= <>
##$DPNAME6= <>
##$DPNAME7= <>
##$DPOAL= (0..7)
0.5 0.5 0.5 0.5 0.5 0.5 0.5 0.5 
##$DPOFFS= (0..7)
0 0 0 0 0 0 0 0 
##$DQDMODE= 0
##$DR= 18
##$DS= 0
##$DSLIST= <SSSSSSSSSSSSSSS>
$$ [...]
##$SUBNAM2= <"">
##$SUBNAM3= <"">
##$SUBNAM4= <"">
##$SUBNAM5= <"">
##$SUBNAM6= <"">
##$SUBNAM7= <"">
##$SUBNAM8= <"">
##$SUBNAM9= <"">
##$SW= 16.9725357007746
##$SWIBOX= (0..15)
0 0 2 0 0 0 0 0 0 0 0 0 0 0 0 0 
##$SW_h= 3396.73913043478
##$TD= 16384
##$TD0= 1
##$TE= 0
##$TE2= 300
##$TE3= 300
##$TEG= 300
##$TL= (0..7)
0 120 120 120 120 120 120 120 
##$TP= (0..7)
150 150 150 150 150 150 150 150 
##$TP07= 0
##$TPNAME0= <>
##$TPNAME1= <>
##$TPNAME2= <>
##$TPNAME3= <>
##$TPNAME4= <>
##$TPNAME5= <>
##$TPNAME6= <>
##$TPNAME7= <>
##$TPOAL= (0..7)
0.5 0.5 0.5 0.5 0.5 0.5 0.5 0.5 
##$TPOFFS= (0..7)
0 0 0 0 0 0 0 0 
##$TUNHIN= 0
##$TUNHOUT= 0
##$TUNXOUT= 0
##$USERA1= <user>
##$USERA2= <user>
##$USERA3= <user>
##$USERA4= <user>
##$USERA5= <user>
##$V9= 5
##$VALIST= <valist>
##$VCLIST= <CCCCCCCCCCCCCCC>
##$VD= 0
##$VDLIST= <DDDDDDDDDDDDDDD>
##$VPLIST= <PPPPPPPPPPPPPPP>
##$VTLIST= <TTTTTTTTTTTTTTT>
##$WBST= 1024
##$WBSW= 4
##$XGAIN= (0..3)
0 0 0 0 
##$XL= 0
##$YL= 0
##$YMAX_a= 676654
##$YMIN_a= -525505
##$ZGOPTNS= <>
##$ZL1= 120
##$ZL2= 120
##$ZL3= 120
##$ZL4= 120
##$ABSF1= 10
##$ABSF2= 0
##$ABSG= 5
##$ABSL= 3
##$ALPHA= 0
##$AQORDER= 0
##$ASSFAC= 0
##$ASSFACI= 0
##$ASSFACX= 0
##$ASSWID= 0
##$AUNMP= <proc_1d>
##$AZFE= 0.1
##$AZFW= 0.1
##$BCFW= 1
##$BC_mod= 2
##$BYTORDP= 1
##$COROFFS= 0
##$CY= 11.3945322036743
##$DATMOD= 1
##$DC= 2
##$DFILT= <>
##$DTYPP= 0
##$F1P= 15.9154993809931
##$F2P= -4.1035820241983
##$FCOR= 0.5
##$FTSIZE= 0
##$FT_mod= 4
##$GAMMA= 1
##$GB= 0.15
##$INTBC= 1
##$INTSCL= 1
##$ISEN= 128
##$LB= 0.24
##$LEV0= 0
##$LPBIN= 0
##$MAXI= 10000
##$MC2= 0
##$MEAN= 0
##$ME_mod= 0
##$MI= 1.114404
##$NCOEF= 0
##$NC_proc= 0
##$NLEV= 6
##$NOISF1= 3.799351
##$NOISF2= 2.8
##$NSP= 1
##$NTH_PI= 0
##$NZP= 0
##$OFFSET= 15.70392
##$PC= 1
##$PHC0= -11116.23
##$PHC1= 9.000929
##$PH_mod= 1
##$PKNL= yes
##$PPARMOD= 0
##$PSCAL= 0
##$PSIGN= 0
##$REVERSE= no
##$SF= 200.130013532006
##$SI= 16384
##$SIGF1= 3
##$SIGF2= 2
##$SINO= 400
##$SIOLD= 16384
##$SREGLST= <1H.CDCl3>
##$SSB= 0
##$STSI= 0
##$STSR= 0
##$SW_p= 3612.71676300578
##$SYMM= 0
##$S_DEV= 0
##$TDeff= 0
##$TDoff= 0
##$TI= <>
##$TILT= no
##$TM1= 0
##$TM2= 0
##$TOPLEV= 0
##$USERP1= <user>
##$USERP2= <user>
##$USERP3= <user>
##$USERP4= <user>
##$USERP5= <user>
##$WDW= 1
##$XDIM= 8192
##$YMAX_p= 0
##$YMIN_p= 0
$$ End of Bruker specific parameters
$$ ---------------------------------
##NTUPLES= NMR FID
##VAR_NAME=  TIME,          FID/REAL,        FID/IMAG
##SYMBOL=    X,             R,               I
##VAR_TYPE=  INDEPENDENT,   DEPENDENT,       DEPENDENT
##VAR_FORM=  AFFN,          ASDF,            ASDF
##VAR_DIM=   8192,          8192,            8192
##UNITS=     SECONDS,       ARBITRARY UNITS, ARBITRARY UNITS
##FACTOR=    0.0002944,     1,               1
##FIRST=     0,             0,               0
##LAST=      2.4114304,     0,               0
##MIN=       0,             -525505,         0
##MAX=       2.4114304,     676654,          0
$$ Real data points
##PAGE= N=1
##DATA TABLE= (X++(R..R)), XYDATA
$$ [...]
$$ plain form
2199 -13 1186 55 1024 667 555 1268 335 1610 715 1305 607 1342 794 580 1329 320 1432 371
2217 371 1222 141 679 615 257 1048 -217 1036 -454 682 -186 361 330 -502 648 -928 678 -981
2235 -981 -201 -419 -931 -51 -1420 123 -1581 -80 -1223 -774 -495 -1379 -158 -1679 210 -1693 -548
2252 -548 -857 -1059 64 -1499 117 -1262 30 -825 -404 19 -788 427 -1065 412 -633 81 29
2269 29 -269 474 -164 1196 -256 857 37 855 639 527 1014 60 1634 188 1399 796 796 837 152
2288 152 1380 12 1476 282 1380 470 867 752 -97 1075 -301 1163 -450 592 0 -81 828
2305 828 -798 536 -848 479 -450 -249 9 -1016 -107 -1222 209 -1020 -331 -956 -1039 -359 -1474
2322 -1474 57 -1760 -381 -975 -874 -479 -1186 -153 -1406 -154 -1098 -319 -573 -764 -73 -702 7 -678
$$ packed form
2199a3J199j131R69l57j12P13r33J275q95N90o98P35n48k14P49j009J112j061
2217C71Q51j081N38o4l58P91j265J253j490J136q68N47l1q32J150j576J606j659
2235i81P80k18n12Q80j369J543j704J501j143M49K79q84J221j521J889j903J145
2252e48l09k02J123j563J616j379J292q55M21M23q07J215j492J477j045P14n2
2269B9k98P43o38J360j452J113q20Q18k16j12M87r54J574j446J211o03%M1o85
2288A52J228j368J464j194J098r10L97j15q49J172j376J464j613J042n92q1R09
2305H28j626J334j384J327r29K01K58j025R09j115J431j229O89o25q3O80j115
2322a474J531j817J379n94J01L95p07J033j253J252r44P79k54j91O91o29P09o85
$$ plain form
2340 -678 441 -627 224 -83 -124 574 -312 792 -139 767 305 913 571 -57 1182 117 1253 368
2358 368 1186 673 984 919 547 1248 197 1501 456 714 601 602 1036 109 1037 -167 931 -45 233
2377 233 338 -180 487 -631 618 -701 421 -253 -456 -134 -986 -208 -967 -64 -975 -160 -968 -1034 -604
2396 -604 -1257 -169 -1218 -269 -1054 -907 -604 -1038 -214 -1335 -130 -1012 -113 -576 -552 -227 -731 259 -689
2415 -689 537 -506 164 -198 -133 513 -392 1009 -269 926 253 528 484 207 1162 78 1253 274
2433 274 989 694 437 1160 304 1397 -30 1323 176 686 511 414 1002 2 1079 -130 998 393
2451 393 476 477 -226 972 -587 578 -541 282 -79 -425 50 -992 175 -603 330 -996 -504 -401 -762
2470 -762 -118 -1154 -284 -1394 -431 -686 -814 -462 -1342 -136 -1246 -5 -1005 -101 -496 -623 -86 -1019
$$ packed form
2340f78J119j068Q51l07m1O98q86J104r31R06m62O08l42o28J239j065J136q85
2358C68Q18n13L11o5l72P01j051J304j045K58j13JM34r27R28j204J098r76K78
2377B33J05n18O67j118J249j319J122o74k03L22q52P78p59R03r11Q15q08o6M30
2396f04o53J088j049R49p85J47L03m34Q24j121J205q82Q99m63K4L25n04R90r48
2415f89J226j043O70l62O5O46r05J401j278J195o73K75m4k77R55j084J175r79
2433B74P15k95k57P23q56J093j427J353j147N10j75r7N88j000J077j209J128o05
2451C93Q3Jp03J198j559J165j119Q23l61l46M75j042J167p78R33j326M92J03l61
2470g62O44j036Q70j110R63k55j28L52q80J206j110J241j000R04l95j27N37r33
$$ plain form
2488 -1019 188 -950 357 -726 -142 272 -384 293 -558 723 -198 525 399 305 691 -132 1021 -231
2506 -231 1060 420 862 834 473 1201 73 1157 414 876 551 654 1000 583 1073 99 842 284 626
2525 626 226 465 791 73 597 -1 429 -384 -23 -109 -103 303 -763 121 -694 -315 -552 -734 -395 -705 -117
2546 -117 -931 -260 -1201 -625 -652 -909 -293 -1141 -370 -832 -150 -1042 -500 -493 -732 -155 -915 40 -907 -111 -459
2567 -459 -212 74 -312 369 -522 468 65 411 275 -35 529 -91 967 92 873 430 653 671 548 1056
2587 1056 120 1077 141 715 542 530 892 274 1063 61 635 165 611 328 418 632 33 591 -467 630
2607 630 -317 227 -34 -167 344 -578 165 -812 80 -608 -50 -516 -688 -157 -805 41 -935 -321 -382 -801
2627 -801 -298 -1023 -361 -882 -197 -787 -289 -507 -636 4 -919 261 -723 26 -88 -186 -161 -503 290 -792
$$ packed form
2488a019J207j138J307j083N84M14o56O77q51J281r21P23j26r4L86q23J153j252
2506b31J291o40M42k8l61P28j128J084p43M62l25J03L46m17M90r74P43n58L42
2525F26m00K39L26p18N24n98M30q13L61q6OM06j066Q84q15L79k37j82L39l10N88
2546a17q14O71r41N76k7k57O16q48P71m62O82q92N42Pk39N77p60R55r47P96l48
2567d59K47K86l86O81q91R90m03L46j36l10N64o20J058q75P81m43K23J8j23N08
2587A056r36R57r36N74j73j2L62o18P89j002N74m70M46k83R0K14n99N58j058J097
2607F30r47N44k61j33N11r22P43r77Q92o88N58m66j72N31o48Q46r76O14o1m19
2627h01N03p25O62n21O85n90M98k18j29O40r23J180r84P49j14r8K5l42P93j082
$$ plain form
2647 -792 296 -292 196 145 -21 598 -379 687 241 711 274 557 566 155 708 163 1095 103 548 614 274
2668 274 648 109 934 89 1031 41 500 345 325 696 -277 767 -101 265 -131 28 70 -362 524 -554
2688 -554 264 -637 75 -426 -601 134 -919 135 -857 135 -781 -171 -366 -683 -419 -819 -134 -802 -281
2707 -281 -705 -427 -229 -976 -72 -830 -168 -443 -447 -340 -525 178 -691 473 -470 181 -180 197 161 -40 667
2728 667 -290 659 -69 553 251 381 545 193 777 26 596 449 464 442 375 702 53 970 246 756 75
2749 75 775 436 227 407 -64 692 -275 628 93 76 284 -103 181 -595 388 -511 58 -354 -332 -239 -820
2770 -820 16 -841 -47 -585 -488 -277 -646 -197 -1150 80 -820 27 -597 -670 -84 -837 303 -984 26
2789 26 -578 -197 -188 -526 193 -614 266 -203 135 -166 -138 74 -165 301 -334 571 -39 392 335 280 656 291
$$ packed form
2647g92J088n88M88n1j66O19r77J066m46M70m37K83Rm11N53n45R32r92M45O6l40
2668B74L74n39Q25q45R42r90M59j55k0L71r73J044q68L66l96J59M2m32Q86j078
2688e54Q18r01P12n01j75P35j053J054r92R92r16O10j95l17K64m00O85o68N21
2707b81m24K78J98p47R04p58O62k75mJ07j85P03q69J164r43O51l61L77l6k01P07
2728F67r57R49p28O22l02J30J64l52N84p51N70j47J5k2o7L27o49R17p24N10o81
2749G5P00l39k09J80m71P56r67R03n35j7K08l87K84p76R83q99N69m12K2R3n81
2770h20Q36q57P94n38R7K11l69M49r53J230r00Q47o24p3N86p53J140j287J010
2789B6o04L81Rl38P19q07Q80m69L38l01K8K12k39M66o35R05o10M31n7n5L76l65
$$ plain form
2811 291 817 119 829 439 474 247 311 424 245 881 36 585 139 360 507 212 847 -7 920 101 233
2832 233 -175 36 358 -309 341 -636 350 -531 64 -356 -259 -109 -878 297 -588 -5 -655 -537 -132 -811
2852 -811 -195 -914 102 -1122 -262 -430 -867 122 -1010 -84 -727 109 -482 -496 40 -607 210 -530 245
2871 245 -556 198 108 -431 336 -127 360 -110 418 -72 214 573 355 462 57 603 167 594 549 520 494
2892 494 413 753 209 552 109 793 168 443 166 180 994 -206 902 -388 473 -151 111 340 -322 564
2912 564 -799 733 -349 -116 82 -768 474 -912 194 -822 -43 -474 -746 54 -1005 306 -795
2929 -795 -363 -836 -456 36 -710 -76 -1031 -194 -817 -118 -372 -647 26 -486 200 -595 159 -442 -162 81
2949 81 -209 168 -180 385 -70 330 29 313 114 288 471 -13 685 -62 857 9 660 309 148 735
$$ packed form
2811B91N26o98P10l90L5k27O4J13j79O36q45N49m46K21J47k95O35q54R27q19J32
2832B33m08K11L22o67O50r77R86q81N95m20R7J50p69J175q85N83o50J18M05o79
2852h11O16p19J016j224Q60j68m37R89j132R26o43Q36n91j4N36o47Q17p40P75
2871B45q01P54r0n39P67m63M87m70N28m90K86L59k18J07m05N46m36M27m5k9k6
2892D94q1L40n44L43m43O84o25K75k77J4Q14j200J108j290Q61o24K62K29o62Q86
2912E64j363J532j082K33J98q50J242j386J106j016P79m31k72Q00j059J311j101
2929g95M32m73L80M92p46O34r55Q37o23O99k54k75O73n12O86p95P54o01K80K43
2949H1k90L77l48N65m55M00l01K84j99J74J83m84O98p47R19q48O51l51j61N87
$$ plain form
2969 735 71 835 65 947 173 403 532 109 1124 -380 1146 -317 599 81 -252 759 -674 912
2987 912 -762 254 -360 -224 287 -841 615 -1210 253 -827 -113 -229 -1012 175 -1148 127 -1218
3004 -1218 -357 -367 -693 -59 -1114 111 -749 -28 -398 -246 -294 -550 -30 -684 228 -255 -29 -241 -167 21
3024 21 -31 197 -427 257 -284 307 -254 -63 264 70 387 -19 1015 -5 563 13 723 564 -157 774
3044 774 17 1028 -181 546 558 315 974 -192 1131 -100 631 -70 1 665 -149 996 -654 434
3062 434 -304 -139 226 -492 318 -987 496 -768 505 -428 -591 4 -1105 336 -845 -164 -561 -450
3080 -450 -368 -703 151 -475 -122 -290 -742 -620 -214 320 -165 -179 -743 -627 -867 -733 -423 175 -27 -106 60
3101 60 -185 281 -130 371 -52 83 59 20 528 -77 807 -140 584 251 135 590 264 872 22 997 130
$$ packed form
2969G35o64P64p70Q82p74K30J29m23J015j504J526j463R16n18l33J011j433J586
2987I12j674J016o14J36N11j128J456j825J463j080P14j16p83J187j323J275j345
3004a218Q61j0l26O34j055J225q60P21l70J52m8k56N20o54R12m83K26k12P4J88
3024B1n2K28o24O84n41N91n61J91L27j94L17m06J034j020N68n50P10j59p21R31
3044G74p57J011j209P27J2k43O59j166J323j231P31p01P1O64q14J145j650J088
3062D34p38J65L65p18Q10j305J483j264J273r33j63N95j109J441j181O81l97J11
3080d50Q2l35Q54o26L53j68m52J22M06N34m85j4n64J16k40J34L10N98k02p9J66
3101F0k45M66m11N01m23J35k4l9N08o05Q84r47P24l33j16M55l26O08q50R75q67
$$ plain form
3122 130 579 475 79 648 -438 688 -277 571 123 253 713 -88 869 -195 589 125 33 358 -464
3141 -464 308 -680 382 -413 138 -101 -426 220 -663 304 -584 -116 -409 -292 -385 -469 -220 -385 -478 -554 -47
3162 -47 -448 -268 -218 -469 -119 -459 162 -717 132 -209 -283 -241 -179 175 -347 305 -591 615 -164 -64 529
3183 529 19 463 -372 179 -174 190 432 78 730 -148 854 -51 613 235 245 559 40 844 -418 981
3203 981 -79 376 349 -59 658 -127 623 -226 276 -3 -330 319 -293 506 -323 227 -231 50 -144 -398
3223 -398 255 -632 146 -640 237 -153 -221 -211 -659 -53 -482 28 -516 -155 -724 -151 -51 -255 -71 -258 -162
3244 -162 -402 236 -122 147 -127 -252 315 -293 303 61 -102 -306 82 245 -120 432 -210 201 2 467
3264 467 200 -84 548 88 706 112 381 212 136 370 32 550 -162 605 147 119 433 -11 535 -200 615
$$ packed form
3122A30M49j04l96N69j086J126r65Q48m48J30M60q01R57j064P84m64r2L25q22
3141d64P72r88J062p95N51k39l25O46q83R67q88M68k93J17r3q4K49j65r3p6N07
3162d7m01J80N0k51L50l40O21q79Q49l41p4M2O2L54n22O52q96J206p79J00N93
3183E29n10M44q35N51l53L64K42l54O52q78J002r05O64l78J0L14n19Q04j262J399
3203I81j060M55k7m08P17p85P50q49N02k79l27O49o12P99q29N50m58K81j94k54
3223c98O53q87P78p86Q77l90o8J0m48O06m29N10n44L61n69N73J00k04J84j87R6
3244a62k40O38l58K69k74j25N67o08N96k42j63k04L88J63l65N52o42M11j99M65
3264D67k67k84O32m60O18n94K69j69p6K34l38N18p12P67m58k8L14m44N46p35Q15
$$ plain form
3285 615 -286 225 -154 61 405 -405 432 -330 217 -241 -120 -195 -345 81 -401 -155 -439 -392 -136 -369 -89
3306 -89 -326 282 -755 -5 -230 -296 -302 -360 30 -420 -239 -333 -22 -335 220 -247 -66 -235 -107 227 -216 -150
3328 -150 59 140 54 91 258 -79 427 -66 484 14 187 369 18 407 -223 688 -153 517 408 133 242
3349 242 -361 653 -113 626 10 99 324 -138 600 -276 432 -192 203 -69 -193 169 -415 110 -333 159
3369 159 -278 -305 99 -304 25 -266 -17 -285 -43 -395 -316 -88 -413 -250 -341 -266 -293 -314 -397 -87 -53 -197 67
3392 67 -529 -79 -204 -32 -3 -163 474 -175 187 -122 430 -271 293 -257 -134 463 -61 519 -88 751 -110
3413 -110 347 301 98 523 -255 656 -201 320 328 -149 482 -281 538 -107 497 152 98 448 -130 291 -417
3434 -417 435 -410 63 148 -374 257 -370 73 -407 -317 -188 -376 209 -446 200 -327 -253 -9 37 30 -442 -148
$$ packed form
3285F15r01N11l79K15L44q10Q37p62N47m58J21p5j50M26m82K46k84M7K56k33K80
3306h9k37O08j037P50k25o6on8L90m50J81r4L11l13N55m67J81j69J28L34m43O6
3328a50K09Q1q6L7J67l37N06m93N50m70J73J82l51L89o30R11q41O70j09k75J09
3349B42o03J014p66P39o16Q9K25m62P38q76P08o24L95k72j24L62n84N25m43M92
3369A59m37k7M04m03L29k91K49k68K42l52P9K28l25J63r1P5k7k1q3L10L4j44K64
3392F7n96M50j25J72K9j60O37o49L62l09N52p01N64n50J23N97n24N80o07Q39q61
3413a10M57m6k03M25p78R11q57N21Qm77O31p63Q19o45O04l45n4L50n78M21p08
3434d17Q52q45M73Q5n22O31o27M43m80R0J29j88N85o55O46n27P4K44M6pm72K94
$$ plain form
3456 -148 28 -140 -322 58 -302 -144 -35 -93 -72 -69 -3 -454 -70 -461 33 -270 5 134 28 465 -469 395
3478 395 -167 40 130 -70 369 -387 526 -309 316 161 -55 540 -100 518 -462 585 -105 367 354 22
3498 22 509 -146 531 -112 218 -98 -179 452 -76 379 -336 185 -159 12 268 -221 56 -255 272 -223 58
3519 58 55 -294 -185 -347 -25 -178 -96 -214 -240 -97 -206 -306 -82 -169 -358 101 -351 -84 -205 -202 -238 -122 -19
3542 -19 -131 143 -404 18 -87 120 95 -34 404 -105 376 -400 258 305 -142 218 -142 365 -142 90 155
3563 155 123 347 -229 626 -61 535 74 11 156 -41 469 -220 434 48 -1 242 -229 234 -275 259 -51
3584 -51 43 -79 -159 73 -63 123 -60 102 -277 18 -369 -90 -335 -354 -197 -281 -241 -80 -270 -378 41 -382
3606 -382 -352 -193 -388 300 -226 132 154 -210 92 -250 381 -295 205 -236 237 26 -254 163 -261 404 -308
$$ packed form
3456a48J76j68j82L80l60J58J09n8K1LO6m51L84l91M94l03K75J29j06M37r34Q64
3478C95n62K07R0k00M39p56R13q35O25j55k16N95o40O18r80J047o90M72j3l32
3498B2M87o55O77o43L30l16q1O31n28M55p15N21l44J71K56m89K77l11N27m95K81
3519E8ll49J09j62L22j53Q2j18k6J43j09j00K24q7j89M59m52K67j21Ll6J16J03
3542a9j12K74n47M22j05K07k5j29M38n09M81p76O58M7m47L60l60N07n07K32O5
3563A55l2K24n76Q55o87N96m61o3J45j97N10o89O54l86m9K43m71M63n09N34l10
3584e1R4j22q0K32j36J86j83J62l79K95l87K79k45j9J57q4M0J61j90j08M19m23
3606c82L0J59j95O88n26L58K2l64L02l42O31o76N00m41M73k11k80M17m24O65p12
$$ plain form
3627 -308 342 -9 -47 221 -202 370 -10 256 99 81 295 43 544 -77 303 -137 240 60 -22 471 252
3648 252 497 -167 575 171 152 199 645 -61 47 638 170 145 -387 -59 598 240 812 543 317 -275 -479
3669 -479 -272 12 5 -91 588 -209 -99 -518 -76 -429 146 -222 -74 -222 -443 104 -506 -117 -89 7 88 -485
3691 -485 386 -160 205 -396 121 204 -154 268 -492 -473 500 353 28 35 -16 -527 292 -169 385 -15 68 1
3713 1 -1 351 -570 356 250 311 289 561 466 25 434 -107 476 -19 -161 217 39 253 -104 64 60 375 134
3736 134 -127 -300 34 -18 -212 -145 -291 297 -408 -224 -334 -266 -193 -384 51 -467 -48 -208 -298 -130 -235 -54
3758 -54 -273 156 -188 -156 145 -326 170 -390 323 -274 178 137 -68 147 52 363 -148 177 -12 223 116
3779 116 -44 468 -32 560 171 453 52 55 373 -91 494 184 519 148 225 510 237 526 -27 467 -188
$$ packed form
3627c08O50l51l8K68m23N72l80K66j57j8K14k52N01o21L80m40L77j80q2M93k19
3648B52K45o64P42m04j9M7M46p06J08N91m68k5n32L28O57l58N72k69k26n92k04
3669d79K07K84pr6O79p97J10m19M42l53N75l68J48j48k21N47o10L89K8R6Q1n73
3691d85Q71n46L65o01N17Q3l58M22p60J9R73j47l25Pn1n11Q19m61N54m00Q3o7
3713AkL52r21R26j06O1k2K72r5m41M09n41N83m95j42L78j78K14l57J68mL15k41
3736A34k61j73L34n2j94O7j46N88p05J84j10O8P3j91M35n18M19j60r0J68j05J81
3758e4k19M29l44L2L01m71M96n60P13n97M52m1k05K15r5L11n11L25j89K35j07
3779A16j60N12n00N92l89K82m01LL18m64N85l10L35l71P7K85k73K89n53M94o55
$$ plain form
3800 -188 -24 -45 162 199 57 38 0 434 -87 101 -54 -49 173 -296 -276 56 116 -294 -108 -190 -224 59 -218
3823 -218 22 -449 73 -304 -146 -271 -368 -127 -395 116 -369 -98 -10 85 -28 -328 73 -324 345 -165 -52
3844 -52 76 67 595 -251 335 -228 39 44 67 393 -108 697 -215 491 169 316 -179 169 443 -144 345 166
3866 166 503 229 318 237 -97 387 82 66 72 176 194 -17 -319 -46 -202 -21 71 -216 68 -140 -145 -85 -94 101
3890 101 -186 -170 -308 55 -332 -234 -157 -133 9 -496 167 -389 -110 -551 -9 -105 -334 24 -462 26 -291 95
3912 95 -171 -251 -63 -581 240 -106 259 -102 -217 149 -351 382 -168 312 -155 41 129 -198 691 -4 200
3933 200 266 438 338 317 615 -140 414 123 236 185 39 255 28 423 -305 284 -278 358 334 358 167 107
3955 107 194 -63 -91 -172 -256 -265 197 -295 -271 7 -137 106 -320 48 -111 -65 -334 -350 228 -527 385 -436 -18
$$ packed form
3800a88J64k1K07L7j42j9l8M34n21J88j55NK22m69K0L32O0m10J86q2l4K83k77
3823b18K40m71N22l77J58j25r7K41k68N11m85K71Q8R5j13l00M01l97O69n10J13
3844e2J28rN28q46N86n63K67NK3L26n01Q05r12P06l22J47m95L48K74n87M89j79
3866A66L37k74Q9q1l34M84l05j6OJ04J8k11l02K73j56J81R2k87K84k08nO0rJ95
3890A01k87J6j38L63l87R8P7K4J42n05O63n56K79m41N42r6k29L58m86M88l17L86
3912I5k66q0J88n18Q21l46L65l61j15L66n00P33n50M80m67J96Q8l27Q89o95K04
3933B00O6J72j00k1K98p55N54k91J13n1j46K16k27L95p28N89n62O36k4K4j91o0
3955A07Q7k57k8q1q4rM62m92K4K78j44K43m26L68j59M6k69j6N78p55R12q21M18
$$ plain form
3978 -18 -64 -603 271 -526 264 -493 -5 -212 -197 71 -300 183 -333 279 -208 126 -29 -196 491 -231 419
3999 419 -318 -55 385 -118 657 -210 426 -242 374 413 98 374 -128 320 -6 622 197 218 223 128 484 154
4021 154 376 92 337 -153 303 -82 170 -92 -84 106 -93 122 -96 176 10 134 -42 -251 87 -472 31
4042 31 -218 7 -245 -260 14 -578 -28 -641 -207 -312 -345 -162 -578 122 -602 121 -482 -302 -168 -325 252
4063 252 -574 445 -361 245 -167 -114 246 -376 407 -222 522 -193 278 226 -69 415 -37 338 -73 342
4083 342 365 152 16 211 278 294 481 265 212 -102 73 150 230 270 -142 -71 -85 491 30 209 323 175 245
4106 245 -245 419 -627 204 -15 -136 -77 -629 319 -479 219 -369 -162 -360 -355 61 -595 20 -523 -70 -357
4127 -357 -310 210 -539 181 -581 58 -216 -235 124 -390 149 -447 8 -435 23 -45 -245 245 -399 -7 127
$$ packed form
3978a8m6n39Q74p97P90p57M88k07J5K68l71M83n16O12m87L34j55j67O87p22O50
3999D19p37K63M40n03P75q67O36o68O16L9l15K76n02M48l26O28m25K1Nr5L56l30
4021A54K22k84K45m90M56l85K52k62QJ90j99K15k18K72j66J24j76k09L38n59N03
4042C1k49K25k52j5K74n92N50o13M34j05l3J83m16P00p24P23o03J80J34j57N77
4063B52q26J019q06O06m12N3L60o22P83o29P44p15M71n2k95M84m52L75m11M15
4083C42K3k13j36J95O7J6J87k16n3l14J75P7Q0M0m12P1j4N76m61J79J14j48P0
4106B45m90O64j046Q31k19j21N9n52R48p98O98n88K07j98NM16o56O15n43M53k87
4127c57M7N20p49P20p62O39k74j9L59n14N39n96M55m43M58o8k00M90o44L92J34
$$ plain form
4148 127 36 -50 74 333 -319 112 69 307 -114 276 344 69 157 87 352 100 383 266 484 157 283 448
4170 448 421 494 23 444 25 603 144 252 349 -181 402 -407 316 -338 40 -84 -177 195 -559 213 -341
4191 -341 466 -210 -370 153 -571 69 -651 -58 -389 -198 -14 -642 150 -610 -276 -538 -219 -169 -30 -8 -356
4212 -356 9 -285 -144 -66 -165 -80 -161 51 -133 10 159 20 40 336 -25 22 17 -23 305 14 206 58 227
4235 227 106 66 381 -76 540 96 392 357 214 101 103 468 -184 388 -51 167 27 -134 833 -396 470
4256 470 -303 219 -54 -232 171 -35 368 -652 179 -413 -243 -57 -481 120 -655 -11 -416 -139 -153 -373
4276 -373 -85 -497 -45 -511 -189 -326 248 -134 -348 -208 -81 192 -297 -73 -453 -20 -283 -103 304 -113
4296 -113 96 -133 326 12 165 -33 5 537 -124 371 -173 64 -223 157 325 -137 792 -167 905 148
$$ packed form
4148A27r1q6J24K59o52M31m3K38m21L90O8k75Q8p0K65k52K83j17K18l27J26J65
4170D48k7P3m71M21m19N78m59J08R7n30N83q09P23o54L78j24r3L72p54P72n54
4191c41Q07o76j60N23p24O40p20N93l31J91J84o28P92p60L34k62L19N0J39K2l48
4212c56L65k94J41P8r9Q5q1K12j84J43J49j39K0K96l61M7nm0L28k91J92j48J69
4235B27j21m0L15m57O16m44K96l5j43j13KL65o52N72m39K18j40j61R67j229Q66
4256D70p73N22k73j78M03k06M03j020Q31n92J70J86m24O01p75O44m05K77j4k20
4276c73K88m12M52m66L22j37N74l82k14J40J27K73m89K24l80M33k63J80M07m17
4296a13K09k29M59l14J53j98L8N32o61M95n44K37k87L80J68m62R29r59J072p57
$$ plain form
4316 148 710 307 -31 519 -209 641 -192 555 178 56 491 -254 528 -287 450 -123 190 -9 7 429
4336 429 -456 179 -228 15 -125 -67 221 -291 135 -449 -202 -571 -93 -323 -382 -271 -444 -25 -415 -146 -552
4357 -552 -17 -295 -358 101 -548 102 -369 -169 -299 88 160 -120 279 -345 88 -392 506 -96 115 280 -74
4378 -74 400 -152 558 98 272 150 40 481 4 720 60 422 256 253 269 94 459 125 515 -166 256
4399 256 337 -232 390 -165 431 -153 254 -145 135 176 -281 335 -99 283 -537 42 -77 -128 71 -166 -16
4420 -16 -413 28 -523 -73 -177 -258 -78 -345 49 -414 44 -528 -240 -173 -309 -16 -123 -70 -282 143 -59
4441 -59 -5 -49 -212 -112 -432 79 -475 9 -97 -128 206 -362 528 -111 612 15 212 99 -90 514 -63
4462 -63 769 -61 278 241 -21 362 -84 410 -233 515 262 200 247 178 201 -211 491 -62 506 87 119 257
$$ packed form
4316A48N62m03l38N50p28Q50q33P47l77j22M35p45P82q15P37n73L13j99J6M22
4336D29q85O35m07K43j40N8K88n12M26n84K47l69M78k30n9J11j73M19l90K69m06
4357e52N35k78o3M59o49O50m71K00j30L87P2k80L99o24M33m80Q98o02K11J65l54
4378g4M74n52P10m60J74j22j10M41m77P16o60L62j66lJ6j75L65l34L90o81M22
4399B56Q1n69O22n55N96n84M07l99K80M1m57O16m34L82q20N79j19n1J99k37J50
4420a6l97M41n51M50j04q1J80k67L94m63M58n72K88O7j36K93j07N3k12M25k02
4441e9N4m4j63J00l20N11n54M84j06l1L34n68Q90o39P23n97J97j13j89O04n77
4462f3Q32q30L39l7k62L83m46M94o43P48k53o2M7o9K3m12P02n53N68m19L2J38
$$ plain form
4484 257 -199 478 -42 284 -322 389 -145 -153 196 -322 79 -650 -64 -415 149 -102 -360 74 -838 17 -525
4505 -525 108 -226 122 -142 -566 77 -695 -38 -613 -221 -465 -398 -198 -393 277 -418 150 -174 104 97 -345
4526 -345 381 -205 354 -229 503 -66 408 265 23 510 -271 577 -116 368 437 210 442 46 788 56
4546 56 476 311 468 428 -229 597 -252 601 -40 423 137 16 351 -256 512 -276 369 -148 -320 9 -122
4567 -122 134 -259 106 -260 -43 -312 -162 -61 -892 20 -485 -119 -469 -128 -83 -282 -90 -342 6 -567
4587 -567 -67 -488 -42 86 -82 0 -558 283 -192 -14 -222 -175 63 -97 320 -438 379 -205 192 111 1
4608 1 473 -248 646 -196 353 88 226 300 -33 849 11 504 -23 641 444 277 262 -184 489 36 453
4629 453 164 339 258 -63 586 -297 555 -255 64 -183 11 166 -207 335 -360 322 -355 -218 -17 -261
$$ packed form
4484B57m56O77n20L26o06P11n34qL49n18M01p29N86l51N64k51k58M34r12Q55n42
4505e25O33l34L48k64m24O43p72O57n75L92k44O7K00j95O70o95N68l24K78pm42
4526c45P26n86N59n83P32n69M74j43k42M87p81Q48o93M84O9k27K32l96P42p32
4546E6M20j65J57m0o57Q26q49Q53o41M63k86j21L35o07P68p88O45n17j72L29j31
4567a22K56l93L65l66K17k69J50J01q31R12n05L66l50L41M5j99J92k52L48n73
4587e67N00m21M46J28j68Q2n58Q41m75J78k08M7K38j60M17p58Q17n84L97q1j10
4608AM72p21Q94q42N49k65J38P4l33Q82q38M93n27O64j97j67j5m46O73m53M17
4629D53k89J75q1l21O49q83Q52q10L19k47J94J55l73N42o95O82o77J37K01k44
$$ plain form
4649 -261 14 -374 35 -275 -41 -377 -105 -298 -269 130 -621 72 -580 80 -730 -189 -134 -342 232 -418 193
4670 193 -481 131 -222 -197 103 -471 249 -727 415 -73 -93 235 -48 338 -188 574 -102 177 214 -169 525
4691 525 -264 603 -240 756 251 479 638 -43 576 -212 545 -184 576 208 43 484 -243 298 23 178
4711 178 50 59 95 -125 136 -114 198 -173 -25 -431 -170 -35 -114 -348 -539 122 -293 72 -332 -212 -297 -486
4733 -486 104 -292 268 -628 64 -514 -330 -158 -499 251 -520 128 -342 -154 -214 -122 90 -569 384 -487 0
4754 0 -59 103 431 -175 500 -427 421 -25 17 130 84 379 -143 419 171 454 344 301 194 -52 512 99
4776 99 345 310 -41 443 -86 446 -86 258 278 86 -157 353 -142 56 -92 -130 22 -438 77 -337 261
4797 261 -25 -102 -170 -382 342 -563 300 -401 -255 -129 -468 86 -650 46 -650 296 -351 -310 447 -491 289
$$ packed form
4649b61K75l88M09l10K34l36K72j93K9L99p51O93o52O60q10N41N5k08N74o50O11
4670A93o74O12l53K5L00n74P20r76J142m88k0L28k83L86n26P62o76K79L7l83O94
4691E25p89Q67q43R96n05K28J59o81O19p88P57p29P60l68j65M41p27N41k75J55
4711A78j28RL6k20K61k50L12l71J48m06K61J35p9k34j91O61m15L65m04J20q5j89
4733d86N90l96N60q96O92n78J84J72l41P50p71O48m70J88o0R2K12o59R53q71M87
4754@n9J62L28o06O75r27Q48m46M2J13m6K95n22N62k48K83j10m3j07k46N64m13
4776I9K46l5l51M84n29N32n32L44K0j92k43N10m95J98j48l8J52m60N15m14N98
4797B61k86p7o8k12P24r05Q63p01J46J26l39N54p36O96o96R46o47M1P57r38P80
$$ plain form
4818 289 -580 301 -325 -259 97 -478 338 -727 314 -304 169 108 -86 413 -540 526 -419 365 180 -129
4838 -129 452 -211 538 -141 475 -99 483 381 -3 522 -4 332 -1 220 197 206 315 99 144 -77 100
4859 100 -112 310 -157 -98 -178 -28 15 -118 238 -352 259 -206 -54 107 -567 18 -885 178 -484 123 -322
4880 -322 -465 100 -473 242 -700 1 -545 -395 128 -621 263 -566 26 -551 -303 -127 -350 -131 -622 401
4900 401 -616 244 -207 -295 309 -456 248 -122 393 234 116 114 95 234 0 219 -349 404 4 279 310
4921 310 74 368 363 494 121 277 127 131 423 122 371 -12 420 -102 450 0 208 401 -126 284 -183
4942 -183 323 -284 122 103 2 191 -304 362 -624 -69 -440 -247 89 -487 99 -632 445 -551 45 -127
4962 -127 -522 30 -646 134 -495 166 -195 -229 152 -378 41 -418 107 -606 225 149 -282 3 -410 269 -298
$$ packed form
4818B89q69Q81o26O6L56n75Q16j065J041o18M73o1j94M99r53J066r45P84j85l09
4838a29N81o63P49o79O16n74N82j02l84N25n26L36l33K21k3RJ09k16M5k21J77
4859A00k12M22m67N9q0J50M3j33L56n90O11m65J52J61o74N85r03J063o62O07m45
4880c22j43N65n73P15r42P01n46J50N23p49Q84q29N92n77K48J76k23K19m91J023
4900D01j017Q60m51q8O04p65P04l70N15j59j18kj9J39k34K19n68P53m00K75L1
4921C10k36K94nJ31l73J56j50MK92l01K49l83M32n22N52m50K08J93n27M10m67
4942a83N06o07M06j9j01J89m95O66r86N55l71J93L36n76N86p31J077r96N96j72
4962a27l95N52o76P80o29O61l61l4L81n30M19m59N25p13Q31p6m31K85m13O79n67
$$ plain form
4983 -298 189 -23 304 246 -32 245 -95 398 15 423 49 247 221 296 345 -6 556 10 595 106 346
5004 346 356 -21 497 0 494 -138 357 41 -23 348 -167 497 -288 336 -320 132 112 -141 309 -501 346
5025 346 -290 80 19 -346 255 -575 216 -588 160 -402 -193 -12 -664 97 -633 127 -315 68 -255 -438
5045 -438 89 -534 36 -669 404 -327 -214 -8 -466 259 -345 316 -442 50 16 163 482 44 236 -42
5065 -42 144 -196 191 273 189 391 37 662 -34 553 178 580 315 377 508 -308 724 -112 570 12 269
5086 269 286 -87 587 -15 520 -232 168 0 214 48 -228 381 -374 125 -265 -47 168 -523 265 -477
5106 -477 201 -502 151 -339 -270 21 -483 255 -589 -212 -474 -406 72 -330 94 -517 187 -462 -260 -178 -374
5127 -374 50 -462 173 -221 44 -209 -28 32 -227 151 218 556 -130 437 315 93 176 66 341 209 461
$$ packed form
4983b98M87k12L27n8k78K77l40M93l83M08l74J98k6P5M9l51N62n46N85m89K40
5004C46J0l77N18m97M94o32M95l16o4L71n15O64p85O24o56M52k0k53M50q10Q47
5025C46o36L70o1l65O01q30P91q04P48n62K09J81o52P61p30P60m42L83l23j83
5045d38N27o23N70p05J073p31J13K06m58P25o04O61p58M92l4J47L19m38J92k78
5065d2J86l40L87Q2q4K02l54O25o96N87l75M02k65O2J31q16J032q36O82n58K57
5086B69J7l73O74o02N35p52M00j68K14j66k76O09p55M99l90K18K15o91P88p42
5106d77O78p03O53m90O9K91n04P38q44L77k62O8M78m02M24o11P04o49K02Q2j96
5127c74M24n12O35l94K65k53J81O0k59L78O7L38o86N67j22k22Q3j10K75j32K52
$$ plain form
5148 461 101 386 293 381 291 -61 362 47 473 -78 462 167 105 302 -228 641 -240 715 -164 283 12
5169 12 -246 185 -389 506 -401 92 -128 -22 264 -544 256 -634 342 -387 -300 -419 -507 -73 -554 48 -377
5190 -377 -103 -200 -331 -187 -447 15 -423 11 -321 -228 25 -145 -136 -479 346 -223 -136 -173 4 166 -53 189
5212 189 -3 170 -129 292 -52 384 79 143 476 -151 478 -74 109 192 270 388 257 792 -97 680 -401
5233 -401 515 86 -57 693 -20 439 -431 538 -1 -105 226 -284 188 -71 436 -257 178 -46 -28 491
5253 491 -390 483 -404 -79 -227 3 -194 -528 -17 -742 80 -558 75 38 -532 118 -461 19 -501 -120
5273 -120 -173 -287 -79 -265 -312 -201 -89 -157 -72 -251 -177 63 -127 190 -186 299 -52 274 -195 145 166 158 447
5296 447 -63 429 59 487 382 107 208 77 582 -124 539 93 386 251 149 456 -210 672 32 362
$$ packed form
5148D61l60K85r3Q8r0l52M23l15M26n51N40k95o2J97n30Q69q81R55q79M47k71
5169A2k58M31n74Q95r07M93k20J06K86q08Q00q90R76p29Q7j19q8M34m81O02m25
5190c77K74r7j31J44k60M62m38M34l32R3K53j70Rl43Q25n69Q7l7J77J62k19K42
5212A89j92J73k99M21l44M36l05O4L33o27O29n52J83Q3P8J18j31N35q89P77j081
5233d01R16m29j43P50p13M59q70R69n39j04L31n10M72k59N07o93M35k24J8N19
5253D91q81Q73q87L25j48K30j97l34N11p25Q22o38O33l7n70O50n79M80n20L81
5273a20n3j14K08j86m7J11J12o8Q5j79P4K40j90L17l76M85l51L26m69L40K1qK89
5296D47n10M92l70M28j05k75J01j31N05p06O63m46K93j35j02L07o66Q82o40L30
$$ plain form
5316 362 335 28 454 -301 346 -147 136 -148 119 391 -389 246 -382 167 -501 -141 -329 -231 206 -292 61
5337 61 -695 -2 -224 -525 -375 -564 -124 -295 -105 -170 -197 -362 -362 -199 -505 -132 -273 18 -217 0 -317 -65
5359 -65 -358 -25 358 -93 405 -232 182 89 92 226 216 180 31 550 -126 241 254 62 624 -126 618 -200
5381 -200 438 138 -241 294 102 953 -291 670 -22 142 632 -341 633 -263 342 -292 214 88 93 277
5401 277 -230 492 -303 173 181 -79 202 -224 183 -370 75 64 87 79 -417 -4 -120 -62 -451 -19 -155 -127 -178
5424 -178 -97 -227 -308 -238 -82 109 -397 -63 -192 -107 51 -113 153 -236 96 -90 147 -9 -26 347 -285 435
5446 435 -513 34 165 43 248 -136 479 -36 402 -247 341 351 -81 667 82 380 -98 384 322 30 111
5467 111 23 320 -72 414 -110 107 62 -297 177 -187 407 -235 -231 109 -167 179 -308 -175 -252 -48 -145 -406
$$ packed form
5316C62k7l07M26p55O47m93K83k84K67K72p80O35o28N49o68L60j88R8M37m98L53
5337F1p56O93k22l01J50j89M40j71J90o5k7j65%J63l06L73j41K91k35K17l17K52
5359f5k93L33L83m51M98o37M14r3LJ34j0l6j49N19o76L67J3j92N62p50P44q18
5381b00O38l00l79N35j92Q51j244R61o92J64M90r73R74q96O05o34N06j26NJ84
5401B77n07P22p95M76Qk60K81m26M07n53M45j1K3qm96M13j16N8l89M32j36K8n1
5424a78Q1j30q1P0J56J91n06L34j29Q5J58j64K66l89L32j86K37j56j7L73o32P20
5446D35r48N47J31j22K05l84O15n15M38o49N88J0m32P48n85K98m78M82o2k92Q1
5467A11q8K97l92M86n24K17m5l59M74l64N94o42ML40k76L46m87J33p7K04r7k61
$$ plain form
5489 -406 -109 -60 -235 -423 -183 -209 -216 -426 -270 -401 -67 -101 -341 -207 -552 6 -29 -178 -89 -566 -66 -303
5511 -303 -57 -59 137 -118 -244 245 -235 299 -105 259 -330 377 175 41 149 -366 437 -41 157 258 -138
5532 -138 237 -45 284 204 524 10 8 388 104 445 151 113 0 299 202 -90 140 37 398 -261 51 -44
5554 -44 41 57 -290 34 22 104 -384 77 -67 118 -142 -170 -89 -298 -38 -333 -144 -211 -213 -429 -182 109 -598
5577 -598 460 -471 -14 -186 -133 -253 -238 -9 -227 79 -118 104 87 -81 170 -42 249 -295 223 62 -20
5598 -20 237 -216 261 -297 589 -208 340 288 188 221 -76 432 -43 469 17 88 334 272 507 33 390 -339
5620 -339 508 318 115 282 -176 598 -67 295 -26 182 -127 29 185 -164 -59 26 -160 -149 6 -200 -367
5641 -367 137 -103 -182 -167 -200 -116 -88 85 -312 -133 -339 83 -340 -194 -323 -354 -48 -294 -86 -101 -34 -225 -149
$$ packed form
5489d06K97M9j75j88K40k6pk10J56j31L34l4k40J34l45N58l5j49Q9m77N00k37
5511c03K46kJ96k55j26M89m80N34m04L64n89P07k02j34J08n15Q03m78J98J01l96
5532a38L75k82L29q0L20n14kL80k84L41k94l8j13K99r7k92K30j03L61o59L12r5
5554d4Q5J6l47L24j2Q2m88M61j44J85k60k8Q1k09K60k95J89o7kk16K47K91p07
5577e98J058r31M57j72N3j20J5K29k18L06j97K22j7j68K51k12K91n44N18j61q2
5598b0K57m53M77n58Q86p97N48n2j00L3k97N08m75N12m52P1K46o2K35m74L57p29
5620c39Q47j90k03J67m58P74o65L62l21K08l09J56J56l49J05Q5j86J1J55k06j67
5641c67N04k40p9J5l3Q4K8J73l97J79k06M22m23J46j29l1L06k46K08j5O7j91P6
$$ plain form
5664 -149 -127 -220 -91 -164 162 -234 4 205 -86 327 -123 140 -278 200 11 188 103 152 393 78 445 62
5686 62 350 79 -55 459 223 414 -210 621 325 122 327 260 282 -38 15 -20 205 187 224 304 -97 201 -159
5709 -159 38 26 156 -236 -152 -325 -496 -6 -341 -178 -265 74 -225 -311 -190 -331 -109 -459 -66 -335 -127
5730 -127 -24 -368 2 -278 -41 -97 -186 -315 31 -223 -287 98 -406 96 -63 70 176 -149 396 -290 270
5751 270 216 202 18 -130 229 -97 593 -17 419 236 212 173 232 412 -173 425 -40 527 106 201 271 25
5773 25 382 7 263 182 153 316 166 234 -299 -53 -265 102 14 -163 -60 -106 138 -191 -62 -323 -121 -3
5795 -3 44 -455 -528 12 -430 -8 -482 -249 -93 -239 -358 -695 43 -497 140 -190 -168 -332 -184 104 -287 283
5817 283 -280 187 -200 -91 -20 80 386 -355 158 -4 181 440 -93 381 -191 205 8 40 11 -134 277
$$ packed form
5664a49K2r3J29p3L26l96K38K01k91M13m50K63m18M78j89J77q5M9K41l15L67l83
5686F2K88k71j34N14k36J91o24Q31k96k03K05o7K2l20N3l5K25j8L7Q0m01K98l60
5709a59J97j2J30l92Q4j73j71M90l35J63q7L39k99q6J21j41K22l50L93k69K08
5730a27J03l44L70k80K37n6q9j29L46k54o4L85n04N02j59J33J06l25N45o86N60
5751B70n4j4j84j48L59l26O90o10M36j83k4l9N9J80n85N98m65N67m21R5P0k46
5773B5L57l75K56q1k9J63j50O8n33K46k12L67q8j77J03m6K44l29J29k61K02J18
5795cM7m99p3N40m42M22m74K33J56j46j19l37P38n40O37l30K2j64J48K88l91N70
5817B83n63M67l87J09P1J00L06p41N13j62J85K59n33M74n72L96j97L2k9j45M11
$$ plain form
5838 277 -42 255 89 217 126 352 88 -35 322 17 203 55 249 240 375 121 295 327 -65 114 -58
5859 -58 259 -166 89 -215 -22 -12 -391 178 -506 16 -18 48 -143 -179 -103 -353 48 -165 -98 -106 -442 91 -199
5882 -199 -128 -408 -225 -653 -101 -113 -293 161 -268 105 -325 124 -229 -143 24 -69 67 -116 -68 32 -79 122
5904 122 -38 67 -12 224 -163 283 29 76 146 -195 433 6 424 -140 221 31 88 218 -14 277 104
5925 104 664 121 261 90 260 -65 1 319 -6 308 96 164 -117 57 243 -254 232 -114 13 -17 -170
5946 -170 -33 -265 215 -479 -249 -277 -131 -139 -28 -33 -555 63 -189 72 -165 -248 240 -338 -132 -342 13 -295
5968 -295 -69 -178 -129 125 -237 221 -316 -44 24 173 77 87 142 48 434 96 226 0 141 186 138 381 -221
5991 -221 364 -37 82 357 212 358 -78 242 40 -17 127 207 233 -15 385 150 319 -55 124 134 -78
$$ packed form
5838B77l19K97j66J28r1K26k64j23L57l05J86j48J94rJ35k54J74L2l92J79j72
5859e8L17m25K55l04J93J0l79N69o84N22l4O6j91l6P6k50M01k13O7ql36N33k90
5882a99P1k80J83m28N52j2j80M54m29L73m30M49l53Q6J67r3J36j83M8J00j11K01
5904A22j60J05p9K36l87M46k54M7P0l41O28m27M18n64L61j90N7J30k32K91j73
5925A04N60n43J40j71J70l25O6L18l25L14k12O8k81J74J86m97M86l46J27l0j53
5946a70J37k32M80o94K30k8J46qJ11nn22O18k52K61k37q3M88n78K06k10L55l08
5968b95K26j09M9K54l62M58n37K72O8J49r6J0N5r4L86l38J30k26J41M5m8K43o02
5991b21N85m01J19K75j45J46m36L20k02n7J44Q0K6k48M00k35J69l74J79J0k12
$$ plain form
6012 -78 156 -184 418 -273 208 -121 -221 11 -30 142 -198 7 -325 111 -256 -116 -238 -321 134 -400 -94
6033 -94 -204 0 -220 -124 27 -481 121 -351 -145 -26 -58 38 -155 200 -421 12 -375 -32 6 -15 260 -41
6055 -41 101 -75 297 -233 107 308 -106 302 -353 186 54 170 206 -25 318 166 336 -43 351 -27 232
6076 232 -9 211 262 92 176 -156 145 73 37 -4 108 400 -1 80 -257 33 -41 -281 99 -214 -49 -33 312
6099 312 -390 -70 -56 -320 90 -199 241 -384 -182 -228 -122 -280 -524 -16 -268 -85 -507 193 -136 -201 13
6120 13 -119 9 -234 -52 -129 -47 -143 -12 63 -152 152 -40 398 126 101 102 -62 369 -247 500 76 84 127 166
6144 166 310 -28 490 -97 250 227 300 446 201 415 -85 288 48 200 76 276 223 -12 134 97 160 -314
6166 -314 238 334 123 274 -465 128 -284 181 -254 -96 114 -302 60 -502 208 -368 -26 -456 -203 -30
$$ packed form
6012g8K34l40O02o91M81l29j00K32m1J72l40K05l32M36l67J40j22q3M55n34L06
6033i4j10K04k20R6J51n08O02m72K06J19l2R6j93L55o21M33l87L43L8k1K75l01
6055d1J42j76L72n30L40K01m14M08o55N39j32J16L6k31L43j52J70l79L94l78K59
6076B32k41K20N1j70Q4l32L01p2l6m1J12K92m01Q1l37K90p4k40L80l13J65J6L45
6099C12p02L20J4k64M10k89M40o25K02m6J06j58k44N08k52J83m22P00l29o5K14
6120A3j32J28k43J82p7Q2r6J31P5k15L04j92M38k72k5Jj64M31o16P47m24QM3L9
6144A66J44l38N18n87L47k3P3J46k45K14n00L73k40J52j24K00n3k35J46l7O3m74
6166c14N52R6k11J51p39N93m12M65m35J58K10m16L62n62P10n76L42m30K53J73
$$ plain form
6186 -30 -350 -11 -379 95 -326 65 68 -260 200 -381 46 -407 190 -304 -78 -70 16 187 -369 217 45 18
6208 18 332 -60 -32 -111 297 -184 483 14 184 375 57 286 -45 461 107 255 251 -19 254 154 504 174
6230 174 172 49 47 246 -87 114 -69 269 -214 33 88 162 108 -86 -9 -435 162 -262 144 -133 -68 -204 -52
6253 -52 72 -438 194 -172 -97 -384 -294 102 -398 -56 -348 -203 -75 -157 -162 -227 70 -411 -78 -485 8 -333
6275 -333 -309 32 -328 198 -419 201 -110 128 78 -277 253 7 155 259 153 137 123 90 136 192 -105 196
6297 196 2 250 316 83 120 223 422 131 309 100 322 134 36 318 158 178 -75 -87 -121 -37 197 36
6319 36 407 -20 58 -305 130 -179 48 17 -136 93 -234 -13 -164 -113 -92 -278 68 -94 -16 -352 -30 -171
6341 -171 -135 -154 -332 122 -250 -117 -369 -200 -259 -93 144 -435 73 -97 74 -107 -174 29 -306 406 -174
$$ packed form
6186c0l20L39l68M74m21L91Ll28M60n81M27m53N97m94K26QQ6J71n56N86j72k7
6208A8L14l92K8p9M08m81O67m69J70J91l18K29l31N06l54J48mk70K73j00L50l30
6230A74kj23kJ99l33K01j83L38m83K47N5P4n4j94P7m26N97m24M06k77O5j36J52
6253e2J24n10O32l66P5k87R0L96n00L42k92J45J28q2no5K97m81L33m07M93l41
6275c33K4L41l60N26o17O20l11K38n0l55N30k46J48J04j06j6j4l3M6N6k97L01
6297A96j94K48O6k33L7J03J99k91J78k09K22j88r8K82j60K0k53j2l4Q4K34j61
6319C6L71m27P8l63M35l09K27l1j53K29l27K21j51N1K1j86L46j62P8l36L22j41
6341a71L6j9j78M54l72J33k52J69n9J66K37n79N08j70J71j81o7K03l35P12n80
$$ plain form
6362 -174 356 -147 168 -143 -56 99 -119 86 87 562 -371 168 -99 -4 91 64 446 143 450 182 79 376
6384 376 -97 168 -144 354 -216 350 -56 117 295 27 97 -201 -14 -110 32 -8 -337 78 -233 -13 -196
6405 -196 40 -137 113 60 -282 82 -271 -14 -284 32 -371 -391 -168 -151 236 -347 9 66 -311 -13 -120
6426 -120 -16 -83 321 -100 132 128 -248 246 -176 316 78 100 -196 25 167 -38 158 98 92 57 123 -31 120
6449 120 157 135 229 276 478 47 189 157 219 422 -18 141 -97 182 -192 74 -16 35 326 -99 124 -136 153
6472 153 12 -130 147 -313 202 -190 124 -227 -46 11 92 71 -212 12 -262 122 -283 -115 56 -326 73
6493 73 -285 -83 -128 -117 -77 -293 -157 -353 209 -268 119 -197 45 172 -263 152 -10 -106 -340 -14 80 -4
6515 -4 82 -14 58 -57 13 -94 417 138 73 195 -70 4 -287 -11 175 88 -95 -142 119 39 488 47 212 17
$$ packed form
6362a74N30n03L15l11Q7J55k18K05JM75r33N39k67R5R5k7L82l03L07k68j03K97
6384C76m73K65l12M98n70N66m06J73J78k68P0k98J87r6J42m0l29M15l11K20j83
6405a96K36j77K50n3l42L64l53K57k70L16m03k0K23J7L87n83L56N7l77K98j07
6426a20J04o7M04m21K32ml76M94m22M92k38K2k96K21J42k05J96o0ol5O6j54J51
6449A20L7k2R4M7K02m31J42l2O2K03m40J59k38K79l74K66r0N1K91m25K23k60K89
6472A53j41j42K77m60N15l92L14l51J81N7Q1k1k83K24k74L84m05J68J71l82L99
6493G3l58K02m5J1M0k16J36j96N62m77L87l16K42J27m35M15j62r6k34L26R4q4
6515dQ6r6P2j15P0j07N11k79o5J22k65P4k91K76J86q7j83m7K61q0M49m41J65j95
$$ plain form
6539 17 84 362 79 183 -198 143 -171 9 1 122 -11 -301 366 -158 165 -224 -251 75 -72 88 -179 77
6561 77 -208 110 -211 -286 -24 -278 80 -147 69 -36 -463 128 -333 43 -292 -104 -14 -210 19 -247 170
6582 170 -213 137 -349 -8 -49 7 2 -5 293 47 105 -84 158 -57 65 368 142 354 75 389 151 168 147
6605 147 64 -1 133 166 61 220 132 454 382 -66 14 -13 132 -118 199 -103 208 127 -253 194 -75 299 -349
6628 -349 154 -38 -200 -51 -112 267 -143 -26 -204 -63 -17 -322 -128 -324 -182 -363 123 -231 -39 -204 -351
6649 -351 178 -128 -16 -98 60 -100 -181 -110 -228 -40 -19 118 -79 6 70 -141 273 -341 238 -259 141 -317
6671 -317 -5 261 -55 196 -285 167 -45 -31 7 -137 158 -37 381 167 462 114 175 191 -169 268 62
6692 62 -29 136 243 -105 165 222 -24 100 -135 174 -183 -264 -78 0 16 -352 214 -88 123 -165 -132 66
$$ packed form
6539A7O7K78k83J04l81L41l14J80qJ21j33k90O67n24L23l89k7L26j47J60k67K56
6561G7k85L18l21p5K62k54L58k27K16j05m27N91m61L76l35J88R0j96K29k66M17
6582A70l83L50m86L41m1N6npK98k46N8j89K42k15J22L03k26K12k79L14k38J7k1
6605A47q3o5J34L3j05J59q8L22p2m48Q0k7J45k50L17l02L11q1l80M47k69L74o48
6628c49N03j92j62J49o1L79m10J17j78J41M6l05J94j96J42j81M86l54J92j65j47
6649c51N29l06J12q2J58j60q1P1j18J88K1J37j97Q5O4k11M14o14N79m97M00m58
6671c17L12K66l16K51m81M52k12J4L8j44K95j95M18k14K95l48O1J6l60M37k06
6692F2r1J65J07l48K70N7k46J24k35L09l57q1J86P8J6l68N66l02K11k88L3J98
$$ plain form
6714 66 -261 1 -518 64 -234 -25 -274 -289 -114 -402 -149 -216 39 -248 -40 255 -193 163 -388 78 -343
6735 -343 -172 -20 -185 142 -75 129 53 187 -31 116 108 -130 123 -86 243 -367 322 216 250 214 -4 267
6757 267 -114 373 104 -13 94 -1 229 -87 437 -98 37 11 -98 60 16 143 -114 144 -147 310 206
6778 206 30 -60 18 127 -110 159 -132 -192 214 -121 82 -213 53 -391 155 47 -80 -122 -189 -29 -193 91
6800 91 103 -157 -131 -784 -51 76 -438 537 71 -93 -733 -286 -35 314 -236 116 226 -167 21 -111 84
6821 84 60 209 -12 223 261 95 116 210 273 152 286 210 34 17 302 81 108 234 106 194 -296 225 462
6844 462 -25 119 -173 380 -368 277 -253 268 113 2 88 -33 354 -392 32 -220 -67 172 -269 -40
6864 -40 -237 -33 -115 -126 64 -269 -163 -178 43 -112 -61 -356 -251 -256 36 -73 -195 139 -144 206 143 41 -95
$$ packed form
6714F6l27K62n19N82k98K09k49j5J75k88K53o7K55k87K08K95m48L56n51M66m21
6735c43J71J52j65L27k17K04p6J34k18J47qk38K53k09L29o10O89j06L4l6k18K71
6757B67l81M87k69j17J07r5K30l16N24n35J35k6j09J58m4J27k57K58k91M57j04
6778B06j76r0P8J09k37K69k91o0M06l35K03k95K66m44N46j08j27m2o7J60j64K84
6800I1J2k60K6o53P33J27n14R75m66j64o40M47K51L49n50L52J10l93J88j32J95
6821H4k4J49k21K35L8j66K1R4O3j21J34p6j76j7K85k21K7J26j28Q8m90N21K37
6844D62m87J44k92N53p48O45n30N21j55j11Q6j21L87p46M24k52J53K39m41K29
6864d0j97K04q2j1J90l33J06j5K21j55N1k95J05nK92j09j22L34k83L50o3j02j36
$$ plain form
6887 -95 121 -7 -261 53 -116 103 -100 -45 102 -86 9 -150 146 56 184 45 26 377 -67 246 19 -53
6909 -53 373 208 49 60 308 -34 196 -5 290 37 115 421 188 133 -83 -230 -166 135 10 -236 134 -289
6931 -289 218 -51 -170 -143 19 -57 -185 106 -83 86 -94 -70 12 75 -101 -344 96 -200 -335 -191 -48 76
6953 76 -245 -37 -222 42 -64 -82 57 -105 -219 20 -150 -148 50 -188 -40 -46 196 -57 -150 346 -249 -73
6975 -73 216 16 158 -42 148 -60 274 43 188 182 -34 220 -74 314 -105 48 -141 157 335 -75 285
6996 285 91 293 39 57 52 47 165 -168 158 -83 111 -202 -16 8 -65 9 -16 -118 84 240 54 18 -142
7019 -142 -120 119 -289 54 -47 -50 -198 76 -58 -280 -134 -102 32 -73 -200 -17 -103 -68 -291 56 168 -39
7041 -39 -17 -109 37 -222 62 -342 209 -449 171 -176 71 -17 -10 244 53 270 -116 143 259 180 45 -105
$$ packed form
6887i5K16j28k54L14j69K19k03N5J47j88R5j59K96r0J28j39j9L51m44L13k27p2
6909e3M26j65j59J1K48l42K30k01K95k53P8L06k33n5k16j47O4L01j25k46L70m23
6931b89N07k69j19K7J62p6j28K91j89J69j80K4Q2O3j76k43M40k96j35J44J43J24
6953G6l21K08j85K64j06j8J39j62j14K39j70KJ98k38J48oK42k53r3M96n95J76
6975g3K89k00J42k00J90k08L34k31J45ok16K54k94L88m19J53j89K98J78m10L60
6996B85j94K02k54J8nnJ18l33L26k41J94l13J86K4p3P4k5j02K02J56j86l6j60
7019a42K2K39m08L43j01lj48K74j34k22J46L2J34j05j27J83q6L5k23L47J12k07
7041c9K2r2J46k59K84m04N51o58O20l47K47q8PK54j91K17l86K59J16p9j35j50
$$ plain form
7063 -105 143 249 232 -164 -35 244 200 135 -126 -51 -54 222 -99 142 100 198 7 -32 124 -186 87 328 -208
7086 -208 172 3 114 -226 3 83 -78 -104 274 -120 -181 70 -25 70 -5 -74 86 -136 -229 1 144 -108 13
7109 13 -50 -31 282 -9 8 -89 31 -75 39 -53 -61 50 49 63 -217 -38 129 -169 68 -140 254 -64 132 97
7133 97 -150 309 -3 48 -7 183 -38 85 46 423 275 -286 -47 148 435 150 377 -11 -24 199 -121 9
7155 9 -148 34 236 -137 -2 -69 -151 14 -165 -331 168 -72 -77 -209 -278 -172 -307 178 -338 -250 -14 -262 -89
7178 -89 -31 15 71 137 62 -12 -274 -284 105 -67 -1 -77 -206 -177 -26 109 -300 110 -210 -105 -165 46 126 41 299
7203 299 -28 94 49 263 -72 342 129 -33 196 -75 213 66 380 172 56 421 158 2 194 89
7223 89 63 -72 158 192 187 53 163 -166 70 229 17 -84 23 72 -49 -229 75 116 -87 -117 90 -23 75
$$ packed form
7063a05K48J06j7l96J29K79m4o5k61P5lK76l21K41m2R8j91l9J56l10K73K41n36
7086b08L80j69J11l40K29Q0j61k6L78l94o1K51r5R5p5o9J60k22r3K30J43k52J21
7109A3o3J9L13k91J7r7J20j06J14r2qJ11jJ4k80J79J67k98K37k08L94l18J96l5
7133I7k47M59l12N1n5J90k21J23l9L77j48n61K39J95K87k85K27l88j3K23l20J30
7155Ij57J82K02l73J35o7q2J65j79j66M99k40nj32o9J06j35M85n16Q8K36k48J73
7178h9N8M6N6O6p5p4k62j0L89j72O6p6j29K9J51J35m09M10l20J05o0K11Q0q5K58
7203B99l27J22m5K14l35M14k13j62K29k71K88j47L14k08j16L65k63j56J92j05
7223H9k6j35K30L4nj34J10l29K36J59k12j01J07M9j21j80L04M1k03l0K07j13R8
$$ plain form
7246 75 -111 26 -125 -54 -324 150 -59 132 76 -207 -134 -108 -240 50 -104 47 -214 -281 11 -137 -38 65
7268 65 -121 -159 219 -309 -10 -24 -122 202 -75 -19 155 239 -271 60 340 143 222 111 201 46 105 84 -67
7291 -67 323 189 8 99 40 -76 38 47 -33 186 -15 139 404 65 298 -140 -87 -27 48 -48 31 17 -19 98
7315 98 89 54 -123 160 -126 -186 39 -143 -145 -289 -96 -45 -207 -165 -16 -116 -218 -407 -13 -104 -107 263 -271 -148
7339 -148 -42 -157 -42 -186 62 -110 117 -52 192 73 -89 292 -11 114 -199 91 -81 327 78 -201
7359 -201 53 -36 127 115 110 95 115 129 -116 14 -72 157 109 -165 201 264 515 -97 116 -73 241 12 123
7382 123 69 102 -2 -42 190 -173 -3 -97 201 152 140 117 -184 -132 -114 -61 -14 56 31 -158 32 -291 71 188
7406 188 -52 -60 -336 -51 -106 -133 -104 6 -278 -79 169 -299 -241 -136 113 -159 -108 16 67 142 -239 189 -6
$$ packed form
7246G5j86J37j51P1k70M74k09J91n6k83P3K6j32K90j54J51k61o7K92j48R9J03
7268F5j86l8L78n28K99j4r8L24k77N6J74Q4n10L31K80j97P9j11R0j55N9k1j51
7291f7L90j34j81R1n9j16J14Rq0K19k01J54K65l39K33m38N3O0P5r6P9j4l6J17
7315I8rl5j77K83k86o0K25j82kj44J93N1j62M2J49j00j02j89L94r1lL70n34J23
7339a48J06j15J15j44K48j72K27j69K44j19j62L81l03J25l13K90j72M08k49k79
7359b01K54q9J63j2nj5K0J4k45J30q6K29m8k74L66O3K51o12K13j89L14k29J11
7382A23n4L3j04m0K32l63J70r4K98m9j2k3l01N2J8N3M7P0k5j89J90l23L62J17
7406A88k40qk76K85n5k7K9J10k84J99K48m68N8J05K49k72N1J24N1P5l81M28j95
$$ plain form
7429 -6 44 35 197 104 179 -60 -195 228 124 80 146 82 33 89 251 -127 287 52 208 97 128 207 -289 90 42
7454 42 258 10 204 150 -1 117 95 114 197 165 99 32 -53 -48 -92 -84 40 -226 84 -66 -229 -31 86 -95 -297
7479 -297 -43 -243 -159 79 -42 1 -99 42 -365 31 -206 -302 -94 -157 120 -172 -139 67 -112 -48 -334 85
7501 85 -361 -65 -247 54 92 119 173 -129 196 298 231 -325 252 267 25 245 -25 92 68 159 -14 157 164
7524 164 -46 -42 -65 260 -143 179 67 353 -21 177 348 53 233 117 286 67 -18 253 -74 186 -135
7545 -135 -165 -149 27 81 -424 -382 -143 -231 -267 144 -186 -121 -198 -227 0 10 -99 -472 -60 -176 -121 4 -238 61
7569 61 48 -181 -107 238 13 -146 0 26 105 -50 69 18 65 -39 178 156 -145 149 -155 -12 78 235 4
7592 4 -159 58 28 -2 54 113 236 -43 145 59 -3 -130 204 -159 95 111 -11 -187 -95 63 -48 141 22
$$ packed form
7429fN0rJ62r3P5k39j35M23j04m4O6o4m9N6J62l78M14k35J56j11L1P9m96L79m8
7454D2K16k48J94n4j51J18k2J9Q3l2o6o7q5Nm4QJ24k66L10j50j63J98J17j81k02
7479b97K54k00Q4K38j21M3j00J41m07L96k37r6K08o3K77k92L3K06j79O4k86M19
7501H5m46K96j82L01L8K7N4l02L25J02o7n56N77J5k42K20k70J17k4R1j73J71P
7524A64k10Mk3L25m03L22j12K86l74J98J71k95J80j16J69k19q5K71l27K60l21
7545a35l0J6J76N4n05M2K39q8l6M11l30O5p7k9K27J0j09l73M12j16N5J25k42K99
7569F1j3k29P4L45k25j59J46K6P9j55J19n1M7j04K17k2l01K94l04J43R0J57k31
7592Dj63K17l0l0N6N9J23k79J88q6o2j27L34l63K54J6j22j76R2J58j11J89j19
$$ plain form
7615 22 -143 155 -50 -8 -162 -108 38 -373 -227 -186 314 -47 118 -61 -53 -215 -156 68 -182 -84 -226 -139 -336
7638 -336 -179 -240 45 -23 -290 171 -395 -135 -62 -131 -127 -21 -92 6 153 -251 -99 77 -128 184 -12 137 -135
7661 -135 66 112 47 -33 -166 258 107 107 65 48 176 240 426 -88 20 -103 98 152 170 168 -52 213 -28 66
7685 66 62 -33 -160 -57 -156 77 48 38 -16 -35 126 -255 -275 -9 -138 213 -107 -172 -46 -159 -174 -37 81 -165
7709 -165 34 -302 -268 24 -19 22 -71 260 -294 -208 -76 132 -130 -156 93 79 106 16 -78 -147 29 -115 159 56
7733 56 97 170 202 32 134 103 181 -199 191 84 179 -206 -98 303 180 140 222 93 -47 26 131 -79 226
7756 226 -183 156 33 389 255 -141 196 230 139 -360 14 -179 234 -54 -219 87 -156 -4 -210 47 14
7777 14 -13 -18 -2 -179 -299 -6 -181 -5 -62 7 -266 -113 69 -147 113 -248 46 -249 -93 -54 -209 249 -136
$$ packed form
7615B2j65K98k05M2j54N4J46m11J46M1N00l61J65j79Qj62N9K24k50R8j42Q7j97
7638c36J57o1K85o8k67M61n66K60P3o9MJ06p1R8J47m04J52J76k05L12j96J49k72
7661a35K01M6o5q0j33M24j51%m2j7J28O4J86n14J08j23K01N4J8kk20K65k41R4
7685F6mr5j27J03r9K33k9j0n4j9J61l81k0K66j29L51l20o5J26j13j5J37J18k46
7709a65J99l36L4K92m3M1r3L31n54Q6J32K08k62k6K49j4K7r0r4o9J76j44K74j03
7733E6M1P3L2j70J02l1P8l80L90j07R5l85J08M01j23m0Q2j29j40P3J05k10L05
7756B26m09L39j23L56j34l96L37L4r1m99L74j93M13k88j65L06k43J52k06K57l3
7777A4k7nJ6j77j20K93j75J76n7O9k73J53J82k16K60l61K94k95J56L9j55M58l85
$$ plain form
7800 -136 47 -75 -187 89 -34 72 18 302 42 45 157 -112 -189 -63 163 126 248 23 186 88 21 134
7822 134 171 451 53 146 88 253 157 -118 339 81 210 171 176 68 -199 121 253 349 -223 71 163 353 -15
7845 -15 -92 60 133 7 214 -82 -272 -274 36 -128 66 -142 -123 9 -123 -190 -227 -108 -298 124 -193 218 83
7868 83 -48 -331 -18 -4 -141 -22 -178 -50 -237 -8 147 -33 -93 -117 86 0 -7 19 87 -80 -45 32 -149 296
7892 296 148 481 14 -17 419 90 126 -31 369 127 40 16 259 199 116 60 351 73 -13 -60 58 8 98 -103
7916 -103 173 155 46 96 -124 -140 -53 33 -63 87 -164 137 209 -362 -113 31 -186 278 -144 -274 -167 287
7938 287 -33 136 -136 -41 -43 -35 -56 -157 38 -337 82 -272 74 77 80 -30 -158 14 -120 203 101 -179 114
7961 114 76 146 140 163 127 227 -70 198 -13 -25 49 140 202 -84 188 107 30 122 -190 136 221 286 260 -141 -55 -37
$$ packed form
7800a36J83j22j12K76j23J06n4K84k60LJ12k69p7J26K26l7J22k25J63r8o7J13
7822A34L7K80l98R3n8J65r6k75M57k58J29l9Nj08k67L20J32R6n72K94R2J90l68
7845a5p7J52P3j26K07k96j90kL10j64J94k08J9J32j32o7l7J19j90M22l17M11j35
7868H3j31k83L13J4j37J19j56J28j87K29J55j80o0k4K03q6pK6O8j67L5P7j81M45
7892B96j48L33m67l1M36l29L6j57M00k42q7k4K43o0q3n6K91k78q6m7J18n0R0k01
7916a03K76j8j09N0k20j6Q7Q6r6J50k51L01P2n71K49J44k17M64m22j30J07M54
7938B87l20J69k72R5kQk1j01J95l75M19l54L46LLj10j28J72j34L23j02k80K93
7961A14l8P0oK3l6J00k97K68k11j2P4R1O2k86K72q1p7R2l12L26Q5O5k6m01Q6J8
$$ plain form
7987 -37 349 69 244 -132 -22 -301 88 36 -314 -84 -20 125 -99 -179 68 85 -38 -75 19 -227 -112 -178 -201
8010 -201 153 -248 40 -295 8 4 -122 160 149 -103 40 275 -313 80 3 -26 -82 -127 -122 -186 68 -31 -256 -168
8034 -168 -47 -8 297 -203 -130 142 9 -67 54 50 315 61 80 370 155 -201 -104 -52 42 262 2 92 -23
8057 -23 179 100 -23 236 122 306 16 290 -131 -137 160 188 130 -183 -116 267 305 -62 200 -13 -135 143 -289
8080 -289 -32 -174 -260 -38 220 -64 -57 -104 -228 141 -62 -44 14 -118 -139 -85 157 -226 -206 172 -222 -84 -290
8103 -290 198 11 82 11 -196 -256 -182 -65 -176 -171 98 196 -115 134 236 196 2 -230 303 -21 123 -29 10
8126 10 118 -9 22 -161 -108 -50 6 107 95 106 2 225 62 312 249 -76 -100 1 -28 143 324 -185 -112 -67
8150 -67 -171 98 65 -74 19 -20 -62 -15 73 179 -57 -211 -144 -237 56 -78 -79 155 -183 246 -54 -87 -88 -180 -104
$$ packed form
7987c7L86k80J75l76J10k79L89n2l50K30O4J45k24q0K47J7j23l7R4k46J15o6k3
8010b01L54m01K88l35L03mj26K82j1k52J43K35n88L93p7k9n6m5No4K54r9k25Q8
8034a68J21L9L05n00P3K72j33p6J21mK65k54J9K90k15l56R7N2R4K20k60R0j15
8057b3K02p9j23K59j14J84k90K74m21oK97K8n8l13O7L83L8l67K62k13j22K78m32
8080b89K57j42q6K22K58k84Pm7j24L69k03J8N8j32k1N4K42l83K0L78l94J38k06
8103b90M88j87P1p1k07o0P4J17j11NK69R8l11K49J02m0j94k32N33l24J44j52L9
8126A0J08j27L1j83N3N8N6J01j2J1j04K23j63K50o3l25k4J01k9J71J81n09P3M5
8150f7j04K69l3j39R3l9m2M7Q8J06k36j54O7r3K93j34jK34l38M29l00l3jr2P6
$$ plain form
8175 -104 -3 26 -167 -37 -41 219 240 129 15 -120 25 -169 -173 -123 -151 -46
$$ packed form
8175a04J01K9j93J30mK60K1j11j14j35J45j94mN0k8J05
8191d6
$$ Imaginary data points
##PAGE= N=2
##DATA TABLE= (X++(I..I)), XYDATA
$$ plain form
0 0 0 0 0 0 0 0 0 0 0 8 -8 16 -21 27 -40 48 -62 77 -96 117 -142 173 -207 248 -295 350 -410 482 -559 647
30 647 -744 856 -979 1115 -1266 1436 -1619 1824 -2047 2295 -2563 2860 -3179 3532 -3916 4335
46 4335 -4790 5292 -5836 6429 -7082 7794 -8581 9445 -10404 11469 -12660 13999 -15521
59 -15521 17262 -19280 21649 -24483 27940 -32277 37919 -45657 57238 -78325 222661 -485115
71 -485115 355900 -202090 189146 249947 -370057 343188 -298419 527486 -334651 165513
81 165513 -42922 -45325 126650 -498928 254965 -213319 224156 -270419 -216993 210883 -222229
92 -222229 193624 -525505 -16923 -45480 -173098 11137 -347684 61599 -61073 -146460
102 -146460 -114926 -151493 51228 -143527 -254050 -62618 -43994 85148 -157016 -179977 19828
$$ packed form
0@%%%%%%%%%Qj6K4l7M8o7Q8j10J39j73K13k59L15l80M55n43O45p60Q92j041J206
30F47j391J600j835K094k381K702l055L443l871M342m858N423o039O711p448Q251
46D335r125J0082j1128J2265j3511J4876j6375J8026j9849K1873k4129K6659k9520
59a5521L2783l6542M0929m6132N2423o0217P0196q3576J02895j35563L00986p07776
71d85115Q41015n57990L91236O0801o20004P13245o41607Q25905q62137N00164
81A65513k08435k403J71975o25578P53893m68284M37475m94575N3426M27876m33112
92b22229M15853p19129N08582k8557j27618J84235l58821M09283j22672q5387
102a46460L1534l6567K02721j94755j10523J91432J8624J29142k42164k2961J99805
$$ plain form
113 19828 36688 56960 -223151 21532 -88795 169344 -64578 -104744 238217 -154661 305759
124 305759 -267499 171485 179256 -118886 242423 -304842 427369 108 139376 34789
134 34789 -66240 404258 -117661 264701 -180533 250673 94229 984 193102 -135535
144 -135535 414034 -195547 171113 -22931 67452 260303 -266862 210938 -140506 251554
154 251554 -2850 -136023 107662 -108471 189942 -173195 -12866 -22353 -7182 -9754 -153445
165 -153445 35705 -59060 16277 -175510 -91197 20210 -78034 -48828 -200533 -61474 41972
176 41972 -121495 -58763 -153341 -35884 36964 -198242 5223 -139890 40451 -52404 -165149
187 -165149 68779 -112182 117918 -187261 -12044 14227 -3430 78890 -205280 156205
$$ packed form
113A9828J6860K0272k80111K44683j10327K58139k33922m0166L42961l92878M60420
124C05759n73258M38984P771k98142L61309n47265P32211m27261J39268j04587
134C4789j01029M70498n21919L82362m45234M31206j56444r3245J92118l28637
144a35535N49569o09581L66660j94044R0383J92851n27165M77800l51444L92060
154B51554k54404j33173K43685k16133K98413l63137J60329r487J5171k572j43691
165a53445J89150r4765P5337j91787Q4313J11407r8244K9206j51705J39059J03446
176D1972j63467O2732r4578J17457P2848k35206K03465j45113J80341r2855j12745
187a65149K33928j80961K30100l05179J75217K6271j7657Q2320k84170L61485
$$ plain form
197 156205 -74261 162477 -68813 -33027 161895 -86115 213254 -191715 205187 28242
207 28242 35059 117181 -123792 308514 -78132 152115 -48950 74112 192063 -51322 144036
218 144036 -95189 225634 -2672 64706 25106 -3697 192898 -108866 117660 -60800
228 -60800 116842 47707 -83163 68808 -42942 111910 -75548 -42289 -7000 12084 8294
239 8294 -88452 -38826 -12565 3115 -73672 -73103 -48790 9673 -79917 -73132 -79946 -5622 -29105
252 -29105 -115706 -50189 -90901 50470 -125632 -53568 -72264 -22079 30250 -165784 45119
263 45119 -116063 79744 -77881 -82025 53806 -81424 114406 -157794 72385 -16855 42217
274 42217 27542 -102714 144061 -63137 145299 -94973 63639 85136 -7977 125660 -115940
$$ packed form
197A56205k30466K36738k31290L5786J94922k48010K99369m04969L96902j76945
207B8242O817Q2122k40973M32306l86646K30247k01065J23062J17951k43385J95358
218A44036k39225L20823k28306O7378l9600k8803J96595l01764K26526j78460
228f0800J77642o9135j30870J51971j11750J54852j87458L3259L5289J9084l790
239H294r6746M9626K6261J5680p6787N69K4313N8463q9590O785o814P4324k3483
252b9105q6601O5517m0712J41371j76102P2064j8696N0185N2329j96034K10903
263D5119j61182J95807j57625m144J35831j35230J95830k72200K30179q9240N9072
274D2217j4675j30256K46775k07198K08436k40272J58612K1497r3113J33637k41600
$$ plain form
285 -115940 186158 -15119 92650 12868 3140 168469 -35668 126781 -65545 137208
295 137208 51471 17391 57478 -29204 156080 -33331 61547 -24641 61333 64678 -37611
306 -37611 34453 -32072 88375 -29590 -12848 -17878 11021 26147 -60555 -27282 -23695 15383
318 15383 -46431 -47977 -55087 10275 -37414 -60171 -58713 -40655 7754 -90498 -38144 -79702 14709
331 14709 -57389 -67532 -40992 -59885 40426 -118174 -2116 -67880 18500 -14738 -89013
342 -89013 30005 -65649 77572 -95620 11267 -4800 4319 51649 -96074 91921 -40271
353 -40271 89806 -32429 -1175 80547 -11787 99642 -72458 105220 16554 61857 29827
364 29827 -18316 123192 -13094 97394 -36616 75495 64135 15262 57368 -25472 108057
$$ packed form
285a15940L02098k01277J07769p9782r728J65329k04137J62449j92326K02753
295A37208q5737l4080M0087q6682J85284j89411R4878q6188Q5974L345j02289
306c7611P2064o6525J20447j17965J6742n030K8899J5126q6702L3273L587L9078
318A5383o1814j546p110O5362m7689k2757J458J8058M8409r8252N2354m1558R4411
331A4709p2098j0143K6540j8893J00311j58600J16058o5764Q6380l3238p4275
342h9013J19018r5654J43221j73192J06887j6067R119M7330j47723J87995j32192
353d0271J30077j22235L1254Q1722r2334J11429j72100J77678q8666M5303l2030
364B9827m8143J41508j36286J10488j34010J12111j1360m8873M2106q2840J33529
$$ plain form
375 108057 875 44821 -11140 34229 64598 -15041 29030 -26955 61918 1868 -8906 -14620
387 -14620 3634 24649 -26183 -23195 -25557 18414 -29896 -31092 -50611 294 -19963 -42309 -50365
400 -50365 -42816 13376 -64828 -23184 -80094 6203 -30950 -60344 -25467 -72029 39542 -88248
412 -88248 -7374 -57950 -5161 5028 -84816 24320 -71823 68318 -67872 -10151 3102
423 3102 -22251 70698 -91345 62342 -36294 59399 1393 -26424 71366 -26512 96623 -59019
435 -59019 67860 26030 32172 52565 -42946 108256 -7562 80514 -14499 29868 73088 6702
447 6702 68334 -34128 81769 17158 34374 17296 3372 68306 -9164 28144 -14474 38156
459 38156 21107 -8018 -7918 -4435 29883 -10066 -17839 -24502 4049 -4050 -18191 -44879 -2957
$$ packed form
375A08057j07182M3946n5961M5369L0369p9639M4071n5985Q8873o0050j0774n714
387a4620J8254K1015n0832K988k362M3971m8310j196j9519N0905k0257k2346q056
400e0365P549N6192p8204M1644n6910Q6297l7153k9394L4877m6562J11571j27790
412h8248Q0874n0576N2789J0189q9844J09136r6143J40141j36190N7721J3253
423C102k5353R2949j62043J53687r8636R5693n8006k7817R7790r7878J23135j55642
435e9019J26879m1830O142K0393r5511J51202j15818Q8076r5013M4367M3220o6386
447F702O1632j02462J15897o4611J7216j7078j3924O4934p7470L7308m2618N2630
459C8156j7049k9125J00L483L4318l9949p773o663K8551q099j4141k6688M1922
$$ plain form
472 -2957 -20296 -21078 -36335 -45393 14325 -59084 -11234 -70149 -5875 -9421 -59739 -15816 -78338
485 -78338 35710 -61844 -16259 -47211 -32344 24732 -76993 23669 -70351 38568 -35245
496 -35245 -29654 18344 -43259 68606 -78559 37182 -16243 26244 33051 -55607 65052 -29417
508 -29417 76444 -19321 15485 41387 4712 66825 -31894 71390 8787 47125 16704 5281
520 5281 75085 3515 56254 -16515 44043 49243 13103 30905 -8614 45089 25751 9881
532 9881 10505 8748 25219 7951 -10986 13665 3451 12368 -20779 -17803 15223 -11872 5047
545 5047 -55574 3442 -15101 -10457 -18668 -61451 19124 -54754 9857 -63623 -17787 -1861 -66474
558 -66474 13776 -85754 34362 -50797 -29404 -20115 -53957 45129 -75546 13115 -59062 13328
$$ packed form
472b957j7339p82j5257r058N9718p3409M7850n8915O4274l546n0318M3923o2522
485g8338J14048r7554M5585l0952J4867N7076j01725J00662r4020J08919p3813
496c5245N591M7998o1603J11865j47165J15741n3425M2487O807q8658J20659r4469
508b9417J05861r5765L4806K5902l6675O2113r8719J03284o2603L8338l0421j1423
520E281O9804p1570N2739p2769O0558N200l6140J7802l9519N3703j9338j5870
532I881O24j757J6471j7268j8937K4651j0214Q917l3147K976L3026k7095J6919
545E047o0621N9016j8543M644q211m2783Q0575p3878O4611p3480M5836J5926o4613
558f6474Q0250r9530J20116q5159K1393R289l3842R9086j20675Q8661p2177P2390
$$ plain form
570 13328 -726 -41822 18678 -55456 58292 -53480 21140 -5821 -4050 44434 -56426 57502
582 57502 -19853 48623 2525 -11571 47317 3050 57537 -17627 33782 22818 34160 30424
594 30424 1684 44117 17723 37089 6941 28822 33520 21634 15597 8884 29421 31408 8890
607 8890 2109 12521 15406 30983 -22768 16836 -6269 11552 9457 -37516 30625 -35075 19376
620 19376 -36341 -14774 11725 -38149 9342 -67461 21131 -34571 -7792 -32551 -48210 22925
632 22925 -63786 22165 -75092 5205 -17257 -46403 13197 -73185 40233 -59912 -2605 -24129
644 -24129 -22917 26801 -58823 20846 -43448 30885 -12821 -16005 9912 -20604 44004 -31941
656 -31941 26558 -7092 19834 21755 -15462 40321 -1054 38215 1014 11559 34702 18115
$$ packed form
570A3328j4054m1096O0500p4134J13748j11772P4620k6961J771M8484j00860J13928
582E7502p7355O8476m6098j4096N8888m4267N4487p5164N1409j0964J1342l736
594C0424k8740M2433k6394J9366l0148K1881M698j1886o037o713K0537J987k2518
607H890o781J0412K885J5577n3751L9604k3105J7821k095m6973O8141o5700N4451
620A9376n5717K1567K6499m9874M7491p6803Q8592n5702K6779k4759j5659P1135
632B2925q6711Q5951r7257Q0297k2462k9146N9600q6382J13418j00145N7307k1524
644b4129J212M9718q5624P9669o4294P4333m3706l184K5917l0516O4608p5945
656c1941N8499l3650K6926J921l7217N5783m1375L9269l7201J0545K3143j6587
$$ plain form
668 18115 29397 4107 21344 34059 23154 16151 17237 18074 36196 9371 17577 16496 21897
681 21897 20584 -1502 22237 3728 31152 -13981 8465 7415 1385 23201 -39372 25769 -23201
694 -23201 14712 -11611 -30857 20402 -40298 20850 -48781 1340 -11952 -27479 -1791 -53056
706 -53056 19174 -42397 -2867 -38459 -21473 2996 -42330 3866 -54884 13103 -27054 -18201
718 -18201 -10126 -34479 20468 -38817 3169 -20339 -1813 5961 -23216 4725 -8552 15968
730 15968 -6156 -827 2603 12134 14116 -975 10277 11713 20035 11648 8625 16029 25258 12770
744 12770 19130 7864 29365 22481 8849 24384 3617 42864 1581 19524 13340 11329 35975
757 35975 -14040 30431 -6392 27959 3406 -5249 19859 -11372 29892 -28769 15765 -9299
$$ packed form
668A8115J1282k5290J7237J2715j0905p003J086Q37J8122k6825Q206j081N401
681B1897j313k2086K3739j8509K7424m5133K2446j050o030K1816o2573O5141m8970
694b3201L7913k6323j9246N1259o0700O1148o9631N0121j3292j5527K5688n1265
706e3056P2230o1571L9530l5592J6986K4469m5326M6196n8750O7987m0157Q853
718a8201Q075k4353N4947n9285M1986k3508J8526P774k9177K7941j3277K4520
730A5968k2124N329L430R531J982j5091J1252J436Q322q387l023P404R229j2488
744A2770O360j1266K1501o884j3632J5535k0767L9247m1283J7943o184k011K4646
757C5975n0015M4471l6823L4351k4553q655K5108l1231M1264n8661M4534k5064
$$ plain form
769 -9299 3338 2506 -31942 20253 -30994 16476 -32888 -9893 -1504 -26881 6628 -45835 8032
782 8032 -26275 -9550 -21316 -27069 1685 -29902 -2766 -36590 -214 -15831 -15218 -11822 -25317
795 -25317 6737 -21230 -3631 -19987 -771 -1636 -9588 -4334 -7649 9987 -4757 2862 -6115
808 -6115 14276 4188 7537 2153 7919 22128 420 20271 -2359 28316 10463 11871 14915
821 14915 8364 33099 -1453 26562 522 28921 13573 5715 22714 -2056 37605 -10144
833 -10144 21366 1951 12301 18691 -13908 23556 -12485 24030 -12302 1684 4158 -8035
845 -8035 13249 -27047 11715 -17874 5491 -13982 -17251 3036 -21737 4308 -31634 -930
857 -930 -16178 -10151 -12608 -25487 856 -22814 -3792 -25951 -8162 -10468 -12946 -11454 -19730 389
$$ packed form
769i299J2637q32l4448N2195n1247M7470m9364K2995Q389k5377L3509n2463N3867
782H032l4307J6725j1766n753K8754l1587K7136l3824L6376j5617O13L396j3495
795b5317L2054k7967J7599j6356J9216q65p952N254l315J7636j4744P619q977
808f115K0391j0088L349n384N766J4209k1708J9851k2630L0675j7853J408L044
821A4915o551K4735l4552K8015k6040K8399j5348p858J6999k4770L9661m7749
833a0144L1510j9415J0350O390l2599L7464l6041L6515l6332J3986K474j2193
845h035K1284m0296L8762k9589K3365j9473l269K0287k4773K6045l5942L0704
857i30j5248O027k457j2879K6343k3670J9022k2159J7789k306k478J492q276K0119
$$ plain form
871 389 -15075 -2804 -18385 -1265 -4343 -5975 -4209 -9538 8637 -5811 5272 -7983 9618
884 9618 3833 4491 5186 -389 20136 -1059 16378 -1199 17888 13141 6550 15059 2420 27491
898 27491 1340 19417 4041 17376 18438 1881 20150 -942 26474 243 12590 6264
910 6264 7789 16514 -7450 15565 -6631 17279 -4990 -491 3747 -5450 10951 -17427 5770
923 5770 -11501 3429 -9077 -11968 -1402 -14758 2827 -23278 -1890 -13898 -5888 -11677 -19263
936 -19263 -2702 -17606 -2160 -22799 -5810 -11838 -7641 -10105 -17808 173 -14911 276 -16897
949 -16897 -2015 -4601 -4817 -2695 -10785 7887 -6915 6143 -9287 6193 4006 1976 6803 -4996
963 -4996 16887 -443 13771 -449 11184 11841 4561 14563 -14 23256 2201 15756 4331
$$ packed form
871C89j5464J2271j5581J7120l078j632J766n329J8175j4448J1083j3255J7601
884I618n785O58O95n575K0525k1195J7437j7577J9087m747o591Q509j2639K5071
898B7491k6151J8077j5376J3335J062j6557J8269k1092K7416k6231J2347o326
910F264J525Q725k3964K3015k2196K3910k2269M499M238r197J6401k8378K3197
923E770j7271J4930j2506k891J0566j3356J7585k6105K1388j2008Q010n789p586
936a9263J6561j4904J5446k0639J6989o028M197k464p703J7981j5084J5187j7173
949a6897J4882k586k16K122q090J8672j4802J3058j5430J5480k187k030M827j1799
963d996K1883j7330J4214j4220J1633O57p280J0002j4577K3270k1055J3555j1425
$$ plain form
976 4331 12032 17398 1555 17449 -2041 22615 2050 11280 5369 4261 17492 -6095 14992
989 14992 -6455 14492 -1419 57 5147 -5816 12169 -14709 6174 -9980 3865 -4517 -11964
1002 -11964 885 -15003 6061 -18919 -2879 -11830 -7288 -5312 -18343 -1087 -17001 -1099
1014 -1099 -18060 -7119 -8331 -9526 -5569 -17909 -611 -12333 89 -13285 -5984 -3343 -5922
1027 -5922 -378 -11571 4280 -6598 4200 -6278 2059 3475 418 5270 -4701 13150 -509
1040 -509 12061 -1237 7622 11396 3532 14517 -2695 18904 2496 14164 5563 7384 16394
1053 16394 434 17242 -2449 19589 3349 8098 7533 1226 18317 -4974 13847 -5495 10788
1066 10788 3697 -1874 7229 -7925 12102 -10042 4333 -5660 -650 -44 -11174 1653 -11716
$$ packed form
976D331P701N366j5843J5894j9490K4656k0565R230n911j108J3231k3587K1087
989A4992k1447K0947j5911J476N090j0963J7985k6878K0883j6154J3845q382p447
1002a1964J2849j5888K1064k4980J6040q951M542J976j3031J7256j5914J5902
1014a099j6961J0941j212j195L957j2340J7298j1722J2422j3374P301K641k579
1027e922N544j1193J5851j0878J0798j0478Q337J416l057M852r971J7851j3659
1040e09J2570j3298Q859L774p864J0985j7212K1599j6408J1668q601J821R010
1053A6394j5960J6808j9691K2038j6240M749n65o307J7091k3291J8821j9342J6283
1066A0788p091n571R103j5154K0027k2144J4375r993N010O06j1130J2827j3369
$$ plain form
1079 -11716 3526 -13618 -4776 -7934 -6818 -2674 -15743 -3033 -13283 -1927 -12740 -8392 -7929
1092 -7929 -8032 -5562 -12802 -3401 -10558 -759 -13288 -3498 -5932 -3374 -1454 -11038 3507 -7810
1106 -7810 6814 -8230 1946 678 -443 7646 -7183 12659 -4540 11802 -1190 4961 11234
1119 11234 -406 15284 -6334 18561 1162 11907 6822 836 18748 -2426 18723 -3649
1131 -3649 14308 6617 4670 11682 -2625 17616 -4381 12198 -2349 7123 7012 -4040 9023
1144 9023 -7846 11705 -5959 2229 -2873 -2748 3845 -9155 1609 -9895 2212 -8670 -4308
1157 -4308 -6539 -6270 -2861 -12207 -3380 -11417 -559 -12219 -5971 -9115 -7116 -3033 -12812 -1710
1171 -1710 -13189 1440 -11559 -3196 -5375 -6177 1787 -12741 5568 -10759 6457 -6591 -1767
$$ packed form
1079a1716J5242j7144Q842l158J116M144j3069J2710j0250J1356j0813M348M63
1092g929j03K470p240R401p157R799j2529R790k434K558J920r584J4545j1317
1106g810J4624j5044J0176j268j121Q089j4829J9842j7199J6342j2992O151O273
1119A1234j1640J5690k1618K4895j7399J0745n085n986J7912k1174K1149k2372
1131c649J7957p691j947P012j4307K0241k1997J6579j4547R472j11j1052J3063
1144I023j6869J9551j7664Q188n102J25O593j3000J0764j1504J2107j0882M362
1157d308k231K69L409r346Q827q037J0858j1660O248l144J999M083r779J1102
1171a710j1479J4629j2999Q363k179q02P964j4528J8309j6327J7216j3048M824
$$ plain form
1184 -1767 4265 -6020 11680 -11148 11371 -2997 6861 4500 -2367 13660 -4280 16323 -4726
1197 -4726 12594 5338 4636 12253 -3375 18738 -2214 14681 1084 7017 11748 229 13572
1210 13572 -3674 13609 1052 7136 3591 1280 9169 -3084 7043 -3320 5747 -779 90
1223 90 -455 -2276 2713 -5687 185 -6510 393 -5624 -3829 -6218 -4623 -3482 -8442 -3281 -11002 -346
1239 -346 -11209 -3869 -8696 -6634 -1822 -13230 -54 -13163 1503 -9481 -4973 -3878 -8625 3893
1253 3893 -13145 4565 -9429 2715 -2721 -5335 5380 -8135 10016 -8559 6922 -424 2504
1266 2504 6607 -4880 12505 -3331 11970 -401 5862 7821 2026 11459 -1483 12765 2014
1279 2014 9416 3839 4793 9585 2246 9696 1 9151 3057 5971 3250 2722 5906 1456 4217
$$ packed form
1184a767O032j0285J7700k2828K2519j4368R858k361o867J6027j7940K0603k1049
1197d726J7320p256p02P617j5628K2113k0952J6895j3597N933M731j1519J3343
1210A3572j7246J7283j2557O084l545k311P889j2253J0127j0363R067o526Q69
1223I0n45j821M989q400N872o695O903o017J795k389J595J141m960N161p721J0656
1239c46j0863P340m827K062M812j1408J3176j3109J4666j0984M508J095m747J2518
1253C893j7038J7710j3994J2144n436k614J0715j3515J8151j8575J5481p346K928
1266B504M103j1487J7385j5836J5301j2371O263J959n795R433j2942J4248j0751
1279B014P402n577R54M792p339P450r695R150o094K914k721n28L184m450K761
$$ plain form
1294 4217 -1229 5331 -1214 3370 -3009 759 531 -3207 1068 -7705 3706 -7611 400 -6998 -4302
1309 -4302 -590 -9639 894 -13025 2491 -10072 -3654 -5675 -9465 2129 -14230 2605 -13415
1322 -13415 1112 -6569 -7702 717 -12010 6328 -12878 2870 -6873 -1533 1816 -8551 6392
1335 6392 -8802 8295 -5566 2867 1781 -1435 8065 -5563 9877 -2647 8641 1466 2655
1348 2655 7665 676 10168 -946 9394 2771 7604 4583 3476 8121 2607 8475 341 8141
1362 8141 1959 6623 1897 2783 5453 256 6088 -3094 6503 -2005 3765 -1639 -942 3068 -5072
1377 -5072 4460 -8617 4229 -6250 -1022 -2490 -7521 3300 -11318 3199 -11280 -53 -5260
1390 -5260 -7091 -520 -11845 3708 -12637 908 -8528 -3549 -949 -10249 2677 -11532 4108
$$ packed form
1294D217n446O560o545M584o379L768k28l738M275q773J1411j1317Q011p398K696
1309d302L712r049J0533j3919J5516j2563O418k021l790J1594j6359J6835j6020
1322a3415J4527p681j133Q419j2727J8338j9206J5748r743N340L349j0367J4943
1335F392j5194J7097j3861Q433j086l216R500j3628J5440j2524J1288p175J189
1348B655N010o989R492j1114J0340o623M833l021j107M645n514N868q134P800
1362H141o182M664m726Q86K670n197N832r182R597q508N770n404O97M010q140
1377e072R532j3077J2846j0479N228j468n031J0821j4618J4517j4479J1227n207
1390e260j831O571j1325J5553j6345J3545r436M979K600r300J2926j4209J5640
$$ plain form
1403 4108 -8206 -1044 -2277 -5104 3930 -8568 4833 -6407 3996 -1697 -1075 3336 -2446 7004
1417 7004 -3546 5921 187 4696 2990 1372 6184 1037 7692 363 6832 2968 5953 4233 2812
1432 2812 6393 2644 7378 545 6914 1853 5877 2734 1610 5566 -328 6583 -2873 5212 -855
1447 -855 2669 910 -2440 4464 -5234 4723 -6526 1932 -2704 -2924 439 -7812 3256 -8563 1276
1462 1276 -7199 -2350 -2000 -7430 248 -10188 1872 -8617 -2023 -4779 -5399 309 -8583 885 -8353
1477 -8353 845 -4647 -3014 -1337 -5041 2453 -6034 2108 -4240 1628 -738 -1087 2270 -1621 4737
1492 4737 -2216 3921 -62 4282 2268 1481 4262 1284 6546 449 5964 1467 5744 3014 2863
1507 2863 5311 1712 7414 -471 6824 1022 5107 3031 432 5906 -1274 6731 -2572 4572 -471
$$ packed form
1403D108j2314P162j233k827R034j2498J3401j1240J0403n693O22M411n782R450
1417G004j0550R467n734M509j706j618M812n147O655p329O469l864K985j720j421
1432B812L581l749M734o833O369n061M024l143j124L956n894O911r456Q085o067
1447h55L524j759l350O904r698R957j1249Q458m636k20L363q251J1068j1819R839
1462A276q475M849L50n430P678j0436J2060j0489O594k756o20N708q892R468r238
1477h353R198n492J633J677l704P494q487Q142o348N868k366l49L357l891O358
1492D737o953O137l983M344k014p87K781k978N262o097N515m497M277k730j51
1507B863K448l599N702p885P295n802M085k076k599N474p180Q005r303P144n043
$$ plain form
1522 -471 1622 2315 -3494 4848 -4943 4342 -4795 655 -789 -3936 1775 -7547 2903 -6860 336
1537 336 -4981 -3575 -368 -6967 1098 -8607 1049 -6368 -2306 -3463 -5638 514 -7455 913 -6742
1552 -6742 480 -3665 -3052 -511 -4932 2368 -5192 1600 -3698 934 37 -1146 1633 -1926 3963
1567 3963 -2164 3796 -391 2766 2599 697 4352 34 6082 -195 5167 1643 4060 4211 1209
1582 1209 5452 652 6648 -173 5265 2028 2895 4348 -438 5838 -1288 5524 -1127 2942 1475
1597 1475 -160 3372 -3616 4148 -3433 3266 -2641 -755 712 -3919 2129 -6339 1977 -4751 -630
1612 -630 -2689 -4176 404 -6403 822 -6993 -256 -4144 -3027 -1945 -5845 645 -6098 309 -5363
1627 -5363 -958 -2415 -3584 -10 -4701 1881 -4205 574 -2583 -95 484 -2024 1773 -2094 3145
$$ packed form
1522d71K093O93n809Q342r791R285r137N450j444l147N711r322J0450r763P196
1537C36n317J406L207o599Q065r705R656p417M062j157k175O152p969Q368p655
1552f742P222m145O13K541m421P300p560O792n298M632q97j183K779l559N889
1567C963o127N960m187L157j67j902L655m318O048o277N362l524K417J51l002
1582A209M243m800N996o821N438l237Q67J453m786O276p126O812o651M069j467
1597A475j635L532o988P764p581O699n907J886J467m631O048q468Q316o728M121
1612f30k059j487M580o807P225p815O737l888J117J082l900O490o743O407n672
1627e363M405j457j169L574m691O582o086M779l157K488N79k508L797l867N239
$$ plain form
1642 3145 -1239 2317 -461 1594 2479 269 3901 -468 4824 74 4188 1661 2978 3991 678
1657 678 5118 333 5811 475 4079 1877 2051 4436 -371 5254 -1413 5228 -364 2055 2204 -719
1673 -719 4087 -3312 4356 -2821 2173 -777 -1493 1573 -4116 2753 -5230 1475 -3492 -1040 -1222 -4841
1689 -4841 1068 -5968 1162 -5953 -882 -2875 -3775 -577 -6086 817 -5581 -82 -4165 -1689 -1115
1704 -1115 -3968 520 -4776 1050 -3419 105 -1571 -1334 633 -2218 1879 -2265 2462 -1078 1678
1719 1678 349 1006 2491 -346 3472 -608 4366 454 3092 2002 1983 4036 170 5114 -134 4864
1735 4864 1030 3011 2992 821 5350 -1032 5223 -1140 3884 1003 476 3140 -1697 4821 -2941 3477
1751 3477 -1316 636 763 -2871 2816 -4091 2644 -3732 310 -1411 -2334 324 -5336 1543 -4771
$$ packed form
1642C145m384L556k778K055Q85k210L632m369N292m750M114k527J317J013l313
1657F78M440m785N478n336L604k202J74K385m807N625o667O641n592K419J49k923
1673g19M806p399P668p177M994k950p16L066n689O869p983O705m967K452j82l619
1689d841N909p036P130p115N071j993r00L198n509O903o398N499m083K476N74
1704a115k853M488n296N826m469L524j676K37J967k851M097m144M727l540K756
1719A678j329O57J485k837L818m080M974l912K638j090j9K053l866M944n248M998
1735D864l834J981j9k171M529o382O255o363N024k881n27K664m837O518p762O418
1751C477m793J952J27l634N687o907O735o376M042j721r23K658n660O879o314
$$ plain form
1766 -4771 308 -3472 -2444 -1115 -4260 228 -5075 156 -3904 -1343 -2553 -2789 -461 -3794 11
1781 11 -3697 -206 -2215 -1012 -899 -1509 238 -1809 830 -1739 1563 -723 1041 261 298 2132 -230
1798 -230 2723 -639 3253 419 2471 1612 1086 4051 -302 4462 -142 4198 1514 1977 3210 250
1814 250 5020 -742 4471 -47 2740 1726 -140 3383 -1944 4222 -1877 2366 16 -99 2011
1829 2011 -2547 2606 -2977 1817 -2124 -765 -226 -2217 1055 -4153 748 -3534 -417 -1665 -2927
1844 -2927 -853 -3003 -445 -3374 -815 -2644 -2069 -1627 -2586 -644 -2755 -575 -3494 164 -2523 446
1860 446 -1146 -606 441 -1449 144 -2074 1746 -1110 1281 0 -101 1909 -1031 2820 -1162 3261
1876 3261 58 1977 2106 -271 4190 -979 4448 -28 3045 1748 965 3538 -931 5102 -1010
$$ packed form
1766d771N079l780J028J329l145M488n303N231m060K561j210k36K328l333L805
1781A1l708L491k009J203J13o10J747k047K639k569L302k286J764p80L7J834k362
1798b30K953l362L892k834K052q59n26K965m353M764m604M340k684M63J233k960
1814B50M770n762N213m518K787j014j866L523n327O166o099M243k350j15K110
1829B011m558N153n583M794l941J359N39j991L272n208M901m282L117j248j262
1844b927K074k150K558k929K559j829N75M42r59J942k111K180k919L658k687K969
1860D46j592N40J047j890J593k218L820k856K391j281j01K010k940L851l982M423
1876C261l203J919J29k377M461n169N427m476L073j297p83K573m469O033o112
$$ plain form
1891 -1010 3879 479 1622 2932 -870 3917 -1857 3671 -448 1545 1225 -1202 2831 -2387 2666
1906 2666 -2246 1341 -839 -1230 513 -2764 1312 -3389 368 -2422 -907 -1183 -2422 -294 -3225
1921 -3225 43 -3322 -714 -2251 -1730 -1520 -2611 -757 -2650 -227 -3065 -64 -2084 -970 -941 -1980
1937 -1980 507 -2242 1026 -1941 862 -807 123 1073 -1380 2373 -1387 2839 -725 1609 1215 69
1953 69 3094 -1117 3932 -662 2990 512 1290 3087 -515 4561 -824 3553 244 1810 2471 383
1969 383 3792 -1217 3164 -502 1860 1171 5 1440 -540 1876 -1402 1439 -517 530 309 -1718
1985 -1718 677 -1881 765 -2005 -94 -1084 -1090 -698 -2301 -522 -2257 -394 -2478 -1206 -1846 -1457 -1331
2002 -1331 -2258 -651 -2377 -270 -2205 -619 -1877 -988 -784 -1852 279 -2071 727 -1781 330 -295
$$ packed form
1891a010M889l400J143J310l802M787n774N528m119J993l20k427M033n218N053
1906B666m912L587k180l91J743l277M076m701L757k790J515k76j239K128k931
1921c225L268l365K608j537N21K10j091J854j893K423k838L001k020J114K9j039
1937a980K487k749L268k967K803j669R30R50k453L753l760M226l564K334l94j146
1953F9L025m211N049m594L652k478P78J797l602N076n385M377l309J566O61k088
1969C83L409n009M381l666K362o89j166J435j980K416l278K841j956J047k21k027
1985a718K395k558K646k770J911r90oL92j603J779j735J863k084J272o40L89J26
2002a331r27J607j726K107j935J586j258Q89K04j068K131k350K798k508K111o25
$$ plain form
2018 -295 -517 862 -1543 1788 -1435 1653 -325 792 1488 -487 2301 -622 2776 -72 1828 1408
2034 1408 628 2695 -289 3049 -227 2502 1147 1254 2083 88 2788 -244 2460 85 1469 1007
2050 1007 -8 1788 -632 1861 -476 1245 -279 244 555 -647 704 -1464 534 -1261 -5
2065 -5 -1040 -657 -468 -1399 -231 -1697 -457 -1979 -793 -1648 -1246 -988 -2205 -398 -2305 -157 -1869
2082 -1869 -689 -1157 -1345 -374 -2171 417 -1981 464 -1407 -257 -50 -1092 1022 -1605 1433 -1317
2098 -1317 869 -72 -162 1501 -713 2117 -679 1713 350 895 1293 -40 2438 73 2468 201
2114 201 1458 864 565 1762 -4 2239 43 2029 442 868 1190 111 1508 -221 1379 -267
2130 -267 768 122 -25 641 -531 583 -913 459 -889 22 -861 -899 -253 -1225 -231 -1441 -26 -1762
$$ packed form
2018b95k22J379k405L331l223L088j978J117O96j975K788k923L398k848J900m20
2034A408p80K067k984L338l276K729j355J07Q29j995K700l032K704k375J384m62
2050A007j015J796k420K493k337J721j524N23L11j202J351k168J998j795J256
2065ej035L83J89r31J168j466J240j522J186q55M02K58j217J807j907K148j712
2082a869J180m68j88R71j797K588k398K445j871J150K07j042K114k627L038k750
2098a317K186r41r0J663k214K830k796K392j363N45L98j333K478k365K395k267
2114B01J257n94k99J197j766K243k196J986j587M26L22j079J397j729J600j646
2130b67J035o46j47O66j172J114j496J372j348R11q83l8O46r72R94j210J415j736
$$ plain form
2148 -1762 -587 -1109 -1009 -611 -1768 -292 -1813 -263 -1420 -882 -786 -1531 -177 -1851 216 -1605 16
2165 16 -547 -497 241 -1156 577 -1274 758 -384 377 426 -163 1190 -584 1422 -181 1210 217 490
2183 490 1336 32 2049 -206 1552 602 982 1121 609 1668 19 1754 169 1385 896 663 1235
2200 1235 160 1298 -437 1216 127 800 373 81 434 -500 607 -813 526 -554 -225 -631 -609
2217 -609 -332 -1196 121 -1332 21 -1078 -549 -645 -1118 -233 -1514 -275 -1678 -36 -1338 -937 -516
2234 -516 -1375 64 -1572 108 -1471 -118 -752 -771 67 -1091 474 -1249 374 -514 58 576 -555
2251 -555 750 -423 1241 -325 859 647 378 1218 16 1435 53 1446 643 799 1250 294 1701
2268 1701 197 1506 477 1082 798 627 943 294 1262 -98 1015 172 633 497 64 604 -382 565
$$ packed form
2148a762J175n22J00L98j157J476j521J550j157N38R6p45J354j674K067j821J621
2165A6n63N0P38j397J733j851K032j142P61M9n89J353j774K006j603J391r93K73
2183D90Q46j304K017k255J758r50L80J39n12J059j649J735j585J216m89k33N72
2200A235j075J138j735J653j089O73m27k92L53r34J107j420J339j080L29m06K2
2217f09K77q64J317j453J353j099N29r6m73Q85j281J239j403J642j302M01M21
2234e16q59J439j636J680j579J353o34j9Q38j158J565j723J623q88N72N18j131
2251e55J305j173J664j566J184k12k69Q40j202J419j382J393q03J56M51r56J407
2268A701j504J309j029O05k84j71L16o49R68j360J113q43M61j36m33N40r86R47
$$ plain form
2286 565 -335 159 -544 124 -418 -477 193 -1131 184 -1239 -57 -819 -773 -330 -1381 -228 -1297 -82
2304 -82 -1495 -410 -1078 -1287 -208 -1488 200 -1256 -49 -961 -539 -450 -1042 351 -1100 287 -908
2321 -908 -24 -418 -487 353 -396 758 -280 985 56 686 945 372 1028 -122 1132 366 1152 699 645
2340 645 1110 457 1320 184 1327 401 1015 731 518 983 208 837 156 1167 307 479 175 45 769
2359 769 -309 565 -410 445 -398 -191 -149 -742 83 -1032 242 -1108 -372 -616 -552 -560 -1283 -223 -1333
2378 -1333 69 -1183 -543 -576 -1076 -360 -1237 -304 -1369 -322 -824 -304 -328 -1018 112 -893 120 -764
2396 -764 -4 -260 -203 470 -334 495 -397 844 -237 453 355 123 1017 -130 1022 191 938 362 556
2415 556 951 223 1267 233 1631 294 1141 702 694 1343 224 1342 73 992 25 646 443 333
$$ packed form
2286E65r00M94p03O68n42n9O70j324J315j423J182p62M6M43j051J153j069J215
2304h2j413J085o68k09J079j280J688j456J207r12M22Q9n92J393j451J387j195
2321i08Q84l94o9Q40p49J154j038J265r29O30K59n73O56j150J254p66P86m53n4
2340F45M65o53Q63j136J143r26O14k84k13M65p75O29o81J011q60J72l04j30P24
2359G69j078Q74r75Q55q43K07M2n93Q25j115J274j350P36k44O4qp23J060j110
2378a333J402j252O40l3n00P16q77R33j065J047n02N20k4o90J130j005J013q84
2396g64P60k56N7O73q04Q29q92J241j081O90r8k32Q94j147J152q31P47n76J94
2415E56L95p28J044j034J398j337Q47m39qO49j119J118j269R19r67O21k03j10
$$ plain form
2433 333 716 -149 1115 -502 535 -338 -59 1 -839 449 -958 95 -816 -256 -221 -706 -282 -1139 8
2452 8 -1609 -423 -962 -567 -448 -1155 -75 -1410 -284 -1184 -261 -658 -954 -186 -1323 190 -1272 150
2470 150 -563 -252 -41 -440 57 -801 686 -316 659 -107 159 333 3 1056 -505 1237 165 970
2488 970 775 482 1116 130 1236 191 1295 679 845 662 464 1334 132 1110 -136 742 523 367
2506 367 704 -334 1051 -242 502 -126 375 202 -187 396 -842 446 -677 48 -687 -630 -232 -869
2524 -869 11 -975 -12 -896 -413 -832 -890 -596 -952 -398 -1123 -611 -1045 -721 -593 -788 -228 -892 -143 -939
2544 -939 -11 -647 -251 -55 -327 473 -483 469 -244 470 24 -99 299 -93 595 -173 1004 228 630 607
2564 607 309 824 121 1379 24 1010 425 742 857 290 1175 221 850 196 668 348 221 548 263
$$ packed form
2433C33L83q65J264j617J037q73K79O0q40J288j407J053r11N60L5m85M24q57J147
2452Hj617J186n39L95J19p07J080j335J126r00R23l97k96P68j137J513j462J422
2470A50p13L11K11l99M97q58J487j002R75p66K66J74l30J053j561J742j072Q05
2488I70j95k93O34r86J106j045J104o16J66j83j98Q70j202R78j246Q78k19j56
2506C67L37j038J385j293P44o28N01j73l89N83j238J288j123P25p35N7L98o37
2524h69Q80r86R63q84M83m19n8K94l56N54p25N12m34L24J28j95N60o64P49p96
2544i39R28o36L96J96k72Q00r56R52p13P14m46j23L98l92O88p68J177p76M02k3
2564F07k98N15p03J258j355R86n85L17J15n67Q85r54O29o54M72l20j27L27k85
$$ plain form
2583 263 777 -152 909 -191 197 76 -41 132 -439 467 -624 104 -556 -416 -491 -617 -113 -1055 -178
2602 -178 -851 -358 -1029 -752 -300 -1005 -128 -1158 -174 -839 -396 -725 -815 -33 -1189 -28 -906 -62 -590
2621 -590 -121 -302 -559 140 -707 419 -616 330 -233 -125 352 -146 718 -320 714 167 741 519 -4
2640 -4 798 -38 956 266 857 505 685 1007 250 982 268 882 230 619 489 258 628 -188 704 -91 396
2661 396 142 419 247 -281 364 -233 207 -554 181 -162 -204 -174 -684 86 -658 -14 -666 -444 -730 -834 -222
2682 -222 -858 15 -1079 -198 -609 -356 -529 -885 -22 -937 32 -756 -104 -345 -441 -105 -767 308 -692
2701 -692 281 -383 120 -6 -99 382 -298 647 -443 618 241 547 919 172 638 92 1095 393 604
2720 604 428 299 889 100 933 192 583 311 516 426 208 713 36 617 -124 544 38 286 45 -227
$$ packed form
2583B63N14r29J061j100L88j21j17J73n71R06j091P28o60J40p5j26N04r42Q77
2602a78o73M93o71K77M52p05Q77j030R84o65M43l29r0P82j156J161q78Q44n28
2621e90M69j81k57O99q47J126j035R46n63J08M77m98Q64j038J034n47N74k22n23
2640dQ02q36R94o90N91l52J80L22p57P32p14O14o52L89j30k31L70q16Q92p95M87
2661C96k54K77j72n28O45n97M40p61P35l43m2L0n10P70p44O44o52K22k86j04O12
2682b22o36Q73j094Q81m11K53j73l56Q63r15R69p88O52k41r6L36o62J075j000
2701f92R73o64N03j26r3M81o80R45j090J061l77L06L72p47M66n46J003p02K11
2720F04j76j29N90p89Q33p41L91k72K05r0k18N05o77N81p41O68n06K48k41k72
$$ plain form
2740 -227 406 -483 229 -329 73 -163 -299 -207 -532 285 -591 -2 -407 -352 -310 -477 -70 -810 -99 -462 -191
2761 -191 -650 -217 -348 -569 -34 -679 146 -655 35 -400 -642 -220 -575 325 -605 393 -346 176 44 -240
2781 -240 436 -584 445 -184 537 -14 210 560 102 918 -34 668 212 739 661 205 791 98 841 29
2801 29 575 256 555 582 26 813 110 779 154 347 236 16 148 -8 225 -386 243 -245 46 -176 -239
2822 -239 -58 -580 172 -800 220 -690 -227 -481 -625 -232 -754 1 -650 41 -665 -378 61 -763 -51 -1063
2842 -1063 -41 -740 -299 -260 -466 -31 -730 515 -786 323 -207 -316 191 -418 561 -503 608 -341
2860 -341 377 300 -125 787 210 952 117 446 379 126 744 203 810 271 894 174 584 657 128 778 91
2881 91 524 -49 876 206 403 170 -79 320 45 367 -492 282 -328 386 -280 -323 4 -563 181 -822
$$ packed form
2740b27O33q89P12n58M02k36j36R2l25Q17q76N89m05N5M2j67M07p40P11l63K71
2761a91m59M33j31k21N35o45Q25q01O90m35k42M22l55R00r30R98p39N22j32k84
2781b40O76j020J029o29P21n51K24L50m58Q16r52P02m56N27p8m56N86o93P43q12
2801B9N46l19K99K7n56P87p03O69o25J93j11k20J32j56K33o11O29m88K91k22o3
2822b39J81n22P52r72J020r10M63k54j44L93n22P55o51O91p06K87M39q24P12j012
2842a063J022o99M41L9k06M35o99J245j301J109n30j09N07o09R79j064J111r49
2860c41P18p7m25R12n77P42q35L29o7k53O18n41O07n39O23p20M10P3n29O50o87
2881I1M33n73R25o70J97k33k49L99k75L22q59P74o10P14o66m3L27n67P44j003
$$ plain form
2901 -822 128 -377 -80 -503 -627 -213 -1028 -180 -1140 13 -462 -631 -163 -914 180 -985 61 -741 -443
2920 -443 -316 -592 130 -794 382 -714 -218 -360 -505 202 -476 622 -573 445 42 142 442 -84
2938 -84 688 -82 705 74 582 537 277 504 88 785 324 852 324 305 398 228 414 357 603 142 659 68
2960 68 420 48 119 621 -41 343 -454 276 -41 180 -15 -284 -33 -564 341 -602 50 -397 -111 -78 -1192
2981 -1192 163 -1083 365 -867 -54 -379 -686 186 -1236 270 -987 -121 -439 -847 91 -1100 394
2998 394 -789 75 -610 -109 273 -378 405 -593 338 -266 278 137 -194 195 76 509 -16 481 319 337
3018 337 416 -145 715 22 779 447 670 523 464 473 96 464 210 757 303 787 179 426 69 277 581
3039 581 -234 487 -453 732 -260 -102 236 -470 254 -748 387 -663 -70 68 -688 -30 -1008 480
$$ packed form
2901h22R50n05K97m23j24M14q15Q48r60J153m75j69M68p51J094j165J046q02K98
2920d43J27k76P22r24J176j096M96j42j45P07o78J098j195J018m03J00L00n26
2938h4P72p70P87o31N08m5k60K27m16O97m61N28n28j9R3j70J86n7K46m61N17n91
2960F8L52l72P1N02o62L84p97P30l17K21j95k69K51n31R05r43O52m47K86L3j114
2981a192J355j246J448j232Q13l25l07Q72j422J506j257Q66l18m08R38j191J494
2998C94j183Q64o85N01L82o51P83r98R31o04N44j41l31L89j19M33n25M97j62J8
3018C37P9n61Q60o93P57l32K23j47n9Rl77L68k54N47m54M84o08K47l57K08L04
3039E81q15P21r40J185r92J58L38p06P24j002J135j050N93J38p56O58r78J488
$$ plain form
3057 480 -900 -62 -619 -466 -27 -840 328 -1109 553 -959 -83 -204 -1123 347 -1375 230 -439
3074 -439 -111 -326 -688 283 -458 375 -601 277 385 86 200 -457 456 68 193 -117 532 261 526 612
3094 612 456 837 391 526 277 530 266 382 365 524 443 266 716 -156 756 187 534 682 113 579 -181
3115 -181 763 -161 593 -206 -169 133 -440 181 -657 226 -555 -24 109 -595 191 -681 511 -1093 -169 -382
3135 -382 -449 -62 -1128 207 -856 -8 -408 -178 -207 -748 540 -914 107 -520 -14 -132 -573 182 -425
3154 -425 215 -461 75 -4 244 211 -194 114 -146 605 -181 65 -39 209 156 275 244 129 665 -116 712
3175 712 316 431 340 192 471 17 701 -239 698 -116 132 554 -265 678 -356 516 -510 103 147 18
3195 18 263 -486 608 -715 238 -268 81 159 -766 393 -617 188 -436 -35 -344 -773 11 -904 50
$$ packed form
3057D80j380Q38n57J53M39q13J168j437J662j512Q76j21r19J470j722J605o69
3074d39L28k15l62R71p41Q33r76Q78J08k99J14o57R13l88J25l10O49k71K65Q6
3094F12j56L81m46J35k49K53k64J16j7J59q1j77M50q72R12n69L47J48n69M66p60
3115a81R44r24P54p99L7L02n73O21q38Q83p81N31J33p04P86q72J192j604R24k13
3135c82o7L87j066J335j063Q48m00K30k9n41J288j454J021o27N06j18m41P55o07
3154d25O40o76N36p9K48l3m05L08k60P51p86K46j04K48n3J19l1j15N36p81Q28
3175G12l96J15r1j48K79m54O84r40R37q14K48M22q19R43j034Q72j026O13M4j29
3195A8K45p49J094j323R53n06L49P8r25J159j010Q05o24M01l09m29P84r15R54
$$ plain form
3214 50 -820 104 -432 -510 -256 -571 -7 -738 128 -535 -246 -264 -181 138 -456 449 -347 392 -18 166 91 7
3236 7 325 -291 395 157 207 216 122 317 -92 379 239 549 63 586 276 270 551 256 642 -64 898 -259
3258 -259 204 209 362 274 -243 469 -304 348 -134 220 -43 -311 331 -642 448 -281 272 -142 -180 89 -655
3279 -655 322 -608 440 -484 -218 -257 -634 118 -540 -25 -513 -367 -395 -227 35 -631 -3 -678 17 -260
3299 -260 -204 97 -169 243 -553 21 -27 225 -274 45 115 -155 239 -80 271 166 354 69 231 178 -73
3320 -73 299 -58 459 64 674 72 354 395 12 556 -61 600 -21 135 -86 72 479 -114 388 -85 277
3341 277 -218 -156 143 -224 328 -719 337 -539 63 -349 -203 -329 -546 212 -720 168 -351 -419 -191 -441
3361 -441 41 -690 236 -415 -69 80 -428 -41 -750 103 -362 -75 -309 -36 -36 -420 67 -270 179 -288 -102
$$ packed form
3214E0q70R24n36p8K54l15N64p31Q66o63K89j8Q3L19n94R05p96P39m10J84p5q4
3236GL18o16O86k38N0Rr4J95m09M71j40L10m86N23l10oK81k95L86p06R62j157
3258b59M63NJ53q8n17P12p73O52m82L54k63k68O42r73J090p29N53m14l8K69p44
3279f55R77r30J048r24K66l9l77P52o58N15m88J46k8J68K62o66O28o75O95k77
3299b60N6L01k66M12p96N74m8K52m99L19P0k70L94l19L51j05J88k85J62n3k51
3320g3L72l57N17l95O10o02K82M1l83N44o17O61o21J56k21J58M07n93N02m73L62
3341B77m95O2K99l67N52j047J056q76O02m12J46j26k17P58r32Q88n19o8K28k50
3361d41M82p31R26o51L46J49n08L87p09Q53m65K87k34K73%l84M87l37M49m67J86
$$ plain form
3382 -102 -10 -9 -190 -148 219 -36 89 51 467 78 226 148 265 268 21 496 42 336 122 446 302 13 518
3405 518 -164 596 23 209 183 -25 215 -325 456 -529 409 -147 58 108 -345 227 -600 297 -450 21 -200
3426 -200 -383 59 -458 361 -599 13 -212 -258 -51 -398 158 -415 -134 -320 36 -119 -492 191 -422 -2
3446 -2 -417 -65 -178 -242 107 -121 45 20 11 -203 -37 -28 -81 219 9 164 292 218 -95 450 57 148 249 92
3470 92 321 -77 419 8 483 172 151 -60 195 699 19 338 28 294 193 -217 281 -302 246 -223 472
3491 472 -222 -134 241 -353 363 -471 410 -70 -163 222 -404 282 -726 57 -590 -353 -134 -485 55 -579
3511 -579 411 -360 -103 -223 -290 41 -105 49 -400 -24 8 -10 28 166 -168 9 -84 -156 16 -27 273 -224
3533 -224 112 114 149 -138 -174 246 19 190 -115 159 17 119 300 -9 389 -244 337 -127 347 411 -376 585
$$ packed form
3382a02R2Jj81M2L67k55J25l8M16l89J48p8J17Lk47M75m54K94k14L24j44k89N05
3405E18o82P60n73J86k6k08K40n40P81r85R38n56K05N0m53N72q27Q97p47M71k21
3426b00j83M42n17Q19r60O12k25m6K07l47N56n73K81j86L56j55l73O83o13M20
3446bm15L52j13o4L49k28J66k5rk14J66Rn3L00k10J55J28p4l13N45l93R1J01j57
3470I2K29l98M96m11M75l11k1k11K55N04o80L19l10K66j01m10M98n83N48m69O95
3491D72o94Q8L75n94P16q34Q81m80r3L85o26O86j008P83o47K37K19l51N40o34
3511e79R90p71K57j20o7L31j46J54m49L76L2j8L8J38l34J77r3p2J72m3L00m97
3533b24L36KL5k87l6M20k27J71l05K74j42J02J81l09L98o33N81m64M74O4p87R61
$$ plain form
3555 585 -64 432 -397 94 353 -296 390 -187 520 -234 350 167 -196 353 -373 500 -215 83 -231 70
3575 70 234 -410 145 -390 224 -352 -418 -135 -696 -160 -341 -23 -31 -242 -124 -75 -19 -395 -186 -267 -226 -136 24
3598 24 -186 -103 134 -108 -110 -18 -49 -172 255 76 217 86 19 165 -135 257 -172 311 -150 78 296 -355
3620 -355 362 -258 647 146 183 304 345 417 -249 562 -276 213 117 11 426 -283 436 -233 204 242 276 176
3642 176 -432 264 -231 -359 -209 148 104 -141 -247 -976 23 -932 -60 742 -794 197 -328 168 -14 154
3662 154 -598 185 -233 -171 -184 -21 -201 -308 344 -551 122 -75 -292 -919 397 383 -199 325 -90 121 -156
3683 -156 201 31 56 209 148 435 61 190 331 46 133 -18 476 -164 368 100 -448 -358 -953 396 -317
3704 -317 163 8 -57 176 -698 562 -382 285 -79 328 -270 -123 242 -316 12 -42 -207 -135 -661 -589 79
$$ packed form
3555E85o49M96q29M91K59o49O86n77P07p54N84j83l63N49p26Q73p15K98l14L01
3575G0J64o44N55n35O14n76o6K83n61N36j81L18qk11J18M9N6l76K09q1M1R0J60
3598B4k10Q3K37k42kR2l1j23M27j79J41j31o7J46l00L92m29M83m61K28K18o51
3620c55P17o20R05n01L7J21M1P2o66Q11q38M89r6j06M15p09P19o69M37L8L4j00
3642A76o08O96m95j28J50L57m4k45j06p29R99r55Q72Q02j536R91n25M96j82J68
3662A54p52P83m18O2j3J63j80j07O52q95O73j97k17o27J316j4n82N24m15K11k77
3683a56L57j70K5J53o1K87l74J29J41k85Q7j51M94o40N32k68n48R0n95J349p13
3704c17M80j55o5K33q74J260r44O67l64M07n98J47L65n58L28n4j65P2n26P2O68
$$ plain form
3725 79 237 -217 241 -202 59 -220 10 -120 -233 99 -368 -158 -397 -60 -221 -13 -162 -132 -109 -288 -97
3746 -97 -14 90 -177 101 -9 -72 168 -413 274 -156 150 -213 137 535 -254 488 -118 183 26 378 230
3767 230 -141 482 -104 634 71 419 68 166 220 -107 518 -119 394 -91 -93 47 158 181 -85 267 -158 169
3789 169 -109 32 235 -246 195 -125 11 0 -268 -255 -146 -81 -583 27 -150 72 -270 -312 -231 -287 -273 -416
3811 -416 -198 -254 216 -173 181 -265 -113 -55 -323 11 -242 98 -51 -181 -84 -95 267 -142 400 -104 163
3832 163 43 108 160 -265 487 -223 265 -16 259 375 -3 450 53 271 -87 266 255 132 319 -82 347
3853 347 -200 247 -332 151 174 -132 66 -255 140 -211 223 81 -27 177 -110 242 -111 -217 -260 -108 -166
3874 -166 -561 139 -223 -111 -212 81 -443 -93 -11 -298 66 -447 -114 -444 -424 -333 -165 -273 -131 -109 -448
$$ packed form
3725G9J58m54M58m43K61k79K30j30j13L32m67K10k39L37j61K08j49L0K3j79J91
3746i7Q3J04k67K78j10o3K40n81O87m30L06l63L50L98p89P42o06L01j57L52j48
3767B30l71O23n86P38n63L48l51R8N4l27O25o37N13m85kJ40J11K3k66L52m25L27
3789A69k78J41K03m81M41l20J36j1k68J3J09O5n02O10j77K22l42m2Q1n6J4j43
3811d16K18n6M70l89L54m46J52N8k68L34k53L40j49j30R7j1L62m09N42n04K67
3832A63j20O5N2m25P52p10M88k81K75J16l78M53l97K18l58L53j1j23J87m01M29
3853C47n47M47n79M83K3l06J98l21L95l51M34j42j08K04k87L52l53j06m3J52n8
3874a66l95P00l62J12j01K93n24L50Q2k87L64n13L33l30K0R1J68j08J42K2l39
$$ plain form
3895 -448 210 -224 14 -194 -90 -97 -8 -121 -203 334 -111 280 7 236 -52 -150 557 -134 156 -181 501 236
3917 236 153 485 213 577 173 443 195 170 623 -194 663 -97 201 220 -128 -1 86 330 -251 0 -59 -7
3939 -7 70 194 45 -284 89 -159 10 -260 -384 -138 -240 -51 -441 127 -357 -53 -475 -66 -113 -314 238
3960 238 -213 102 -467 -10 -317 109 -59 -132 -110 -391 203 -306 292 12 152 25 -338 399 -281 373 -22
3981 -22 -68 -28 24 249 9 434 -231 437 118 208 456 -198 572 -201 425 -1 163 221 -331 590 -263 395
4003 395 57 490 215 -5 282 -91 198 251 305 -92 -182 221 -188 135 -126 202 -100 -211 86 -285 86
4024 86 -415 -261 -416 -306 -271 -10 -221 -44 -118 -74 115 -291 52 -486 -75 -369 96 35 -407 226 -482 162
4046 162 -187 208 -279 -130 112 -133 348 -265 227 -318 248 134 -364 516 3 453 86 262 481 -123
$$ packed form
3895d48O58m34K38k08J04pQ9j13q2N37m45L91k73K29k88r8P07o91K90l37O82k65
3917B36q3L32k72L64m04K70k48k5M53q17Q57p60K98J9l48J27Q7K44n81K51n9N2
3939gP7J24j49l29L73k48J69k70j24K46j02J89l90N68m84L04m22M09m7k01N52
3960B38m51L15n69M57l07M26j68p3K2k81N94n09N98k80J40j27l63P37o80O54l95
3981b2m6M0N2K25k40M25o65O68l19R0K48o54P70p73O26m26J64N8n52R21q53O58
4003C95l38M33k75k20K87l73K89N3N4l97r0M03m09L23k61L28l02j11K97l71L71
4024H6n01J54j55J10L5K61k11J77p4M4J89m06L43n38M11k94M65o1m42O33p08O44
4046A62l49L95m87J49K42k45M81o13M92n45N66j14m98Q80n13M50l67J76K19o04
$$ plain form
4066 -123 593 -215 606 -66 227 419 35 413 13 623 -45 341 71 167 245 212 316 -68 230 -74 -24
4087 -24 -18 -215 56 -11 28 -215 -35 -173 37 -134 -38 -410 -367 -226 -488 -17 -228 8 -609 22 -205 -381
4109 -381 -119 -698 -114 -784 -175 -243 -198 -121 -443 194 -384 21 -74 -61 179 -349 236 -362 268 -80 249 123
4131 123 -356 380 -376 591 -232 433 175 -6 389 79 654 -56 427 71 420 220 111 269 -3 642
4151 642 97 280 209 149 341 -128 177 -159 306 -167 90 40 46 -115 3 145 -175 256 -361 169 -220 3
4173 3 -441 -330 50 -672 165 -457 8 -153 -108 -247 -467 151 -535 118 -554 -181 39 -358 77 -753 217
4194 217 -353 248 -122 -185 7 -439 219 -388 72 56 -66 127 -142 342 65 250 172 245 154 168 295 -42
4216 -42 572 13 190 321 257 183 -77 293 -67 208 96 293 -170 436 8 201 320 89 399 -7 -22
$$ packed form
4066a23P16q08Q21o72K93J92l84L78m00O10o68L86k70R6P8l3J04l84K98l04N0
4087b4Oj97K71o7L9k43J80j38K10j71R6l72M3J41k62M71k11K36o17O31k27j76
4109c81K62n79N84o70O09o8M5P7l22O37n78M05r5J3K40n28N85n98O30l48L29j26
4131A23m79P36p56R67q23O65k58j81L95l10N75p10M83l56L49k00j09J58k72O45
4151F42n45J83p1o0J92m69L05l36M65m73K57n0Oj61J18J42l20M31o17N30l89K23
4173Cm44J11L80p22Q37o22M65j61M5j39k20O18o86O53o72L73K20l97M35q30R70
4194B17n70O01l70o3J92m46O58o07M60j6j22J93k69M84k77J85p8P3r1J4J27l37
4216d2O14n59J77J31o4p4k60L70l60K75j12J97m63O06m28J93J19k31L10m06j5
$$ plain form
4237 -22 -135 455 43 -163 285 -428 459 -192 279 -280 -327 71 -516 74 -505 -103 -611 -277 -221 -544 -2
4258 -2 -708 -141 -421 -208 -300 -228 -53 -568 169 -375 168 -201 -71 76 -112 -73 -567 -60 -347 126 -216 2
4280 2 419 -54 267 -152 524 -57 334 41 128 108 -90 379 -76 418 179 371 282 478 534 212 599 -85
4302 -85 374 -46 270 74 39 289 -269 354 -103 491 131 207 120 -174 421 -462 517 -264 53 -8 -352 69
4324 69 -583 433 -505 59 -81 -117 -71 -776 125 -677 22 -727 -28 -242 -604 -35 -644 44 -475 -125 -348
4345 -348 -117 131 -475 56 -462 -49 -95 -44 61 -68 45 -19 250 -37 74 119 279 277 87 256 -72 278
4367 278 -130 579 27 94 399 135 388 -23 752 39 527 45 255 267 -165 526 -51 329 412 194 -4
4388 -4 -47 560 -101 292 -140 -56 -166 -18 76 -346 21 -507 273 -213 -173 -191 -345 -46 -637 95 -294 -8
$$ packed form
4237b2j13N90m12k06M48p13Q87o51M71n59m7L98n87N90n79M02n08L34N6l23N42
4258bp06N67k80K13r2P2J75n15P37n44N43l69J30J47j88L9m94N07k87M73l42K18
4280BM17m73L21m19O76n81L91k93Q7k0j98M69m55M94k39J92q9J96N6l22L87o84
4302h5M59m20L16j96l5K50n58O23m57N94l60P6q7k94N95q83R79p81L17o1l44M21
4324F9o52J016r38N64j40l6M6p05R01q02O99p49O99k14l62N69o09O88n19L50k23
4345c48K31K48o06N31n18M13m6N1J05j29J13o4K69k87J11M5J60kj90J69l28L50
4367B78m08P09n52O7L05k64K53m11P75p13M88m82K10J2m32O91n77L80Q3k18j98
4388dm3O07o61L93m32Q4j10J48R4m22L67n28P80m86M0j8j54K99n91P32l89K86
$$ plain form
4410 -8 -521 -376 -411 -383 -27 -605 28 -263 64 -240 -84 -278 -389 -337 -415 64 -144 148 -312 -154 102 -51
4432 -51 375 22 216 -13 138 -1 91 179 69 601 -156 526 98 346 571 94 679 -280 868 210 437
4453 437 321 35 584 98 616 -91 499 56 363 148 -100 615 -332 619 -260 270 -212 -27 254 -297
4473 -297 213 -522 79 -283 -142 -252 -297 70 -540 213 -298 -63 -449 -254 -21 -529 -61 -636 -137 -658
4493 -658 -134 -336 -326 -77 -615 -307 -650 -27 -252 -48 -147 -237 429 -189 201 -65 434 128 215 362 -3
4514 -3 259 -133 547 5 291 287 159 308 162 702 -212 550 192 524 435 61 621 137 537 -134 397 -46
4536 -46 65 197 -236 312 -641 338 -234 -47 236 -378 218 -578 242 -423 32 -295 -94 -203 -569 73
4556 73 -650 316 -565 -396 -227 -112 38 -481 153 -862 -86 -601 -145 -164 -219 -102 -467 -28 -186 70 -429
$$ packed form
4410hn13J45l5K8L56n78O33k91L27l04J56j94j11N2p8M79k08K92m60J58K56j53
4432e1M26l53J94k29J51j39R2Q8j10N32p57O82m28K48K25m77N85r59J148o58K27
4453D37j16k86N49m86N18p07N90m43L07k15k48P15r47R51q79N30m82J85K81n51
4473b97N10p35O01l62J41j10m5L67o10P53n11K35l86J95K33n08M68n75M99n21
4493f58N24k02J0K49n38L08l43O23k25K04r9r0O66o18L90k66M99l06Q7J47l65
4514cK62l92O80n42K86mj28J49j46N40r14P62l58L32q9l74N60m84M00o71N31m43
4536d6J11J32m33N48r53R79n72J87K83o14N96p96Q20o65M55l27K01j09l66O42
4556G3p23R66q81J69J69J15J50n19O34j015P76n15M56j9n5J17l65M39j58K56m99
$$ plain form
4577 -429 -276 183 -280 211 -325 251 -154 232 55 -59 -44 125 294 -168 537 164 684 361 477 418 116
4598 116 776 -80 516 210 379 475 -164 520 -90 702 -134 375 287 41 253 -220 451 -119 132 63 127
4619 127 137 -440 295 -546 382 -342 76 80 -241 2 -440 -60 -336 -149 -174 -324 24 -463 11 -161 -333
4640 -333 -296 -151 -178 -39 -198 -142 324 -104 -147 -221 44 -98 57 -183 -200 102 -318 298 -290 -28 46 77 175
4663 175 -173 430 -98 390 -26 551 237 54 710 -180 603 47 351 399 241 692 -377 564 -105 624
4683 624 84 212 324 -20 689 -434 303 -137 198 166 -124 76 -677 480 -324 249 -228 -31 57 -463
4703 -463 79 -513 -92 -378 -106 -262 -128 -150 -423 -69 -294 -281 -426 -217 -205 80 -183 -352 -19 -383 -9
4724 -9 -437 -203 -501 -288 -136 -23 116 -560 91 -82 253 56 -88 231 -389 614 -308 172 32 276
$$ packed form
4577d29J53M59m63M91n36N76m05L86j77j14J5J69J69m62P05l73N20l23J16n9l02
4598A16O60q56N96l06J69R6o39O84o10P92q36N09q8k46K12m73O71n70K51o9O4
4619A27J0n77P35q41R28p24M18Ml21K43m42L80k76J87k5j50L48m87M74j72j72
4640c33L7J45k7J39j59N6M66m28m3p4K65j42J55k40j7L02m20O16n88K62P4L1R8
4663A75l48O03n28M88m16N77l14j83O56q90P83n56L04M8j58M51j069R41o69P29
4683F24n40J28J12l44P09j123P37m40L35l2k90K00p53J157q04N73m77J97Q8n20
4703d63N42n92M21k86K72j56J34k2k73L54k25J3j45K09J2K85k63j69L33l64L74
4724im28K34k98K13J52J13J39o76O51j73L35j97j44L19o20J003r22M80j40K44
$$ plain form
4744 276 227 -85 489 -232 488 93 323 237 33 652 -356 735 3 600 355 287 564 -286 427 -91
4764 -91 255 -96 10 -40 -458 498 -186 485 -304 -100 -52 -50 93 -130 139 -322 -206 -539 -92 -213 44 -356
4786 -356 -475 -33 -613 0 -420 -91 -363 23 -15 -350 -95 -585 -104 -449 77 -298 -170 -78 -384 375 -541
4807 -541 179 -262 60 162 -299 253 -423 463 -448 262 234 -126 461 -399 550 -151 590 60 84 478 -293
4828 -293 756 76 740 182 332 260 -222 392 -216 320 -102 -8 11 144 224 37 424 -426 325 4 110
4849 110 -30 -21 -75 -148 351 -47 -32 -311 -15 -406 -318 -203 -376 79 -305 129 -301 25 -170 -251 234 -584
4871 -584 104 -494 322 -423 -81 1 -250 106 -695 296 -377 165 -88 -139 263 -280 476 -585 362 -50
$$ packed form
4744B76m9l12N74p21P20l95K30q6k04O19j008J091p32N97k45o8K77q50P13n18
4764i1L46l51J06n0m18R56o84O71p89K04M8KJ43k23K69m61J16l33M47j21K57m00
4786c56j19M42n80O13m20L29k72L86l8l35K55m90M81l45N26l75J28R2l06P59r16
4807e41P20m41L22J02m61N52o76Q86r11P10k8l60N87q60R49p01P41n30K4L94p71
4828b93J049o80O64n58J50p2m82O14o08N36m22R4J9J33Q0j87L87q50P51l21J06
4849A10j40Rn4p3M99l98J5k79K96l91Q8J15j73M55l84M34m30L26j95q1M85q18
4871e84O88n98Q16p45L42Q2k51L56q01R91o73N42k53n1M02n43P56j061R47m12
$$ [...]
8191C6
##END NTUPLES=NMR FID
##END=
