##TITLE=1H_SR4_K_TFA
 CDcl3, 8 sc, 
 23.12.2019
##JCAMPDX= 6.0         $$ Bruker NMR JCAMP-DX V2.0
##DATA TYPE= NMR FID
##DATA CLASS= NTUPLES
##ORIGIN= UXNMR, Bruker Analytische Messtechnik GmbH
##OWNER= root
$$ XWIN-NMR		Version 3.5
$$ Mon Dec 23 14:25:05 2019 Russian Standard Time (UT+4h)  she@DPX200
##.OBSERVE FREQUENCY= 200.1315
##.OBSERVE NUCLEUS= ^1H
##.DELAY= (6, 6)
##.ACQUISITION MODE= SIMULTANEOUS
##.ACQUISITION SCHEME= undefined
##.AVERAGES= 8
##.DIGITISER RES= 18
##SPECTROMETER/DATA SYSTEM= spect
##.PULSE SEQUENCE= zg30
##.SOLVENT NAME= DMSO
##.SHIFT REFERENCE= (INTERNAL, DMSO, 0, 15.7039)
##AUDIT TRAIL= $$ (NUMBER, WHEN, WHO, WHERE, WHAT)
$$ ##TITLE= Audit trail, XWIN-NMR		Version 3.5
$$ ##JCAMPDX= 5.01
$$ ##ORIGIN= Bruker BioSpin GmbH
$$ ##OWNER= she
$$ F:/spectra/data/she/nmr/H-F/1/audita.txt
$$ ##AUDIT TRAIL=  $$ (NUMBER, WHEN, WHO, WHERE, WHAT)
(   1,<2019-12-23 14:23:54.98 +0400>,<she>,<DPX200>,
      <created by zg, POWCHK disabled, PULCHK disabled
       configuration hash MD5:
       00 E9 B6 7A A2 85 ED C7 34 08 36 98 17 FE 4E 26
       data hash MD5: 16K
       ED 73 57 F8 D2 DE 51 93 B9 52 17 D2 4F 7F B7 C7>)
$$ ##END=
$$ 
$$ hash MD5
$$ 04 FC F7 9E C5 EE E6 24 FB 02 C2 A6 53 61 8E 8F
##$RELAX= 
##$RELAX= 
##$RELAX= 
##$RELAX= 
##$RELAX= 
##$RELAX= 
$$ Bruker specific parameters
$$ --------------------------
##$DU= <F:/spectra>
##$EXPNO= 1
##$NAME= <H-F>
##$PROCNO= 1
##$TYPE= <nmr>
##$USER= <she>
##$AMP= (0..31)
100 100 100 100 100 100 100 100 100 100 100 100 100 100 100 100 100 100 
100 100 100 100 100 100 100 100 100 100 100 100 100 100 
##$AQSEQ= 0
##$AQ_mod= 1
##$AUNM= <au_zg>
##$AUTOPOS= <>
##$BF1= 200.13
##$BF2= 200.13
##$BF3= 200.13
##$BF4= 200.13
##$BF5= 200.13
##$BF6= 200.13
##$BF7= 200.13
##$BF8= 200.13
##$BYTORDA= 1
##$CFDGTYP= 0
##$CFRGTYP= 5
##$CHEMSTR= <none>
##$CNST= (0..31)
1 1 145 1 1 1 1 1 1 1 1 1 1 1 1 1 1 1 1 1 1 1 1 1 1 1 1 1 1 1 1 1 
##$CPDPRG= <>
##$CPDPRG1= <>
##$CPDPRG2= <>
##$CPDPRG3= <>
##$CPDPRG4= <mlev>
##$CPDPRG5= <mlev>
##$CPDPRG6= <mlev>
##$CPDPRG7= <mlev>
##$CPDPRG8= <mlev>
##$CPDPRGB= <>
##$CPDPRGT= <>
##$D= (0..31)
0 1.2 0 0 0 0 0 0 0 0.06 0 0.03 0 0 0 0 0.0002 0 0 0 0 0 0 0 0 0 0 0 0 
0 0 0 
##$DATE= 1577096634
##$DBL= (0..7)
120 120 120 120 120 120 120 120 
##$DBP= (0..7)
150 150 150 150 150 150 150 150 
##$DBP07= 0
##$DBPNAM0= <>
##$DBPNAM1= <>
##$DBPNAM2= <>
##$DBPNAM3= <>
##$DBPNAM4= <>
##$DBPNAM5= <>
##$DBPNAM6= <>
##$DBPNAM7= <>
##$DBPOAL= (0..7)
0.5 0.5 0.5 0.5 0.5 0.5 0.5 0.5 
##$DBPOFFS= (0..7)
0 0 0 0 0 0 0 0 
##$DE= 6
##$DECBNUC= <off>
##$DECIM= 24
##$DECNUC= <off>
##$DECSTAT= 4
##$DIGMOD= 1
##$DIGTYP= 9
##$DL= (0..7)
0 120 120 120 120 120 120 120 
##$DP= (0..7)
150 150 150 150 150 150 150 150 
##$DP07= 0
##$DPNAME0= <>
##$DPNAME1= <>
##$DPNAME2= <>
##$DPNAME3= <>
##$DPNAME4= <>
##$DPNAME5= <>
##$DPNAME6= <>
##$DPNAME7= <>
##$DPOAL= (0..7)
0.5 0.5 0.5 0.5 0.5 0.5 0.5 0.5 
##$DPOFFS= (0..7)
0 0 0 0 0 0 0 0 
##$DQDMODE= 0
##$DR= 18
##$DS= 0
##$DSLIST= <SSSSSSSSSSSSSSS>
$$ [...]
##$SUBNAM2= <"">
##$SUBNAM3= <"">
##$SUBNAM4= <"">
##$SUBNAM5= <"">
##$SUBNAM6= <"">
##$SUBNAM7= <"">
##$SUBNAM8= <"">
##$SUBNAM9= <"">
##$SW= 24.9337058887773
##$SWIBOX= (0..15)
0 0 2 0 0 0 0 0 0 0 0 0 0 0 0 0 
##$SW_h= 4990.01996007984
##$TD= 16384
##$TD0= 1
##$TE= 0
##$TE2= 300
##$TE3= 300
##$TEG= 300
##$TL= (0..7)
0 120 120 120 120 120 120 120 
##$TP= (0..7)
150 150 150 150 150 150 150 150 
##$TP07= 0
##$TPNAME0= <>
##$TPNAME1= <>
##$TPNAME2= <>
##$TPNAME3= <>
##$TPNAME4= <>
##$TPNAME5= <>
##$TPNAME6= <>
##$TPNAME7= <>
##$TPOAL= (0..7)
0.5 0.5 0.5 0.5 0.5 0.5 0.5 0.5 
##$TPOFFS= (0..7)
0 0 0 0 0 0 0 0 
##$TUNHIN= 0
##$TUNHOUT= 0
##$TUNXOUT= 0
##$USERA1= <user>
##$USERA2= <user>
##$USERA3= <user>
##$USERA4= <user>
##$USERA5= <user>
##$V9= 5
##$VALIST= <valist>
##$VCLIST= <CCCCCCCCCCCCCCC>
##$VD= 0
##$VDLIST= <DDDDDDDDDDDDDDD>
##$VPLIST= <PPPPPPPPPPPPPPP>
##$VTLIST= <TTTTTTTTTTTTTTT>
##$WBST= 1024
##$WBSW= 4
##$XGAIN= (0..3)
0 0 0 0 
##$XL= 0
##$YL= 0
##$YMAX_a= 182297
##$YMIN_a= -154854
##$ZGOPTNS= <>
##$ZL1= 120
##$ZL2= 120
##$ZL3= 120
##$ZL4= 120
##$ABSF1= 10
##$ABSF2= 0
##$ABSG= 5
##$ABSL= 3
##$ALPHA= 0
##$AQORDER= 0
##$ASSFAC= 0
##$ASSFACI= 0
##$ASSFACX= 0
##$ASSWID= 0
##$AUNMP= <proc_1d>
##$AZFE= 0.1
##$AZFW= 0.1
##$BCFW= 1
##$BC_mod= 2
##$BYTORDP= 1
##$COROFFS= 0
##$CY= 11.3945322036743
##$DATMOD= 1
##$DC= 2
##$DFILT= <>
##$DTYPP= 0
##$F1P= 16.9975609425685
##$F2P= -3.02152046262296
##$FCOR= 0.5
##$FTSIZE= 0
##$FT_mod= 4
##$GAMMA= 1
##$GB= 0.15
##$INTBC= 1
##$INTSCL= 1
##$ISEN= 128
##$LB= 0.24
##$LEV0= 0
##$LPBIN= 0
##$MAXI= 10000
##$MC2= 0
##$MEAN= 0
##$ME_mod= 0
##$MI= 1.114404
##$NCOEF= 0
##$NC_proc= 0
##$NLEV= 6
##$NOISF1= 3.799351
##$NOISF2= 2.8
##$NSP= 1
##$NTH_PI= 0
##$NZP= 0
##$OFFSET= 15.70392
##$PC= 1
##$PHC0= -10144.12
##$PHC1= 8.800797
##$PH_mod= 1
##$PKNL= yes
##$PPARMOD= 0
##$PSCAL= 0
##$PSIGN= 0
##$REVERSE= no
##$SF= 200.130013532006
##$SI= 16384
##$SIGF1= 3
##$SIGF2= 2
##$SINO= 400
##$SIOLD= 16384
##$SREGLST= <1H.CDCl3>
##$SSB= 0
##$STSI= 0
##$STSR= 0
##$SW_p= 3612.71676300578
##$SYMM= 0
##$S_DEV= 0
##$TDeff= 0
##$TDoff= 0
##$TI= <>
##$TILT= no
##$TM1= 0
##$TM2= 0
##$TOPLEV= 0
##$USERP1= <user>
##$USERP2= <user>
##$USERP3= <user>
##$USERP4= <user>
##$USERP5= <user>
##$WDW= 1
##$XDIM= 8192
##$YMAX_p= 0
##$YMIN_p= 0
$$ End of Bruker specific parameters
$$ ---------------------------------
##NTUPLES= NMR FID
##VAR_NAME=  TIME,          FID/REAL,        FID/IMAG
##SYMBOL=    X,             R,               I
##VAR_TYPE=  INDEPENDENT,   DEPENDENT,       DEPENDENT
##VAR_FORM=  AFFN,          ASDF,            ASDF
##VAR_DIM=   8192,          8192,            8192
##UNITS=     SECONDS,       ARBITRARY UNITS, ARBITRARY UNITS
##FACTOR=    0.0002004,     1,               1
##FIRST=     0,             0,               0
##LAST=      1.6414764,     0,               0
##MIN=       0,             -154854,         0
##MAX=       1.6414764,     182297,          0
$$ Real data points
##PAGE= N=1
##DATA TABLE= (X++(R..R)), XYDATA
0@%%%%%%%%qJ6j6J6k4L2l2M0m8N6o9P7q9J06j23J45j68J92k21K49k82L22l62M06
$$ 0 0 0 0 0 0 0 0 0 -8 8 -8 8 -16 16 -16 24 -24 32 -37 40 -49 57 -66 79 -89 103 -118 131 -151 171 -191 215
32B15m57N11n70O38p09P89q77R71j077J193j319J460j620J795j992K216k473K769
$$ 215 -242 269 -301 337 -372 417 -460 511 -566 627 -692 768 -852 943 -1049 1167 -1306 1463
50A463l114L526m026M647n444O514q030J0365j4481K3921q7169l1422R1094M720
$$ 1463 -1651 1875 -2151 2496 -2948 3566 -4464 5901 -8580 15341 -71828 -103250 -12156 -7436
64g436P8293N1355p9353j64876l0195R3630R3331L8265J7770o3311j30361n1966
$$ -7436 70857 122212 42859 -122017 -152212 -58582 34749 73014 90784 27473 -102888 -154854
76a54854J15745J32023J4572o2394n5808p1239n2216O6659J56972O5741q5329
$$ -154854 -39109 92914 107486 45092 -10716 -81955 -134171 -67512 89460 155201 69872
87F9872j15760m4043Q599M8345Q5467N2700m7432q8886l6494J7389L9958P4705
$$ 69872 -45888 -89931 -81332 -32987 52480 105180 57748 -31138 -67632 -50243 -10285 64420
99F4420O9458l7632j38883q6353N1294J03410N9656J2865l3834q7408o8208L9690
$$ 64420 133878 96246 -42637 -128990 -77696 25714 85370 98235 64401 -23007 -91215 -51525
111e1525J03158M7036l0135m6074m7433m8464J4841J02616Q5033k8646r0458n5081
$$ -51525 51633 98669 68534 22460 -24973 -73437 -58596 44020 129053 100407 9949 -45132
123d5132j1922J3278O3140Q7640J1071r1079q6786J820N9740N8958L8920r159
$$ -45132 -57054 -43776 19364 107004 118075 26996 -59790 -57970 1770 60728 99648 90489
135I0489q1335r3352l272Q9664Q4022J6489l2888n2822n6833k1394M5805P7096
$$ 90489 9154 -84198 -87470 2194 86216 102705 69817 16995 -39838 -61232 -15427 61669
147F1669L5425l2413o8605n3413J638O3250P8695K4390n1384q1414m7279J6371
$$ 61669 97094 64681 -3924 -57337 -55699 7551 86246 110636 59252 -22162 -69441 -53070
159e3070O5972O8402J9874m3881p0386m2710J5986O1461N7672L478n7351o7214
$$ -53070 12902 81304 101178 57297 -13089 -55799 -39813 21648 79320 82798 25447 -41767
171d1767k1237L6926O3995M9849L698n1336p3688l7088L0302P0912N3600m838
$$ -41767 -63004 -26078 37917 87766 91464 40128 -33560 -70648 -40346 30566 84166 79328
183G9328n9406o4641j3047M9036O5312K9875k2597n8412n9052j3725M9757P5074
$$ 79328 19922 -44719 -57766 -8730 56582 86457 63860 5448 -53604 -67329 -17572 57502
195E7502L7036k6337o2027n5978j1812M4826O9744K8943l8387o1999l2727R791
$$ 57502 94538 68201 6174 -49804 -61616 -16790 52954 81897 43510 -18489 -51216 -41425
207d1425M3986O0151L1210m0099q4216m6451K5167N9046M8750J8851k7534o6425
$$ -41425 2561 62712 93922 53823 -30393 -76844 -51677 7369 56119 74970 47436 -18989
219a8989m6798K4703O7047M0763r340l9228n1907l7137K1993P7384N8041j7263
$$ -18989 -65787 -41084 25963 66726 57386 18158 -33749 -70886 -48893 28491 86532 69269
231F9269o2546n0636j8009J9043N6285N5092n408o3789n3657J92L7853M7358L5412
$$ 69269 6723 -43913 -61922 -42879 13406 68498 63090 -699 -54356 -54164 -16311 31047 66459
244F6459j0346o6860o6027J95N9970N8041K2979j6602n2061n8536q199N5412O0809
$$ 66459 56113 -10747 -76774 -76579 -16609 41432 64411 47809 -4252 -62788 -70987 -15575 45234
257D5234Q700l6170m6769l5038J630N3217O6068J2292n1716o1921k8520J1251
$$ 45234 53934 17764 -29005 -64043 -62413 -9196 56872 69164 17448 -44473 -72993 -61742
269f1742M5744N8659K1516m5409o7676k4058L1218M8269L5501K792m3275o4594
$$ -61742 -15998 42661 64177 18768 -48908 -72966 -41748 6521 42022 44814 1539 -63055
281f3055k4358M3393O6414L3146j2916m3403n3687k6823L0962O5332L5716k2050
$$ -63055 -87413 -44020 22394 55540 42624 -779 -54466 -81289 -50327 15005 50721 28671
293B8671m8882l7970p467L2924N8370L4862k9290o6886m3935P531M5437N3002
$$ 28671 -20211 -58181 -65648 -32724 25646 60508 31218 -35668 -79603 -72072 -26635 26367
305B6367K8958k2827o0940m4591J1619M8822M2727R681k7963n1660l5831J6960
$$ 26367 55325 32498 -28442 -73033 -61414 -12592 30135 39816 11853 -39807 -75638 -58678
317e8678N9459M9230M98m1649n3055l1157J5216N5011N0792J796m4558m8836j6916
$$ -58678 781 50011 50509 8860 -44195 -75352 -60136 -5125 45667 47463 2905 -45931 -62847
330f2847K4980M9013L7153q034n1969n1084p585L8924N3958L2366j0215m8522
$$ -62847 -37867 11146 48299 40265 -11704 -62788 -70373 -31449 22509 54875 44660 -3862
342c862n0741j0646L7122N1345K4063j8767m5018l8411M63M3703N1887J7040l2261
$$ -3862 -54603 -65249 -28127 23218 47281 28514 -16504 -54915 -54452 -10749 41138 58178 25917
355B5917n3201l5652P193M4765N0916J7230l0434n1383l0189J3291M2939L9375
$$ 25917 -27284 -62936 -55743 -10978 39938 57168 26734 -24649 -54838 -41547 1392 40767
367D0767N483l4471m8512k2089K3854N1413L8050j337m0145m9863k2661K2868
$$ 40767 46250 11779 -36733 -58822 -34968 16445 54495 53158 13013 -36850 -59511 -36643
379c6643M9192L6398n506l9108m0053j0305K7870M5397K6146j5727m5859m0098
$$ -36643 12549 48947 43441 4333 -35720 -46025 -18155 27242 53388 37661 -8198 -48296
391d8296l739L5944M7719K4894j6418m5147l8425j455L4479M1655J6375k1573
$$ -48296 -52035 -16091 31628 56522 40104 -5043 -43468 -44923 -10444 31211 47586 26013
403B6013m1342k8063Q627L9776M0268Q459l0716m6665k7701J2465M1614M0053
$$ 26013 -15329 -43392 -34765 5011 45279 53738 23022 -23643 -51344 -38879 2735 42788
415D2788Q022k8411m1561k1153J5520L7867L0325k287l3192l9452j4328K3850
$$ 42788 50810 22399 -19162 -40315 -24795 13072 43397 41110 7918 -31534 -45862 -22012
427b2012M4193L0207n985l7006l9197j3250K2361M0236K6755q011l4252l2205
$$ -22012 22181 52388 46403 9397 -29800 -43050 -20689 19547 46302 38291 4039 -28166
439b8166m338K6626L6652J7598j6468l9111l0911J469L2561L8533J7036j5925
$$ -28166 -32504 -5878 30774 48372 31904 -7207 -38118 -36649 -4088 34445 51481 35556
451C5556l6897k8676Q69K9338L1993Q913k0729l2903j9791J0676L4287L2253L419
$$ 35556 -1341 -30017 -29148 190 32183 41096 20367 -12536 -32327 -21651 12636 44889 48308
464D8308k8221l6591j9185J1789L3913L0669L683k5746l2796j3462J5078L0451
$$ 48308 20087 -16504 -35689 -23900 10013 40682 44365 18619 -14177 -27639 -12561 17890
476A7890K1944m238k8661l1097p965K2264L5138K2433o513l1069l2881r957K0143
$$ 17890 39834 35596 6935 -24162 -32127 -9863 25275 47708 41195 10126 -22755 -32712 -12569
489a2569L2738J8283q837k6840k3800j937K3049L0501J2206j6355l1876k4285
$$ -12569 20169 38452 29615 2775 -21025 -22962 87 30588 42794 26439 -5437 -29722
501b9722J126K5351L1208J3455j4564l0825k1369L073K2080K4996O881j6832k7833
$$ -29722 -28596 -3245 27963 41418 26854 -3971 -25340 -22267 -187 24809 31690 14858 -12975
514a2975j5255R786K7221K4149K316k2212l1245j6161J0801K7596K2999K412j8612
$$ -12975 -28230 -18444 8777 32926 35242 13030 -18215 -34376 -23575 4021 27020 29432 10820
527A0820k5438j1532J2031K5659J6878n998k4012k4770p742J7050L0265J9142
$$ 10820 -14618 -26150 -14119 11540 28418 22420 -1592 -26362 -34104 -17054 13211 32353
539C2353p075k5769k3766o340J3270K4767J7004n868k4800k0480R4J8411K3109
$$ 32353 25278 -491 -24257 -30597 -17327 7440 24444 18576 -6224 -26704 -26610 -8199 14910
552A4910J1678j1185k8568k2451L104K3880K4012J0094q897k3293k1979OK2143
$$ 14910 26588 15403 -13165 -35616 -32512 -8632 15380 25474 16577 -6716 -28695 -28689 -6546
565f546K1327K358j4192k0292j3374M815K4192K4903K152k0720k4143j2231M260
$$ -6546 14781 17139 2947 -17345 -30719 -25904 -1712 23191 25343 4623 -19520 -31751 -27491
578b7491K0244K4951O203k0577k5005n890J2385J7681J4863M43j9653k6577n411
$$ -27491 -7247 17704 23907 3330 -21675 -27565 -15180 2501 17364 17807 -1846 -28423 -33834
591c3834J9165K3805J2208j524j5844k5537j3635J5657K7405J1215r250j5618
$$ -33834 -14669 9136 21344 19820 3976 -21561 -35196 -19539 7866 19081 9831 -5787
603e787j4699o055J4224K7857J3259j6649k6834j3744J128J3714K4167J6518j0316
$$ -5787 -20486 -26541 -12317 15540 28799 12150 -14684 -28428 -27300 -13586 10581 27099 16783
616A6783k8027j4752P043J4609J3161Q812o169k4671j8743R661K6028J7040R89
$$ 16783 -11244 -25996 -18953 -4344 8817 17629 11460 -13211 -31954 -22293 3735 20775 21764
629B1764j1500k3720k0590N295K9421K1068m045j6351j3427r462L455K1794K0960
$$ 21764 10264 -13456 -34046 -28751 670 21738 17693 1342 -12085 -21547 -18092 3702 24662
642B4662n584k6059j7289p22R000J8532K2241K114k5378k6296j433J5023J5081
$$ 24662 19078 -6981 -24270 -24992 -15992 2540 24781 26895 1517 -24779 -26212 -11189 3892
655C892J2179J999j8844k6670j745K6202K3326J038j1592j6973j8880n356K1828
$$ 3892 16071 18070 -774 -27444 -29189 -2987 20339 21377 9785 -7188 -26068 -31424 -9596
668i596K8311N967j5188j6098j0391m096J1999K4388R763j9004k4851p261R144
$$ -9596 18715 24682 9494 -6604 -16995 -21091 -9092 15296 25059 6055 -18796 -26057 -16913
681a6913J6789K0353R044j7492l0827j2151J4426K0363J3117K925j2444k2572
$$ -16913 -124 20229 29273 11781 -19046 -31197 -16771 3592 16709 19634 7190 -15382
693a5382j0666J5708K3768Q151p042j3849j7752j0798J2156K9274J6568r226k0486
$$ -15382 -26048 -10340 13428 21579 14537 688 -17064 -27862 -15706 13568 30136 20910 424
706D24j5591o712Q818K4039J6973j0707k5784j3117O784J6026J6704J0844r713
$$ 424 -15167 -21879 -13061 10978 27951 17244 -8540 -21657 -14873 1153 17857 28701 18988
719A8988k7576j8314P373K1179J6341N185n683j8782j7970K902K1756J7878o22
$$ 18988 -8588 -26902 -19529 1650 17991 23176 17493 -1289 -19259 -16357 5399 23277 22655
732B2655j4531j8484j1817P392K4768K0691j853k0573k0663q493Q140K0817J7417
$$ 22655 8124 -10360 -22177 -14785 9983 30674 28821 8248 -12415 -20908 -12768 8049 25466
745B5466k619j8749j6652k198J1071J7725J3168n110k2536j9470l75J6850J9245
$$ 25466 22847 4098 -12554 -14752 -3681 14044 27212 22102 -434 -19904 -20279 -3429 15816
758A5816J1897l569k0511k1538j371J9104J9134L555j0036j6757j4114K245K1274
$$ 15816 27713 24144 3633 -17905 -19276 -172 18962 22517 12481 -4276 -18390 -16145 5129
771E129K0797J188j6531j8591j1371K020J7471K0466N222j5554j9356p348O946
$$ 5129 25926 27114 10583 -8008 -19379 -17359 112 20578 25800 10246 -9110 -16458 -9512
784i512J5606J4782M19j7777k0904m637J3606J8873J3623r98j7496k2374n930
$$ -9512 6094 20876 21295 3518 -17386 -22023 -8417 10456 24079 23081 5585 -16789 -22719
797b2719J4683J7960P833l912j2981j5904m258J6067K0813M796j1836j6348j2690
$$ -22719 -8036 9924 17757 13845 864 -15040 -19298 -3231 17582 22378 10542 -5806 -18496
810a8496l429J4258K3429R635j3436k0365q032L703R737J4204Q060j1465k1554
$$ -18496 -21925 -7667 15762 25397 11961 -8404 -16436 -12733 -2996 11208 19268 7803 -13751
823a3751q344J0927J6551J1030K609r823k1481j3398J0269K0618J1224l131r680
$$ -13751 -22095 -11168 5383 16413 19022 9199 -12282 -25680 -15411 5207 16431 13300 3620
836C620j2416r189P250J9103J1567q384j6254j1478k660Q544J8679J4246o582
$$ 3620 -8796 -17985 -10735 8368 19935 11551 -4703 -16181 -18841 -10297 8382 22628 16046
849A6046j8896j2727N80Q142J2007J0791l620j8060j3406N486J5727J0994K797
$$ 16046 -2850 -15577 -14997 -6855 5152 15943 12323 -5737 -19143 -13657 2070 13064 15861
862A5861o088j6463j4892L284J9115J3695k65p362r893j0707j260J4775J5542
$$ 15861 9773 -6690 -21582 -18298 817 14512 14247 6885 -3008 -13715 -14975 -200 15342
875A5342k014j3902j1492k566M480J2567J5377O76j6595j6803k344Q246J0527
$$ 15342 13328 -574 -12066 -14632 -10152 2415 17792 18468 1873 -14930 -17274 -9028 1499
888A499R439K026j0954j5192j963J2478J1589L116m180j0114j2452l932J1893
$$ 1499 10938 12964 2010 -13182 -15145 -2667 8922 12038 7858 -2256 -14708 -18640 -6747
901f747J6643N769o767j0993j0077l504Q348J4615N317r016j2474m794L520Q936
$$ -6747 9896 15665 8898 -2095 -12172 -15676 -7328 7287 12604 3588 -8886 -13680 -10160 -1224
915a224J1059M344r639j5349p206N388J0262R300M638n578j3280p752N331J1384
$$ -1224 9835 14179 4540 -10809 -18015 -12627 -2365 6935 11573 5995 -7285 -15037 -9706 1678
929A678O121j002o880j0665o126O451J4440R275l313j0503j0212m624M484J1152
$$ 1678 7799 6797 -83 -10748 -16874 -10423 4017 13292 9979 -524 -10736 -15360 -10876 276
943B76R313k322r980p376k40N500Q326O420l168j1654r971K37R232J0799N810
$$ 276 9589 7267 -2713 -10089 -10329 -4829 3497 9917 6749 -4905 -14876 -14639 -5407 5392 11202
958A1202k404j0083j0202o31Q273R077K814m530q639o167J495R921J0049J542
$$ 11202 8798 -1285 -11487 -12118 -3845 5232 8046 3516 -5123 -11290 -9795 126 10175 11717
972A1717p505j0542o064J343Q836J0255L292n988r116n061K260Q184P111P05p660
$$ 11717 4212 -6330 -12394 -11051 -2215 8040 11332 5344 -3772 -8833 -6573 1611 8722 9427 1767
987A767r893l374O254J0200P656k87q202j0136m725M054R125O969l86o856p299
$$ 1767 -8126 -11500 -5246 4954 12610 12323 4121 -6015 -10740 -6686 2439 9408 9022 2166 -5133
1002e133k008N079R279N028l537r072q706j355P398J0469N872k364q796q715j283
$$ -5133 -7141 -2062 7217 12245 8708 -364 -9070 -10425 -3027 7442 13314 10950 2154 -6561 -7844
1017g844N561Q813M029m039p818o290J461P838Q695L164n826j0454p146J201Q045
$$ -7844 -2283 6530 10559 6520 -1298 -7588 -6127 1711 10406 13570 7744 -2710 -9856 -8655 -610
1032f10Q968L572m303q989n832K208P449P096M11o825r080m456M512R982P757
$$ -610 8358 11930 7627 -1362 -7194 -4986 2463 9559 9970 3145 -5935 -10391 -5879 4103 11860
1047A1860L02p636r199n193K954Q834P470n35o938p442k346M855Q940N382l087
$$ 11860 12162 4526 -4673 -9866 -6912 1922 9392 8857 1919 -5523 -7869 -3014 5926 11308 8221
1062H221q853q919j608O191J0272O509j867q601q934j339O301P934L721l301q636
$$ 8221 -632 -9551 -11159 -4968 5304 11813 9946 1345 -7589 -8928 -2627 5307 9028 5727 -2909
1077b909o792J098Q915R146K735n639j0320o953L38Q346R679L310n582q864n198
$$ -2909 -9701 -8603 312 9458 12193 6554 -3766 -10719 -10381 -2035 7644 10954 5372 -3492 -8690
1092h690K559P654P141R19p564r597m160N257R546Q451J28p535j0313m828M384
$$ -8690 -6131 1523 8664 9583 2019 -7578 -11738 -6481 3065 11516 11644 4109 -6204 -11032 -6648
1107f648R160O450q99p000p889k152N834R593N612l825r433q673j480P160J0313
$$ -6648 2512 8962 8063 1063 -6826 -8978 -3144 6449 12061 8236 -1197 -9870 -11350 -4190 6123
1122F123O165l072r327p956n97O736Q248L857m879r362o123K118R123Q895K475
$$ 6123 12288 9216 -111 -8067 -8664 -1928 6320 10177 5298 -4064 -10187 -8069 1054 9949 12424
1137A2424o172j0644p154J928R304Q753J882n774q801n058L359Q942P166j359
$$ 12424 6252 -4392 -11546 -9618 -314 8439 10321 4547 -4254 -9312 -5953 2989 10155 8796
1151H796q026r337l145M922J0599P665r52q684r548l278M877R005N871k132q408
$$ 8796 770 -8567 -11712 -6790 3809 11474 10522 1838 -7710 -10988 -6111 2894 8765 6633 -1775
1166a775p511n44P400Q748M001m158j0124q231L8Q289R640M132m387q470p268
$$ -1775 -9286 -9830 -2430 6318 10319 6161 -3963 -12194 -12156 -3867 5773 9905 5518 -2952 -10220
1181a0220N18P894P952J500o564q317m554K423R502R180M85p622j0219m225K509
$$ -10220 -9702 -1808 6144 7644 1080 -7237 -11791 -9368 134 9314 9799 2177 -8042 -12267 -9758
1196i758Q155Q012J166p113q782k511N656P895M892j431q332r151k046P251J0356
$$ -9758 -1603 6409 7575 462 -8320 -10831 -5175 2720 7612 6181 -2151 -11302 -13348 -6097 4259
1211D259N040k453p507q375k285N909R275M107m658p787n250R30O825R159K836
$$ 4259 9299 6846 -661 -9036 -11321 -5412 3863 7970 3312 -4475 -9725 -8795 -1970 7189 10025
1226A0025o151r609n768K211O757Q184L754m786r343m841L830O946N277N39n324
$$ 10025 3874 -5735 -11503 -9292 -2535 5649 9403 4617 -4726 -9567 -5737 1209 6486 7025 1701
1241A701q556m507N576R683O432j769o593p636m528L704Q887O653k425o930n544
$$ 1701 -6855 -11362 -5786 3897 10329 8560 1967 -5669 -10197 -6493 2394 9047 6622 -308 -5852
1256e852r20M275P821N213l645r624o410J196N866P632M704j815q979p248J141
$$ -5852 -6772 -2497 5324 10537 6892 -2732 -9142 -7946 -2080 5552 10256 8441 -538 -7786 -6645
1271f645O978N380R44k812o082n553J933Q788O765q29n667o156n190J077P634
$$ -6645 333 5713 6657 3845 -2237 -7790 -5857 2931 9696 8867 3200 -2956 -8146 -7069 565
1286E65P685L98n840o234j937J928N541N870n76p776o889kM939O112M566J76o552
$$ 565 8250 8648 2808 -3426 -5363 -3435 2106 7976 7400 -376 -7265 -7267 -2328 3784 8350 8526 1974
1303A974q178j799N554N631K132p09m044n718j248O260O935R78m513n686m386
$$ 1974 -6204 -8003 -2449 3182 5314 4605 561 -5157 -6405 -145 6790 7768 3255 -2431 -6817
1318f817q94N261Q102L329m750o613k385N71L281M814K487m645o610j900L470
$$ -6817 -7711 -2450 5652 8981 4231 -2382 -4767 -4196 -915 3899 6386 1741 -4869 -6769 -3299
1333c299N016M080J646m098p584l984L062O149M054j46k448m968l044K886N829
$$ -3299 1717 5797 7443 3345 -4239 -8223 -5161 988 5042 4896 2448 -2520 -5564 -2678 3151
1348C151L034k370m858l475j747K744P088M610k241n566l974r96J599M647M354
$$ 3151 6185 3815 -1043 -4518 -6265 -3521 3567 8177 5936 370 -3604 -4600 -3001 1646 6000
1363F000j211n560l607J002M044L681K057j588o383m781J474N184L984J471q55
$$ 6000 4789 -771 -4378 -3376 668 4349 6406 4818 -1565 -6346 -4872 312 4296 5767 4912
1378D912m174m713K2N014L810m25k730l180k982J299N113N088J23m477m568k559
$$ 4912 738 -3975 -3953 1061 4871 4446 1716 -1464 -4446 -3147 1966 7054 7177 2700 -1868 -4427
1394d427M28M006N377P91l768m665n23K024K856K864J76m323n211m39L242M467
$$ -4427 -3999 7 5384 6175 2407 -2258 -2781 -757 2099 4963 5139 816 -4395 -4834 -1592 2875
1410B875K725P81l879n500k469L379M737J142q33k366l395j815L503N751J256
$$ 2875 5600 6381 2502 -2998 -5467 -2088 2649 3791 2958 592 -2803 -4618 -1115 4636 5892
1425E892l067m389k711j002K113O030L438k861m992k102L83J728L263K839k295
$$ 5892 2825 -1564 -4275 -5277 -3164 2866 6304 3443 -1549 -3651 -3268 -1540 1723 4562 2267
1440B267n596k695K626L908K676J667j783n484m459J448N093K556M05j162l030
$$ 2267 -3329 -6024 -3398 510 3186 4853 3070 -2414 -6873 -5425 -332 2224 2629 1467 -1563
1455a563l370N96N372L573j815m175k545j704N85N075N710o09n254l781o16O55
$$ -1563 -4933 -4337 1035 4608 2793 -1382 -3927 -5631 -5046 29 5739 5130 -124 -3905 -4521 -3866
1471c866K635M310P85n081m842J565L724K842J267K82m301o185q01N471N089Q57
$$ -3866 -1231 3079 3864 -1217 -6059 -4494 -770 2072 3339 3621 -680 -6865 -7666 -2195 2894 3751
1487C751j099k337m055k015M155N294M45l908l229j248l79L409O184J981m720
$$ 3751 2652 315 -3740 -5755 -1600 3694 4139 231 -2998 -4246 -4625 -1216 4968 6949 2229
1502B229n649j475R80K021M170L412k836o295j552L364L653J797K07k378n749
$$ 2229 -3420 -4895 -3915 -1894 2276 5688 2852 -3443 -4995 -1631 2022 3819 4026 1648 -4101
1517d101l056L790O135K806j419k498l648l465J414N923L632k588m152k379M27
$$ -4101 -7157 -3367 2768 5574 4155 1657 -1991 -5456 -4042 1881 5513 2925 -1227 -3606 -3179
1532c179J241M817M218k224o877m177J256L516L612K994n18n330m720J143M653
$$ -3179 -1938 2879 7097 4873 -2004 -6181 -4925 -1409 2203 5197 4679 -651 -5371 -4228 425
1547D25K967O8j546l979l923J015N714N084k24l783l989k997j68M412N274O4m112
$$ 425 3392 3460 1914 -2065 -5988 -4973 741 5825 5601 1818 -2171 -5168 -5336 -924 4350 4414 302
1564C02l901r15J731M087L526n45m756n743n13L943M525K930j35l979n075j514
$$ 302 -3599 -4514 -2783 1304 4830 4285 -471 -6214 -6727 -2784 1741 4671 4536 557 -4518 -6032
1580f032M017L974J716j982l406l249m69M404N311J371l059n563k887J61L780
$$ -6032 -2015 1959 3675 1693 -1713 -4962 -5431 -1027 4284 5655 2596 -2967 -5854 -5693 -1913
1595a913N219J794k518n118k529J502M023L152M82l672m599k293K767N097L946
$$ -1913 3306 5100 2582 -2536 -5065 -3563 460 3612 4094 422 -4177 -6470 -3703 1394 5340
1610E340%l798m855k542K126M751L338o54l573l958l49L022M549K306j707m763
$$ 5340 5340 1542 -3313 -5855 -3729 1022 4360 3706 133 -3825 -4174 -1152 3397 5703 3996 -767
1626g67m525N04L444M651K276j686l847l616p8L540L817R34k446m014k549J447
$$ -767 -5292 -4788 -1344 3307 5583 3897 50 -3566 -3644 -104 3713 4647 2201 -1813 -4362 -2915
1642b915L958M468Q38l202n115k746J443L922L514J138k651m671j852K486M223
$$ -2915 1043 5511 6349 3147 -1968 -4714 -3271 651 4165 5303 2652 -2019 -3871 -1385 2838
1657B838K078o83l393m257j475K868N485K544j012m099l297j532J941M344K755
$$ 2838 4916 4233 840 -3417 -4892 -2024 3461 6005 4993 894 -2403 -3935 -1994 2350 5105
1672E105j648m203k700Q19K999L530J361k243m447l341Q32L692L904J304j786
$$ 5105 3457 -746 -3446 -2627 372 3902 5263 3020 -1427 -4768 -3936 -244 3660 4964 3178
1687C178l967l085P76M183K637m97k441l124j640J178M218L769n74l815l623j336
$$ 3178 -789 -3874 -3098 1085 3722 3225 784 -2340 -3980 -2802 1416 5185 4611 796 -2827 -4163
1703d163J298L229L211J90l234l617l05K573K545J809q19l910l391l44L596M145
$$ -4163 -2865 364 3575 3765 531 -3086 -3391 -818 1727 3536 2717 -1193 -4584 -4928 -1332 2813
1719B813J156p91l096l260p31K641L273P20j749k736j555M33K773L418R83l238
$$ 2813 3969 3178 82 -3178 -3909 -1268 2005 2725 976 -1760 -3315 -2882 -109 3309 4292 1054
1735A054l548j814J111K402K922J376j584l492j319J227K508J528J1k113l057
$$ 1054 -2494 -4308 -3197 -795 2127 3503 1919 -1573 -2892 -1665 843 2371 2382 269 -2788
1750b788r87J952L871K008j047k091k625j819J378L210K122o86k306k001M4J616
$$ -2788 -3775 -1823 2048 4056 3009 918 -1707 -3526 -2148 1062 3184 2498 192 -1809 -1765 -149
1766a49K245J595j106l668j961M88K028K391J718n78k670k277p7J775K068M10
$$ -149 2096 3691 2585 -1083 -3044 -2556 -528 1863 3581 3003 333 -1944 -2021 -246 1822 2232
1782B232r18k026j565L90K759K530n7j999k442j680K83K541K112P58j564k229
$$ 2232 1314 -712 -2277 -1887 872 3402 3345 1346 -1096 -2776 -2493 48 2160 2918 1354 -875
1798h75r35O73K046J721q04j897k073o19J469K441J574M3j806k781q56J151J997
$$ -875 -1810 -1137 909 2630 1826 -71 -2144 -2763 -1294 1147 2721 2764 958 -1823 -2679 -1528 469
1815D69R76L23j960j592l13J186K321Q87q81k393k203PJ631K093J721q68j727
$$ 469 1445 1768 -192 -1784 -2097 -911 1410 2297 1416 -977 -3180 -3173 -1542 551 2272 1404 -323
1832c23j839l35J199J804R83j293j869j040K63K272J344J194j522k687j489L62
$$ -323 -2162 -2497 -1298 506 1489 196 -1673 -2713 -2450 -178 1166 2360 838 -1849 -3338 -2976
1848b976J734J766J037p35j899j404M42J849J631n10j407j729j082J319K320J650
$$ -2976 -1242 524 1561 826 -1073 -2477 -2035 -186 1445 935 -472 -2201 -3283 -1964 356 2006
1864B006k34j297k311j432L13K375J905n5j502j418o01J143J908J323m38k374
$$ 2006 1772 475 -1836 -3268 -2955 -580 1325 1270 -232 -1650 -2251 -1108 800 2123 1685 -689
1880f89k033o01J587K427J654j90j770k259l08J211J853N53l56j950j624L58J988
$$ -689 -2722 -3323 -1736 691 2345 2155 385 -1874 -2182 -971 882 1435 1079 -871 -2495 -2137 -149
1897a49K260Q53j289j987k223j57J823K515J054j301j914r37J66J709J762K98
$$ -149 2111 2964 1675 -312 -2535 -2692 -869 1646 2700 1399 -515 -1452 -1286 423 2185 2483
1913B483j728k235j233R81K621J759L99j473k683j473J235J621J803j38j536j703
$$ 2483 755 -1480 -2713 -1732 889 2648 3047 1574 -1109 -2582 -1347 274 2077 1939 403 -1300
1929a300q32J500K500J124r38k140k160p01J486K813K025r37k279j710q67J332
$$ -1300 -2132 -632 1868 2992 2054 -86 -2246 -2947 -1461 1352 3377 2440 161 -1549 -2416 -1084
1945a084K428Q65j015k436j479O61J963K111R79q56l275k088Q52J667K295N25
$$ -1084 1344 2209 1194 -1242 -2721 -2060 -97 2014 2993 2137 -1138 -3226 -2374 -707 1588 2113
1961B113q84k152k023J025K448J648k18j978k026j424J246K936K027j07k027k214
$$ 2113 1229 -923 -2946 -1921 527 2175 1957 -21 -2047 -3471 -2225 711 2738 2631 604 -1610
1977a610j194R38K095J920m00k253j628j52J780K037J319n92l106k498N27K221
$$ -1610 -2804 -1866 229 2149 1749 -504 -2132 -2284 -504 1533 2852 2260 -846 -3344 -2817 -596
1993e96J889J795j079j820k627J30K387K042J88j296j630k136P99K498K758K96
$$ -596 1293 3088 2009 189 -2438 -2308 79 2121 2309 1013 -617 -2753 -1954 544 3302 3598
2009C598k228k900o50q1K484K402L6j862j875n99J312J769J475M55k741k628p86
$$ 3598 1370 -1530 -2180 -2261 223 2625 2661 799 -1076 -1675 -363 1406 2881 3336 595 -2033 -2819
2026b819K397K215J450K46k175k587r32J842K458P96j133j716j630j23J894L082
$$ -2819 -422 1793 3243 3489 1314 -1273 -2205 -363 2095 2891 1758 42 -1588 -1711 183 3265
2042C265P52k094k479j500J83J505K576J811j838l009j110J381J266J618N72j533
$$ 3265 4017 1923 -556 -2056 -1873 -368 2208 4019 2181 -828 -1938 -557 709 2327 2899 1366
2058A366l148j004K019K364J477j12j503k357k160J238L325J365j279j287j294
$$ 1366 -1782 -2786 -767 1597 3074 2962 1459 -898 -3058 -1820 1505 2870 1591 304 -990
2073i90q87J225K258J804j631k783j261q7J119K638J371n89k949j997Q50J567
$$ -990 -1877 -652 1606 3410 1779 -1004 -2265 -2352 -1233 1405 2776 2187 -762 -2759 -1909 -342
2089c42J414L57p07k013j769Q52K823J609k78j265j751j969J28K760K073j95j668
$$ -342 1072 1429 722 -1291 -3060 -2208 615 2224 1946 681 -1070 -3039 -2911 -151 1922 1727 59
2106E9j738j83K41J738J611k66k487j974J64J596J459K005l69k174k292r4J457
$$ 59 -1679 -1862 -1621 117 1728 1462 -1025 -2999 -2835 -1239 220 2225 1856 -318 -2610 -2704 -1247
2123a247J378J029l86j436j673j01K233J880J0j444j498j369L6J785K459L03j308
$$ -1247 131 1160 774 -662 -2335 -2436 -203 1677 1687 243 -1255 -2624 -2588 -803 1656 1959 651
2140F51j536q20K12J069J210J062j976j802k23J129J739J027l5j350j791j091
$$ 651 -885 -1705 -1493 -424 786 1848 -128 -1930 -2153 -1024 715 1742 1707 357 -1434 -2525
2156b525J646J267O27ro43j430l50J017J292P41o95j552j284O9R15K247R99j104
$$ -2525 -879 388 1015 1006 363 -1067 -1417 -400 892 1633 938 -614 -1898 -1829 -914 1333 2332 1228
2174A228j623q40j08P85J330P09o42j685m81L38J252J444r4r86j628j130O55J348
$$ 1228 -395 -1235 -1343 -558 772 1481 839 -846 -1327 -989 263 1707 1613 627 -1001 -2131 -1476 -128
2192a28J231L26p38j158j124O23J491K87n8j114r98k68J020J103R53n30j273q70
$$ -128 1103 1429 691 -467 -1591 -968 523 810 752 -362 -1360 -1628 -608 495 1448 918 -355 -1225
2210a225l14J49J194J059l16r07p26j80Q08P18O53m05j285j288N37J205R86O11
$$ -1225 -1539 -1390 -196 863 547 -360 -1086 -1266 -458 260 913 508 -777 -2065 -1528 -323 663 1274
2228A274m07j062j401L50N97J076m5l70r08n51J98J146J437m14q41o94q19kQ81
$$ 1274 867 -195 -1596 -1246 -649 427 382 12 -896 -1447 -1249 -103 1334 920 79 -615 -1434 -1436 -555
2247e55J076M01n57p60j17k09Q15M18L24r47j058Q9O84Q86M94K96o69j387m61
$$ -555 521 922 365 -395 -512 -721 94 512 836 -111 -1169 -1080 -396 490 984 1280 611 -776 -1237
2266a237O08J029N14j06l21m36q52O17J428J80n85o06m78n56M15J438P26m88p58
$$ -1237 -629 400 914 808 487 51 -801 -184 1244 1424 839 233 -245 -801 -386 1052 1778 1290 532
2285E32q03K58M6N37Q34l90r36n79O60N70L24N22Q6j497o89K20P27P63J11l9m44
$$ 532 -271 -13 33 570 1404 1014 78 -501 159 729 1053 1575 1661 164 -525 -305 422 1185 1296 1257 813
2306H13q39l33J068J097m68p80n73l54K8J165P19L89q10j044l49k89N17R93P50
$$ 813 -26 -359 709 1806 1338 558 -15 -369 -341 824 1543 1932 1122 78 -271 -560 -43 950 1700
2325A700q42j381K09N55O83L50j32q02r51o11P54J402L09q8q04q04j84L00J095
$$ 1700 858 -523 -314 241 924 1274 1142 340 -611 -1222 -468 934 1243 1155 351 -453 -637 -337 758
2344G58N41p93p55l88K8O03P90N93m26j426q81J16O73R62Q94n12j149m63Q7R40
$$ 758 1299 506 -249 -637 -609 -6 784 1377 951 -475 -1356 -1240 -567 395 1289 777 -372 -835 -748 192
2364A92N89P8n09j020r22N63J388Q99J56r31j118o31j0R48R93L97r17q75k10M83
$$ 192 781 859 350 -670 -1592 -1029 359 1258 1414 483 -635 -1266 -1276 -328 665 1062 145 -730 -940 -457
2384d57Q55Q64j56j453j018m12R92J229Q61j72o83j034q93R96J019Q26o27j108
$$ -457 398 1262 1106 -347 -1365 -1777 -785 444 1305 1133 450 -584 -1477 -481 538 1364 737 -371
2402c71q08M38R26J065L55q74j078j210K88J065J542J74n49j103p45K95J156O08
$$ -371 -1179 -741 185 1250 1605 731 -347 -1557 -1269 -204 1338 1512 963 -140 -885 -590 566 1174
2420A174q5p80j155m39O98J072R57J7q85j445n03Q23R24P12l31p34p85k47Q91
$$ 1174 1089 309 -846 -1285 -587 485 1442 1459 574 -871 -1374 -551 373 1085 754 20 -765 -1012 -121
2439a21J244L90o84j265q78l1Q74J200P51n51j488j91k99P43J061K19j058n42
$$ -121 1123 1513 829 -436 -1314 -1345 -471 729 1480 929 -559 -750 -1049 -306 755 974 -84 -626
2457f26q94K48J290J275J90j067j231r36O75N85Q61O52p56j350m29R20R55L90
$$ -626 -1520 -1272 18 1293 1483 416 -815 -1751 -1076 -491 370 1022 266 -1084 -1513 -593 362 752
2475G52k28r81j146l11N70J770N99n63n83j227l09O13J177N95o49j169m41K23
$$ 752 524 -457 -1603 -1914 -1344 426 1025 462 -121 -1348 -1657 -1044 133 728 79 -1090 -1531 -1308
2493a308J107Q52L22r15j224r89M38J343Q94M55o48j273o85P57O56P97j19j111
$$ -1308 -201 651 973 58 -1166 -2155 -1717 -374 520 975 327 -946 -1631 -874 -218 579 460 -651
2511f51j036K68L58R55J221k61r99j017m12K34J207R44m07q16o74M88K97Q01M86
$$ -651 -1687 -1419 -1061 -106 1115 854 -145 -1162 -1574 -1340 -133 811 404 -412 -1086 -598 -301 500 986
2530I86n10j102q97n5J597R11L93m98j090o68R6P77R47j26n82q60n6M87Q12J086
$$ 986 476 -626 -1523 -1578 19 930 1323 825 -265 -933 -837 -60 887 761 179 -681 -737 -250 562 1648
2550A648l84r19q25m30K48P55J260k38o82q72q0O72N11M11l79q45m69k07O91J015
$$ 1648 1264 345 -480 -910 -662 93 1353 1115 433 -439 -519 153 664 1075 696 -149 -618 -825 -134 881
2570H81O10n65m26r92k98R90K40N76m87o22m52L05L81R78q0o10q59m13K93O23
$$ 881 1491 926 500 -492 -790 200 440 1016 529 -93 -545 -240 141 1119 1039 429 -430 -843 -550 73
2590G3O53M02k17r21n34M49J92O06J52p88p39j44P18N95P09n22n06q08k15L99
$$ 73 726 1128 911 -10 -544 -95 97 703 855 67 -672 -816 -98 497 1206 684 178 -630 -845 -446
2610d46O34N46l93m36k0m62O02K56M87n12q76k56M08J04R83Q8j24p40l73N0mN90
$$ -446 188 734 341 -95 -115 -577 25 281 768 256 -620 -876 -468 -364 619 707 583 -157 -530 -480 -484 106
2632A06K0J57l78o69O01N57K09j81k52o85M7J0O16L93p3j97k01l05L44K81K11
$$ 106 126 283 -95 -764 -163 394 603 422 170 -515 -468 -458 158 551 478 281 80 -225 119 400 611
2653F11k09p40j31J37K74N42K19J85o47m60m7K32L93M20l23j07l23k6M28M24j51
$$ 611 402 -338 -469 -332 -58 484 703 888 241 -219 -266 -34 359 779 456 349 26 0 428 852 701
2674G01k64l27m21j63O90P80k84K35m93m36k94O22j86L08k07j78L5P7K59J65L23
$$ 701 437 110 -311 -474 216 996 712 947 454 18 -276 346 160 468 261 83 118 195 454 619 942
2695I42m96n94j68O5M38K66K59l25l40k88K73K51p6P9L2n12j85J48M40J71L68
$$ 942 446 -148 -316 -251 187 453 712 387 47 -241 32 283 207 286 318 -194 -379 -231 209 380 748
2716G48o30l62j15j84M66O7L44l82k98J38k42N16K67m40k19m27K27J46J66P34
$$ 748 118 -244 -359 -543 -77 -10 334 -48 -346 -208 -450 66 333 -107 -326 -753 -526 -380 -214 520
2736E20q7m60o04J7K17L3N3M37k83m69mN54J13L32k18p02j60l46M38N94J40k31
$$ 520 433 -27 -631 -614 -397 -364 -311 126 -157 -626 -630 -76 37 369 151 -551 -711 -1057 -619 -25 115 -116
2758a16l0n13P6K68J35J0k18m88j85N04M83R4L23m2p90m38K11K11L71J32l3n63
$$ -116 -146 -659 -583 -315 -180 -170 -388 -876 -1061 -557 -74 20 343 301 -489 -927 -716 -505 -134 -2 -35 -598
2780e98p8K79M45L19l57Q4n64l02K16Q77J59mj83n57k79K9O93L5n9j39k40m3N56
$$ -598 -676 -397 48 367 10 94 -470 -772 -556 321 480 476 293 -264 -543 -514 179 214 155 16 -224 -267 289
2803B89MM86l93n03k76j97M78L12L43k29j59m50J12J79N64M2m29m04j53j77J014
$$ 289 293 779 386 -117 -393 -590 -112 200 543 314 155 -295 -183 -4 560 602 173 -231 -384 -561 453
2824D53L31m6k79o25n24K53N19N05K91p31n28j1J81M82L13P5p50m23nJ12O33L04
$$ 453 784 738 459 -166 -690 -437 82 587 878 147 -381 -392 -211 271 584 659 -91 -514 -519 -407 226 530
2846E30L75p48n83J92p5M63n7j50j67j18m29N13R38l3o55m69l09Q6M78N51k22
$$ 530 905 157 -426 -234 -309 154 97 -53 -220 -338 -767 -254 684 651 -4 -473 -782 -696 -218 333 111
2867A11J51n71m35L05L67M77j24n30k30n19N56R90k17J06l52o32m66N52M69J16
$$ 111 262 -309 -744 -439 -72 405 281 -249 -479 -998 -442 548 331 437 85 -547 -1013 -461 8 124
2887A24J80m37l60K04J6P68Jj16o04l68j39M08P25K36k98n02l30J75Q3P23p0j60
$$ 124 304 -133 -493 -289 -273 495 496 380 -224 -592 -731 -323 402 638 340 -162 -492 -317 -234 489 419 259
2909B59n93m32P80L90L67Q3m02n05p73M75N87M18l6m05q4k71K53L81M43o30o4
$$ 259 -334 -766 14 404 771 854 452 -53 -826 -351 236 654 618 213 129 -142 111 492 935 305 241
2930B41q93L99L5P87O69l11p18l48j07N42L63J83m60m06j03N1N16N64k75k89l72
$$ 241 -652 -253 -218 569 1238 927 209 -139 -246 296 659 842 382 -24 -127 -76 440 1004 729 440 68
2951F8n44K7P30M80J90j90o30j99L8N50K39O7q29r8n52O43M43L64q5m44o04j47
$$ 68 -476 -449 281 761 951 761 131 -68 -30 520 759 826 -3 -101 -653 -10 433 797 712 268 -336 -483
2973d83N80J60K97l94j81o2J72K51q3K68n87m20l43O07K16M34J80o04k92n7n3
$$ -483 97 257 554 160 -21 -83 89 340 257 525 -62 -482 -825 -218 -2 432 612 8 -284 -341 -394
2994c94J97N60l77k12l38p4O16j00P05j24m94o16j55N77K24o6L9J42n39k10L60
$$ -394 -197 363 -14 -226 -564 -638 -22 -122 583 459 -35 -651 -806 -229 -5 -71 -32 110 -429 -639 -279
3015b79L09L0o2n22j21j30L71M45L61k97l21l38K66q5M32L9j19o16L52RK65K56
$$ -279 30 60 -2 -524 -645 -775 -404 41 402 105 -216 -554 -288 -373 59 98 -21 -637 -285 -276 -11 245
3037B45k57l80q9k15J70L61J17L63j56m76j54M05j13L68Nl89m49K85K96K50J51
$$ 245 -12 -392 -481 -696 -526 -165 -48 315 159 -317 -471 -66 -179 189 194 -195 -644 -359 -63 187 338
3058C38m87ok78R6M5K99k6J59j84p3l2K2L95J88m26J21m56L1J80L13j45j08K47
$$ 338 -149 -155 -433 -337 -292 7 -19 140 -44 -117 -149 -127 268 456 30 151 -305 -274 -94 219 74 -34 213
3081B13l14R6q0K00k40Rk46K61J83R4K89l25j76j68k14J02J06n9K72R9k29J70
$$ 213 -101 -5 -85 115 -125 -116 -362 -101 82 176 465 140 -36 -204 -418 -316 -210 -269 3 102 -127 43
3103D3j52J03j14k27J13j6j85M08LR0j2k14j57j03M31k17k6R8L9k90J47J48J07
$$ 43 -109 -6 -120 -347 -234 -250 -435 -27 -24 66 54 -160 -317 -420 11 -206 -232 -134 -95 -385 -238 -90 17
3126A7l14J97m53Q3j22K50M55j56J25j41n09J12L94n9p4P6j80K22l26K04q2L47
$$ 17 -297 -100 -553 -470 -592 -342 113 -43 82 -59 -568 -456 -62 -121 -195 -119 -299 -77 -403 -199 -281 66
3148F6p5n82L61L0K6K93l6M6k48L0Pj77K92m66O27j64N2o3Q7J25L7j72j36OJ44
$$ 66 -9 -591 -230 -200 -174 119 83 129 -119 -89 -82 -259 33 -433 194 30 82 19 106 231 268 96 -40 -34 110
3173A10m10K01N30k1l42Q9k26O7j2K86j33j04k7K22O6Q7j3P7p5m30M66k97n9K24
$$ 110 -300 -99 431 410 68 157 -69 -2 -14 272 139 35 8 230 296 383 370 447 372 -58 408 111 52 276
3197B76M0k48k14L61Q9K45k04j37K77n22L34K89l38M24k17o4l2k65K87j67J32
$$ 276 316 68 -146 215 304 549 345 208 485 -37 297 586 248 672 455 391 359 94 381 214 346
3218C46k09j1nL31l34K68K93n36j49J07k76M62PJ19k39L8j66K43K57P0l62k03
$$ 346 137 126 121 452 118 386 679 143 -6 101 -175 287 294 413 174 212 46 289 546 616 254 51
3240E1J08l02J47N6J85L8m48j84R2L70m8K95k89m14M3J3K65J80o6R9m87r7R5K82
$$ 51 159 -143 4 60 245 283 -165 -349 -257 113 65 360 71 -343 -300 -287 -22 158 92 191 -296 -393 -298 -16
3264a6K45m56J56k68L49m09L33J44j21j04k39K05jL85N14p24j97j18j39R1M20
$$ -16 229 -227 -71 -339 10 -399 -66 78 -43 -147 -386 -181 -182 203 717 -7 -204 -322 -461 -370 50
3285E0L34m78Q2k18j00rL78K95l41n20N3K9K99J68Q1k85O4k79K49R7J31R1k51
$$ 50 384 -94 -12 -230 -330 -339 39 334 -7 -527 -474 -445 -146 22 103 -182 -118 -397 -148 -51 80 171 -80
3308h0m36K10K73L90Q4K8m33k55K33l1M25J36l68j11m25J35K51o2K99l40K1k70
$$ -80 -516 -306 -33 357 441 469 36 -219 14 -17 408 544 176 65 -360 -225 26 -36 263 -77 -56 -326
3330c26K27M68L7K8k00n92J77J14J95J67mm35M7k40K42L75R7k39l94k38K00K16
$$ -326 -99 369 406 434 234 -358 -181 -67 128 295 291 -144 -97 -337 -95 280 377 138 -256 -494 -294 -78
3352g8K89p7l28k18j88K60L58N7m38L03l25j09K70L13Q7J57m18l4o03L28J39K86
$$ -78 211 134 -194 -412 -600 -340 18 75 -363 -60 -385 -494 -224 89 176 333 -85 -119 -722 -394 -255 31
3374C1L52k69n64j6M42l90P09m65k91J16O8pJ32O1J37l4n83L58k27L97R2p7m37
$$ 31 383 114 -450 -466 -24 -414 295 -170 -461 -345 -277 -284 -152 -91 46 12 -571 -213 -440 -43 49 -28 -465
3397d65J41L4L58L25j85k43o29J37J94K29K20k30Ll30j83K30M51N8K7m00j98p7
$$ -465 -324 -290 68 393 208 -35 -664 -527 -333 -104 116 -114 -111 -441 -624 -394 57 115 142 -258 -456 -533
3419e33M09J90l19J20L38m72k28L21K1M51l98M1Q8m2L00k80L09k54j1m05M29L3
$$ -533 -124 66 -253 -133 205 -267 -495 -174 -153 298 -100 -59 29 -13 287 7 316 62 51 -354 75 108
3441A08P2M7k54J07k44J61K75Q4k41m6j28j1j7K31K38j37L9l09N5J98k24K35J09
$$ 108 180 227 -27 80 -164 -3 272 356 115 69 -59 -70 -87 144 382 245 284 -25 30 228 4 239 348
3464C48m13L09j26L1L67j43l54j56oK94J72J07J57o52k6J80j40L02j02J14l3j23
$$ 348 -65 244 118 149 516 373 19 -137 -143 151 323 430 587 -65 -91 89 -51 251 149 263 230 107
3486A07o1K28j65J22l5J13k32q4L29k1K17m49J76nk37N0K09k87k03l9K21o7K91
$$ 107 46 274 109 231 196 309 77 -7 322 301 518 69 245 240 3 53 262 -25 -228 -267 -46 -113 178
3509A78j47j1J19j62J27j5K7Q8l61J64L10l14j85K18j00P0J40l59J46K16l54K11
$$ 178 31 20 139 -23 104 89 116 204 -157 7 317 3 -182 36 -64 6 146 -213 -67 149 -205 6
3531FK9J96l12K06j83p2j97M34k57j81L47R5k67K29J87n64K13J28k15P6J89k10
$$ 6 35 231 -81 125 -58 -130 -327 107 -150 -331 16 111 -156 73 260 -304 -91 37 -178 -102 87 -123
3553a23J16J40j37L5o4m8m4K14j12K32J85k37j05J59j21j95K17J8k38K34m5nJ19
$$ -123 -7 133 -4 31 -33 -81 -125 89 -23 209 394 157 52 211 90 -105 112 130 -108 126 81 76 195
3576A95k32J12k8P7p7L93p35N27j59Q5p8j6K81j00K2j59m8L00j56M2K19l09K60
$$ 195 -37 75 47 124 47 440 -295 232 73 158 80 64 345 245 267 108 60 360 204 246 465 156 416
3599D16l29J45j6j34Ok66J21K1R9R1K3J21k07j7j85K12L3ok01q9L79k04k99L83
$$ 416 87 232 216 82 88 -178 -57 -36 63 154 177 298 91 74 -111 101 134 128 -73 -162 217 13 -286 97
3623I7N0j95j41K27p5O2L3K6j38k35J28l3J56N4m17J48J9L9j42K71j4M6k4k84
$$ 97 147 -48 -189 38 -37 25 58 84 -54 -289 -161 -194 -38 16 -401 -253 -234 -195 -337 -66 -80 -34 -58 -342
3647c42RJ59M5O0l47P5K99K3L5j16k46J83k30J22p3M88q4j16k19J40j44M6j99
$$ -342 -333 -174 -129 -69 -416 -341 -42 -19 16 -100 -346 -163 -393 -271 -344 144 60 -56 -275 -135 -279 -233 -432
3670d32J32K9J58l3J15m6m4L8k23p9m8M99k65M72k82r8Q4j15P0L53j82k54j72
$$ -432 -300 -271 -113 -146 -31 -77 -121 -83 -306 -385 -433 66 -199 273 -9 -107 -23 -138 -68 285 103 -151 -323
3693c23J13m03M57J99J7R3j05j16q0P1O1K27k98j06L0Q1P4M71m9m42j1k0r3L0
$$ -323 -210 -613 -156 43 60 153 48 -68 -148 -77 -16 211 -87 -193 -163 -82 -8 463 414 -28 -39 -59 -152 -122
3717a22P57l18l14k40K58m4L91j45J03m64K51j28J69JJ56K5n0m03J96K14N3k3
$$ -122 635 317 3 -237 21 -23 368 223 326 -138 113 -15 154 155 311 336 286 -117 79 293 346 323
3739C23l56J23j38j33M41k08O75o48k66j9P1J69Q9ok54Q6k6j2R5L37j66k2jk07
$$ 323 -33 90 -48 -181 260 52 727 79 -187 -206 -135 34 123 117 -137 -51 -77 -89 6 343 177 155 154 -53
3763e3j68N75k69r6jm42K69K01j96K36j48J04M0l54N27j11Nj46k60K86l87M14
$$ -53 -221 354 85 -11 -12 -454 -185 16 -180 56 -92 12 52 -302 225 114 119 -27 -287 -1 -388 26
3785B6l9L42m85J53m45L43N5Q0J05k16r8K20r6m0K28k12O9k95Q5j32R7K64J01
$$ 26 -13 329 -156 -3 -448 -105 -50 30 135 -81 -179 41 -55 -95 133 -79 -10 -305 -220 -352 -255 9 110
3808A10l00Q8L01j69m02N41k45q8p9J15L49l3k67L94j98k52J05J75J55q9k85k98
$$ 110 -190 -102 199 30 -372 169 -76 -164 -243 -128 221 188 -79 315 117 -135 -30 145 300 211 -74 -372
3830c72K90J63K45j20Q9p3M9J65k62L88k53J7j22P1k64j7N6L71O4n98K02k1j5
$$ -372 -82 81 326 206 295 222 271 436 174 562 309 326 204 275 11 -6 50 421 485 -113 89 68 53
3853E3L68m27J22j02J42j12n4J93m1K43m36J73j95L57j59j5j50K79l79M81M5j73
$$ 53 421 -6 116 14 156 44 -10 183 142 385 -51 122 -73 284 125 110 -40 239 -140 341 386 213
3875B13J3l7l66J89n5j03L79l28J98l40Q3J33k17L53j85K80l27p7L32n3l13J95
$$ 213 226 189 -177 12 -43 -146 233 -95 103 -237 -154 -21 -238 115 -70 210 -117 -194 138 85 -228 -33
3897c3J34j03l4Qj15J94n2k91J7M34m34K05J16j92J52l17L05R6K1k44J34j5j91
$$ -33 101 -2 -36 -28 -143 51 -1 -292 -275 159 -275 -70 46 -146 6 -311 -6 90 111 -133 1 -14 -205
3920b05K01P8J18n22K21k9k36L02r3j78L99j19n8k02N57k73l19L76J15l08J60
$$ -205 -4 74 192 -330 -109 -138 -374 -72 -165 -343 56 -63 -121 -323 234 -39 -358 18 133 -175 -15
3941a5km7J20J66l80pL03l11L31r5l53L4K9J18k2J25k19J49j9J88j20R2l84N68
$$ -15 -17 -64 56 222 -158 -165 138 -173 158 63 -290 -256 -227 -109 -131 -6 -225 -76 -95 93 -27 65 -319 249
3965B49l07J00p7Qj02m8m5L45K25k92o6p1K59l23J2J79o7%L40m11L20P2j59k99
$$ 249 -58 42 -35 -27 -129 -177 -222 123 348 56 -10 -81 178 -145 -133 46 -21 -21 319 -92 228 300 141 -158
3989a58K41n2k9J34J5k51L07m61J08K30M1Q2O2p9j34q2K3J28N4J41l94L73k33
$$ -158 83 31 2 136 151 -100 207 -254 -146 84 125 207 269 190 56 -26 -3 125 179 320 -74 299 66
4012F6m8pJ79j74K1k41R2K16q6j67J94j97J47k24K34K2M3m33L82J05m66K35K44
$$ 66 18 11 190 16 37 -204 -112 104 18 -149 45 -152 -5 -229 5 27 70 -363 19 124 -342 -107 137
4035A37j64j43J14m10M16R2j6o4p6J0j90O8K72Q0N4k65J21k64J12l3J75k42L88
$$ 137 -27 -170 -56 -466 -50 42 26 -38 -114 -104 -294 -226 46 126 180 -85 36 -228 -116 -149 26 -216 172
4058A72j33jJ8N9k6j33k73K60l4J07Rm3q8%K2Q1j15K2N37k86l65J09K32R4j92
$$ 172 39 38 56 115 89 -44 -317 -57 -91 16 25 -18 -106 -106 -84 -3 -118 -96 441 155 -210 -101 131 225 33
4083C3Rp3j76J46P0R2J19j66J63k13J72O4P3q9j09k12R9k87M14K17j07p5L1k67
$$ 33 42 -31 -207 -61 9 101 220 54 217 4 176 240 313 224 115 -97 2 -285 129 346 239 164 195 -72
4107g2n6M19k68MKQ2P6l60J50L98K7j40k96q1N4J90l49J29K05j49k96M57o2K24
$$ -72 -128 291 23 27 29 111 187 -173 -23 375 402 262 -34 -115 -61 129 -220 -91 114 -35 -331 126 64 288
4131B88lk86O0j23N18j55k59K50m85j67M36k38M08j47j8n9j44J47L65lk66q9j73
$$ 288 285 -1 59 -64 454 299 40 290 -195 -362 74 -164 244 97 79 20 -124 23 388 385 119 30 -143
4154a43J17k92M24Kk33K93k24K07J2k66J79nk37J48j39J26j25M1K98k51j15J02
$$ -143 -26 -318 106 108 -125 168 -56 151 163 -103 76 71 -166 -18 -157 -31 -156 -115 183 -68 -183 -81
4176h1J54n3K03j41k24j42m0K49J5o7j10j16L66Q3O7P5k44j7r9L1L68l14l2j6
$$ -81 73 20 223 82 -142 -284 -324 -75 -60 -127 -237 -353 13 96 163 238 -6 -23 -122 -91 277 -37 -69 -85
4200h5J38J1k42Q0M9o2j73L61n2j2k1j42J73J41k57L00j44J36J66l42K36k42r5
$$ -85 53 64 -178 -98 -49 -111 -284 77 25 13 -8 -150 23 164 -93 207 63 199 365 23 259 17 -78
4223g8k7K37k6J45q8L3k95M72n08N19k84Pj14J69l5j88J65J32j16j38L3k40K53
$$ -78 -105 132 106 251 163 196 -99 373 -135 384 100 107 -7 162 127 -61 104 236 120 -18 15 -225 28
4246B8j6j19pK8L78k63M9k10kM03l92N63l05N8k5j84K30j58n4K9Qj72l46O5O24
$$ 28 12 -107 -114 -86 292 29 78 -132 -134 269 -123 440 135 193 168 -16 214 56 2 31 39 -133 -479 -414 210
4271B10k84O0K93l23j44L52l10K88o4j04r3q2Q4j38Q5K65j51k51J77p3J40j54
$$ 210 -74 -14 279 -44 -188 164 -146 142 78 -26 -119 -201 -117 -255 -170 95 -56 -307 -130 -203 -63 -217
4293b17J68M10l99j86L33m3m26M10j70Q3k8J30l68J90O3O5o5k27K1J9M3L84k67
$$ -217 -49 361 -38 -224 109 66 -360 50 -120 -37 -65 65 -303 -113 -50 15 -50 -277 -256 -237 -194 190 -77
4316g7j94K63j37K24l3k54j52J16L04k40J78k16K9J42k0m8K07k48K5J85K40m21
$$ -77 -271 -8 -145 79 46 -208 -360 -244 60 -180 -2 -218 -189 -47 -67 -115 92 -156 -131 54 294 -127
4338a27l9L30j50k73M06m13P1R4K54J30m0Pn44N6Q5M48l06O3j60K50j91j72K29
$$ -127 -166 164 14 -259 147 -266 -195 -101 153 283 243 250 -294 -238 -153 295 -11 52 -108 142 -49 -221 8
4361Hp2O8m0n7J59k9J85l32J71J24L7j02nK49l88J88N3N9j37m1K17l53J71q3j60
$$ 8 -64 4 -36 -93 66 37 222 -110 61 185 222 120 115 364 -24 164 217 276 139 98 315 -38 133 50 -110
4386a10L4j13J49m3M3K12Jo3J23r2q4K14m53J28J64k29k28K38K55l29J85M2J40
$$ -110 -76 -189 -40 -83 -40 172 173 110 233 141 57 271 -182 -54 110 -119 -347 -109 146 -183 2 44 184
4409A84n55J76R4Pq5L83n67J23J37N2o8O3m2L3k8n6J73n0Q1l31M48j56n6q9j56
$$ 184 -371 -195 -101 -94 -179 204 -363 -240 -103 -51 -119 -56 -98 -65 -93 -149 24 -26 55 -276 172 16 -40 -129 -285
4434b85L14j6jk13Q1P0k50L86n7l28P8O6L31j77l40L46M7l12K96K52k63l2q1R2
$$ -285 29 13 12 -201 -120 -50 -300 86 29 -299 -221 -155 176 -1 -341 5 52 -260 36 288 25 -7 -88 4
4458DN0J13Rm5N8m35M34j86j08K27J30j37k18J21K48j92j01R5j6J00L3k56J78
$$ 4 54 167 176 131 189 -246 188 2 -106 121 251 114 -104 17 265 73 -28 67 51 151 184 -72 106
4481A06p9p2r9ll7J70K50P8k47J07k09j2J13K20j92q1j64N0J94J80J2k92K14o6
$$ 106 27 -45 -144 -147 -184 -14 236 314 67 174 -35 -47 66 286 94 13 -151 -101 93 273 285 -7 207 141
4505A41k92K92M4k06L4k25K38j99L13O5N9j11j09r9M67r7j84j9rJ43k34o3J30
$$ 141 -151 141 185 -21 13 -212 26 -173 140 205 264 153 44 -55 412 315 131 112 103 246 12 -51 79
4528G9N6k6M6j26n2r7K31l8r0K48l39o8P3o8K83k01N2l6k23M01m5J61l93J47k2
$$ 79 135 109 155 29 -23 -120 111 73 -17 231 -108 -176 -103 -171 112 -89 -37 -73 -296 105 60 221 -172 -25 -47
4553d7J1r3j46M04j89J5j94K49L1l13N98l71J72j81J91j55R4P1j44J59l73m8K65
$$ -47 -36 -129 -275 129 -60 -45 -239 10 41 -272 326 -45 127 -54 137 -18 76 147 3 162 -211 -259 6
4576FP1k22K51m1k90K53k52L40j16n1q1j48K07J6O0K9J68o68N77J62l91M5J22
$$ 6 77 -145 106 65 -225 28 -224 116 0 -51 -132 -280 -73 -57 3 32 200 -468 109 271 -120 -75 47
4599D7l83L7N3K54j43L16k89K6J76l02J01L32k08O8jk09J58J53o7r7O4r1K50N
$$ 47 -336 -299 -246 8 -135 181 -108 -82 94 -208 -107 225 17 85 84 -125 33 186 119 22 86 -5 245 250
4623B50j77m1JJ03R3l3l28J67M8j3j27j83J94J11j17J14k61K67q9j12K31q3m3
$$ 250 73 32 33 136 229 196 -132 35 83 70 -57 -240 -46 65 -52 62 -199 68 -21 -133 98 15 -28
4646b8l10L05J70k05L25j99j85L40l40r1M31m3j09J10j52n08M74j4J33j25L2Q4
$$ -28 -338 -33 137 -68 257 58 -127 213 -127 -218 213 170 61 171 19 -489 -15 -29 104 -21 11 95
4668I5m3P0n0j91Q4r2J5j18Q5M3K10Nj40l2J13l11J61k3l2J8j89L27M0j07mn8
$$ 95 52 122 72 -119 -35 -127 -112 -230 -145 -102 108 113 -27 -59 54 -257 -96 -119 -151 -133 -322 5 45 -62 -66 -124
4694a24q6K83o2j00k42K33M0k88K38J6Q8k1j59K70j64R5k24J78J12k99j88M85
$$ -124 -210 73 11 -89 -331 -98 -58 -346 -108 -92 -4 -25 -184 86 -78 17 -207 -29 83 -216 -404 81
4716H1j72J68l53o1L37j46J1K82j70L2J93l5J33n07O8oO1K37l05K52Kk07r5R1
$$ 81 -91 77 -276 -337 0 -146 -135 147 -23 9 202 167 300 -207 -139 -145 -84 153 -152 100 102 -105 -200 -109
4740a09J33p8j69K08J31K5j03J66k2j8n5O9r2j07K02j37K02k06K17k19l1O0K67
$$ -109 24 -54 -223 -15 116 141 38 204 182 164 109 178 86 -21 181 44 246 40 257 38 7 67 334
4763C34n91K76m6n7m6K3M07r2k80N7p4K22L8m43L50j37o7R0L45n03M32m34N32
$$ 334 -257 19 -27 -84 -130 -107 300 208 -72 -15 -89 133 171 -272 78 -59 -126 -36 309 -194 238 -196 336
4786C36m34k11N60n19M66l1pR1m78K97L7m35J94K51j75R7P7J30l72n7k1J32j5
$$ 336 -98 -309 251 -268 198 167 160 251 -227 70 107 -328 -134 117 -58 39 116 246 -126 -183 -204 -72 -87
4809h7J18l03J73M2j84J47K56o1k3m27N13k12l8K83m00Q4K42k49P5k28K08N0k5
$$ -87 31 -272 -99 -57 -241 -94 162 101 78 -349 164 -48 -86 197 -203 -119 123 -126 -51 -279 -71 -21 -46
4832d6j47m4L51j53O2J32q9n7j14L68k44j24L42l31j99K18K10j80N7J03K32n61
$$ -46 -193 -237 114 -39 23 155 66 9 -105 263 19 -105 237 -94 -293 -75 135 -45 12 115 347 -214
4854b14K65o6p8J01O7r2LM4j19J14J76l35M90m9k45l20R1O07j86m4P0k56r1P1
$$ -214 51 -15 -93 8 75 -17 -14 30 -89 25 201 -134 356 307 62 -258 -167 440 254 210 280 24 -67 4
4878Dn4L80k35j18M3K85l64k3l9J51j83K24j1L2j14J10M9j04P8j1K8l7K12l81
$$ 4 -50 330 95 -23 20 305 -59 -82 -121 30 -153 71 60 92 -22 88 137 33 111 100 128 91 303 -78
4902g8k9k0M66j36j28q5P4k86M7P8J6k10K63j70K86k16R7N8l07K57J76l02N8K44
$$ -78 -107 -127 339 203 75 -10 64 -222 -175 -97 -81 -291 -28 -198 88 -128 -31 27 -280 -23 153 -149 -91 153
4926A53k31K4L68m55LP4J38J5J1l80M00L4k75M47m83K94j12m69M91j09K84m15
$$ 153 -78 -54 314 -141 -138 -64 74 89 100 -280 120 154 -121 326 -157 137 25 -444 47 -62 222 -193
4948a93K14m9k7j91K2O05n74L01l46K26%N7o2J10j18Nj05Q6N4n7r4j40K26K5k15
$$ -193 21 -28 -55 -246 -224 381 -193 108 -238 -12 -12 45 -17 93 -25 -20 -125 -39 15 -42 -136 -276 -50 -25 -240
4973b40m2N11j61j13J8oN9k39M27ml18L4K00k43L15L5k78J48j20k2J52k01J01
$$ -240 -282 229 68 -45 -27 -33 26 -213 214 210 -108 -74 126 -117 198 233 -45 103 -17 -39 113 -88 13
4996A3k2m50N49l2P2p6K5j54J40k51J6K78J14j42k00L8J39l06J79j9M39j98j57
$$ 13 -9 -459 90 58 130 54 79 -75 65 -186 -170 108 222 80 -120 -82 57 -249 -70 -89 350 152 -5
5019eK04k09K54K9j33j39j68J63K74l26m7M9K2j14L20j58M2j8K30l43K50k87K09
$$ -5 199 -10 244 273 140 1 -167 -4 270 -56 -103 -54 -32 -146 174 16 58 40 270 -73 177 -110 99
5042I9r4l1q7J44Q0l69L64J25j60j93j55O12l57J95j37Q1n4q8o2J48J34k11M16
$$ 99 5 -26 -113 31 111 -258 106 231 71 -122 -277 335 -22 173 36 117 63 -25 -87 61 195 -16 400
5065D00m86N9oL12k81J1r5K63k20J9pR6n6K5LR3j16k56o6J23J7k7K50m0K4k03
$$ 400 -86 -27 -33 279 -2 9 -86 177 -43 -24 -31 65 9 34 37 130 14 -242 -308 -185 -168 -195 55 15 39 -164
5091a64l07K60K08J47j67J45j02k85K89j27l4l8N03k33j89J26R7Q5k26J22j87
$$ -164 -471 -211 -3 144 -23 122 20 -265 24 -103 -137 -175 328 95 -94 32 129 214 -12 110 -77
5112g7K6r8L34j82k8K93j72j29k1l8K22J12k45K81j11k88L57j30R5m7j44n3Jl8
$$ -77 -51 -149 185 3 -25 268 96 -33 -54 -92 130 242 -3 278 167 -121 236 106 201 154 10 -43 -42 -80
5136h0o3J15N8r8j56M9K33k8J30j47M0m7j81L33j12q7N8J28M0l04K43J22j40J54
$$ -80 -143 -28 30 -68 -224 -175 58 30 160 13 53 6 -175 158 46 -41 17 145 185 -119 124 246 106 260
5160B60k23N3k0k36J96j47l2K18M7j31M0K54k9m49J24O0j11L49l88K1M7J55j07
$$ 260 37 90 70 -166 30 -117 -149 69 116 -15 25 279 250 -199 -75 -15 -126 223 -165 -144 -97 58 -49
5183d9j13J78M1j0r2J37j87m8P7j11L87k81j40l3K85K50m63K10k28r5K50j3j6
$$ -49 -162 16 57 47 -45 92 -95 -143 -66 -177 210 -71 -211 -244 41 291 -172 38 -190 -285 -35 -48 -64
5206f4j40J15j31L19p2J52k69k29J62K0P5j6K70j76j72L43k52N6q4J58J5P9r7
$$ -64 -204 -89 -220 99 27 179 -90 -319 -157 -137 -62 -78 192 16 -156 187 -65 -9 -93 65 80 159 62
5229F2j97K10k36J59j59L9J84q1k17k8L58j8N3J2k84J92j6K0r8J4K13n37K55J43
$$ 62 -135 75 -161 -2 -161 -122 62 -19 -236 -264 94 76 129 141 -143 49 33 53 -45 -31 182 -355 -100 43
5253D3R7o4j38K62l97L83j23j40P6n7o3M6k23K31O9R9k4k25J74l4K50l18J14l7
$$ 43 140 76 -62 200 -197 186 63 -77 -1 -58 -121 -75 -298 -67 2 101 77 -148 26 -8 242 -76 38 1
5277Aj54K73J63m32L07j92J3J2J03J49r5l72K88J42m40N57l46O4n8R7J9Q4k60
$$ 1 -153 120 283 -149 158 -34 -21 -9 94 243 148 -224 64 206 -234 323 -23 41 -17 80 99 183 -77
5300g7K37J62j48k39K10k18lJ98k39n1L23j58J63l62N5J60No1M0K50j83k36J3
$$ -77 160 322 174 -65 145 -73 -76 122 -117 -168 155 -3 160 -202 -147 13 18 -43 -3 247 64 -172 -159
5323a59O6n5K03j55k4j96L00J34N9k4N5k89P5j75k2K29p5Lj8n3N9M5j62L34j09
$$ -159 -93 -148 55 -100 -124 -320 -20 114 173 149 204 -85 -10 -185 -207 22 -53 -50 -68 -121 -62 -17 -179 155 46
5348D6k70L54l34m5K92k31qj47M02n9K30l18K02j59K19r3j2J03j89j5J43J08j91
$$ 46 -224 130 -204 -249 43 -188 -196 -343 59 0 230 -88 114 -45 174 81 69 172 -17 -32 111 219 28
5371B8L4o7L35k65No1N4j45k14L02K31p0m5k35M94k67k02K26l26Q7K95K8n16O43
$$ 28 62 -5 330 65 70 9 63 -82 -296 6 237 167 122 -113 381 114 -88 138 -188 -101 194 222 -294 349
5395C49l84j42M4J00K22n4K2M8q8o0l56M75J35p00M71n9K45k86Q0J43j65n4j71
$$ 349 -35 -177 -133 -33 189 135 157 205 117 57 -299 176 311 -389 82 23 268 -18 62 205 40 -14 -185
5418a85K66j36J29N7l60J31p5K17j31k1J19k38nL13L6j50J92q2l0k67n7J33n2
$$ -185 81 -55 74 131 -229 -98 -173 44 -87 -108 11 -227 -232 81 117 -33 159 77 47 -220 -277 -144 -196
5441a96K04K31m33K69k25K51P5k58J0l1k22L39P5j16J87j82n5M1K02k25Q4q3K60
$$ -196 8 239 -194 75 -150 101 176 -82 -72 -103 -325 14 89 -27 160 -22 -77 -36 166 -59 25 -58 202
5464B02m26K19K92m8l00q1Q9K64j98R1J56k94P6j93j10L88k27l4J61ok12N2J60
$$ 202 -224 -5 287 239 -61 -142 -53 211 13 104 260 -34 42 -151 -261 127 -100 -134 27 21 -191 -139 21
5487B1J62J12j00l97L0M0j98L65J52k97l23K91n8L13j5M9l70l9K37J35j90k9L0
$$ 21 183 295 195 -202 -172 -132 -330 35 187 -110 -433 -142 -200 113 98 147 -223 -262 -25 110 -80 -109 -79
5510g9L8K94m92J99J23k8N5J43o32O12P2k04o2p9K2r4jJ84k1p6l4j07J33o4J76
$$ -79 -41 253 -239 -40 83 55 110 253 -379 233 305 101 39 -40 -18 -112 -113 71 50 -26 -60 -167 -34 -98 78
5535G8j61K11j85N9j83J00L10J07j12K1p2l31m2K26M09o05K69L9L7K29k73J0j56
$$ 78 -83 128 -57 2 -181 -81 229 336 224 245 173 -158 -200 26 435 -170 99 138 175 404 131 141 -15
5558a5M22p38O68k98n8J2k14J90k31L50Q4m12K44q2L67m38j32J59J36j05K24q0
$$ -15 407 -331 337 39 -19 -7 -221 -31 -262 88 172 -240 4 -78 289 -149 -281 -122 14 -91 133 53
5580E3J58k52k4J40j64p6J4j89K54J60o0j45P6P0k31L18L1j11J32l41L0J1L5J25
$$ 53 211 -41 -65 75 -89 -165 -151 -340 -86 74 14 -131 -55 15 -216 102 133 22 154 -187 -157 -146 -111 14
5604A4R0r6PR7Q0j49j35J71J20k40J35q9k50M78n6j91O0q7K56l65K67l99K75r
$$ 14 104 8 15 112 192 43 -92 79 199 -41 94 5 -245 233 177 -14 46 -41 215 -150 117 -282 -7 -16
5628a6L31o22L36m37K94L79m35K18L3J64k37j37J1n7M6K40l18K01j51J19r2J80
$$ -16 315 -307 29 -408 -114 265 -170 48 81 245 8 -129 -118 -175 -129 111 -207 -6 -157 -38 -130 50
5650E0j74j82L59Q1k14L30l43K15K19n22J59O1J24O8k01j27J67m22K86k47M26
$$ 50 -124 -306 53 134 -80 250 -93 122 341 -181 -22 39 163 231 30 -97 70 -352 -66 -313 113
5671A13K29k98m3K8j03K23k28R3k93L81r1K39m98K90K6l0J39l41N9J96j10P7J18
$$ 113 342 44 1 29 -74 149 -79 14 -279 102 11 250 -248 42 68 38 177 -164 -105 91 -19 58 176
5694A76j66%M9j10K21Q3J27j64j67J75n65N98k74m8J75k59J73l18M06k22P2J95
$$ 176 10 10 59 -51 170 253 380 216 49 224 -341 257 -17 -65 110 -149 24 -294 112 -110 -38 157
5716A57Q0l67J53k43R3K89k47j54J76K4j44K72j24K74j42l65L96j89j18n5j19
$$ 157 237 -130 23 -220 -127 162 -85 -239 -63 -39 -183 89 -35 239 97 -268 128 -61 -179 -234 -353
5737c53L84J7k05O2L56k78j04K62k01j79L23K0k96K83l08L27k10J05r6L44k36
$$ -353 31 48 -157 -95 261 -17 -121 141 -60 -239 84 104 -192 91 -217 110 -100 5 -91 253 17
5758A7J27k36J07r9J46J7l57N01k60K36p1j10k7o9M7J19j04j58L21J60k00j48
$$ 17 144 -92 15 -84 62 79 -278 223 -37 199 128 18 -9 -78 -31 88 -16 -174 147 307 107 -41
5780d1M7J87k13j64K26M2O0k12r0k09M38j35P3J09j36K98l74q2J44K42k50N9l0
$$ -41 6 193 -20 -184 42 84 144 -68 -158 -367 71 -64 9 118 -18 280 -94 -176 -32 210 -40 19 -11
5803a1J93J34k78k95J12nJ02q0P8L62m04L20l77L80l85M27n46J01L44j97j72O5
$$ -11 182 316 38 -257 -145 -150 -48 -128 -50 312 -92 228 -149 231 -154 273 -273 -172 172 -25 -197 -132
5825a32K13k89K64K35r7R0j44m30L71k29K7J47L40l21j78M5j78K70j24n4J39J33
$$ -132 81 -208 56 291 194 284 140 -290 81 -148 -121 26 366 45 -133 -88 -266 4 -120 -174 -35 98
5847I8J3j48j97K95J42m40O1P9o0J30n3r8M21m72J41j10L21l02J46m0j78J49k21
$$ 98 111 -37 -234 61 203 -237 -176 -97 -157 -27 -80 -178 243 -229 -88 -198 123 -179 -33 -73 -251 -102 -323
5870c23J00K35m0k6J6nQ6k4n2j02K95j04j44O8k38K41J70k91J6K9p2K33K88l56
$$ -323 -223 12 -28 -54 -38 -43 43 19 -33 -135 160 56 -88 -20 -258 -17 153 -138 -122 -93 -165 68 356 0
5894@K09k62l7K28l0l09L65l63R1L01n07L47l0J45k86K05j98K54O4oj46K76j73
$$ 0 209 -53 -90 138 108 -201 164 -199 -108 193 -314 33 3 148 -138 67 -131 123 187 181 35 311 138
5917A38l64J12K57p3K43k94n4K76j81L1m7K11k93R7k32N84l93J09l1j26J27o2
$$ 138 -226 -114 143 70 313 19 -35 241 60 91 44 255 -38 59 -173 411 18 127 96 -30 97 35
5939C5o4R8R4k09O5O6k23J02P2K20j93q3r3K09j30J84k25J13J30r6j03M5p4j01
$$ 35 -29 69 163 -46 19 85 -138 -36 36 256 63 -20 -113 96 -34 150 -75 38 168 72 -31 14 -60 -161
5963a61L32r8j37J65k21l0K36m83O28k48J63l13J63k27O3J8L98m28N27k90j96
$$ -161 171 73 -64 101 -120 -150 86 -397 231 -17 146 -167 -4 -231 -168 -150 248 -180 347 57 -139
5984a39J59J82r6j87J70l21J25L02j92j48M41k70k47K06L06o20K82J44K06j02
$$ -139 20 202 106 -81 89 -232 -107 195 3 -145 296 26 -221 -15 291 -329 -47 97 303 201
6004B01J60n91L93J00m46K64J16j92j86J36J15K38m47L64l17n5J17M1J53Q1j10
$$ 201 361 -230 163 263 -183 81 197 5 -181 -45 70 308 -139 225 -92 -147 -30 11 164 245 135
6025A35k69L63l22P9J19M2P0R3m62J31q5J66r5K51j83m3R2L2k01N0Q4j00L73j49
$$ 135 -134 229 -93 -14 105 147 217 310 -152 -21 -106 60 -35 216 33 -10 82 114 -87 -37 47 -53 320 171
6049A71o29L63MQ1N3J42k60J56J2j0L6K04m24M4K71j01j47jn5j26J97L04k41j2
$$ 171 -458 -95 -91 -10 43 185 -75 81 93 83 119 323 -101 -57 214 113 -34 -35 -90 -216 -19 285 44 32
6073C2l46M55l25M3J91o1p4K45k68J7j9n3M11k95nR9O3L2J30m12K01k86K02K13
$$ 32 -314 141 -184 -141 50 -11 -85 160 -108 -91 -110 -163 248 -47 -52 47 110 142 272 -140 61 -225 -23 190
6097A90k80J77r1j63P0J49j70K42j04j18L01m72J37L00l2l24K44K1j30M5n3R6
$$ 190 -90 87 -4 -167 -97 52 -118 124 20 -98 203 -269 -132 168 136 -188 56 77 -53 -8 -61 35
6119C5k91Q1J65l2J90n0o9k29R8K70n9j33j10J86q0JL00k38j31M49o87J51j28
$$ 35 -256 -175 -10 -42 148 98 29 -200 -102 168 109 -24 -134 52 -28 -27 273 35 -96 353 -334 -183 -311
6142c11K08M09j82j66l25N53m76L02nK97l75p8R7O4p2K19k44K41om31M38j69O4
$$ -311 -103 306 124 -42 -367 186 -290 12 7 304 -71 -149 -52 12 -60 159 -85 156 150 -281 157 -12 52
6165E2j83L22p3k75K40O3j36l6R8K0J22l05L00j47l89M74j75J00j11p8L42l5j13
$$ 52 -131 191 118 -157 83 146 10 -26 72 92 214 -91 209 62 -327 147 -28 72 -39 -117 225 190 77
6188G7L50o18M97m26o4M46M7J08l38k42J40J18r8K11l62J98o4R7M3j50J56O6k82
$$ 77 427 -191 306 -120 -184 262 309 417 79 -163 -23 95 -3 208 -154 44 -20 77 120 -30 126 192 -90
6211i0J9M8L06m62K64J59l7k26o8J85pN4m73K78n1L40j58J04k03N8L1M5O7m78
$$ -90 -71 -23 283 -179 85 244 207 -19 -87 98 91 145 -328 -50 -101 239 81 185 -18 40 71 116 183 -295
6235b95k8J54J21J4m9R0j99pL9J41J86k80K27k43L45l36J3J32Q8P6k15L3qJ9J41
$$ -295 -323 -169 -48 -34 -83 7 -192 -199 -160 -19 167 -113 114 -129 216 -120 -107 25 113 189 -26 7 -1 18 159
6260A59l4m92K70J71j57k6N5J05j48j10K44j08J41k15L44k68M7J73N3L5l0O8p9
$$ 159 125 -367 -97 74 -83 -109 -54 51 -97 -207 37 -71 70 -145 199 -69 -22 151 204 239 209 277 198
6283A98l54J02kpm3j7J7J90l39J40J37n3K17j44j02p9L84m82L54P4r0l15M50l53
$$ 198 -156 -54 -56 -63 -106 -123 -106 84 -255 -115 22 -31 186 42 -60 -139 245 -237 117 191 101 -214 236 -117
6307a17J34mL4k9J7R0k43J55j51L03l72M26j24Q9k39nJ70l14K19j59M7j93k8L59
$$ -117 17 13 47 18 35 125 -118 37 -114 189 -183 243 119 208 -31 -36 134 -180 39 -120 -73 -266 -294 65
6331F5J13r8p8R7j05M5J14j40j2lR8k76q5J24O3r9K13m72N11j77L18k37q0P3j48
$$ 65 178 80 2 99 -6 39 153 13 1 -2 96 -180 -265 -141 -78 -177 36 -436 75 -102 216 -21 -101 -28 -176
6356a76N97m51j13K45j48J81k74K0L40j54j5k3PL4l80M50m53M72k03j55L67k94
$$ -176 421 -30 -143 102 -46 135 -139 -119 221 67 52 29 36 70 -310 140 -313 159 -44 -199 168 -126
6378a26J88j72K64RN4k39p0j1n7K6K50o6k65K26M5j49Q6J46J00k30k6k22Q9J22
$$ -126 62 -110 154 163 217 -22 -92 -103 -160 -134 116 50 -215 11 56 -93 -7 139 239 9 -17 -239 -150 -28
6402b8J02o2J38n22L69j11R0P7o8j29rJ67J60j04j04n7O5k5K4J39k57j3j23L58
$$ -28 74 12 150 -372 -3 -114 -24 53 -15 -144 -153 14 174 70 -34 -91 -26 -51 -27 112 -145 -158 -281 77
6426G7k59K72J19k58J55m6j39RK69l45J38j78J37Kk8K69J34l82R5J29k99qJ10
$$ 77 -182 90 209 -49 106 60 -79 -70 199 -146 -8 -186 -49 -47 -75 194 328 -54 41 170 -129 -137 -27
6449b7j1j51L87n23l0M69k08P4M9J4k16M02k68J38np8M7K68k83n5p2J87l05K05
$$ -27 -38 -189 198 -325 -355 114 -94 -20 29 43 -173 229 -39 99 94 16 63 331 48 -7 -79 108 -197 8
6473Hq4J3k45N53l27p6J65j64P4o2L04J76m16L02j24k06oq8K95k97J38Q7K61k11
$$ 8 -76 -63 -308 245 -82 -158 7 -157 -83 -145 159 335 -81 221 97 -109 -115 -203 92 -205 -67 20 281 70
6497G0l92J87O9L55m13M4j61L88l41J60j22j17N67n28K47o5n8l1L48M4k28N0j81
$$ 70 -322 -135 -66 289 -124 -80 -241 147 -194 -34 -156 -273 294 -234 13 -52 -110 -141 207 251 23 73 -108
6520a08P6j1k28K22n5j33K89j41N9N3k27M5K30j84p4L40j39j53LL99j82jM5n5
$$ -108 -32 -43 -271 -49 -104 -237 52 -89 -30 23 -204 -159 71 -113 -187 153 14 -139 -136 263 81 80 125 70
6544G0j8k34M09j56j25R3M3r0j7Q0J16n5M5J20l96J30OJ44n4l33P8J43R2k13K80
$$ 70 52 -182 227 71 -54 39 82 -8 -25 55 171 116 161 281 -115 15 21 165 111 -222 -144 -1 91 -122 158
6569A58k36J25R3k03OL48l71j63K7K77K54j66K03m60J93J45j28n8k31K3J50Q2
$$ 158 -78 47 140 -63 -57 291 -80 -243 -216 61 315 149 352 -108 85 230 102 44 -187 -164 -14 68
6591F8j06p1N7j25J51L5o9qk5K9j11R5J40q7j60J07K6m4p6P9m7K6L12j01j99R5
$$ 68 -38 -109 -52 -177 -26 9 -60 -68 -93 -64 -175 -80 60 -27 -187 -80 -54 -98 -174 -95 -142 -116 196 95 -104 -9
6617ij2j29K00j56J55J99q3m04R1J44J8j27M16k14J11j52J47l33J08P0j94M78
$$ -9 -21 -150 50 -106 49 248 165 -239 -148 -4 14 -113 303 89 200 48 195 -138 -30 40 -154 324
6639C24m48J31l57O67j78N2n1j29L0k07K14J26j57Mk42L99k58K13Q6k84lL42k80
$$ 324 -124 7 -350 317 139 191 140 11 41 -166 48 174 17 21 -221 178 -80 133 219 -65 -68 274 -6
6662fl25J11J14K62j96j29K56L2j51j6J95K7m9j66n9J06J4J42N3k45L1J52k04
$$ -6 -331 -220 -106 156 -40 -169 87 119 -32 -48 147 174 125 -41 -100 6 20 162 215 -30 1 153 -51
6685e1N5K87q6l67J89j47L80j88M7Ql29M4r8M40j70jj11q9K59k50M49j00J54m83
$$ -51 4 291 205 -162 27 -120 260 72 119 127 -202 -158 -256 184 14 13 -98 -187 72 -178 271 171 325 -158
6709a58L30j98o9K09k34P6J43q6J03j06r1Q6K00j23j49K37j43r0M6Q0lqj22J00
$$ -158 172 -26 -95 114 -120 -44 99 13 116 10 -81 5 205 82 -67 170 27 -63 -17 63 60 52 -70 30
6733C0K6l2j57L21k87L27k11J06k59K75r9J9j31l4k33N28mk62m2l1K17l94L50
$$ 30 56 24 -133 188 -99 228 17 123 -136 139 40 59 -72 -106 -339 189 185 -77 -119 -150 67 -327 23
6756B3J8l17L37qj03K66k64K9O9J58j69j30M7M6J6K91j63k10K09O1l57K31k50
$$ 23 41 -276 61 53 -50 216 -48 -19 50 208 39 -91 -44 2 18 309 146 -64 145 206 -151 80 -170
6779a70K44k24P4Q9o6j20L35j94K53k50Q6l2r7J27j1Q3j69J38P9k56K95n28M39
$$ -170 74 -150 -76 13 -53 -173 162 -32 221 -29 57 25 -72 55 44 127 -42 96 175 -81 214 -314 125
6802A25k43K40o41M07N22q45N14k01M57l98J04J4j69k42J94j59N97k11k12j48
$$ 125 -118 122 -519 -112 410 -435 79 -122 335 -63 41 55 -114 -356 -162 -321 276 65 -147 -295
6822b95O28l29J16k33J77J0o7o5M4Mn7J93j20J0lj29O1K97l51J88k04l9J17J34
$$ -295 333 4 120 -113 64 74 7 -58 -14 -10 -67 126 6 16 13 -116 -55 242 -109 79 -125 -164 -47 87
6846H7o8j08R1o4q1l59M88j48R0n0j5K4K85L1m01J39k0p0K44k79M9J74m2o6J51
$$ 87 19 -89 2 -62 -143 -502 -14 -162 -72 -122 -137 -113 172 203 -198 -59 -79 -149 95 -184 -135 39 -3 -69 82
6871H2j75J86r2j81K89k31M06l65K08k68J16p4M12l50J12n2j87K2J75k4J1N5l44
$$ 82 -93 93 1 -180 109 -122 284 -81 127 -141 -25 -99 313 -37 75 23 -164 -142 33 9 20 75 -269
6894b69M99j17l59L19j09n2J80O5j50J38P3l04K6j65K23P6k53Q1L53Ol97j2J81
$$ -269 230 113 -246 73 -36 -88 92 157 7 145 218 -86 -60 -225 -2 74 -179 -98 255 261 -136 -148 33
6917C3j88P1J04J87j6m50K71J30j10LK69k21J07l23J76j85J38j73L6M6k12L36
$$ 33 -155 -84 20 207 191 -259 12 142 32 35 304 83 190 -133 43 -142 -4 -177 -141 -95 -307 29
6939B9j68L80m82K20m33L32L58k71J00M2k01K82m33N95l68J44p1K15j30j98JJ91
$$ 29 -139 241 -241 -21 -454 -122 236 -35 65 107 -94 188 -245 350 -18 126 55 270 140 -58 -57 134
6961A34k32k10N95l65P5K4NQ8k19K1J23J6J6q3j87K25q5R3J71j39l05n7M41k04
$$ 134 -98 -308 287 -78 -3 21 26 114 -105 -84 39 55 71 -12 -199 26 -59 34 205 66 -239 -296 145 -59
6985e9J60k76J2J87R5l53K83m2o5k3j25J67r0lk32N81k97L15j56l87L84j91J78
$$ -59 101 -175 -163 24 119 -234 49 7 -58 -81 -206 -39 -129 -132 -364 217 -80 235 79 -308 76 -115 63
7008F3J2j42L4L5Pj96L00P1l78N43m14K08j18J8J29Q0o24M08j6j65K24p8k6j04
$$ 63 75 -67 -33 2 9 -187 113 184 -194 349 -65 143 25 43 172 252 -372 36 20 -145 79 1 -25 -129
7032a29J84o0J31J77Pl91K91k25j24K33j73J52j50R5p6K27j36k18J63L19j85K4
$$ -129 55 -5 126 303 310 -81 210 -15 -139 94 -79 73 -77 18 -58 169 33 -185 -22 297 112 136
7054A36J0l14L04k51j17K11J78n41J32L37p6j79J22l06K37K95p8Rn6k03J47K00
$$ 136 146 -168 136 -115 -232 -21 157 -384 -252 85 9 -170 -48 -354 -117 178 100 109 53 -150 -3 197
7076A97k24K20l25J22k0j03J05N5j35O8J47o7lJ11j25K4M5J5l07J44K75n31L38
$$ 197 -27 193 -132 -10 -30 -133 -28 27 -108 -40 107 40 37 148 23 47 92 107 -200 -56 219 -312 26
7099B6l4n9k70L47J4M0P0j01j90J01j15L60k78J81j39J30j83J81Q1k28K74M4j80
$$ 26 -8 -67 -337 10 24 64 134 33 -157 -56 -171 189 -89 92 -47 83 -100 81 162 -66 208 252 72
7122G2j28K9j30K01j73k82N26j66J31L30k90j14j16r8J44O7M3p5Q3Mj79J71q3
$$ 72 -56 -27 -157 44 -129 -411 115 -51 80 410 120 6 -110 -208 -64 3 46 -29 54 58 -121 50 -33
7145c3m0J76k6J54l94K14J49o00L89m8j9m6K53k86J41J41L8K0j33q6J69k97j64
$$ -33 -73 103 77 231 -163 51 200 -400 -11 -59 -78 -124 129 -157 -16 125 163 183 50 -36 133 -164 -328
7168c28o6K87m6l8K72M7nj0J97l34Q0j83N6RJ6K42k33j23K10j84R6k06R8P8j3
$$ -328 -394 -107 -153 -191 81 128 123 113 310 -24 56 -127 -71 -62 -46 196 -37 -160 50 -134 -38 -244 -146 -68 -81
7193h1J50l96L28K0j98J9q9K71K52k20m36N98j67K34m50R8r9L91j08k56J56m4
$$ -81 69 -327 1 21 -177 -158 -247 24 276 56 -380 218 51 285 -165 -67 -166 225 117 -139 17 -27
7215b7j9J61j61N8j02N4J13k53J84P0j52%L46l79l5K84l97L28j1m13K55J34l05
$$ -27 -46 115 -46 12 -90 -36 77 -176 8 78 -74 -74 272 -107 -142 142 -255 73 62 -351 -96 38 -267
7238b67J28K34k87J79k64L10M8j29j38l9L24j51P5P4j08j58K55Q1j19J05Q9l27
$$ -267 -139 95 -192 -13 -277 33 81 -48 -186 -225 99 -52 23 97 -11 -169 86 167 48 153 242 -85
7260h5j65J19J24k10Q2o1L74k1k78R4K35m47L11l6p5rj0Lj13K0J86P9k05n3Q8
$$ -85 -250 -131 -7 -217 -135 -196 178 157 -121 -27 208 -239 72 36 -39 -48 -58 -55 -168 -148 38 117 -88 -141 -53
7285e3k0K8Q0M6k50J98j22K11j57j44J26K40N2l20R9j18RRj20J83j68K19k88N92
$$ -53 -73 -45 35 81 -169 29 -93 118 -39 -183 -57 183 235 -85 14 -104 -95 -86 -206 -23 -191 28 -260 332
7309C32k48k83J76Q2o1%o6j70K71q5k9L10q2m21K69M6j67K20k43J84M0l43J53
$$ 332 84 -199 -23 59 -2 -2 -68 -238 33 -52 -81 229 147 -274 -5 41 -126 94 -149 35 75 -268 -115
7332a15nJ58j74J18j68Q2k4K62o9M5j35Q1m2j13Q9L2k30K98QO4r9j88M7M3O6j5
$$ -115 -120 38 -136 -18 -186 -104 -128 134 65 110 -25 56 14 -99 -10 22 -208 90 98 162 63 -125 -78 -35 31 16
7358A6J45j95P9j8N4R5l16Q5L44l11j42J97R6k20N0o0M4N2M6J07j24J67k21Pm6
$$ 16 161 -34 45 27 81 176 -140 -55 289 -22 -164 33 129 -91 -41 -101 -57 -5 41 148 24 191 -30 -23 -69
7383f9j09J52J27l56K54L78l23J40k06J08j16l04L60K9m8j19L54k64R1j9m19N14
$$ -69 -178 -26 101 -255 -1 377 54 194 -12 96 -20 -324 36 65 17 -102 252 -12 79 60 -359 155
7405A55k24j09M56j29j13K7j12j0k4K25q8K24l06j06L65m3j28j68P0Q6r5J23J92
$$ 155 -69 -178 278 149 36 63 -49 -59 -83 142 54 278 -28 -134 231 188 60 -108 -38 48 -47 76 268
7428B68r9j64o8J85q7K8l06K38j58J0NN8j55M05j80R5q1m9K42l02N4j02nJ25L21
$$ 268 169 5 -63 122 35 63 -243 -5 -163 -153 -148 -90 -245 160 -20 75 -6 -55 187 -115 -61 -163 -168 -43 278
7453B78l90N7J0qK19k09K40k35q4J16J24l4J51O4k74j39j35L16n0j39j69M24j36
$$ 278 -112 -55 -45 -53 166 -43 197 -38 -122 -6 118 84 235 299 25 -114 -249 67 17 -122 -291 133 -3
7476cq0K99l10P1L11o4p9k12O1k35L47k14j0R7k69R5K90k33p9J92O7Q9j27j56
$$ -3 -83 216 -94 -23 288 224 145 -67 -6 -241 106 -108 -118 -21 -290 -195 95 -138 -217 -25 42 131 4 -152
7500a52K36J41j51k9J3m2P8J9qQ3k81O0K34k50j13L22k63K33n7k00J70n6on8P0
$$ -152 84 225 74 45 58 16 94 113 105 188 -93 -33 201 -49 -162 160 -103 130 73 -127 43 -13 -19 -77 -7
7525gj30l0K00L8j05K3p4k33L22N2M5l34P7O70o26O0Q6j07%J62J00m77M21J56
$$ -7 -137 -167 33 71 -34 -11 -85 -318 4 56 101 -233 -156 514 -112 -52 34 -73 -73 89 189 -288 133 289
7549B89k52j40OL50k38m7O1L8j24j24K11p9r1N0J86j98k5p4J75q0O5j11O0K93
$$ 289 37 -103 -97 253 15 -32 29 67 -57 -181 30 -49 -140 -90 96 -102 -127 -201 -26 -106 -41 -152 -92 201
7573B01n59L29J44P6l26K05O2o6P4j80k8j17K02j8kQ9k72L59k27K59L6m12J01
$$ 201 -358 -29 115 191 -135 70 132 66 140 -40 -68 -185 17 -1 -3 86 -186 173 -54 205 241 -171 -70
7596g0K3O9p4J12O0%m72J82K30l1J25N0k80R2Q3m63M46K11k42r2M0P0j69K14K1
$$ -70 -47 22 -52 60 120 120 -352 -170 60 29 154 204 -76 16 99 -364 82 293 51 -41 -1 69 -100 114 135
7621A35Rp5j0M0j22R5k96M67j38p8j68M04l83MK46j89L22l11k07K43M8R2o8k73
$$ 135 144 69 59 99 -23 72 -224 243 105 27 -141 263 -120 -116 130 -59 263 -48 -255 -12 36 128 60 -213
7645b13J64J18j89K25Nj69J59r0n7L5m20M29M4R2j94j74J33J93j47k24K51R0R0
$$ -213 -49 69 -120 105 110 -59 100 10 -47 -12 -432 -3 41 133 -61 -235 -102 91 -56 -280 -29 61 151
7668A51r4j01j6p3K55k10P3J3k38J51j74K36J2p8J5K66k47k31J50J17K86k67J39
$$ 151 57 -44 -60 -133 122 -88 -15 -2 -240 -89 -263 -27 -15 -93 -78 188 -59 -290 -140 -23 263 -4 135
7691A35j51l9J44K4m87N00q4J65K44k88o0l33J37M7j10j5K52l11J35p9J66j87
$$ 135 -16 -55 89 113 -374 126 42 207 451 163 103 -230 -93 -46 -156 -171 81 -230 -95 -174 -8 -195
7713a95J74K67m36M30o4l06J07K6K92n00Q7J31R3j11R8J44j89M8j28L2J52k83
$$ -195 -21 246 -190 240 176 -130 -23 3 295 -205 -118 13 106 -5 93 237 48 96 -32 0 152 -131
7735a31L28j11k58N83p4n71M10J5l7k15n9R4n4J32N1N2j29o1j36Qj38K69J50o6
$$ -131 197 86 -172 411 337 -234 176 191 154 -61 -120 -26 -80 52 103 155 26 -35 -171 -163 -301 -32 118 52
7759E2Q1l13J42m9l02M51q5J81j12k6j38j81N28k70j84j13M78k71K11p3r7k57
$$ 52 133 -180 -38 -87 -389 62 -23 158 46 20 -118 -299 229 -41 -225 -338 140 -131 80 7 -90 -347
7781c47L40r5qK55j13O1j81K3j4R8mJ15k6l20N03j36o9j66K28Q8j15k20J95k78
$$ -347 -7 -102 -110 145 32 93 -88 -65 -79 19 15 130 104 -216 287 151 82 -84 144 232 117 -103 92 -186
7805a86K77k9j31k7L18O5l65J28L8o5J40l30K49l05K54k5m4J35M1l25Q3o7M1J53
$$ -186 91 62 -69 -96 222 287 -78 50 88 23 163 -167 82 -223 31 6 -38 97 138 -187 -104 -171 -130 23
7829B3Kj58r7K83q8K81l99P4K90r2k13J05j30R6J0RJ96k55J33j61R2J8k19L17
$$ 23 25 -133 -230 53 -35 246 -153 -79 211 119 -94 11 -119 -23 -13 -4 192 -63 70 -91 1 19 -200 117
7853A17j64n9K82j5n5o6p6M6j10K49k97l5J2M35k3j81J41k69j09J32J64k40J45
$$ 117 -47 -106 176 161 106 40 -36 10 -100 149 -148 -183 -171 264 241 60 201 -68 -177 -45 119 -121 24
7876B4j40K18l1j67Q3M8J06p8K35k35j38r3J46J31J35l28K13j80P8J31l62K96
$$ 24 -116 102 71 -96 -13 35 141 63 298 63 -75 -168 -22 109 244 -84 129 -51 27 158 -204 92
7898I2k41R8r8l6J90m0R2K63j65l45K15k23Q3J13J05k72j59N16l67J8j23K17J40
$$ 92 -149 -51 -149 -185 5 -35 57 320 155 -190 25 -198 -115 -2 103 -169 -328 188 -179 -161 -284 -67 73
7921G3j66J51j50N9J89k06J25r5N6Jj00k29K93q9k16N37j39k8mn2j77J40j83L8
$$ 73 -93 58 -92 -33 156 -50 75 -20 36 37 -63 -292 1 -88 -304 233 94 66 62 10 -167 -27 -210 -172
7945a72M5J74p1k94L0L20O9J92o9l55J37p4N7O1M9p4L8l05PL10l45M75M1m29R3
$$ -172 -127 47 -24 -318 -288 32 101 293 224 -131 6 -68 -11 50 99 25 63 -242 -235 75 -270 205 246 -183 -90
7970i0p4J2j5J32j17K14j80m6L01k74m3L43k41J14P9k71K38r2J8k67O0m9M28j38
$$ -90 -164 -152 -167 -35 -152 62 -118 -164 137 -137 -180 163 -78 36 115 -156 82 -10 8 -259 -199 -248 180 42
7994D2J35k37p2j25M27q7j34M6K0l11K00L55N6k39k74J75k29L05J12k34J01M5
$$ 42 177 -60 -132 -257 170 83 -51 -5 15 -296 -96 259 315 76 -198 -23 -252 53 165 -69 32 77
8016G7l4J12j13p0q2J48j58l7L39l86L07M5M9m94J88J66k02J25m8j2p8KJ97r5
$$ 77 43 155 42 -28 -110 38 -120 -157 182 -204 103 148 197 -297 -109 57 -145 -20 -68 -80 -158 -156 41 -54
8040e4P4K15k94j07K82m8k4k86O3m9J59K09J26l34J52m4N5J02r2l3L76l52k2j31
$$ -54 20 235 -59 -166 116 68 44 -242 -179 -228 -69 140 266 -68 84 40 95 197 105 72 448 96 74 -57
8064e7Q9J9m45L86j22M54j74k06K00j4k40M06j52Q8m47K65j98K62j57N4k0p6k63
$$ -57 32 51 -394 -8 -130 324 150 -56 144 130 -110 296 144 232 -215 50 -148 114 -43 11 -9 -85 -348
8087c48L94r3J04l34K93m5R1%j76M8L10j25j97J19Jk05R6k5J25j8qr1j38J95J67
$$ -348 46 -47 57 -277 16 -29 62 62 -114 -66 244 119 -78 41 42 -163 -67 -92 33 15 7 -84 -222 -27 140
8112A40k72J39r5n3RK6K48k09j16J88J9K61k48q7K76l25j58K69j75N4J0K16j39
$$ 140 -132 7 -88 -141 -132 -106 142 -67 -183 5 24 285 37 -50 226 -99 -257 12 -163 -109 -99 117 -22
8135b2M9L02k26k06L42j06l10Q9M9j34O8K3o0J33n1r9L60p6j13j54K11j17j44
$$ -22 27 329 103 -103 239 133 -177 -88 -39 -173 -105 -82 -142 -9 -60 -159 201 125 12 -142 69 -48 -192
8158a92J76l45L90j16O7k1K63J7j39j71P1K8K6R0j00mJ01j71j10K57k57p3K89
$$ -192 -16 -361 29 -87 -20 -41 222 239 100 -71 0 28 54 144 44 40 141 -30 -140 117 -140 -213 76
8181G6j19k75K03Q3KR4j85R3J06j43
$$ 76 -43 -318 -115 -32 -30 64 -121 -28 78 -65
8191f5
$$ Imaginary data points
##PAGE= N=2
##DATA TABLE= (X++(I..I)), XYDATA
0@%%%%%%%qJ6j6J6k4L2m0M8n6P2q6J02j20J37j61J87k14K48k83L23l69M18m74
$$ 0 0 0 0 0 0 0 0 -8 8 -8 8 -16 16 -24 24 -32 40 -46 56 -64 73 -88 99 -115 133 -150 173 -196 222 -252
30b52N33o00O75p54Q43r41J048j166J297j439J593j762J948k157K391k651K945
$$ -252 281 -319 356 -398 445 -496 552 -614 683 -756 837 -925 1023 -1134 1257 -1394 1551
47A551l277L655m095M610n224N971o900Q099r713J2010j5577K1923l6602J30602
$$ 1551 -1726 1929 -2166 2444 -2780 3191 -3709 4390 -5323 6687 -8890 13033 -23569 107033
61A07033N2414k60951m6077J16630J36980J2662p792o0381j10360o9938J01534
$$ 107033 159447 -101504 -147581 -30951 106029 118691 110899 50518 -59842 -129780 -28246
72b8246J45719M1534o0734o2341p8816o5748M5207J60717Q5005p6655j19962m1962
$$ -28246 117473 159007 98273 35932 -42884 -108632 -63425 97292 182297 105642 -14320 -56282
84e6282M884L4272Q9082Q7364m0317j41894r0997L5356J02558J04169M9592o6782
$$ -56282 -51398 -17126 71956 159320 119003 -22891 -113888 -78532 24026 128195 177787 111005
96A11005j51749q3991O3513J12738N0977k885l3229q2047q2558K5380J26816R0563
$$ 111005 -40744 -124735 -61222 51516 102493 99608 66379 -15668 -98226 -72846 53970 144533
108A44533j9160q0191q8315o7083J9552J30057J18983j9968j18125q6864j4706
$$ 144533 125373 45182 -43133 -110216 -90664 39393 158376 138408 20283 -66581 -81287
119h1287L4585Q2035R2859j062j20581j09499J2082R0467P6925L6835j4423q7587
$$ -81287 -46702 35333 128192 127130 6549 -102950 -90868 -401 76524 113359 98936 11349
131A1349j08847j9465R0876R8748K8665l2810o4356p4453k4166P4141J12890L4179
$$ 11349 -97498 -116963 -26087 72661 101326 68516 4160 -70293 -94459 -20318 92572 126751
143A26751p6231j07552n3385K8699Q8217Q8480J9093o7805r6650m7893K7910P8109
$$ 126751 50520 -57032 -110417 -81718 6499 94979 114072 46267 -50383 -98276 -70366 7743
155G743P2277J2600o3197q9790m0099M1886Q9367O6086r789q1222r0142k9120
$$ 7743 80020 92620 29423 -60367 -100466 -58580 30787 96873 87084 5862 -84280 -113400
167a13400N1577R0383O4473n179p5206q8652k6316N9639Q9310M1436l6075q0104
$$ -113400 -61823 28560 93033 87854 12648 -76004 -102320 -42681 46629 88065 51990 -28114
179b8114o4046L18O6596Q2030L5097l4946p8922o9599p699O5659Q6869L1764m7643
$$ -28114 -92160 -91842 -25246 56784 91881 56935 -21987 -91586 -99285 -33626 53243 85007 37364
192C7364p8376m7548J4252O5588P0636J4615n9685q2350l6256L0428O9777O8382
$$ 37364 -41012 -88560 -74308 -8720 61916 76531 16846 -65504 -101760 -71332 -1555 66827
204F6827J8294n8115r1050l9539M2619P2682M1733n125m5952o7305l2850M4971
$$ 66827 85121 27006 -64044 -103583 -60964 11718 53451 48326 2374 -64931 -97781 -52810
216e2810Q6435M4468k8918o4891n9295k4018L7646Q3635N4708k9665p4765m7595
$$ -52810 33625 78093 49175 -15716 -75011 -99029 -61383 22252 76960 47295 -27470 -75065
228g5065J663L6707N7081M2201k3607q0276n6393J9158O4441N5621K1996k7304
$$ -75065 -73402 -36695 20386 62587 38980 -41296 -97689 -78531 -14090 41531 63527 36223
240C6223p1816o1261J1618O9885N6375M619l3353m9478m0741R445O5947O0315
$$ 36223 -35593 -96854 -85236 -15351 41024 45643 12290 -37188 -77929 -68484 -2537 57778
252E7778o122n7372n5560k3311J8011O0292O3840M893o0971o3510j4025L0134
$$ 57778 51656 -5716 -61276 -84587 -66576 -6284 57556 62449 1478 -62032 -76057 -45923
264d5923M7697M2133R44n4084o2189o353N1667N5526K3138j3911m8694n8762j6685
$$ -45923 1774 43907 44851 -9233 -71422 -77775 -26108 29418 52556 38645 -10049 -68811 -85496
277h5496M8785O6579K4679k3610m3658l9880j1063L8487O1343K3099l8845n7938
$$ -85496 -36711 29868 54547 30937 -12721 -52601 -63664 -25177 36166 59265 20420 -37518
289c7518k9069J1567M3451N5246K4543l5957o5739l4073J8944M4867L9155J3554
$$ -37518 -66587 -55020 -11569 43677 68220 32263 -33476 -67549 -48605 -3738 35417 48971
301D8971k5771n2016l1240K3594N3836L6065m007l6984m9562k8577K2621O0464
$$ 48971 23200 -28816 -60056 -36462 17374 53439 49432 12448 -37114 -65691 -43070 17394
313A7394M4781o460m3141m3929j7322J9689M7570L6737j0161m7301m0491j966
$$ 17394 62175 55715 12574 -31355 -48677 -28988 18582 55319 45158 -2143 -42634 -44600
325d4600L3160M5923K9085j3110n0248m7419m400L7052M6618K4434j1920m1060
$$ -44600 -11440 34483 63568 50458 210 -47209 -51609 -14557 32061 56495 44575 3515
337C515l9813k510L8393M4752J1994k6787m4118l0961N981M3366M8611J3469l0641
$$ 3515 -36298 -38808 -415 44337 56331 29544 -14574 -45535 -39554 3812 52423 65892 35251
350C5251m7285k9395P196L6725M0679J1089k8736m4053k1225J8080M1335L3129
$$ 35251 -12034 -41429 -34233 2492 43171 54260 25524 -18529 -39754 -21674 19661 52790
362E2790R79l4784m7052k1263K2567M7044L5645j135l4264m1828j7972K0148M1866
$$ 52790 53769 18985 -28067 -49330 -26763 20281 55926 54791 20527 -21301 -39273 -19125 22741
375B2741K7467r773l7508l5461o120K8629M4163K6780j4058m4253l9856o769L0027
$$ 22741 50208 40435 2927 -32534 -38654 -10025 34138 60918 46860 2607 -37249 -44018 -13991
388a3991M2312K3977j2770l9270l3515J6L2611L8751J3163k2113m1868k9822N999
$$ -13991 28321 52298 39528 258 -33257 -33241 -630 38121 51284 29171 -12697 -42519 -36520
401c6520L9127M2307J3491k5571m3711k9575N740L5446L6650R475k5469l8585
$$ -36520 2607 44914 58405 32834 -10877 -40452 -34712 734 37384 46859 21390 -17195
413a7195k0582J5092L9280L2657k88l3682m2801j9740J8785M2877L3325l91l1712
$$ -17195 -37777 -22685 16595 49252 48964 15282 -27519 -47259 -28474 14403 47728 47337 15625
426A5625l7801j5391J9244L7986K6051p995l6132l4491o005K8390M0978K3025
$$ 15625 -22176 -37567 -18323 19663 45714 37719 1587 -32904 -38909 -10519 30459 53484
438E3484j3401m0619l7669n456K9691M0009K1246j3332l6930l1050P96L1860L6865
$$ 53484 40083 -536 -38205 -43661 -13970 26039 47285 33953 -2977 -34027 -33231 -1371 35494
451C5494J0849k3942m0826k7226O966L8186M0508J2035k5355m1689k6188P170
$$ 35494 46343 22401 -18425 -45651 -38685 -499 40009 52044 26689 -15000 -41188 -34018
463c4018L4201L3954O754k7681l7552j7619J6312L7486K9984r90l3050m1257j7198
$$ -34018 183 34137 40891 13210 -24342 -41961 -25649 11837 41821 40831 7781 -33476 -50674
476e0674K0859M0722K9974k655l1733l6535j2732K1387L6083K1072j1040l4265
$$ -50674 -29815 10907 40881 38226 6493 -30042 -42774 -21387 14696 35768 24728 -9537
488i537l1069l589K8629M0324K0418j6242l9789l2907k412K8416L7115J6572j7518
$$ -9537 -40606 -44195 -15566 24758 45176 28934 -10855 -43762 -46174 -17758 19357 35929 18411
501A8411l6692k4877N935L1378L2927Q575k4422m0218k3743J1612L8083L4954
$$ 18411 -18281 -43158 -37223 -5845 27082 35657 11235 -28983 -52726 -41114 -3031 31923
513C1923O292k6574l8817k1856J1875L5243K8489R92k7274l3328j3886J9358L8699
$$ 31923 38215 11641 -27176 -49032 -37157 -1914 26575 27567 293 -33035 -46921 -27563 11136
526A1136K6356p483l4715l5870j1916K1462L8716K5804p282l2582k9842n331K1950
$$ 11136 37492 30009 -4706 -40576 -52492 -31030 7686 33490 26208 -6374 -36216 -41547 -19597
539a9597L3869J8151j3617l6799k8146M254L1069L3827J4165j6698l6874k8746
$$ -19597 14272 32423 18806 -17993 -46139 -41885 -10816 23011 37176 20478 -16396 -45142
551d5142L756L1638L1141Q558j6591l1137k2020P782L4235K9806q11k7796l2410
$$ -45142 -41386 -9748 21393 29951 13360 -17777 -39797 -32015 2220 32026 31215 3419 -28991
564b8991j6159J1526L5613L2593J903k9946l2836j1148J4673K9255K4150k141
$$ -28991 -45150 -33624 1989 34582 36485 6539 -26297 -37445 -22772 6483 30633 28492
576B8492l0999l1674k941K5283L0312J6415n855k9865l4168p260K7320L5199J4211
$$ 28492 -2507 -34181 -37122 -11839 18473 34888 29033 -832 -35000 -42260 -14940 20259 34470
589C4470j0996k5961k5946n136K6594L4693O920k3168k9412j5259M325K5370L4162
$$ 34470 23474 -2487 -28433 -33569 -6975 27718 34638 11470 -17942 -33201 -28876 -3506 30656
602C0656J2463k4250l6263j5212R490K1906K3529J0069j8559l3562j4122J8605
$$ 30656 43119 18869 -17394 -32606 -23116 -1210 22319 32388 13829 -19733 -33855 -15250
614a5250K8635J7160r89j9794l2954j8032J9623L8375J9254r325k2450k2387j1289
$$ -15250 13385 30545 29556 9762 -23192 -41224 -21601 16774 36028 26703 4253 -18134 -29423
627b9423J2946L1858J8111j4376k6828j5644j10J4458K8059K0911j2018l6080
$$ -29423 -16477 15381 33492 19116 -7712 -23356 -23466 -9008 19051 39962 27944 -8136
639h136k3281N340J9812K1361J5524n924l0262k4455Q967K8921J7721r3j3065
$$ -8136 -31417 -26077 -6265 15096 30620 24696 -5566 -30021 -21054 7867 25588 25495 12430
652A2430k4084k0732P002L3951K4760m622j9596j7699j3037q4K2600K7463N70
$$ 12430 -11654 -32386 -25384 8567 33327 28705 9109 -8590 -21627 -21711 889 28352 28922
665B8922k5138k0867k708J0725J9707K1397M42k9507l0181p90K1224K0723J2696
$$ 28922 3784 -17083 -19791 -9066 10641 32038 32480 2973 -27208 -27998 -6774 13949 26645
678B6645N4j9250k5812m748K1613K1474L329q803j5315j7781m283K0653K8378
$$ 26645 26699 7449 -18363 -23111 -1498 19976 23305 14502 -813 -18594 -22877 -2224 26154
691B6154P360j5549k0514j5555l867J6209K7812J0730j8133k3765p698P665J4281
$$ 26154 33514 17965 -2549 -18104 -21971 -5762 22050 32780 14647 -9118 -16816 -9151 5130
704E130J7425O548j7925k7064q402J4586J9084J2985M762j0471k4204j5164J0512
$$ 5130 22555 29103 11178 -15886 -24288 -9702 9382 22367 27129 16658 -7546 -22710 -12198
717a2198K2217J1522l274j1634j6460j0426J0677K6320J4842j0428k2099j5351
$$ -12198 10019 21541 18267 6633 -9827 -20253 -9576 16744 31586 21158 -941 -16292
729a6292m250J0599K1524J5053n977k0513j3879K68J0143J4328R790o330k0004
$$ -16292 -20542 -9943 11581 26634 20657 144 -13735 -13467 -3324 11004 20794 14464 -5540
742e540j5108L403J6301J7346Q782q094k2203j7656K681J8120J6014M169q176
$$ -5540 -20648 -17245 -944 16402 25184 17090 -5113 -22769 -20088 -1968 14046 18215 10039
755A0039j6335j2904M408J9724J4444l303j4026j4411r197L258J8759J8853J528
$$ 10039 -6296 -19200 -14792 4932 19376 16073 2047 -12364 -21561 -18303 456 19309 20837
768B0837j5932j6613o932L916J3580J5679J465j7169j7186j551J2021J4857J0913
$$ 20837 4905 -11708 -18640 -14724 -1144 14535 16000 -1169 -18355 -19906 -7885 6972 17885
781A7885k352j6982j9397l600J3013J7208Q970j831j3000j6092l781J3332J5762
$$ 17885 15533 -1449 -20846 -24446 -11433 5775 14745 12914 -86 -16178 -19959 -6627 9135
794I135M310p122j3151j2870k119J5228K1087O355j2378j5872j0783k062J0957
$$ 9135 13445 6323 -6828 -19698 -21817 -6589 14498 20853 8475 -7397 -18180 -20242 -9285
807i285J8463Q107j1793j7733m675N914J0080J1521O370j0505k2088j0152J1044
$$ -9285 9178 17285 5492 -12241 -16916 -11002 -922 10599 16969 6464 -15624 -25776 -14732
820a4732J7277J0233K635p433j7126j2398P118J8806R528m806r698j0503p406
$$ -14732 2545 12778 15413 7980 -9146 -21544 -14426 4380 13908 9102 -596 -11099 -18505
833a8505O332J9971J3772o919j8353j2258l005O531J5701J4954k904j7729j2903
$$ -18505 -12173 7798 21570 14651 -3702 -15960 -18965 -12434 3267 18221 15317 -2412 -15315
846a5315J568R345J1088Q789l747j8603j5175M315J6984J3496L849m265j4699
$$ -15315 -13747 -4402 6686 15475 11728 -6875 -22050 -17735 -751 12745 16594 12329 -2370
859b370j6601q58J6577J5778R82q120j0773j0080m41J6236J7976o07j6986j5105
$$ -2370 -18971 -19829 -3252 12526 13508 5388 -5385 -15465 -15906 330 18306 17699 713 -14392
873a4392m001L954J2761J7054M801j4823j8237m378Q407J0732Q948K070j1233
$$ -14392 -18393 -14439 -1678 15376 20177 5354 -12883 -17261 -8854 1878 10826 12896 1663
886A663j7831m608J3831J6945O843l917j1774j6491p538J1480K0137Q694p468
$$ 1663 -16168 -20776 -6945 10000 16843 12926 1152 -15339 -22877 -11397 8740 17434 9966
899I966j2988j0150k225R598J6062P182j0553j6895q243L455J1097J5200Q619
$$ 9966 -3022 -13172 -15397 -5799 10263 17445 6892 -10003 -18246 -14791 -3694 11506 20125
912B0125q407j8932j1943M063J2942J2211M162p418j5727r495P267J6883J1131
$$ 20125 11718 -7214 -19157 -15094 -2152 10059 14221 6803 -8924 -18419 -11152 5731 16862
925A6862k021j1354j5039r358O934J8304J3966k724j2878j2297m686N397J4055
$$ 16862 14841 3487 -11552 -20910 -13976 4328 18294 15570 2692 -9605 -14291 -8894 5161
938E161J1624l361j5517j2577l15J1148J4667R673m332j7128j5761j40J3081J4836
$$ 5161 16785 13424 -2093 -14670 -14985 -3837 10830 20503 16171 -957 -16718 -16858 -3777 11059
952A1059N942n120j2998j1725J413J3250J3524K238r962j4276r053K715J4912
$$ 11059 17001 11881 -1117 -12842 -11429 1821 15345 17583 7621 -6655 -15708 -12993 1919
965A919J5446L306j0885j5211q276L835J2762J2453J397j1433j3829n024Q263
$$ 1919 17365 20671 9786 -5425 -13701 -9866 2896 15349 16746 5313 -8516 -13540 -5277
978e277J4405J0011k137j3530j5620m085R214J5493R659k388j2077j2710l218
$$ -5277 9128 19139 17002 3472 -12148 -16233 -7019 8474 18133 15745 3668 -9042 -12260
991a2260Q959J3743O239n696j3756j1206N09J2764J4929O010q039j5362j0886
$$ -12260 -3301 10442 16681 10985 -2771 -13977 -13468 -704 14225 20235 12196 -3166 -14052
1004a4052J082J1767J2868M264p924j2612q165L940J2551J0836N49j0574j4332
$$ -14052 -12970 -1203 11665 15929 8005 -4607 -12772 -8832 3719 14555 15104 4530 -9802
1017i802o610O034J4032J1906L31j0588j3814n999O225J2391Q319j667j1211j1261
$$ -9802 -16412 -10378 3654 15560 15891 5303 -8511 -14510 -8285 4106 12425 10758 -453 -11714
1031a1714j819Q957J3387P345m933j3089j2077j858R512J3145P209m719j2002
$$ -11714 -13533 -4576 8811 16156 11223 -1866 -13943 -15801 -6289 6856 14065 9346 -2656
1044b656r424N95R081J1247M046p550j2886p778L336J1647J1916L094q005j3216
$$ -2656 -12080 -11485 -2404 8843 12889 5339 -7547 -15325 -11989 -342 11574 14668 6663 -6553
1058f553q305L069J1099R798J508p558j0760m810N369J1449Q171j908j0290j1483
$$ -6553 -14858 -11789 -690 9108 10616 3058 -7702 -12512 -7143 4306 12477 10569 279 -11204
1072a1204l800O152J2308R362j616r988j0198k994O350J0347N820l306j0727q427
$$ -11204 -15004 -8852 3456 12818 11202 1214 -8984 -11978 -5628 4719 10539 7233 -3494 -11921
1086a1921N23R046J0940M331n094j0897r417QQ943J0727L704m672r432o715J436
$$ -11921 -11398 -2352 8588 12919 7825 -3072 -12489 -12481 -3538 7189 10893 6221 -3211 -9926 -8490
1101h490Q823Q648J204p921r615n334L664J0254R540J125p840j0405n168L276
$$ -8490 333 8981 10185 2264 -7351 -12685 -9021 1233 10773 11898 4058 -6347 -11515 -8239
1115h239Q673P449J36p151q502k734N826R286N531k337r007r053k756O552J0345
$$ -8239 434 7883 8019 868 -7634 -10368 -4542 4744 10275 7938 -1069 -10122 -12878 -6326 4019
1130D019N584j795p680q098j667N648Q044L383l896p816n899Q41P010R109L467
$$ 4019 9603 7808 128 -7970 -9637 -3989 4055 7438 3542 -4274 -10173 -9332 -2322 6787 10254
1145A0254n215r580o425N86O464Q079L418l983p956m686K299O849N980L12n283
$$ 10254 5039 -4541 -10966 -10380 -3916 4163 7581 3598 -4358 -9044 -6745 104 6084 6396 1113
1160A113q651m507L671R189O917K35n411p937m827K381P464N806q37n443n702
$$ 1113 -7538 -12045 -8374 815 7732 7967 2556 -5381 -10208 -7827 -363 5443 4606 -837 -6539
1175f539j928M047P680N372k238q182o788j445M544P160N590n31o689o360o99
$$ -6539 -8467 -4420 3260 8632 6394 -1788 -8576 -10021 -5477 1683 7273 6742 53 -6307 -7006
1190g006M566N007L363j999o597n748J012O746P448J994l153o955o167p73O138
$$ -7006 -2440 2567 5930 3931 -2666 -8414 -7402 -656 6792 8786 5633 -1322 -7489 -8262 -2124
1205b124O857K187l056n243l777O75N557O190P68n729o803k451J873N902P087
$$ -2124 4733 6920 3864 -1379 -5156 -4481 1076 7266 8034 2305 -4498 -6949 -5076 826 7913
1220G913K415n090q274k967K169N130M298J274l865p035k123M777O683L439j138
$$ 7913 10328 5238 -3036 -6003 -3834 1296 5594 6868 3003 -4032 -6155 -1378 5305 8744 7606
1235G606n109o808l601M126Q106M265j668m015m842k521K434O722L992k994o958
$$ 7606 2497 -4311 -7912 -3786 4320 8585 6917 2902 -1940 -4461 -2027 4695 8687 5693 -1265
1250a265l991N04M261O224M798k711q346n698L09M914M797L321j102o227n095
$$ -1265 -5256 -4752 -491 5733 10531 7820 -526 -6224 -5915 -1001 3796 7117 6015 -212 -5307
1265e307J215O222M681m1l343n632n715J105P797P113K88m697n041m448J43N522
$$ -5307 -4092 2130 6811 6770 3427 -2205 -7920 -6815 982 8095 8383 3686 -1355 -5803 -5660 -138
1281a38O489J25o016n062p44K514N089N219P06p180p788j355M022N329M860R48
$$ -138 6351 6476 460 -4602 -5346 -2832 2257 7476 8182 1002 -6786 -8141 -4119 1210 6070 7018
1297G018m903p372j858N023N813K014k141m506n689j879O380Q652K327m277n672
$$ 7018 2115 -5257 -7115 -2092 3721 5735 3594 -912 -6601 -8480 -2100 6552 8879 4602 -1070
1312a070m843j596L914P663L240l880o333k479J407L807N133K982m372q804l655
$$ -1070 -5913 -7509 -3595 4068 7308 3428 -2905 -5384 -3977 -170 4963 7945 3573 -5231 -8886
1327h886L247O664M973K046l387p441m989K642O798M076j142l425n280k725L090
$$ -8886 -5639 1025 5998 8044 4657 -2784 -7773 -5131 1667 5743 4601 1176 -4104 -6829 -3739
1342c739Q103M846k550o198o063k224K794P657N809j741o534m811k29K998N702
$$ -3739 4364 9210 6660 462 -5601 -7825 -5031 2626 8435 6694 160 -4651 -4880 -1882 3820
1357C820L690k338p631n477J884O116N696K686k399p090o700O71O703N261J513
$$ 3820 7510 5172 -2459 -7936 -6052 64 5760 8446 6047 -1043 -7743 -7072 -369 4892 6405
1372F405k968n084m685J318O627O188r48n766n936l141J911O763O829J95o117
$$ 6405 3437 -1647 -6332 -5014 1613 7801 6853 1087 -4849 -7990 -6079 684 7513 7708 1591
1387A591o187j756K197N313M656o58o306n912L9M940N611L563j471o398p003j113
$$ 1591 -4596 -6352 -4155 1158 5814 5156 -1150 -7062 -7023 -2083 3528 7091 5620 -778 -7781 -8894
1403h894N489O226K787j388n269n475o39O105O160M56m582n202l581K37N621P897
$$ -8894 -3405 2821 5608 4220 -1049 -6524 -7163 -1058 5102 5558 976 -4226 -7807 -7570 -1949 5948
1419E948J510n297o458k563O43M039N754J947m832o736q89L748M723L395L77n085
$$ 5948 7458 2161 -4297 -6860 -6217 -2178 3576 5523 691 -6045 -6934 -3186 1537 4932 5309 224
1435B24p586k723N370P061K594k27m099n704k439L767O783K163l137m778l277
$$ 224 -7362 -10085 -4715 2346 4940 4713 614 -5090 -7529 -3762 3021 5184 2047 -2731 -6008
1450f008q49M239P267L374m589o829l180N62L067N211M004k534p239l116L348
$$ -6008 -6857 -2618 4649 8023 3434 -3395 -6575 -6013 -2946 2265 6269 3735 -3504 -6620 -3272
1465c272M589K692J045k515o978m274L780P312L424p40k667m076m633J262O620
$$ -3272 1317 4009 5054 2539 -4439 -8713 -4933 2379 5803 5063 2396 -1680 -6313 -5051 1569
1480A569M607k897m569j934o68J528N236M854k428o733m128R25K510L781M230
$$ 1569 6176 3279 -1290 -3224 -3892 -2364 2872 7726 5298 -1435 -5563 -4638 -2128 1653 5883
1495E883pn410n443J289M685K622N84j126m240m958J010O566M606n50k994l640
$$ 5883 5876 466 -4977 -3688 997 3619 4203 3077 -1163 -6121 -5111 1455 6061 5511 2517 -1123
1511a123l444q56M885N337J84m322k990m69N07L120M470M63n492n736J9L387L014
$$ -1123 -4567 -5423 -538 4799 4983 661 -2329 -2798 -2291 829 5299 5762 270 -5466 -5447 -2060 954
1528I54L246J663l446o341j546M084L579K59m33k026l493j424L969N170J240l479
$$ 954 4200 5863 2417 -3924 -5470 -1386 2193 2452 2019 -7 -3500 -4924 -955 4215 5455 1976
1544A976l212k207j275J896M989K893k396m171j488Q45J488K801J593j963n365
$$ 1976 -1236 -3443 -4718 -2822 2167 5060 2664 -1507 -2995 -2150 -662 2139 3732 1769 -3596
1559c596j598K137M346K187L64j508m097l268J527M027K155j68j682k344j461
$$ -3596 -5194 -3057 1289 3476 3840 2332 -1765 -5033 -3506 521 2676 2508 826 -1518 -2979
1574b979Q26L845K994j703l197l050q18R58M128L552m29l328l105r2J714K043
$$ -2979 -2153 1692 4686 2983 -214 -3264 -4082 -3124 1004 4556 4127 799 -2306 -2398 -684 1359
1590A359J284j73k729k398j49L264L001Q19j392k622l228q34K880L116J734j153
$$ 1359 2643 2470 -259 -2657 -2806 458 3459 4278 2886 264 -2964 -3798 -918 2198 3932 2779
1606B779k038k167J39J705K608P43k121k928j587R18K965K911P56j453l171k617
$$ 2779 741 -1426 -1287 418 3026 3769 1648 -1280 -2867 -1949 1016 3927 4683 3230 59 -2558
1622b558M43K527K190N27j270k395j066J084K413K164p48k464k922p96J095K682
$$ -2558 -2115 412 2602 3129 1859 -536 -1602 -518 1895 4059 3311 847 -2075 -2871 -1776 906
1638I06K783L96k232l168o04J026J742J263Jj610k357q46K409K756J061n22k407
$$ 906 3689 4085 1853 -1315 -1919 -893 849 2112 2113 503 -1854 -2700 -291 2465 3526 3004 597
1655E97l057j274J666L208J625n91k031j459o82J125K165J563j825l135j424Q39
$$ 597 -2460 -3734 -2068 1140 2765 2174 143 -1316 -1998 -873 1292 2855 1030 -2105 -3529 -2690
1671b690J760K621J482o28l362l069O16K291J749P01n28k196j847Q94K755K089
$$ -2690 -930 1691 3173 2545 -817 -3886 -3270 -979 770 1471 943 -1253 -3100 -2206 549 2638
1687B638l49k218k223j599K54K757L404K89k349k219j041K32J846K373m1k436
$$ 2638 2289 71 -2152 -3751 -3497 -740 2664 2953 604 -1615 -2656 -2424 -578 1795 1754 -682
1703f82k321m04K238K271J499L7k270l893q14K069L253J153m43j249k154q07J253
$$ -682 -3003 -3407 -1169 1102 2601 2638 368 -3525 -4339 -2270 983 2136 1693 444 -1710 -2517 -1264
1720a264K941R49j578k563j465l16K336L291J642j301l451k058J82J650K446J207
$$ -1264 1677 2626 1048 -1515 -2980 -3296 -960 2331 3973 2672 -779 -2837 -2655 -1005 1441 2648
1736B648q18k997j794J537K742J644J77j923l041k171J012L821K467k58j613k355
$$ 2648 1830 -1167 -2961 -1424 1318 2962 3139 1216 -1825 -3996 -2984 837 3304 3046 1433 -922
1752i22k077R08K938K182o16k851k028l16J953K732K281q38l423l007l55K131
$$ -922 -2999 -2091 847 3029 2413 -438 -2466 -2782 -829 1903 4184 3346 -77 -3084 -3439 -1308
1768a308K282J959m62k512k468J30K127K512O67j745k709k540L94L059L357R74
$$ -1308 974 2933 2471 -41 -2509 -2379 -252 2260 2927 1182 -1527 -4067 -3673 -614 2743 3717
1784C717j804k986k192L64K135K416O10j970k751o07J132K926K146l78k554l480
$$ 3717 1913 -1073 -3265 -2901 -766 1650 2260 290 -2461 -3068 -1936 990 3136 2758 204 -3276
1800c276j419J755L301K204J55k464l067p54J750K770J485j115k805k168q5K303
$$ -3276 -4695 -2940 361 2565 2720 256 -2811 -3565 -1815 955 2440 1325 -1480 -3648 -3733 -1430
1816a430L202J531j421l004k664j59J918L218J181j335k647j834Q12K203K779
$$ -1430 1772 3303 1882 -1122 -3786 -3945 -2027 1191 2372 1037 -1610 -3444 -2632 -429 2350
1831B350K82k077l424j073P97K919K730N42j980k913j432J196K333J778k48j958
$$ 2350 2632 555 -2869 -3942 -3145 -226 2504 3046 1066 -1847 -3279 -2083 250 2028 1780 -178
1847a78k367n90K369K716J519p78k719k510j162J804L618J779r58k315k080l33
$$ -178 -2545 -3135 -766 1950 3469 2691 -28 -2538 -3700 -1896 1722 3501 2543 228 -1852 -2185
1863b185J601K733J118j906k657j657Q71K452K596R40j799k824j966P04K278K001
$$ -2185 -584 2149 3267 1361 -1296 -2953 -2082 370 2966 3906 2107 -717 -2683 -1979 299 2300
1879B300L08j380k079j308J117K921J791p49k627j834j205J397K799K261m97k445
$$ 2300 2608 1228 -851 -2159 -1042 1879 3670 2921 294 -1540 -2745 -1348 1451 3712 3215 770
1895G70j838m69J071J771J612r32k513j563N27J780K001J107q78k655k434K92
$$ 770 -1068 -1537 -466 1305 2917 1985 -528 -2091 -1564 216 2217 3324 2446 -209 -2643 -2351
1911b351J857K513K99p45j724j510L15K228J579k93j733j962q00N21K062K772
$$ -2351 -494 2019 2318 1573 -151 -1661 -1346 882 2461 2168 435 -1527 -2327 -1806 256 3028
1927C028K3j811k209j020L61J388K126o4j556k054mJ266J663J147k92k370k116
$$ 3028 3051 1240 -969 -1989 -1628 -240 1886 1822 266 -1788 -1792 -526 1137 2284 1992 -378 -2494
1944b494k69J696J888J265m17j457j446o41J651J412N76j164j357j165L45J638
$$ -2494 -2763 -1067 821 2086 1669 212 -1234 -1875 -224 1188 1764 600 -757 -1922 -1577 61
1960F1K160K56j390j767j171K80J065J779M58p49k079j93R20J428M41K4j096k325
$$ 61 2221 2477 1087 -680 -1851 -1571 -506 1273 1731 982 -1097 -1290 -370 1058 1499 1523 427 -1898
1978a898j04J132J816Q55j42o28j607q98O54J685N77p12p07o00m88J159J889N61
$$ -1898 -2002 -870 946 1801 1659 1031 -576 -1474 -820 865 1442 730 23 -577 -1065 94 1983 2544
1996B544j209j225j179j41O20J496J310o48j163p60L82K21N03M58k92j614q80
$$ 2544 1335 110 -1069 -1210 -590 906 2216 1568 405 -355 27 248 751 1209 917 -697 -1577
2013a577J262J035J254j23j68j442j508K50J198Q57k48m01k16o61m39J457J233
$$ -1577 -315 720 1974 1851 1683 241 -1267 -1017 181 1038 790 389 173 -488 -927 530 1763
2030A763n57j434o46k85n7J051J508M02j306j146m4K98j04Q21K38n90j089L7J362
$$ 1763 1206 -228 -874 -1159 -1216 -165 1343 1745 439 -707 -751 -453 -557 264 502 -88 -1177 -1140 222
2049B22N13k17K44q19j437q39J006J561Q6q1k68m88o89k28J497N13j413p48J59
$$ 222 735 518 762 -57 -1494 -2333 -1327 234 320 239 -29 -517 -1206 -1434 63 576 -837 -1585 -1426
2068a426rJ85J425J041n20j968n74K72JO12J086M11j391o89M76P18l4K90N5q34
$$ -1426 -1435 -1250 175 1216 696 -1272 -1846 -1574 -1573 -961 125 536 -855 -1544 -1068 -350 -384 -94 -39 -873
2088h73j623L33J847J194m55n06r4j102o62J082J287N9j169m54M27m43J040J006
$$ -873 -2496 -2163 -316 878 423 -83 -177 -1279 -1941 -859 428 487 -682 -1136 -709 -1152 -112 894
2106H94J94r84j700j54N86Q99N76Q91k34j658m60O75M93K94Q7l23j475o02J533
$$ 894 1088 104 -1596 -1750 -1164 -265 311 1202 968 -690 -1150 -475 18 312 399 76 -1399 -2001 -468
2125d68J329Q84n94p04r52r52J74J782O92l25j161j48n7K81P87J163p16j901n23
$$ -468 861 1745 1151 447 -505 -1457 -1283 499 1191 866 -295 -443 -500 -219 568 1731 1015 -886 -1409
2144a409K00J204J047Q01k05j389j404M27N42O61M99m39p02q84K16J467Q72Jp67
$$ -1409 -1209 -5 1042 1843 1638 249 -1155 -728 -186 475 974 535 -167 -1051 -835 632 1504 1505 738
2163G38j216r28p3J243J901j19j057j030n49L90J066Q60k33j114j093l41J118
$$ 738 -478 -1406 -1479 -236 1665 1546 489 -541 -1090 -700 366 1226 993 -121 -1214 -1555 -437
2180d37J133J295n28j409j475j40P32R93R18o7j250p48k74J418J016j65j61j730
$$ -437 696 1991 1463 54 -1421 -1561 -829 164 1082 1015 -235 -983 -1257 161 1177 1012 851 -879
$$ [...]
8191E1
##END NTUPLES=NMR FID
##END=
