##TITLE=1H_SR49_oil
 CDCl3,8 sc, 
 30.03.2021
##JCAMPDX= 6.0         $$ Bruker NMR JCAMP-DX V2.0
##DATA TYPE= NMR FID
##DATA CLASS= NTUPLES
##ORIGIN= UXNMR, Bruker Analytische Messtechnik GmbH
##OWNER= root
$$ XWIN-NMR		Version 3.5
$$ Tue Mar 30 13:07:41 2021 Russian Standard Time (UT+4h)  she@DPX200
##.OBSERVE FREQUENCY= 200.131506
##.OBSERVE NUCLEUS= ^1H
##.DELAY= (6, 6)
##.ACQUISITION MODE= SIMULTANEOUS
##.ACQUISITION SCHEME= undefined
##.AVERAGES= 8
##.DIGITISER RES= 18
##SPECTROMETER/DATA SYSTEM= spect
##.PULSE SEQUENCE= zg30
##.SOLVENT NAME= CDCl3
##.SHIFT REFERENCE= (INTERNAL, CDCl3, 0, 15.7039)
##AUDIT TRAIL= $$ (NUMBER, WHEN, WHO, WHERE, WHAT)
$$ ##TITLE= Audit trail, XWIN-NMR		Version 3.5
$$ ##JCAMPDX= 5.01
$$ ##ORIGIN= Bruker BioSpin GmbH
$$ ##OWNER= she
$$ F:/spectra/data/she/nmr/H-F/1/audita.txt
$$ ##AUDIT TRAIL=  $$ (NUMBER, WHEN, WHO, WHERE, WHAT)
(   1,<2021-03-30 13:06:20.59 +0400>,<she>,<DPX200>,
      <created by zg, POWCHK disabled, PULCHK disabled
       configuration hash MD5:
       00 E9 B6 7A A2 85 ED C7 34 08 36 98 17 FE 4E 26
       data hash MD5: 16K
       F0 E3 EE 02 82 A9 D9 DA F5 13 3D E5 07 56 C6 5D>)
$$ ##END=
$$ 
$$ hash MD5
$$ A5 FA 6D FD 3A D7 4B 74 65 71 18 FE BD AB A0 33
##$RELAX= 
##$RELAX= 
##$RELAX= 
##$RELAX= 
##$RELAX= 
##$RELAX= 
$$ Bruker specific parameters
$$ --------------------------
##$DU= <F:/spectra>
##$EXPNO= 1
##$NAME= <H-F>
##$PROCNO= 1
##$TYPE= <nmr>
##$USER= <she>
##$AMP= (0..31)
100 100 100 100 100 100 100 100 100 100 100 100 100 100 100 100 100 100 
100 100 100 100 100 100 100 100 100 100 100 100 100 100 
##$AQSEQ= 0
##$AQ_mod= 1
##$AUNM= <au_zg>
##$AUTOPOS= <>
##$BF1= 200.13
##$BF2= 200.13
##$BF3= 200.13
##$BF4= 200.13
##$BF5= 200.13
##$BF6= 200.13
##$BF7= 200.13
##$BF8= 200.13
##$BYTORDA= 1
##$CFDGTYP= 0
##$CFRGTYP= 5
##$CHEMSTR= <none>
##$CNST= (0..31)
1 1 145 1 1 1 1 1 1 1 1 1 1 1 1 1 1 1 1 1 1 1 1 1 1 1 1 1 1 1 1 1 
##$CPDPRG= <>
##$CPDPRG1= <>
##$CPDPRG2= <>
##$CPDPRG3= <>
##$CPDPRG4= <mlev>
##$CPDPRG5= <mlev>
##$CPDPRG6= <mlev>
##$CPDPRG7= <mlev>
##$CPDPRG8= <mlev>
##$CPDPRGB= <>
##$CPDPRGT= <>
##$D= (0..31)
0 1.2 0 0 0 0 0 0 0 0.06 0 0.03 0 0 0 0 0.0002 0 0 0 0 0 0 0 0 0 0 0 0 
0 0 0 
##$DATE= 1617095180
##$DBL= (0..7)
120 120 120 120 120 120 120 120 
##$DBP= (0..7)
150 150 150 150 150 150 150 150 
##$DBP07= 0
##$DBPNAM0= <>
##$DBPNAM1= <>
##$DBPNAM2= <>
##$DBPNAM3= <>
##$DBPNAM4= <>
##$DBPNAM5= <>
##$DBPNAM6= <>
##$DBPNAM7= <>
##$DBPOAL= (0..7)
0.5 0.5 0.5 0.5 0.5 0.5 0.5 0.5 
##$DBPOFFS= (0..7)
0 0 0 0 0 0 0 0 
##$DE= 6
##$DECBNUC= <off>
##$DECIM= 32
##$DECNUC= <off>
##$DECSTAT= 4
##$DIGMOD= 1
##$DIGTYP= 9
##$DL= (0..7)
0 120 120 120 120 120 120 120 
##$DP= (0..7)
150 150 150 150 150 150 150 150 
##$DP07= 0
##$DPNAME0= <>
##$DPNAME1= <>
##$DPNAME2= <>
##$DPNAME3= <>
##$DPNAME4= <>
##$DPNAME5= <>
##$DPNAME6= <>
##$DPNAME7= <>
##$DPOAL= (0..7)
0.5 0.5 0.5 0.5 0.5 0.5 0.5 0.5 
##$DPOFFS= (0..7)
0 0 0 0 0 0 0 0 
##$DQDMODE= 0
##$DR= 18
##$DS= 0
##$DSLIST= <SSSSSSSSSSSSSSS>
$$ [...]
##$SUBNAM2= <"">
##$SUBNAM3= <"">
##$SUBNAM4= <"">
##$SUBNAM5= <"">
##$SUBNAM6= <"">
##$SUBNAM7= <"">
##$SUBNAM8= <"">
##$SUBNAM9= <"">
##$SW= 16.9725357007746
##$SWIBOX= (0..15)
0 0 2 0 0 0 0 0 0 0 0 0 0 0 0 0 
##$SW_h= 3396.73913043478
##$TD= 16384
##$TD0= 1
##$TE= 0
##$TE2= 300
##$TE3= 300
##$TEG= 300
##$TL= (0..7)
0 120 120 120 120 120 120 120 
##$TP= (0..7)
150 150 150 150 150 150 150 150 
##$TP07= 0
##$TPNAME0= <>
##$TPNAME1= <>
##$TPNAME2= <>
##$TPNAME3= <>
##$TPNAME4= <>
##$TPNAME5= <>
##$TPNAME6= <>
##$TPNAME7= <>
##$TPOAL= (0..7)
0.5 0.5 0.5 0.5 0.5 0.5 0.5 0.5 
##$TPOFFS= (0..7)
0 0 0 0 0 0 0 0 
##$TUNHIN= 0
##$TUNHOUT= 0
##$TUNXOUT= 0
##$USERA1= <user>
##$USERA2= <user>
##$USERA3= <user>
##$USERA4= <user>
##$USERA5= <user>
##$V9= 5
##$VALIST= <valist>
##$VCLIST= <CCCCCCCCCCCCCCC>
##$VD= 0
##$VDLIST= <DDDDDDDDDDDDDDD>
##$VPLIST= <PPPPPPPPPPPPPPP>
##$VTLIST= <TTTTTTTTTTTTTTT>
##$WBST= 1024
##$WBSW= 4
##$XGAIN= (0..3)
0 0 0 0 
##$XL= 0
##$YL= 0
##$YMAX_a= 333594
##$YMIN_a= -239795
##$ZGOPTNS= <>
##$ZL1= 120
##$ZL2= 120
##$ZL3= 120
##$ZL4= 120
##$ABSF1= 10
##$ABSF2= 0
##$ABSG= 5
##$ABSL= 3
##$ALPHA= 0
##$AQORDER= 0
##$ASSFAC= 0
##$ASSFACI= 0
##$ASSFACX= 0
##$ASSWID= 0
##$AUNMP= <proc_1d>
##$AZFE= 0.1
##$AZFW= 0.1
##$BCFW= 1
##$BC_mod= 2
##$BYTORDP= 1
##$COROFFS= 0
##$CY= 11.3945322036743
##$DATMOD= 1
##$DC= 2
##$DFILT= <>
##$DTYPP= 0
##$F1P= 15.9154993809931
##$F2P= -4.1035820241983
##$FCOR= 0.5
##$FTSIZE= 0
##$FT_mod= 4
##$GAMMA= 1
##$GB= 0.15
##$INTBC= 1
##$INTSCL= 1
##$ISEN= 128
##$LB= 0.24
##$LEV0= 0
##$LPBIN= 0
##$MAXI= 10000
##$MC2= 0
##$MEAN= 0
##$ME_mod= 0
##$MI= 1.114404
##$NCOEF= 0
##$NC_proc= 0
##$NLEV= 6
##$NOISF1= 3.799351
##$NOISF2= 2.8
##$NSP= 1
##$NTH_PI= 0
##$NZP= 0
##$OFFSET= 15.70392
##$PC= 1
##$PHC0= -11113.8
##$PHC1= 5.200929
##$PH_mod= 1
##$PKNL= yes
##$PPARMOD= 0
##$PSCAL= 0
##$PSIGN= 0
##$REVERSE= no
##$SF= 200.130013532006
##$SI= 16384
##$SIGF1= 3
##$SIGF2= 2
##$SINO= 400
##$SIOLD= 16384
##$SREGLST= <1H.CDCl3>
##$SSB= 0
##$STSI= 0
##$STSR= 0
##$SW_p= 3612.71676300578
##$SYMM= 0
##$S_DEV= 0
##$TDeff= 0
##$TDoff= 0
##$TI= <>
##$TILT= no
##$TM1= 0
##$TM2= 0
##$TOPLEV= 0
##$USERP1= <user>
##$USERP2= <user>
##$USERP3= <user>
##$USERP4= <user>
##$USERP5= <user>
##$WDW= 1
##$XDIM= 8192
##$YMAX_p= 0
##$YMIN_p= 0
$$ End of Bruker specific parameters
$$ ---------------------------------
##NTUPLES= NMR FID
##VAR_NAME=  TIME,          FID/REAL,        FID/IMAG
##SYMBOL=    X,             R,               I
##VAR_TYPE=  INDEPENDENT,   DEPENDENT,       DEPENDENT
##VAR_FORM=  AFFN,          ASDF,            ASDF
##VAR_DIM=   8192,          8192,            8192
##UNITS=     SECONDS,       ARBITRARY UNITS, ARBITRARY UNITS
##FACTOR=    0.0002944,     1,               1
##FIRST=     0,             0,               0
##LAST=      2.4114304,     0,               0
##MIN=       0,             -239795,         0
##MAX=       2.4114304,     333594,          0
$$ Real data points
##PAGE= N=1
##DATA TABLE= (X++(R..R)), XYDATA
0 0 0 0 0 0 0 0 0 0 -8 8 -8 8 -8 16 -16 24 -32 32 -40 48 -61 72 -85 96 -117 135 -157 179 -206 237 -269
31 -269 304 -347 389 -440 494 -555 619 -691 770 -856 949 -1051 1162 -1284 1417 -1562 1721
48 1721 -1896 2087 -2299 2534 -2793 3086 -3411 3782 -4207 4695 -5268 5951 -6777 7803 -9109
63 -9109 10841 -13242 16790 -22546 33353 -60275 257239 332368 -191793 333594 24385 -53411
75 -53411 269317 44189 121172 119521 64582 173516 -17668 163164 148789 63585 280918
86 280918 73225 67639 178189 3727 141888 121122 84912 136956 52647 145721 35567
97 35567 32053 229150 39336 118688 176047 -69325 53652 94758 21475 99769 65639 45539
109 45539 -1941 26667 56545 -30327 92672 62654 -34492 75400 -58281 -63796 55437
120 55437 -48802 24778 31194 -64126 -2528 -52920 -35321 9388 -46084 18311 -37820 -101069
132 -101069 -25303 -80401 -54470 19784 -55951 -59680 -49405 -85692 -54682 -32733 -42419 -51835
144 -51835 -53765 -61295 -82663 -64336 -52032 -59430 -28399 -34774 -69607 -63019 -63024 -60360 -38519 -28056
158 -28056 -37923 -60736 -56696 -54685 -69276 -25741 -9818 -47149 -26407 -37463 -72116 -23122 -10995
171 -10995 -34629 -14714 -27136 -48800 -30766 -18003 -22160 -13806 1731 -11491 -18531 -10268 -23023
184 -23023 -13881 4886 3584 4596 -10176 -11291 -7374 -11722 25332 21396 469 25709 -6987
197 -6987 -13242 33952 11136 19358 41846 -588 5737 25001 9529 27372 37374 22602 23409
210 23409 27225 19434 20314 32294 29328 33525 38043 19119 21398 21797 19052 44183 39592 29145
224 29145 34937 12524 17173 37199 28166 39260 35123 11293 21194 19069 14713 37414 27275
237 27275 12735 27709 10980 1930 28780 14993 7182 32595 11494 -2612 16636 -1956
249 -1956 -4610 21506 10808 715 5593 -7323 -12522 1146 9005 4319 -2299 -5911 -15786 -18138
263 -18138 -2271 869 -10064 -5283 -8202 -25310 -12783 -2210 -19305 -7897 1779 -23408 -14922
276 -14922 -4002 -28079 -15118 3030 -17322 -11885 -4010 -27876 -22082 -2969 -9067 -6494 -143
289 -143 -14340 -22710 -12372 -5049 -7361 -2581 -291 -16747 -17086 -729 -8236 -7160 8180 -6742
303 -6742 -12482 2918 -9410 -13001 3887 -1818 -3945 6196 -4211 -11679 -4258 -2030 -200 5569
317 5569 2884 -6350 -9115 -4717 -2773 2817 8783 -715 -7718 -4352 -6826 -4254 5591 -461 -6577
332 -6577 74 -4856 -9963 1973 -1049 -7580 7088 1752 -11453 -576 -6991 -13355 5940 3182
346 3182 -5782 995 -8191 -12193 1214 3865 4045 3262 -2854 -5697 -6210 -277 5155 -74 1161 3888
362 3888 -6159 -49 8930 -3326 4399 14945 -2107 4706 11875 -9041 2489 14134 1241
375 1241 11164 12926 -3616 1890 10459 8915 12507 15847 7628 -331 6495 8465 6130 12666 10976
390 10976 5105 5148 7718 9312 4655 11438 14318 966 11108 11195 -7490 6990 9834 -1758 14181
405 14181 10580 -5030 2930 3547 1335 9690 8482 80 -3261 -1812 -1531 1178 3763 2072 -803
420 -803 -3428 -668 -702 -4480 2727 -375 -5749 3497 -4533 -9818 -476 -7222 -3902 4155 -4226 -4209
436 -4209 -5576 -9066 -2561 -1424 961 -1659 -10144 -6883 -7004 -5872 2123 -3257 -6185 -4057 -6030
451 -6030 -3424 -3688 -3020 -3371 -6514 -1024 -4888 -9758 -1990 -6613 -5062 2678 -5354 -3917 -4582 -10204
467 -10204 -1701 -4228 -2326 1841 -11195 -7445 -4041 -9644 2340 518 -8767 -3389 -7253 -6435 201
482 201 -4742 -4355 -4014 -6669 -2599 -4006 -7707 -4121 -1485 -3476 -531 -837 -9007 -3307 868 -5106
498 -5106 2757 2514 -8246 -638 -1454 -4386 6688 4309 -257 1935 -2409 76 5741 4842 4526 2756
514 2756 2003 3735 6133 5648 4532 7191 6571 8270 9862 2008 5259 9688 5252 15532 10543 796
530 796 12153 4634 5548 19273 5378 9470 13288 -2263 10367 10838 4076 17061 5995 1820
544 1820 10814 3725 7019 9547 5058 4821 4404 8039 486 -386 8026 -2740 5949 10560 -6901
559 -6901 661 161 -4501 6787 429 -767 -3360 -9672 1376 -6260 -5051 5940 -9997 -6457
573 -6457 75 -13440 -4310 463 -8944 -6723 -4072 -8138 -10241 -4000 -7625 -12046 279 -4965 -9916
588 -9916 -3706 -12667 -8224 -1552 -4975 -2013 -10131 -9517 -4617 -10634 1476 -1719 -10755 1099 -7734
603 -7734 -8230 2241 -6648 -1867 -104 -5629 -1347 -5058 -2158 -845 -4924 3158 -642 -2598 2002
618 2002 -5470 -2421 2011 1288 3968 -1874 -1893 -1213 -3432 6457 3430 -2562 3709 -2113 -3029 5080
634 5080 1123 -14 3531 806 -470 2455 708 -631 2845 1509 2417 2649 -1544 1773 -317 -374
650 -374 7630 1532 644 4269 -4674 1397 7155 799 5561 2915 -3653 3259 3163 1959 6109 2558
666 2558 955 3801 3527 1862 4096 4298 2233 5570 5108 1033 3014 2830 2484 6031 5304 3911 2425
683 2425 1173 2870 4677 4999 5925 2237 -629 1866 1977 2329 5854 2280 -1461 3464 534 -602
699 -602 5696 -715 -1063 5601 -2298 -2016 2194 -4438 -1289 2769 -1487 -1085 -1715 -4122 -3979 -1793 1609
716 1609 -1502 -4001 -2704 -6465 -5457 308 -2021 -4916 -2546 -4218 -7023 -2433 -955 -6004 -2867
731 -2867 -482 -7007 -3757 -1258 -7424 -3828 -103 -3878 -2608 -2011 -5335 -4673 -918 510 -850 -1242
747 -1242 -2215 -5215 -2061 1838 -592 -178 368 -3175 -2043 1579 451 125 2637 448 -604 2149
763 2149 845 -279 2030 1889 1263 2497 1239 -859 -280 1817 3211 2807 2555 1166 -2170 789
779 789 3118 1379 2989 1321 -2315 -225 1140 952 2030 1069 85 -494 -314 910 8 -586 678
796 678 449 -879 -223 -705 -2793 -815 2399 -832 118 928 -4313 -1218 2635 -582 1858 825 -3407
813 -3407 -1264 -40 888 1512 -132 404 -1229 -677 2423 593 311 2417 610 300 2294 1042 -936
830 -936 2034 3356 369 3612 2252 -2451 3001 3202 1199 5592 1673 -1016 1359 792 2598 3723
846 3723 2448 640 -625 1575 1246 1816 3475 309 744 1245 -194 1214 -783 356 825 -1111
862 -1111 1947 -1777 -3467 1368 -2728 454 3005 -4316 -1775 -1816 -4383 1292 -618 -2334 -1802 -4533
878 -4533 -3165 -2741 -279 -1005 -3861 -445 -3979 -4633 910 -3482 -2876 491 -3540 -2449 -1603 -2489 -3546
895 -3546 -2188 2697 -2281 -1886 1218 -6340 -1830 3744 -2143 566 327 -3070 -1934 361 2690 -1180
911 -1180 1473 2760 -5322 1719 3673 -3512 4203 2418 -2697 2875 537 -25 273 1116 3513 -1096
927 -1096 3568 2462 -5740 4411 2499 -2105 7533 -217 -4203 2827 -225 767 2981 1274 -143
942 -143 -1948 2411 463 -1413 4819 -161 -2074 3338 -1316 -1502 1747 966 -683 745 2528 -2023
958 -2023 -1421 2665 -1878 1391 5020 -2128 -683 710 -1699 2031 2841 583 -925 -247 692 -142
974 -142 2844 2028 -1441 2733 629 -812 3258 16 880 2986 -30 1518 674 230 1701 -271
990 -271 2632 2243 -894 2771 -1147 -1859 4224 351 361 2357 -3191 -1349 2231 -388 229 707 -1550
1007 -1550 -1519 306 330 -2044 -703 13 -2886 -439 -510 -4380 -1638 -270 -3121 -920 -1108 -3673 -2710
1024 -2710 -1782 -2554 -2111 -961 -1865 -4850 -2925 -1778 -3216 -660 -873 -4943 -2918 -881 -3058 -1271
1040 -1271 -611 -3594 -2082 130 -2030 -2325 -654 -1450 -1050 833 16 -1565 -1108 82 -330 818 1666
1057 1666 -374 -946 684 -135 788 2646 1117 599 1005 494 2365 2671 1794 2114 963 1501 3161
1074 3161 1440 1845 1789 1470 2913 2348 2177 1168 782 2858 2399 1856 2929 467 144 2200 1125
1091 1125 2031 2295 480 589 486 1208 1145 720 2018 -395 -209 2524 -780 -359 2002 -2052 359
1108 359 2653 -1328 -345 670 -1492 -52 1772 459 -1233 -491 193 -1163 1049 1755 -2262 -717
1124 -717 1196 -1424 -211 1873 -890 -1463 1261 -94 -1206 1289 532 -2551 963 1154 -1611 749
1140 749 671 -2404 340 2156 -745 -159 618 -1837 -589 1959 -658 -1053 401 -1411 -1378 722 -158
1157 -158 -1511 -556 -493 -1452 -562 144 -1782 -1840 -58 -1928 -1304 439 -2772 -2407 97 -2193 -1456 21
1175 21 -2615 -2534 -974 -1149 -1202 -908 -1442 -2866 -1423 -315 -1801 -523 -984 -2626 -578 -258 -1480 -242
1193 -242 -678 -1688 -108 123 -493 -977 -111 -322 -512 1816 265 -924 973 -148 -66 2602 693
1210 693 -422 1076 663 495 2030 2403 133 515 2411 459 1351 3280 523 247 2780 878 686
1227 686 2290 999 -127 2076 2379 377 1269 1279 -631 1271 2784 208 656 1257 -483 348 1811
1244 1811 711 -442 375 -156 -1092 895 852 -1204 -228 402 -1107 -136 612 -1471 -796 423 -723
1261 -723 -1006 354 -1219 -1758 412 86 -1032 166 -645 -2076 -67 405 -696 155 -308 -940 -527
1278 -527 466 407 -410 -49 204 -718 475 823 -551 11 523 94 323 855 -27 -337 434 1131 413 632
1298 632 352 -856 358 880 440 569 27 -167 -363 280 1085 -54 -581 94 -694 247 817 -304 -452
1317 -452 -558 -582 -490 -37 -550 -1221 -505 -157 -765 -6 -878 -1558 -721 -497 -499 -242 -1154 -1138 -1602 -578 196
1338 196 -1143 -290 -976 -2070 272 -337 -656 -34 -1251 -614 -238 12 237 -1224 -127 125 -599 1087
1356 1087 -262 -732 654 2 562 456 196 359 -280 1003 972 778 870 -268 295 694 879 1451 795
1375 795 348 759 -56 1160 1305 -34 731 443 631 769 207 885 -601 376 1615 -173 647 231
1393 231 -993 672 255 371 421 -881 146 -796 -144 1478 -1236 -60 316 -2243 632 72 -1293
1410 -1293 122 -827 -429 -119 -264 83 -1345 -181 367 -1102 775 -630 -1782 744 -52 -150 524
1427 524 -666 -219 -622 557 810 -730 899 -150 -689 1344 49 83 1015 125 -198 332 1316 311
1445 311 -478 1286 -312 192 2115 -745 -185 574 -246 1315 391 274 190 -984 1488 79 -340 1325
1463 1325 -936 -395 790 -781 106 -159 -563 -4 -906 219 -132 -1186 375 -1156 -878 885 -1111
1480 -1111 -563 -585 -1352 -349 -196 -367 -898 -1223 -385 -523 -327 302 -1077 -1009 -75 -305 -187 -234 -335 -598
1500 -598 380 178 -413 39 172 -318 532 573 97 123 106 244 -193 926 1201 -516 444 552 85 1460
1520 1460 911 -11 609 13 846 1165 562 783 246 598 1263 228 802 745 117 917 924 282 399 -33
1540 -33 133 559 246 310 485 -292 7 532 -138 276 168 -597 -630 -127 266 -90 -709 -277 -823 -445 288
1561 288 -891 -679 168 -1097 -147 348 -1197 -786 -511 -402 -201 -337 -155 -698 -618 280 -915 55 358
1580 358 -1215 -392 448 -676 92 214 -676 -291 333 49 -187 550 511 -696 593 1097 -721 597
1598 597 326 -678 710 1268 -746 -151 382 -352 98 1101 106 -396 488 144 -502 645 320 -690
1616 -690 135 489 -511 -115 549 -680 -686 313 -486 -557 486 -658 -755 374 259 -225 -266 -479 -746 29
1636 29 316 -374 -528 -284 -639 -291 507 -221 -325 -26 -382 66 202 -153 -230 -457 128 207 -98 199 -93
1657 -93 -247 460 219 501 455 33 337 258 707 912 149 46 414 468 817 738 306 545 469 789 545 786
1679 786 602 -48 518 842 286 678 279 5 576 522 367 404 229 -76 36 256 516 -350 -345 70 -638
1700 -638 75 -55 -499 -403 -621 -502 103 16 -395 -791 -531 -291 -920 140 -573 -675 -272 -611 -643 -468 -585
1721 -585 -714 -659 -282 -201 -637 -350 -631 -315 158 -450 -51 -296 -933 -28 -200 347 226 -78 -201 -135 244
1742 244 116 70 327 -102 76 299 -5 322 361 170 306 392 287 236 163 44 167 590 597 -86 217 225 -107
1765 -107 450 281 -295 50 311 23 8 684 -378 -455 422 -267 -471 369 -109 -584 110 9 -550 45
1785 45 40 -706 -382 552 -737 -667 386 -919 -689 661 -202 -351 178 -207 -475 408 697 -628 -54 181
1805 181 -386 150 891 -422 -143 567 67 231 797 78 -538 466 160 -382 838 455 -302 723 434
1824 434 2 630 -22 134 186 666 369 -130 765 -202 -196 865 285 -214 283 -98 85 305 332 206 -193
1845 -193 -48 23 80 256 -443 -337 -177 -544 -287 156 -171 -203 -360 -428 -84 44 -626 -447 -210 -527 -163
1866 -163 -75 -659 -577 -29 -349 -169 -266 -428 -490 -287 225 -687 -348 -83 -813 53 28 -416 300 -38 -252 16
1888 16 120 182 -119 135 277 -212 626 621 -333 251 162 73 668 331 -16 501 458 169 448 571 -1 -145
1910 -145 569 82 110 207 58 -195 387 266 134 504 260 -118 -85 531 77 86 31 -481 49 75 -120 184
1932 184 -440 -64 -117 -216 314 -323 -603 -8 -456 154 18 -416 82 -459 81 370 -682 -208 -1 -628
1952 -628 367 123 -628 -12 -148 -258 -31 81 -34 -274 236 219 -254 393 626 -415 567 366 -125 477
1972 477 490 -442 150 548 67 146 405 -214 -64 523 463 218 280 389 -545 467 524 -423 64 461 -520
1993 -520 155 450 -342 -123 275 -283 -195 465 -21 -557 -116 -181 -401 285 195 -969 -217 -5 -386 243 -9
2014 -9 -842 -352 193 -332 -152 115 -584 -536 48 9 -388 -150 -274 -395 -166 107 -629 -52 134 -759 318
2035 318 212 -9 143 -402 -172 384 379 300 -96 169 188 103 607 256 -174 486 472 161 798 154 -123 673
2057 673 57 204 465 193 193 263 431 280 154 535 -417 148 454 71 181 221 -166 -103 277 81 121 260
2079 260 -212 -746 374 28 -340 -192 202 -558 33 76 -240 -503 -37 -208 -164 24 -343 -659 122 -191
2099 -191 -423 388 -314 -642 -191 -33 -246 -80 92 -373 -392 57 -270 -68 232 -318 -314 63 43 -216 121
2120 121 -36 -111 316 122 -75 -121 125 57 282 430 -16 -96 141 2 -142 255 245 67 192 -92 29 163
2142 163 105 14 -144 439 337 -122 -132 -249 -313 -29 13 -77 63 -346 -75 1 141 110 -557 -295 -231 -377 -62
2165 -62 -222 -124 -171 -322 0 -292 49 -459 -627 -124 -43 -135 -104 -50 -174 -1 111 -52 -114 -97 177 -494 202
2188 202 151 -312 145 163 2 459 187 12 26 267 416 27 483 187 -152 551 130 365 546 120 177
2209 177 352 305 346 220 48 90 240 782 283 -8 262 100 415 328 17 30 -97 -97 -12 134 298 -181 3
2232 3 -213 -371 126 126 -217 -43 -335 -118 -12 -9 -83 72 -526 -294 -114 -102 -226 -235 -94 -139 72 -106 -368 -218
2256 -218 -173 -176 -138 -161 -307 -77 -166 30 -186 404 -176 -287 509 126 -251 184 -51 -347 12 404 -19 -223
2278 -223 298 -356 -2 478 9 106 344 43 -122 312 174 -174 -163 159 -19 91 463 -460 -188 167 -504
2299 -504 -22 238 -84 -431 -221 130 -84 58 78 -504 -55 375 -391 201 -166 -510 -173 21 -289 -126
2319 -126 -116 -423 -576 260 150 -473 3 -82 -311 -85 -190 -587 -270 -104 61 -143 4 -108 -524 45 -79
2340 -79 45 321 328 -337 97 113 364 -106 61 -139 -66 352 114 144 290 -9 168 375 351 35 113 195 328
2363 328 102 460 248 97 71 173 79 -64 -87 92 -111 -166 85 189 -47 145 -154 55 -80 224 257 -68
2385 -68 225 114 4 -51 -146 -324 -27 -226 -181 -189 -220 -256 -148 -277 -45 -169 -485 -121 -187 -143 -5 -353 4
2408 4 -303 -155 164 242 -205 -6 -247 -78 -182 27 101 4 -156 -88 211 129 -20 -122 451 172 147 362 -77
2431 -77 -206 343 175 113 -124 287 99 -34 273 102 38 264 -11 -333 -55 277 -3 236 378 -392 -129
2452 -129 270 -345 -64 -54 33 -107 46 23 -711 158 20 -309 -429 -79 -376 54 118 -478 -196 -105 -483 -273
2474 -273 -23 -245 -166 -56 -98 -250 111 147 -219 -100 10 -85 -122 182 89 -115 -88 -188 -160 279 93 244 153
2497 153 132 -43 119 464 71 65 370 10 242 402 -121 171 291 100 221 175 378 364 145 426 71 -39
2519 -39 272 214 -40 185 181 167 -82 -183 531 117 168 59 -139 199 90 -283 128 -100 -387 148 -38 82
2541 82 -260 269 -281 -74 -7 71 -439 -102 -26 -67 -155 -115 -425 -50 -47 154 -217 -49 -268 -198 -67 -261 -46
2564 -46 97 -156 -100 -12 118 -40 -86 263 -21 -153 206 -61 49 39 -100 84 56 159 -38 -130 3 484
2586 484 21 85 145 145 17 187 289 98 -194 -140 -238 121 -164 -186 267 -163 -99 338 192 107 -171 -187 -174 55
2610 55 125 -168 -220 -181 -115 13 -81 -168 -414 -104 304 7 -63 -148 -150 -230 -6 133 -104 -43 -149 -263 -70 10 -102
2635 -102 -69 36 -357 -178 223 -274 61 77 3 -29 217 -15 -2 57 308 -120 197 85 -319 148 262 307
2657 307 322 127 10 -16 238 232 -48 336 -56 -49 546 329 -27 454 112 -128 -127 253 -144 -312 204 183 39
2680 39 359 -222 -235 18 -65 23 225 -202 21 -13 23 56 29 341 -417 96 -194 -194 -46 -216 -243 -13 -125 -50
2704 -50 -208 92 -71 -86 -173 -214 -93 223 87 -447 -154 143 103 -3 -91 -260 127 -159 -96 -200 134 -43
2726 -43 123 211 114 74 106 -11 161 139 283 150 -147 117 78 15 -216 183 30 364 0 245 175 76 367
2749 367 114 43 18 268 -136 -99 -85 -276 161 -4 -84 -306 -66 -136 -318 53 34 -379 -62 -268 -17 101
2771 101 -136 -60 -174 128 34 -192 91 -240 -245 -115 4 -134 -199 110 -163 111 -77 -265 -122 12 -241 126
2793 126 69 -54 -119 69 33 116 174 90 -107 142 438 -5 -49 266 -52 -111 -132 228 84 36 396 149 8
2816 8 159 187 155 102 335 -241 262 180 19 79 188 -64 -213 125 8 -170 114 -89 -259 37 -26 6 107
2839 107 19 -374 -88 115 -256 -231 192 -70 -89 -27 -337 -244 -130 -83 -291 198 -42 -179 -138 92 -135 -215 93
2862 93 -162 -100 -120 -126 -258 -159 112 350 17 -91 185 179 215 209 60 -217 59 94 52 72 -86 -16 -24 289 208 -155
2888 -155 -124 22 -194 -282 148 19 -327 213 12 91 293 107 -91 123 26 -54 209 -49 -8 215 32 101
2910 101 -76 2 7 111 168 104 -289 -155 -20 -99 -114 66 -388 43 -351 68 102 58 -202 61 -157 -31 144
2933 144 17 -117 -26 74 -101 -20 210 -106 -26 -181 -101 -11 297 -181 -47 -10 226 -170 87 -79 -58 130
2955 130 342 -19 247 -28 126 -67 239 28 27 212 184 82 143 116 -45 212 33 143 116 307 33 22
2977 22 87 20 177 398 -391 61 143 -70 92 -22 -53 30 -253 29 -75 -34 25 -248 -22 94 -90 130 59
3000 59 -222 -75 210 -236 -61 -167 -34 -98 -215 -130 12 -354 -45 -227 -92 59 -229 63 6 57 -139 -118
3022 -118 24 -161 -177 225 74 -11 -143 -29 -2 -170 9 59 -155 29 138 175 216 189 72 147 15 103 79
3045 79 195 47 -89 19 -16 -81 308 -79 -247 -245 11 14 110 29 171 101 49 11 42 168 91 236 100 -302 112
3070 112 104 -204 -162 36 -125 -62 -15 -98 -16 -11 11 126 -48 23 35 -51 -2 -285 -27 -123 -5 55 -216 -238 -25 -11
3096 -11 146 13 -76 35 2 23 -10 267 150 -68 35 4 -54 176 190 -33 168 229 -102 -139 47 -236 -110
3119 -110 199 22 108 -85 155 8 -40 148 -115 68 70 -82 145 187 91 -60 145 115 -121 185 -92 -64 98
3142 98 -121 -174 102 171 185 -201 70 117 -303 -252 -244 -32 36 -70 -221 139 -35 -40 66 -10 -279 -73 41 -66
3166 -66 -5 377 -128 33 42 -23 -35 25 53 51 131 110 269 19 23 -23 59 158 -134 -209 68 91 -83 138 130 186 147 254
3194 254 154 114 181 100 125 -15 -30 204 157 77 -26 -111 -178 -79 46 -89 28 -166 -19 39 170 62 17 -73
3218 -73 -79 78 -143 -30 -109 -31 -139 -122 -7 -36 14 27 155 -197 -290 96 -13 -13 49 -107 -151 230 -54 118 -274
3243 -274 -27 -171 20 12 -63 136 -132 -168 79 -89 129 132 -265 126 -93 -73 196 181 -181 325 -149 -124 -90
3266 -90 132 33 213 -12 139 197 113 246 91 -8 -168 -6 -280 47 80 14 -129 -149 -225 -24 16 -69 -54 43
3290 43 -89 215 -270 -286 -35 -26 119 -189 -162 -70 -133 125 156 150 -170 -73 105 -113 71 115 -315 134 -86 182
3314 182 -39 -39 -88 15 -15 -164 288 -170 230 -238 31 82 -70 -224 -45 76 254 228 181 -334 -113 113
3336 113 -106 -69 98 -202 210 52 130 -246 161 93 -82 11 128 41 96 115 -237 126 234 -155 226 -45
3358 -45 20 -23 285 -180 -108 -248 -27 120 -104 -66 -314 -21 -201 -93 -101 -283 96 -30 -97 -17 -245 15 108
3381 108 30 -75 -175 -172 31 -125 -41 -61 -35 -123 148 -10 -221 101 -130 48 47 309 32 -147 -160 50 -86
3404 -86 -28 34 -78 -55 81 -148 120 110 -195 -62 112 245 -32 -57 -42 -19 -191 -100 48 263 -216 45 40 145
3428 145 266 -64 52 -316 246 -115 13 -117 97 -143 -152 -151 47 -23 55 83 -117 -33 -211 -168 172 85 48 -176
3452 -176 -42 -287 -4 41 236 -145 -87 -46 -103 236 -90 -104 59 -61 35 104 -86 42 -118 -99 -88 -156 14
3475 14 -133 53 155 -131 163 123 -38 -51 164 347 -73 -68 -78 -181 -275 -125 135 -38 232 -86 -12 -69 15
3498 15 40 23 76 -94 -61 83 72 125 -180 -60 -36 -135 -101 28 -155 -213 -90 -139 123 -114 -242 -124 219 155
3522 155 112 4 -211 10 -30 -170 -4 -107 102 64 -128 0 150 -44 -41 97 -334 107 13 -124 139 126
3544 126 -76 -186 -241 41 -182 43 -29 97 -128 -114 85 -74 -89 69 140 -36 38 -41 32 119 -20 41 -113
3567 -113 -19 -55 61 -181 -133 -181 59 61 -50 -98 144 -50 -163 13 34 -14 65 138 145 -140 123 -15 48 -42 -20
3592 -20 -197 -136 13 16 158 118 -56 -182 46 6 -107 -219 61 16 22 -1 -42 189 -90 -15 73 28 151 -201 135
3617 135 -199 -91 164 22 70 54 48 -78 -3 -92 -40 12 -99 -131 48 -51 -57 -44 -123 -326 342 -150 19 -9 77
3642 77 -175 109 80 -216 132 -181 71 133 80 -26 11 -241 320 -21 -223 163 -107 132 -18 43 86 -53
3664 -53 -35 -53 29 51 -253 -194 -125 76 238 -179 188 -115 125 57 3 107 -182 -153 -313 52 -97 90 254
3687 254 -93 -93 -272 -199 70 -116 66 53 -75 -85 77 91 -11 104 1 8 181 84 -105 10 50 112 68 140
3711 140 56 127 41 194 3 15 42 12 -130 -228 -46 4 -220 20 55 79 -21 -128 29 77 91 -100 -29 257
3735 257 29 -11 -117 127 -157 -37 76 -265 12 -185 51 171 7 -200 -65 147 8 -56 -9 -130 23
3756 23 -131 -140 27 112 98 51 -99 177 -13 38 108 -4 -102 -107 -62 61 -23 -5 -106 235 37 228 -14 83 -65
3781 -65 86 -23 120 40 -132 152 -67 31 -212 -43 -102 49 107 -77 91 -54 -230 21 -142 32 -51 129
3803 129 -87 50 155 17 -91 125 -65 126 59 -94 53 -12 197 -170 131 362 -176 45 -65 -5 53
3824 53 -127 -52 119 70 -98 42 69 149 -120 -28 -58 -245 -109 -158 240 168 -43 -26 -184 -56 90 6 -118 134
3848 134 -2 -30 206 133 -123 -97 213 205 -181 1 80 136 185 72 65 189 -55 4 120 242 172 -56 5 -151
3872 -151 240 -266 57 169 112 -150 -13 -71 -67 200 -41 -133 -144 19 -348 9 -4 -11 392 -4 212 79 -106
3895 -106 -43 -36 99 -270 -21 -102 -186 2 -80 82 11 -179 166 68 148 276 -80 -202 121 83 187 1 134
3918 134 86 129 202 -26 264 91 -36 -129 -148 -117 -111 51 126 -182 -12 -99 59 119 -35 230 -34 99 -105 -7
3942 -7 12 73 204 -68 167 137 -123 75 52 386 -43 -20 -88 -88 32 64 -168 -16 -42 9 97 -14 -34 -38 -178 -188
3968 -188 37 186 -5 60 106 88 88 12 353 -21 122 130 134 36 -154 -164 -57 -12 70 -65 -104 -82 90 75 -6 -103
3994 -103 -27 -219 54 33 4 -1 -65 -92 -37 11 -67 15 -172 99 -124 41 10 33 123 -230 108 119 136 -208 45
4019 45 -13 59 -207 -133 187 -136 303 66 -142 -226 -203 163 -68 -180 95 -204 -97 99 -173 212 185 154 -95
4042 -95 -71 -46 -54 -168 18 -110 -59 37 -64 20 -4 102 -147 343 77 -140 30 -278 165 -225 -113 203 20
4065 20 138 92 278 145 -21 -65 13 -51 -38 49 73 151 172 168 101 106 23 221 229 -115 95 -116 -105 -339 21 45 -133
4092 -133 -33 -68 -45 235 37 49 97 46 -64 136 191 -114 -190 -109 -191 -9 -416 87 -38 82 -126 430 44
4115 44 7 16 27 -6 -130 -95 -114 114 -105 -31 194 -76 -107 -72 12 -2 220 16 -327 205 32 79 137 70 -31
4140 -31 192 -39 -27 -211 -38 -175 -30 139 166 39 2 119 40 -40 -130 -16 176 -128 91 184 91 -38 -144
4163 -144 -115 77 -1 115 92 4 -100 34 42 58 154 -177 124 195 207 -255 225 -330 197 255 -209 -37 13 -216
4187 -216 -71 3 67 -217 62 144 308 -102 -146 -28 -194 -185 60 -53 45 -173 115 -188 80 131 -4 -152 3
4210 3 170 34 54 -154 -229 -186 -35 142 -117 19 114 98 201 -116 -7 -108 140 -167 119 66 5 -71 64
4233 64 198 114 67 -230 -37 -153 22 186 131 91 -87 97 114 -43 27 -58 -73 -84 -152 150 165 -17 62 91 -201
4258 -201 -94 -336 23 -12 19 -104 135 187 -95 -53 115 36 -167 214 71 136 -269 269 144 -160 125 -110
4280 -110 -235 -115 -25 78 -191 56 -170 108 24 -61 232 91 -118 -176 143 -1 -108 -220 99 1 29 -32
4302 -32 -51 139 54 -6 -16 103 -137 -240 85 60 118 128 50 29 -118 -319 83 -34 95 178 55 -56 -40 96
4326 96 99 79 -254 129 -44 -26 -90 200 -141 84 -155 73 166 -93 -38 -117 -17 28 -25 -4 -145 -249 -112 9
4350 9 -35 -382 -59 -12 88 -67 215 49 -123 60 141 73 124 -19 34 -54 307 -352 0 21 -108 -46 -160 70
4374 70 5 54 47 -131 106 165 216 122 329 -29 78 -52 -105 75 -2 -148 -99 -127 -8 -16 -156 -28 -59 49 -34
4399 -34 128 -127 75 45 25 49 162 271 -100 29 126 -74 70 103 -182 -73 -162 241 21 -383 -65 68
4421 68 -131 16 183 -104 -259 100 27 85 54 67 -132 -27 -82 34 293 -132 -32 -155 70 -33 -14 -118
4443 -118 -188 -85 153 9 -48 -38 -141 -231 246 59 -118 11 212 122 -60 273 -158 -251 -106 -6 284 58
4465 58 -123 323 5 74 -233 -42 -200 312 65 86 -88 -13 -4 -230 42 86 119 31 -60 -174 133 68 135 -346
4489 -346 -207 174 134 65 141 -72 -32 13 113 -69 -73 -108 -110 -108 -362 261 -79 -19 -51 -72 -160 -172 -3 -25 68 -178
4515 -178 236 153 -129 50 -118 140 28 123 -216 51 247 61 112 169 -186 257 -53 172 170 352 22 -166
4537 -166 219 141 -28 -280 163 -11 -185 -230 45 -317 -117 123 8 90 -22 -2 -2 -83 -57 52 -17 -37 84
4560 84 -13 -80 43 -69 -75 18 179 -231 22 -1 -170 -242 -231 59 -9 47 74 -91 -54 50 -47 47 -82 -205 -84
4585 -84 227 -252 -125 -54 -140 -347 94 -4 72 134 -115 -55 -39 -89 -38 -222 131 355 -232 -54 149 55 150 -1
4609 -1 8 92 -193 166 -73 3 -259 -47 -48 59 -253 -80 79 -61 -165 46 -87 41 -27 -163 253 179 -73
4632 -73 -81 36 -226 129 -12 84 -122 95 32 7 67 174 -28 37 -8 -44 -45 -148 -120 168 187 143 -84 16 72
4657 72 42 88 58 -73 -152 -13 100 152 -222 -71 -87 195 27 -56 -53 117 105 170 187 -132 177 70 52 14 51
4682 51 37 -198 -23 -34 49 70 -63 81 79 4 102 34 -263 33 -62 4 -77 -34 -59 -18 -14 -140 28 112 1 -189
4708 -189 -83 48 -84 -24 175 30 -186 -25 99 -90 45 -144 178 -276 -235 -127 23 68 -145 87 -68
4729 -68 101 8 -42 -27 -90 -204 231 -237 1 149 -17 -145 -52 25 144 172 -59 224 -23 154 183 -246 -109
4752 -109 -47 121 127 112 139 -65 -296 103 -14 -36 -126 -147 32 104 264 91 166 25 193 -46 160 220 -159 -73
4776 -73 5 -41 -40 5 -168 154 350 -81 -67 -161 -73 182 -101 -224 -104 -39 -170 13 76 -2 172 96 14 36 135
4801 135 -15 -160 116 -15 22 -128 232 -29 -47 108 -16 98 15 2 8 48 310 -86 62 149 189 -11 -123
4824 -123 110 126 116 3 110 41 -51 207 59 25 126 -15 33 -174 23 98 185 183 -125 22 228 23 162
4847 162 44 -142 -40 -35 46 149 -24 -30 -13 310 40 255 -86 -97 -19 -70 35 -155 -171 -141 121 -94 -46 -6
4871 -6 46 150 -7 -35 30 75 -95 -47 -40 -51 53 -279 -389 53 70 -170 154 82 25 43 -208 -162 314 174 -87
4896 -87 -116 -12 -119 -77 30 -123 49 100 -222 274 31 100 -51 229 -232 62 158 10 262 -256 80 -94
4918 -94 337 174 203 311 -2 -19 76 9 -152 273 127 107 84 160 94 -80 -142 -134 163 -68 53 33 49 25 -1
4943 -1 -249 62 -20 71 -94 143 119 76 128 -45 -118 -62 -186 -19 71 -74 35 -141 -194 11 138 -139 109 -133
4967 -133 174 70 -68 57 9 23 12 33 -151 -24 108 195 -118 -151 74 -83 -100 -96 -33 126 98 324 -38 250
4991 250 89 104 172 106 123 -130 135 -20 13 72 -6 0 -129 -88 359 2 -9 -15 -4 -138 -129 89 -11 -232 218
5016 218 -43 10 165 -96 32 -150 -112 105 -238 -78 9 -15 -110 109 -81 -25 -43 35 -24 -35 110 -20 -30 32
5040 32 -58 -5 79 -26 283 101 180 -84 52 119 153 47 23 -23 -215 -109 -13 102 7 -195 146 59 136 -163
5064 -163 186 187 25 50 -133 162 -268 62 139 -221 58 -285 -173 1 144 -112 218 212 16 78 -51 1 -126
5087 -126 -127 228 -164 -122 -218 -136 -7 21 45 62 -14 -1 -47 -36 -46 125 -16 -93 -228 -6 105 74 173 -11 72 143
5113 143 -173 -71 69 102 83 51 71 179 -24 207 -41 308 -53 58 -96 -19 -118 148 25 -274 -283 40 -56
5136 -56 49 51 -232 -21 -157 137 18 116 -195 -67 -162 -103 -49 87 245 -54 5 -94 -39 136 -181 -142 -50 -77
5160 -77 -21 -62 78 0 -31 157 -71 -31 22 -18 -167 59 87 -34 -10 -63 -462 137 -111 -218 226 117 170 -168
5184 -168 -34 -121 120 -38 -53 32 -40 -11 -137 -37 90 159 -28 145 50 119 87 4 -282 163 106 -132 42 -74
5208 -74 -181 -150 -49 -373 -137 -10 41 -354 -49 -126 66 -7 -49 -52 -50 73 22 225 116 1 60 -137 -63 47
5232 47 -54 -42 -102 -84 126 -44 -170 -23 53 -31 52 -219 -192 -191 73 -62 -81 -78 125 111 89 -70 -211 214 -226
5257 -226 -32 -190 101 140 -141 215 155 13 -74 136 99 10 -175 133 -353 194 -187 80 40 -58 -8 114 -99
5280 -99 26 166 -269 149 -128 -181 -187 241 -109 -130 -104 -158 -32 -7 4 79 57 85 98 68 -2 -170 201 -44 -51 52
5306 52 10 -136 311 160 193 -32 126 288 226 116 -5 182 -50 83 8 -234 62 89 236 42 85 -134
5328 -134 -147 -11 -41 -91 -9 -225 195 227 -99 -367 40 -72 -23 -57 38 79 -16 -243 -8 114 -9 295 261 -242
5352 -242 -119 47 256 -113 199 37 -68 40 -117 -26 11 88 -57 84 -24 -140 139 37 225 -236 66
5373 66 -87 -160 39 97 81 -102 10 -76 -136 55 -40 -198 -48 -158 60 -115 -162 -23 -154 -5 69 -79 44
5396 44 -51 18 -66 203 -66 -17 67 -151 -22 137 -145 150 -51 -115 -260 -133 58 -149 52 -124 406 75
5418 75 -205 -14 353 98 56 283 109 -58 32 -7 -106 65 -183 56 -49 16 86 -152 152 -101 31 -130
5440 -130 106 181 -35 -120 -162 78 6 -46 13 -46 -21 -172 -94 -56 170 44 -129 -131 -136 163 -101 -292 224 -71 -32
5465 -32 -53 135 -5 36 -309 -161 44 -56 -38 -50 -5 -82 -71 -3 -256 29 172 -34 75 369 93 128 134 46
5489 46 4 -252 163 252 -30 154 102 106 -175 124 -66 139 157 -245 232 -96 45 -224 41 -66 -245 19
5511 19 -37 -19 60 -65 221 -264 -246 -13 -116 268 0 8 -15 81 -13 115 -140 -120 28 -71 268 69 111 -32
5535 -32 -156 98 41 -172 192 -185 -207 -63 11 -58 -41 91 -110 5 -170 -71 166 -217 91 -39 10 137 215
5558 215 49 112 -139 -40 -106 -180 -76 -104 163 -156 109 -299 14 -49 193 -90 -241 -157 -140 -188 124 80 -55
5581 -55 -125 147 3 51 30 95 86 -44 238 -22 16 163 20 -45 -58 61 36 -108 -67 -1 -152 -76 -37 54 56 -27
5607 -27 -215 15 -12 111 -14 79 -4 -196 -29 66 -143 -139 68 -12 -114 -53 30 39 96 -301 55 157 182 -17 -66
5632 -66 -146 100 243 -23 -233 -117 52 -75 99 -153 30 -18 -138 -111 -16 31 -72 -147 -158 280 -170 -150 165
5655 165 -11 73 -227 -67 110 176 -22 -292 167 -27 -95 -73 -66 238 90 209 -134 53 -142 241 -162 -34
5677 -34 -68 45 -200 -143 33 -138 -105 -44 213 38 -2 -156 36 30 28 -3 125 211 92 67 -285 -42 32 -91 100
5702 100 -241 282 123 127 -81 -49 -31 207 44 -190 -22 -316 -51 36 8 -26 -40 345 61 -135 -124 47 158
5725 158 -166 -78 67 91 -56 87 7 -87 226 35 -46 -250 -143 46 75 234 -19 -183 -211 -48 8 49 -57
5748 -57 -130 -81 73 6 155 -218 -42 29 -66 83 -224 -118 297 -104 48 -43 87 -216 4 5 184 -123 -81
5771 -81 21 -72 73 -7 246 214 -33 -122 -43 -136 154 227 -38 109 78 4 -39 -300 56 43 2 -124 -272 197
5795 197 50 -145 -42 99 -134 256 151 83 -138 149 101 -52 61 -48 -187 -80 -126 281 76 -2 84 61
5817 61 -130 -227 -17 231 75 -52 94 55 -287 40 129 100 217 -240 173 -61 -77 -112 39 -12 -128 -421 41
5840 41 119 -55 -88 -125 -150 129 168 77 -34 -221 -90 -116 90 129 138 110 -37 -106 -46 -141 -39 -121 205 -30 174
5865 174 66 -9 -97 166 -45 -15 46 -217 217 60 -70 194 109 -83 -123 127 155 127 -20 -122 129 -78 -50
5888 -50 60 -123 -23 -327 -181 -200 -147 -28 -162 -123 34 -153 36 -3 236 183 106 180 144 11 64 307 11
5911 11 -8 195 17 -164 -113 175 -46 -15 -76 -184 72 60 89 9 -14 65 81 -150 57 -72 -49 -84 106 236
5935 236 -74 130 156 64 24 10 -64 -78 93 35 154 -55 191 76 10 -6 102 40 -66 17 94 57 54 58 87 -80
5961 -80 -74 -196 -134 -247 -165 -170 150 -64 -26 53 26 -184 -76 101 -244 -126 12 116 -166 -83 -215 -2 -18 -38
5985 -38 155 62 231 -186 -142 62 -114 63 124 36 -16 85 -76 71 -51 -130 -123 -192 -80 -160 158 185 59 47
6009 47 86 -36 -82 -29 64 158 80 361 109 -134 90 18 80 -15 -78 -135 -51 -235 36 -298 20 86 -11 -180 140
6034 140 -240 -38 -147 218 105 -54 102 -190 -225 20 -76 -9 278 128 -59 -42 47 54 138 -54 -60 -63 218 52
6058 52 97 -229 -50 46 -62 87 20 -94 -19 151 -249 -41 204 -50 -31 -42 13 82 164 -41 -187 -133 -12 -25
6082 -25 -123 136 -37 196 173 -167 -25 62 -42 -33 32 -267 126 -142 -145 122 -114 110 -156 136 32 -147 149
6105 149 16 108 188 -55 -58 -114 -186 -43 -214 11 269 83 -251 23 -53 -92 37 -121 -100 124 63 95 102 -186
6129 -186 46 165 234 -63 -314 -114 166 2 63 -105 137 266 217 271 7 75 -118 103 -66 175 -207 -317
6151 -317 124 -82 -196 -180 -90 -218 48 -199 -71 -140 142 81 338 -15 -99 299 52 23 -4 -29 161 178 192
6174 192 -48 -136 26 -127 -49 80 -152 -50 59 116 126 -112 101 -342 -105 21 133 4 79 36 106 -160
6196 -160 -54 -195 -279 -111 46 -45 36 -90 -30 -52 153 -82 -63 9 -7 148 -122 37 3 -130 127 3 8 52
6220 52 4 -24 -261 -32 -23 78 -243 -117 -41 -217 -42 208 67 29 -68 -26 -46 -20 90 83 -58 -13 44 -25 -45 51
6246 51 60 -159 -13 -25 -204 140 -100 -114 -189 -34 80 126 -151 -212 -32 -151 -139 77 -79 -145 287 -15 -290
6269 -290 -101 -75 -6 -17 -15 -86 15 41 -195 12 -68 -18 15 75 31 73 -58 -160 111 -18 -38 -25 -240 -39 -17
6294 -17 -7 -182 193 37 10 127 0 195 208 -54 -110 163 -72 -174 53 98 -62 -4 133 -25 172 50
6316 50 -9 -95 -316 -129 -104 -9 19 90 51 117 10 24 62 38 -75 -282 65 62 43 79 -6 -33 -63 -42 204 132 93
6343 93 25 119 60 -35 4 -77 -123 0 77 -194 165 -20 163 -177 38 -8 -30 -213 217 126 -171 -69 -68 56 35
6368 35 84 13 -81 23 284 -142 65 -24 -39 73 118 -164 -38 110 326 -28 -60 -154 184 75 186 47 177
6391 177 -64 55 96 211 -45 22 -188 -65 132 39 254 34 262 -8 -62 -14 -78 5 -110 -92 -155 -24 214
6414 214 206 122 97 33 5 -101 -200 154 27 -103 194 74 -150 -131 7 68 94 96 -34 -34 -187 -172 101 75 22 -14
6440 -14 -217 -149 -6 -39 184 -29 -194 -16 77 -144 -66 85 78 -109 322 -137 7 162 84 217 -86 -29 -31 9
6464 9 -7 -33 56 -30 166 65 125 -129 22 -28 254 175 192 -86 44 203 236 -124 -23 192 128 79 9 203 213
6489 213 89 61 -14 27 -9 73 188 -102 -65 -4 -6 18 222 -81 -56 -6 -44 -100 -36 -184 -124 99 -10 -175 -111 -138
6515 -138 237 -108 93 17 -190 -277 97 -92 206 88 -189 87 -30 262 11 187 -63 72 -163 -91 -26
6536 -26 20 55 181 -167 177 -126 235 117 -136 -92 -233 7 -41 299 262 93 -130 113 -27 66 13 -31 -3
6559 -3 135 55 33 -117 124 54 -73 162 -12 -95 -162 28 -91 71 -179 26 -303 157 -50 -107 -98 12 206
6582 206 -118 156 -24 94 28 -67 -15 -108 -5 -77 32 -164 2 -273 189 163 -135 102 3 64 -19 9 57 122
6606 122 99 125 -26 -190 40 -227 225 297 58 -8 167 178 24 191 -10 109 -36 141 -6 167 -101 110
6628 110 96 11 91 137 30 -283 -69 -138 -72 -298 38 -117 -112 35 164 59 119 -106 141 -142 170 48 3
6651 3 -33 -81 241 -13 -111 52 26 105 18 112 -3 31 25 26 -110 -230 139 -49 167 0 132 -6 -69 25 -140
6676 -140 -309 151 177 -29 -24 -121 169 31 -123 -125 95 -2 -31 -126 -169 -34 -84 68 -11 75 -42 72 125 -6 152
6701 152 -138 105 -134 112 -83 -113 -38 159 -105 61 153 -58 130 103 76 21 6 101 40 -136 20 -169 153
6724 153 -314 -19 -127 -100 -10 223 4 142 -120 113 -152 39 149 -50 29 -42 -129 14 164 -182 -74 9
6746 9 -65 142 7 -402 -36 152 -79 -176 5 -125 -6 106 159 -108 -170 -117 229 -183 20 254 56 68 -80
6769 -80 244 22 -22 -49 51 -16 -144 -87 69 33 -115 119 52 4 272 5 -46 23 81 90 74 28 -54 -41 -109 0
6795 0 193 80 202 157 -124 -137 156 -59 -152 76 199 -128 -252 9 39 -85 179 279 119 -92 -64 349
6817 349 12 5 210 -19 -74 277 25 -4 85 -39 35 52 101 -39 -183 89 57 103 -45 55 -144 -1 -163
6840 -163 130 -140 171 110 -83 -136 -12 -11 100 54 -153 164 -258 -141 -156 99 -26 -120 -20 6 -227 -51 53
6863 53 110 134 37 -52 173 -7 256 -101 -159 47 240 -152 -42 168 -109 45 8 51 -129 -219 -127 -3 -77 -227
6887 -227 -159 -87 -14 -69 -141 -46 21 150 -10 -104 -46 -59 16 65 173 -90 163 -54 -80 19 -112 118 -83 -21 108
6912 108 -86 -44 -82 84 154 -176 -52 -66 -54 -115 15 -30 35 46 -91 93 183 29 143 -134 105 -24 -92 -31
6936 -31 79 -59 308 -13 60 49 -22 33 35 204 163 -80 71 -119 -38 61 73 5 109 -204 -151 65 30 257 -79
6961 -79 109 -124 174 51 -141 -8 -79 -124 -133 21 -85 23 -190 145 121 101 198 67 18 -154 4 59 68 -190
6985 -190 -138 -283 80 156 96 53 -160 253 -131 -207 -13 -79 33 84 100 24 34 -113 54 9 -270 14 48 -6
7009 -6 34 154 -13 72 -80 -49 -90 -5 69 -84 -74 -3 31 -84 138 249 204 38 -91 -77 187 -8 134 192 46
7034 46 13 80 -75 168 135 110 -240 -244 -71 12 266 174 -170 -260 -110 -119 191 -150 0 35 159 -205 -105 -111 156
7059 156 24 -179 -1 -267 -94 182 -36 -77 307 -211 3 -287 84 -38 -201 19 129 94 -136 96 224
7080 224 -68 15 176 161 259 86 254 -46 171 164 73 97 -105 -165 -53 267 136 176 247 -61 -138 -48 -119 -48 42
7105 42 -22 85 -64 -118 140 178 27 -114 53 173 78 -83 80 89 -151 -183 211 -9 64 -81 -395 -153 -93
7128 -93 -25 126 106 4 37 -25 -274 -315 -384 120 117 -155 -86 193 105 -44 82 4 139 -71 14 251 106 -47
7152 -47 -131 246 130 -36 19 -88 -147 93 -134 112 35 -172 -273 -62 -161 1 -120 -122 17 -30 152 -87 143
7175 143 -91 143 -76 46 59 97 -316 -30 -70 114 -70 61 122 -11 245 -99 32 -17 -248 -176 137 -199
7197 -199 104 -78 -328 111 38 -132 -388 152 46 -60 32 -34 33 -48 -111 -114 60 -82 -7 -77 -16 127 -3 76
7221 76 230 -11 93 89 29 93 -26 -32 -104 -203 -198 -88 -55 -33 -28 -37 144 -86 -14 -68 -392 -168 -262 15 -137 23 67
7248 67 -30 -53 -18 -169 46 -40 -104 186 198 -6 27 -176 91 173 -62 -89 5 -68 -31 15 -100 216 28 43 125
7273 125 43 -20 195 -176 -8 -12 234 50 17 128 -284 -129 -29 -373 8 63 -60 -235 -118 123 -21 -4
7295 -4 -137 -26 207 -164 186 64 79 25 -198 115 87 -68 -45 167 -126 -162 -71 -47 46 -160 45 -50 -157 -31
7319 -31 -52 217 -50 -268 -230 -144 22 -90 -99 20 30 10 -155 -23 -34 35 -246 22 131 35 -136 -112 -111 139 -67
7344 -67 -167 137 67 188 21 -266 -227 17 -77 68 -57 -60 184 -184 28 267 -221 -126 79 -67 -58 61 -162
7367 -162 -37 -76 214 -240 281 -134 -153 -104 95 176 -51 -262 -97 277 260 20 -172 11 -15 -145 104 190
7389 190 154 38 -74 55 -126 11 -206 -118 -18 19 -78 -84 -68 85 -26 48 -55 152 -105 -200 -79 -76 121 11
7413 11 43 37 -63 77 67 69 18 12 -183 -83 207 -34 93 -18 -58 -94 -130 10 -138 -341 81 -30 88 -91
7437 -91 -243 41 0 21 81 -38 118 -90 164 -60 -31 -65 188 -130 -1 9 -159 -8 -124 110 -21 46 181
7460 181 -124 -57 189 -114 -81 -17 102 -86 -131 50 -3 121 -260 -85 53 -165 -112 -55 -56 37 143 -34 -57 11
7484 11 -118 18 121 -149 -12 -72 -198 151 70 -264 -24 152 -180 101 30 169 -200 105 -281 -187 -69 -19
7506 -19 -93 45 -167 -9 69 -37 75 -69 -187 -36 -143 114 -54 -182 21 323 -78 -98 -108 -285 -210 -176
7528 -176 26 -93 53 26 11 -142 -124 205 -140 133 -99 -94 14 -168 -23 -202 294 20 -125 -16 -85 117
7550 117 -209 198 95 -89 -89 124 45 -61 -155 -170 -112 41 -49 -253 68 43 -187 -20 -156 48 -22 10 245
7573 245 -68 4 -208 -54 388 -228 78 -92 -55 -133 -25 -80 59 177 -15 185 19 65 -101 180 -242 -60
7595 -60 -83 -245 177 -212 214 -110 -20 196 72 -162 -108 416 -9 -36 119 -49 -121 95 -4 6 -122 87 190
7618 190 45 -82 41 -169 -139 -163 -197 -200 1 56 -305 176 9 3 137 8 191 -141 -5 -227 23 -77 14
7641 14 -3 17 -113 34 171 -157 417 -113 132 -60 19 -176 -228 137 -205 -32 -171 -61 28 176 -12 -381
7663 -381 -227 134 -61 -25 -70 -70 -140 -183 26 -6 253 169 -117 -70 80 -23 -124 -142 6 44 -137 -165 -14 -84
7687 -84 151 -142 -297 362 129 0 155 130 -91 139 -64 -115 113 -58 17 -345 -26 -11 -51 326 -338 101
7709 101 -1 -48 66 -48 17 176 114 -247 -143 -39 -145 -122 -287 76 -31 13 -69 -178 -194 93 292 -83
7731 -83 -237 -55 0 -40 -43 211 -207 -58 352 83 -71 84 93 -189 -43 2 -10 -72 46 -153 -99 -214 76 13
7755 13 166 180 -77 -127 -165 -64 -84 7 -383 39 28 53 97 197 9 -82 -20 126 148 4 171 87 -165 -22
7779 -22 152 -92 26 -292 15 159 -43 28 53 -23 319 92 -110 82 -224 -131 80 -184 5 -17 -145 77
7801 77 -106 60 -185 -38 238 -141 95 -19 -77 132 -38 47 -88 157 327 6 280 219 -121 58 15 -200
7823 -200 131 -23 65 -51 -136 226 -36 -95 -249 60 -370 -235 -117 -125 49 -1 -34 5 -74 222 -150 -8 -37
7846 -37 67 -106 81 164 100 178 82 -25 -185 142 -100 -172 68 -42 -30 -52 90 66 -208 -86 -104 -158 -3 -263
7870 -263 -42 -140 184 -47 -147 143 -49 325 7 -209 50 73 11 -247 -100 -85 -106 30 79 -187 115 40
7892 40 -52 426 199 -47 180 -147 107 257 -74 -193 66 0 26 72 -41 18 -168 32 189 17 86 -352
7914 -352 47 19 -54 -80 -68 315 -101 -110 98 140 250 182 -83 101 -40 39 71 9 -23 -39 81 270 97 -55
7938 -55 10 -29 234 126 -45 -254 116 -35 -40 -17 167 -192 132 -45 -204 -13 -57 -125 125 -122 380 59 32
7961 32 26 266 -6 -141 168 40 -98 8 -157 26 8 -73 -104 -247 -220 128 191 -105 143 -221 -197 -14 -46
7984 -46 -63 -196 107 -122 -68 121 -249 145 79 -193 72 325 -115 -121 25 110 -24 70 30 66 96 -106 118 -103
8008 -103 149 -64 124 -99 30 -141 119 -18 41 70 -31 -53 168 193 42 -272 -5 195 -171 -61 225
8029 225 -159 77 12 -100 52 92 55 5 -64 298 127 12 51 53 -142 206 -16 -32 80 58 -1 118 -146 -45
8053 -45 91 -109 97 33 81 261 -99 -50 34 155 -114 -155 111 -165 114 -79 178 -16 114 -77 -85 -116 45
8076 45 -83 284 0 109 38 190 -117 -153 163 132 147 -14 128 88 -176 -57 3 -142 -94 -51 -204 -122 -130 -163
8100 -163 -46 265 163 -433 15 -297 7 51 -132 -257 107 62 232 -110 215 -21 -151 105 -249 180 -35
8121 -35 -154 114 -41 141 -47 102 -224 103 43 -48 -16 -224 -101 51 62 -1 -43 -49 -73 303 190 -110 -15 36
8145 36 266 200 -155 49 115 -103 57 -181 -240 -56 92 -1 230 -230 -163 132 -89 -88 -73 -6 18 -166 74 4
8169 4 126 -10 149 -94 129 52 -7 20 -40 -125 -34 -37 116 43 -84 107 102 86 14 91 -20 36
8191C6
$$ Imaginary data points
##PAGE= N=2
##DATA TABLE= (X++(I..I)), XYDATA
0 0 0 0 0 0 0 0 0 0 0 8 -8 8 -8 16 -16 24 -32 33 -44 56 -64 78 -90 108 -128 150 -174 202 -234 268 -308
31 -308 351 -400 454 -513 580 -651 732 -818 915 -1019 1133 -1259 1396 -1542 1707 -1885 2080
48 2080 -2292 2523 -2780 3063 -3374 3720 -4104 4539 -5026 5585 -6226 6974 -7862 8933
62 8933 -10254 11933 -14146 17224 -21817 29562 -46229 166539 -137394 97300 202792 -239795
74 -239795 237224 78918 11715 137547 -9347 71758 -26561 4337 169432 -35271 125138
85 125138 11199 -153384 51152 -70727 -26433 75835 -66840 2688 -72478 -42907 -27373
96 -27373 -110188 86691 -39471 -138761 18254 -195881 -134950 33612 -95583 -52351 -58090
107 -58090 -117697 -108842 -99959 -30386 -104862 -62710 -20959 -171850 -76250 -94044 -169696 -621
119 -621 -74411 -95760 -20960 -136329 -84395 -61131 -93895 -20085 -76717 -62000 -52408 -135967
131 -135967 -45791 -40683 -69663 15951 -48551 -86366 -33214 -56524 -34441 -871 -23303 -34791
143 -34791 -34081 -29679 -36699 -19372 6462 -5444 7844 10091 -28379 -17712 2568 3108 21049
156 21049 24789 8499 -8622 -2579 17099 10537 35515 57235 10322 12111 28576 -3760 33531
169 33531 61969 20562 28079 32225 9327 30048 49135 40232 38989 48032 35269 20824 33830
182 33830 31077 32486 52353 43702 34213 26394 22219 38026 35300 53735 56705 17843 34539 28626
196 28626 7023 56838 45541 20677 47649 13930 5234 41043 26214 28223 40667 19108
208 19108 13333 20285 14995 13035 23577 20252 12942 15859 247 -2504 10105 5206 19001 17520
222 17520 -7182 -1417 -10659 -13401 12610 2363 -3882 -1695 -25480 -17708 -5333 -15112 -400
235 -400 -4495 -28349 -15019 -16719 -31623 -6363 -8650 -29848 -7961 -17017 -41285 -17191 -20051
248 -20051 -32427 -5840 -11826 -32235 -23601 -26472 -29864 -13506 -6872 -16361 -25323 -25683 -26569 -24758
262 -24758 -9359 -4519 -18911 -18948 -13916 -25078 -15681 2060 -13365 -13246 2380 -18414 -19168 2357
276 2357 -14520 -12192 12723 -6690 -12809 3742 -12408 -11473 13676 6857 -1352 5175 -5235 -12239
290 -12239 2257 11898 6651 4559 6334 -5144 -6684 12077 9462 648 13952 4340 -8303 8709
304 8709 5161 -5173 12123 10580 -303 8194 2487 -7124 3236 8535 6495 8250 4211 -4531
318 -4531 -4794 3173 6850 6988 9093 191 -7871 -734 2042 1893 9395 4692 -4796 1939 2990 -3604
334 -3604 6247 8492 -2037 7268 8111 -8271 1329 5711 -4259 11766 13407 -3041 3812 3079 -2571
349 -2571 11917 14863 7653 5697 782 -169 3456 8237 12713 7219 4531 8703 2689 4478 15684
364 15684 5966 4023 16875 2240 -865 13265 -2594 346 19808 4758 3632 11666 -4418
377 -4418 -1660 12181 7957 4831 6196 -818 -7719 -157 5843 595 3462 3027 -5037 -3936 -292
392 -292 963 -2828 -1423 3635 -9196 -6644 1603 -16014 -7529 5587 -10305 -2174 1439 -16999
406 -16999 -9193 -1145 -6774 -2166 -2692 -12537 -14222 -9058 -6403 -4758 -3045 -5599 -8707 -8973 -6683
421 -6683 -4230 -7889 -4295 -2840 -11442 -4295 -5028 -13693 -2049 -2900 -6308 3182 -4800 -9378 -4316
436 -4316 -7258 -1160 1319 -1906 -2860 -9671 -5915 -652 -1925 3944 -210 -6659 -1617 -2359 -874 600
452 600 -1432 -260 -2757 -165 118 -6115 1571 1892 -2185 5952 -789 -3973 952 -3794 2294 4517
468 4517 -686 4228 -4743 -5082 5704 -251 5873 8427 -4888 467 2820 89 7454 3260 255
483 255 3650 1900 4324 5273 1505 4925 8491 5503 5387 6558 377 3812 12065 4895 6911 10546
499 10546 -318 4850 10620 4581 12108 12175 2273 5791 5231 5359 11666 9555 6506 5754 4885 6730
515 6730 8516 7221 5316 6811 6600 5089 6372 768 790 8764 3295 5921 6196 -7099 2704 3881
531 3881 -4063 9690 -587 -7193 4252 -9263 -3754 6178 -7463 877 -2508 -13983 -1285
544 -1285 -4372 -7038 -1289 -7957 -8377 -7642 -5665 -8690 -12993 -2369 -8419 -9812 736 -15854 -13552
559 -13552 -3300 -11863 -2924 -5203 -13029 -8620 -13809 -5026 -4168 -11416 1324 -9485 -14168 540
573 540 -10631 -7600 3326 -7969 -7597 -2081 -5129 -6839 -1180 -275 -6730 2613 2716 -7825 740
588 740 -2102 -3280 7679 1419 884 -1515 -4352 5784 935 5187 8600 -5302 4700 4865 -3217
603 -3217 10035 4054 993 8226 377 3364 3994 2965 7361 1975 6357 6569 -360 5740 1839
618 1839 1434 8578 4992 4886 1482 -608 4349 2169 7536 7551 -2400 3152 2924 -1229 7292 5188
634 5188 -262 4231 2831 12 3023 3330 457 3767 3462 1507 2733 -446 1682 3577 875 6616
650 6616 3432 -2946 3770 -1264 -182 9000 1013 808 2778 -4632 1788 5505 675 3365 1451
665 1451 -1762 1914 2223 -538 1030 1626 -635 781 1052 -2734 -1619 686 -615 1786 796 -2766
681 -2766 -2848 -3186 -1400 621 -819 -1624 -4068 -6549 -3294 -1396 -2368 -731 -3191 -7625 -2977 -2276 -6112
698 -6112 -213 -3472 -8071 -344 -4800 -8606 -1290 -5967 -5816 926 -3914 -5750 -4130 -5695 -3946
713 -3946 -1768 -342 -2661 -6452 -4072 -4070 -4144 2034 97 -4494 -2010 -1194 -3484 158 2807 -2372 -1484
730 -1484 2732 -2529 -1812 3627 -1310 -555 5709 1019 -86 2847 -104 589 4932 5136 2102 1122
746 1122 1304 -242 1964 6283 3327 1616 2739 679 1178 5402 4093 2133 3764 2100 199 2716
762 2716 2546 518 2723 2905 1003 1803 1008 -908 415 2277 2797 1200 -297 -612 -2417 29 3158
779 3158 419 -149 -191 -3464 -1205 1600 251 759 -499 -1483 -1127 -903 123 -60 -1252 -195 203
796 203 -1371 -792 -283 -1504 50 3309 302 -1379 1214 -2298 -812 4636 672 388 1147 -2659
812 -2659 -238 2680 1862 2237 585 300 492 -34 2837 2103 -14 2266 843 -292 1521 1048 -926
829 -926 1103 3237 -176 628 1635 -3031 742 3310 -1204 1515 -265 -4490 -539 52 -238 845
845 845 -1605 -2629 -2840 -848 111 -1289 -166 -2353 -3431 -1555 -2952 -2076 -1941 -2841 -988 -3502 -1924
862 -1924 -2386 -5431 214 -1204 -2666 1920 -4982 -4671 -106 -4022 645 829 -3770 -1965 -2805 -1683
878 -1683 249 949 1271 -2326 -307 212 -2750 3216 889 -1939 2869 -12 -930 1655 489 874
894 874 1622 4710 1646 -1609 3835 -888 -489 8068 1069 -13 2988 -1293 755 3588 4356 1531
910 1531 333 4377 -1657 414 7106 -1644 2081 4937 -3218 1886 2190 -841 1579 954 3008 -297
926 -297 246 2967 -5293 1577 5999 -3597 3250 1166 -6927 2462 1889 -897 2112 -533 -1362 -2099
942 -2099 1272 1773 -2451 2327 551 -4538 1944 119 -2763 1771 743 -1284 -119 1617 -1123
957 -1123 -2352 2813 -209 -562 4457 -2299 -3313 1865 -861 907 2872 -888 -1716 -623 1136 117
973 117 1203 1701 -2588 205 1092 -2373 1590 269 -1824 1481 -1424 -1474 -167 -2079 207 -1002
989 -1002 -667 535 -3342 -1007 -1419 -4200 1957 -210 -4003 -285 -3616 -3615 1569 -1058 -2826 -1434
1005 -1434 -3089 -3046 -1003 -746 -2771 -2450 -583 -2975 -2213 94 -3692 -1744 1001 -2277 -1419 147
1021 147 -2675 -1559 -20 -176 -384 119 -547 -2237 -771 2267 457 1102 1826 -2155 -367 3663 1039
1038 1039 1108 3013 253 748 3574 1604 954 2842 2433 1842 3518 2720 1087 1816 3026 2770 2765 3276
1056 3276 1725 758 2495 2728 2360 3774 2140 555 1689 1595 2433 3024 964 1194 1016 622 2283
1073 2283 824 12 871 367 938 1028 -502 -781 -770 898 1126 -914 -68 -1343 -1998 686 -126 -970
1091 -970 53 -1694 -1550 -828 -875 -295 -1445 -788 -1711 -2735 521 -1297 -2571 572 -2362 -2123 1873
1108 1873 -1867 -2529 144 -1390 -1175 963 -835 -2332 -1335 56 -1091 -317 1109 -2214 -2049 1538
1124 1538 -1057 -1116 1316 -884 -2296 781 480 -1530 103 329 -2376 -323 1459 -1871 -916 1082
1140 1082 -2290 -957 1758 -1366 -1885 133 -1530 -1680 1190 -582 -2378 -510 -934 -1766 595 -425
1156 -425 -1770 -1116 -562 -1197 -688 287 -1290 -1826 623 -938 -1455 1065 -1398 -2022 1246 35 -889
1173 -889 815 -681 -1387 1004 1020 -61 430 182 -545 470 2381 615 444 1689 -489 1221 2765
1190 2765 581 1274 1645 631 1805 2314 1464 926 1488 1683 1293 2434 2101 57 1821 2244 768
1207 768 2973 1887 -423 1208 1806 734 1656 2171 232 57 1965 774 153 2151 127 -1293
1223 -1293 1670 367 -1110 1100 125 -1404 391 1052 -1328 -1284 227 -1612 -698 1369 -1343 -2204
1239 -2204 -185 -1651 -1440 569 -1012 -1946 -1153 -1019 -1755 -375 133 -2028 -1472 -184 -1556 -1004 517
1256 517 -1680 -1385 300 -339 -954 174 -678 -1430 787 1029 -812 -29 -149 -1170 266 1334 -125
1273 -125 207 -27 -275 258 1022 910 -221 -194 294 -115 351 1196 -562 -368 1129 136 136 582 -442 -404
1293 -404 70 846 -250 -116 -87 -1159 -420 707 -112 -520 -839 -1104 -741 -121 268 -693 -1357 -415 -729
1312 -729 -581 413 -747 -1002 -537 -526 -248 -391 -461 -952 -553 402 -746 -129 -298 -1066 25 474 239 188
1332 188 -705 -240 -101 315 1258 -287 -37 469 -793 1343 1235 109 634 23 232 1307 751 1221
1350 1221 368 629 1530 369 1107 1044 -168 1191 1272 617 1007 158 512 568 902 1595 567 258 -22
1369 -22 -413 693 598 832 2 -983 268 -179 250 717 -902 -158 -37 -223 3 -773 -214 -931 -641 907
1389 907 -972 -888 75 -1696 -219 346 -1127 -247 -1211 -832 -280 -804 1137 -1035 -1418 736 -1865 -143
1407 -143 1250 -1530 140 -276 -821 569 -54 -86 -361 -300 1314 -595 226 891 -1223 1136 1077 -111
1425 -111 790 -154 -128 350 624 1362 -636 372 664 -890 1289 575 -551 879 -140 -158 333 601
1443 601 483 -832 557 337 -632 1451 -450 -1506 662 -502 261 61 -1322 -447 -1248 522 274
1460 274 -1755 247 -505 -1714 1025 -826 -799 -186 -1239 -500 -465 -356 -8 -1379 -10 -254 -1196 940
1478 940 -356 -1121 321 -451 306 594 -313 -293 -479 552 813 101 641 8 -294 1103 472 430 571
1497 571 386 170 908 943 -11 637 1026 232 593 941 62 458 499 720 487 724 1068 -449 319 942
1517 942 -378 1012 1026 -590 211 293 205 860 -395 -434 -226 -252 328 -412 -383 -14 -762 -151 30 -672 -548
1538 -548 -627 -589 -200 -747 -729 -469 -1172 -652 -304 -408 -643 -492 -923 -860 -323 -169 -394 -919 -730 -546 -554 313
1560 313 -245 -1035 266 -261 -95 800 -711 -349 291 160 426 69 -67 -199 -238 1125 167 46 1165
1579 1165 -300 -357 1334 3 140 1346 -250 -57 723 298 288 156 319 -272 459 1264 -491 -81
1597 -81 899 -620 296 1301 -408 -546 599 35 -211 647 142 -943 124 211 -460 216 448 -1100
1615 -1100 -448 294 -356 -192 492 -601 -740 453 -84 -691 145 24 -924 364 143 -411 -208 -19 -113
1634 -113 169 533 28 -347 -43 223 143 822 501 -249 598 8 357 830 365 184 170 589 557 202 491
1655 491 364 48 722 782 112 624 -93 -97 620 437 553 236 -202 208 127 539 386 -176 -244 -1 -236 -13
1677 -13 -124 -525 -533 -361 86 -372 -465 161 -657 -407 -1 -823 -448 -699 -529 -602 -277 -140 -846 -912 -572 -746
1699 -746 -178 -192 -899 -865 -501 -608 -433 -289 -68 -784 -280 53 -117 12 -262 -488 123 73 -101 235 -257
1720 -257 -49 224 23 383 87 202 380 333 757 320 211 25 -35 490 734 608 505 94 250 483 618
1741 618 681 136 311 261 332 670 397 -91 394 156 -11 440 135 -244 26 -10 -92 595 656 -792 -38 91
1763 91 -363 88 392 -672 -460 -120 -312 -211 474 -551 -862 454 241 -888 346 20 -619 120 426
1782 426 -343 -171 169 -407 -404 673 -293 -792 467 -342 -436 1093 367 -439 646 103 91 134 586 -182
1802 -182 -70 422 -41 -90 882 -148 -161 849 66 -81 841 -26 -649 322 401 -160 309 326 -653 245 579
1823 579 -266 -146 -143 -317 -10 410 -48 -607 -131 -196 -608 362 -19 -493 23 -467 -662 -72 -226 -344 -496
1844 -496 -425 -79 -395 -22 -550 -619 -193 -239 -278 65 -603 -333 -115 -149 4 -8 -679 -518 96 30 -33 247 -506
1867 -506 -231 85 99 62 351 224 -134 81 575 -93 131 639 -219 371 833 -148 485 643 -89 416 598
1888 598 227 356 403 435 96 461 870 -242 41 356 -167 581 627 -351 -33 309 6 230 274 -95 -192
1909 -192 159 74 -311 275 -212 -531 31 -14 -274 -382 -364 -426 -382 10 -305 -163 -221 -435 -505 179 -411 -186
1931 -186 -309 -20 -166 -174 334 -54 -579 224 -190 -581 356 -599 -203 224 -68 597 -180 -295 303 -161 374
1952 374 599 -324 189 270 67 204 197 165 -58 221 411 75 228 330 -206 121 606 -321 51 380 -536
1973 -536 -78 667 133 -432 271 -340 -202 598 369 -291 -120 -206 -419 -315 385 -497 -314 446 -853 -481
1993 -481 2 -436 -400 44 -398 -242 -37 -163 -717 -346 177 -562 49 214 -796 -393 608 -313 -188 195
2013 195 -568 -239 489 5 -131 145 -121 -71 640 188 133 166 259 163 389 482 84 217 558 -29 315 1046
2035 1046 -171 461 677 -178 604 701 163 139 177 53 290 511 298 -613 263 565 -12 513 15 -226
2055 -226 287 133 -213 167 -25 -429 127 95 -449 -72 155 -498 -459 392 -193 -488 -285 -625 -564 -13 73
2076 73 -414 -219 24 -737 -86 153 -770 -456 238 -289 -440 270 -535 -367 83 -18 -255 292 85 -527
2096 -527 175 219 -289 178 154 -524 268 382 -198 379 332 -20 -37 407 272 -304 437 257 -172 711 288
2117 288 -409 148 136 9 494 363 -146 -120 70 168 36 355 -19 -381 -276 56 -226 339 62 -427 64
2138 64 -47 64 56 -13 -191 -315 -239 -23 -275 -63 -259 -316 92 -306 -287 -143 -294 10 7 18 100 -615 -139 70
2162 70 58 112 -62 -252 -389 250 258 55 159 106 196 61 457 88 350 342 208 225 507 198 217 336 321 279
2186 279 434 335 -69 217 437 166 407 357 118 157 483 341 -46 352 63 -273 183 96 -256 21 -58 -332
2208 -332 82 -37 327 -274 -18 -168 22 228 62 -66 179 -154 -173 162 -575 -235 72 -120 82 -249
2228 -249 -212 -98 -254 -89 -101 -11 -76 -341 -230 -448 -140 -176 -210 -145 -133 -235 194 33 -226 -68 -76 -11 104 -34
2252 -34 269 -159 -212 213 -3 27 -161 51 -5 164 -31 -128 144 93 -394 325 338 -86 305 477 -88 122
2274 122 -101 127 -216 423 -119 -107 311 25 -446 -126 125 -6 60 138 -120 -313 317 -126 -218 224 -207
2295 -207 -578 285 -94 -227 199 -111 -358 83 27 -241 -3 230 -335 -214 296 -250 -49 115 -337 -113
2315 -113 375 67 15 81 271 -102 168 477 -325 -7 297 -77 122 343 8 164 127 107 90 249 416 160
2337 160 505 601 105 164 431 15 268 400 209 6 153 -69 49 46 77 64 -130 -84 -154 40 319 -160 -154
2360 -154 144 43 -121 -73 -310 -159 -67 150 36 -108 41 -126 -225 -236 111 -271 -506 -277 -225 -134 11 -367
2382 -367 -247 -128 -281 48 -98 53 -260 -456 144 -113 -119 -93 -439 -157 -60 -17 -3 92 -191 253 222 -10 233
2405 233 89 157 -41 44 -8 -33 -244 -7 -142 -60 222 151 -238 133 -53 359 157 34 77 -185 -25 238
2427 238 -115 21 -148 -38 222 140 51 -248 -50 150 -303 274 -291 138 -77 163 -100 56 369 -204 3
2448 3 49 -122 -67 228 115 -215 59 -39 -132 -7 9 -224 74 86 -90 -68 168 -202 -71 102 -381 33 149
2471 149 -251 -132 82 239 120 100 266 57 461 270 -176 143 393 -40 418 384 145 -92 143 364 279
2492 279 341 68 -93 74 494 -27 50 270 -50 98 444 -76 -138 64 -321 -135 194 214 182 -31 -178 176
2514 176 -145 -46 -7 -266 -44 -311 -171 253 -283 -229 -260 -118 -142 -140 -277 -122 -314 -178 145 -285 -279 -471 -411
2537 -411 68 -303 -109 -270 -212 46 -206 -130 -130 -262 -166 -18 -25 62 -32 -163 109 12 308 -193 363 70 27 133
2561 133 104 71 113 205 -171 -6 210 105 -188 130 233 -29 314 179 -34 83 24 124 83 195 -31 70
2583 70 -41 161 -160 -22 244 -21 67 177 -66 -40 107 -161 -194 -223 6 -197 -85 -184 -189 116 27 38 -88
2606 -88 -35 -369 -63 -16 -183 -218 30 3 -67 44 -94 -258 -48 306 -76 -197 115 25 10 99 275 -40 259
2629 259 341 -119 198 429 -82 -69 358 -163 172 230 146 35 382 386 233 32 164 -110 47 112 -75 183
2651 183 293 -281 -78 59 120 73 95 4 -290 -122 -79 -167 -75 -2 -438 -48 163 -232 77 -64 -241 -200 15
2674 15 8 -286 -185 -64 -421 -35 -63 -368 225 -8 -294 -120 -22 -339 -71 -203 -194 -249 34 -215 -32 -10 -258
2697 -258 -103 -82 -92 -6 -41 -47 -4 -88 -5 -377 236 106 -258 -5 182 36 106 239 15 224 361 -8 78 170
2721 170 -23 57 -63 198 240 166 -13 -99 213 -240 -251 246 -64 -242 -40 62 10 111 -102 -119 45 -276
2743 -276 34 23 50 -232 -137 42 32 43 19 -222 69 13 -51 -110 -126 -227 26 -68 64 -112 72 -113 -60 291
2767 291 262 -52 -216 348 -301 -15 75 114 -15 157 -198 -119 -68 94 24 -29 -102 304 172 226 -28 -25 301 62
2791 62 92 159 131 188 220 94 142 -75 128 -43 304 44 -146 132 62 157 121 166 -41 48 -203 103 42 -246
2815 -246 123 -244 -166 -10 -103 -195 -213 -146 36 -222 -106 -357 -193 -176 -180 -260 -25 -110 -233 -16 67 -155 -45 180
2839 180 -156 181 97 -252 47 295 209 -155 139 -134 -163 24 168 -255 109 382 -95 40 3 6 165 148
2861 148 244 -108 61 227 254 80 93 386 -99 142 -109 149 174 17 141 143 -183 320 427 34 172 86
2883 86 183 186 77 -1 134 113 345 246 115 9 24 139 -126 46 -199 -248 -174 143 -79 286 149 -133 -91 -165
2907 -165 -45 5 -154 -16 -113 -225 187 -210 -183 -250 -363 -146 250 -320 -363 3 -230 35 -49 60 -53 54
2929 54 223 -37 216 98 -19 -58 146 55 264 208 -157 -200 175 -159 -142 93 47 -118 157 214 13 -130 228
2952 228 125 -40 13 -68 -24 154 71 164 189 84 -24 72 109 -67 -226 170 89 -138 -82 98 -203 72 -98
2975 -98 -379 246 14 -291 86 -288 -6 155 -48 -214 136 -95 -243 -139 -50 -257 -204 -309 162 -118 134
2996 134 283 -80 -61 -27 390 226 138 -292 -148 -80 127 -108 -80 168 -29 66 206 321 211 248 53 88 -166
3019 -166 222 -39 -147 23 -156 111 182 -6 -22 23 217 230 164 201 128 7 70 307 86 247 129 -22 117
3042 117 2 26 -54 -15 -95 106 -255 -47 -42 -98 -77 -42 -90 -31 108 -65 -91 -220 25 -110 -138 93 -17 -330
3066 -330 3 -431 -47 36 -60 -142 -42 -147 171 -156 -49 -38 8 163 -201 60 -26 -115 13 21 37 28 -93 349
3090 349 27 -132 232 -15 79 -131 144 238 -212 -114 186 162 -161 210 59 64 -56 311 -61 93 70 0 68
3113 68 110 -217 157 -87 -291 -16 59 -168 -23 -66 -46 -85 63 -230 -161 -4 -155 -115 -169 218 -134 38 72
3136 72 -99 -65 13 -144 -184 -98 -212 -65 -9 -50 -180 137 4 -185 66 64 -168 87 45 -196 -78 -37 88 65
3160 65 55 -203 -88 194 -286 166 239 213 -217 -163 -82 -38 163 5 -7 -98 134 -157 71 -87 74 119 -80
3183 -80 -121 -3 -144 51 -112 31 -264 -335 -53 -125 -86 -72 175 152 -268 178 -100 19 -144 -284 -394 -86
3205 -86 -311 134 -146 -250 181 8 247 105 112 -259 -30 62 -1 229 81 -20 -196 127 -150 71 -44 -99
3227 -99 -42 -130 126 -24 54 14 -51 156 -211 -190 -52 -230 -4 -95 -109 87 84 4 -189 214 214 91 77 -240 237
3252 237 -86 78 116 79 127 40 286 161 8 -43 64 42 31 -51 -92 -164 123 -108 -130 87 -155 -149 -77 -95 -3
3277 -3 -178 30 70 120 -16 113 -224 -157 -45 -194 -31 133 -39 -200 188 50 -181 -72 -226 -154 -197 121
3299 121 -120 24 105 -20 378 264 62 116 -85 161 143 -162 -53 94 -39 12 -7 206 98 102 75 -244 -161
3322 -161 -198 -114 120 -48 -271 -53 108 -32 70 106 4 -141 -48 191 92 170 -193 -16 -16 181 -7 -5 -18 -82
3346 -82 51 -116 42 87 14 -83 -5 205 -108 -102 -80 425 -62 89 -119 -71 -257 -23 -87 88 -212 -202 110 -151
3370 -151 -152 144 53 -75 -175 203 52 43 -140 -16 -159 -114 43 132 164 -8 -84 -179 258 -14 13 -227 7 -64
3394 -64 31 -63 -64 40 -62 16 -186 278 -19 -180 105 16 -145 97 -69 13 99 -128 52 57 79 -71 118 -55
3418 -55 -32 -113 -70 -55 120 38 -12 -45 72 90 14 91 2 79 -275 -245 180 99 19 -21 113 61 -52 40 -56 -53 229
3445 229 47 -61 -94 -56 -162 -50 -186 -100 73 -108 -73 -88 -16 -241 -232 243 177 -110 64 50 6 25 46 56 239
3470 239 206 26 -183 -68 17 -118 -79 -245 46 -55 82 -87 322 26 184 128 88 -34 -56 39 -131 -176 125
3493 125 42 -47 45 -220 147 14 -75 17 1 181 -175 -278 -229 6 -41 -57 16 -21 -55 172 101 -123 -48 31 -134
3518 -134 -79 -241 -63 -21 -67 68 269 -100 -141 -154 225 129 -119 -55 -18 -43 -235 92 -163 81 7 -225 -100
3541 -100 -257 -66 101 111 277 103 40 -141 183 244 -34 71 -95 25 65 -7 -149 -195 -305 -91 78 -287
3563 -287 96 -4 19 214 65 27 -184 93 24 151 -88 54 2 -28 28 22 -173 -278 -66 -39 -56 70 94 34
3587 34 -177 159 -138 -50 38 -62 -150 51 137 -267 163 -90 -49 -3 9 109 -173 -55 65 243 241 -138 113
3610 113 -3 -105 -82 163 -142 11 -26 -14 6 206 62 199 -16 -26 -66 -89 -63 70 80 -58 -180 190 33
3633 33 -303 122 -97 -94 -11 -136 -151 28 112 11 16 -101 11 20 -216 -167 -21 -220 -59 154 -220 -198 23 -97
3657 -97 42 55 203 -249 197 54 215 76 -21 -88 9 -157 -172 138 -25 171 -264 228 -109 185 -194 4
3679 4 -114 -80 13 102 110 138 -2 -52 -138 -99 -50 -101 213 113 -62 62 31 -17 -123 -65 -39 -146 68 50 14 -141
3705 -141 -31 -22 11 -41 211 44 87 4 28 -83 -167 40 147 12 -177 78 48 185 -147 55 28 -207 -79
3728 -79 -213 -34 -253 -119 79 18 -163 99 -105 -82 -7 136 -145 0 96 -49 147 196 -38 -60 132 101 21
3751 21 -103 143 133 -9 105 137 -111 -118 141 -81 -89 -221 -172 -237 -147 92 97 69 -65 -36 79 10 -128 -167 23
3776 23 -38 223 -3 -34 -42 224 89 -134 0 78 266 171 -77 -326 11 -76 -23 -241 13 -106 101 -264 102
3799 102 57 -125 82 -31 -19 -326 -90 -168 128 2 67 152 -175 -25 87 51 -330 63 73 163 30 148 -71
3822 -71 101 154 -86 49 61 -401 31 95 29 -31 -59 88 67 50 181 37 -148 248 86 -56 211 240 30
3845 30 66 -18 93 -26 -143 157 129 142 -103 -180 -34 -31 36 192 -78 -41 -244 -77 -138 32 -84 -106 -33 -8 1
3870 1 -20 30 128 -310 -203 -28 -38 -123 -10 -202 119 118 61 -102 71 -62 -98 165 -4 27 -11 -50 -12 177 -63
3895 -63 50 45 -123 -8 72 -196 273 69 93 -238 35 -111 264 -114 179 156 64 71 374 -120 -6 51 61 98
3919 98 16 179 -22 131 -7 251 -112 247 1 94 -93 -62 -82 17 -84 97 56 3 26 -132 -219 -12 279
3942 279 -171 49 22 0 21 8 169 -81 -321 24 -194 -122 -91 181 40 -19 -162 -161 -271 195 -118 -87 57
3965 57 63 -207 -24 -69 -59 99 -13 79 -194 -8 -104 38 -150 231 58 -94 -150 -109 27 -183 -72 291 -50
3988 -50 -26 23 50 -124 -64 42 -14 -260 -244 -39 14 69 -30 -76 161 -81 169 -52 -1 74 125 -12 22 99 -168
4013 -168 -59 -33 -57 -133 -57 -164 112 89 -156 369 -32 56 -47 -20 50 -115 190 -116 181 -188 -100 -110 84
4036 84 95 -167 -5 -100 -241 -69 -175 24 -31 -173 -37 219 229 368 34 -42 111 106 50 20 107 -59 199 -14
4060 -14 80 181 53 18 124 -75 182 169 4 15 291 96 -3 203 -98 33 27 126 -13 139 269 1 52
4083 52 -114 -58 17 95 -77 12 -132 96 -80 -286 -179 27 69 32 -75 106 -79 104 138 85 81 11 278 -106
4107 -106 102 -88 -47 82 -21 -185 34 23 1 7 158 -78 164 58 90 -7 41 -83 -58 129 11 7 -100 146
4131 146 -38 314 38 -95 -87 -57 341 15 -9 172 67 -137 -34 -156 -43 293 64 -30 -34 -210 126 -22
4153 -22 -93 152 -102 -145 60 -4 -125 68 -40 -203 -18 -84 -212 0 113 -288 -66 -157 -299 33 -41 -11 -155
4176 -155 -46 -30 -114 -269 -309 84 -243 -4 -125 -28 83 18 -87 31 -146 -108 -184 -281 -134 -7 254 51 93
4199 93 70 -138 77 14 78 52 126 75 75 -29 128 -7 137 -96 168 -208 -32 170 -192 126 -30 319 85
4222 85 7 -21 -3 -15 30 74 -84 -103 26 -143 -95 -134 -200 -93 -91 2 -151 -129 -124 -79 -100 -118 -289 -167 -59 264 36
4249 36 -271 -50 240 -91 131 -133 -63 79 -249 30 162 -85 -56 -37 27 97 34 -165 -331 -134 220 -69
4271 -69 133 -126 26 -20 -55 90 -46 23 32 186 248 -176 128 27 -8 7 113 -6 -137 -37 -148 157 38
4294 38 -328 68 -107 -182 167 -173 166 84 12 36 33 180 169 -77 -88 55 40 -152 -96 -139 -44 -66 -115 -194 54
4319 54 136 -76 47 -134 -28 -66 -41 -70 -80 10 252 49 234 42 1 -38 -6 104 -195 -178 116 23 -210 204
4343 204 102 -124 41 -129 54 -148 21 -38 44 -48 76 303 -101 -117 158 378 -107 85 -184 157 292
4364 292 -146 -36 67 -258 125 199 85 -74 62 49 212 33 -14 -88 124 -53 -134 107 -121 67 22 -211
4386 -211 23 250 -156 43 37 -114 92 137 -204 -207 -232 -74 -129 43 44 -13 -84 52 20 29 151 64 -135 135 141 -130
4412 -130 -118 107 -58 -56 162 271 -192 28 202 116 -131 -33 69 -100 -92 -137 -109 -246 11 110 128 29 -317 10
4436 10 155 -106 -103 127 72 121 239 315 114 -46 -150 -81 -125 -123 181 109 26 -153 172 23 -132 -115 92 -36
4460 -36 44 47 -263 -161 -285 137 -43 114 -203 226 -204 72 -99 -99 101 -294 57 -115 -241 62 44 22 -70
4483 -70 -61 -34 4 -144 -29 -36 189 -13 18 122 -25 -42 125 78 38 112 -15 18 52 -12 39 -92 128 -117 395
4508 395 -82 -10 155 95 35 -9 115 -19 169 -8 256 72 -135 -234 -80 -58 -230 -91 111 38 114 76 -134
4531 -134 -34 232 70 -130 158 -46 -57 264 162 44 121 60 89 -149 -15 -229 -155 -68 -69 240 53 -127 67
4554 67 206 7 14 -204 -76 -210 44 35 34 -203 21 12 -127 -138 -20 50 -7 89 29 -34 71 276 -16 170 -85
4579 -85 -66 87 -100 -126 74 -29 -198 -11 107 9 -19 139 183 84 -33 -121 35 -18 52 103 66 63 1 -177 120
4604 120 77 -275 14 98 -176 -212 -143 -362 -155 79 11 -128 -94 -128 -50 -105 -25 -16 123 -125 -61 23 -93 80 -10
4629 -10 -42 -70 -211 -2 174 -22 -113 51 -126 -15 88 -113 12 -89 -136 88 -309 150 -159 -57 155 77
4651 77 -351 193 16 -184 72 66 -34 -3 18 84 56 -204 39 163 113 -237 -209 -7 135 28 17 143 74 -106
4675 -106 28 13 65 -61 313 -21 -116 -418 235 97 -91 336 8 -145 -112 -58 -83 36 -124 -40 -55 152 -98
4698 -98 -296 3 48 32 66 84 175 46 -100 -50 31 264 -237 148 24 -37 44 -83 -56 -207 -11 -32 -55 77
4722 77 -151 122 72 -195 95 28 -114 15 58 -203 28 -95 33 -49 75 49 151 90 75 -23 121 -70 -31
4745 -31 71 -78 -127 119 -210 72 61 -228 86 -24 153 -242 -156 -215 270 41 148 180 -170 59 53 -33 20
4768 20 152 -282 -90 -101 -150 41 -234 16 249 124 -153 35 57 -297 -128 -79 54 -94 134 -99 2 -158
4790 -158 -48 5 112 127 -164 -35 61 -318 300 -82 69 -4 -193 27 44 -79 121 -37 -15 155 -121 -28
4812 -28 120 113 110 265 -10 50 163 96 -266 -107 49 192 -91 119 -159 -108 -110 -71 -49 172 27 56 -131 64
4836 64 54 -61 88 -73 -17 -162 -151 -11 5 -102 -119 -48 -98 -172 -156 80 -10 -9 32 13 53 -189 281 22 -265
4861 -265 -48 229 190 163 199 35 302 243 -141 -18 7 130 108 318 26 -157 111 188 -155 87 202 -142
4883 -142 215 -56 -126 183 33 -49 299 -102 -7 -94 -139 -300 -284 81 -256 152 20 81 -150 17 185 44
4905 44 -47 2 22 -38 -89 -66 139 -54 -115 35 -259 -42 -92 166 -111 -17 41 -42 -155 -34 44 -158 -26 -4 -115
4930 -115 51 14 -25 -142 -6 17 75 12 100 307 216 -92 -16 -1 -35 -95 -232 31 -22 77 105 24 -194 207 -88
4955 -88 193 -105 84 175 142 101 14 -106 48 376 93 40 98 65 -144 -160 -3 -60 42 -46 24 -85 121 411
4979 411 133 128 -4 218 -147 -63 -46 -53 136 77 -222 -239 -6 -308 199 -79 56 -22 -84 -13 -45 41 202 -54
5003 -54 -47 -100 -62 -216 -86 -215 -150 -109 64 85 -71 6 -232 34 44 -36 7 -248 -228 31 -201 -195 6 -153 44
5028 44 -25 -133 91 -167 16 121 -194 75 57 85 -74 -130 65 -184 -175 -131 73 1 -118 26 -21 -34 -211 84
5052 84 28 179 137 80 -279 210 -106 -166 -132 120 -212 -206 -63 127 -169 78 140 -47 3 -32 -206 -104 250 -229
5076 -229 -119 94 -68 18 -258 169 16 -89 86 -211 15 -127 125 -9 96 -173 77 -148 -100 14 58
5097 58 -163 41 -65 118 65 99 -33 -114 -152 -228 221 -66 -28 98 -14 -26 148 -115 16 1 -142 99 170
5120 170 22 -287 36 -130 112 92 117 217 -60 29 -132 203 -148 149 10 43 113 43 192 -18 258 -36
5142 -36 -177 -143 -104 -47 79 115 59 155 -19 -64 20 -62 345 -38 -91 36 4 -152 37 114 14 -75 -86 -45 -185
5167 -185 74 -193 -81 147 -196 -240 16 206 -54 39 -31 9 151 -72 -104 -209 64 133 174 -112 -17 -8 119
5190 119 103 45 -102 -156 45 45 142 -173 -101 -20 -6 63 137 -146 55 24 -232 84 103 132 71 -56 -186 109 273
5215 273 304 110 24 58 -24 -216 3 61 80 88 -83 286 108 132 40 -21 -42 -76 -30 -35 90 104 -143 -21 -220 220
5241 220 -126 41 91 -29 -209 -206 -248 30 155 16 -82 106 -7 -57 28 55 62 -44 -54 116 21 120 189 98 0
5266 0 14 -42 -47 -128 121 4 146 102 -144 -155 -6 136 -24 -54 109 -107 28 -29 -255 -32 194 85 98 -6
5290 -6 -56 -142 113 -149 -137 38 159 -242 -16 10 -203 -109 -100 218 -42 184 -58 -80 176 204 58 -200 63 157
5314 157 -75 32 176 36 -235 -19 -126 85 4 27 -180 -70 -40 -150 -43 21 63 -209 -98 -56 185 -163
5336 -163 -126 84 -92 225 49 81 22 -141 22 258 105 -113 22 163 99 -76 -142 -26 205 -83 63 -22
5358 -22 44 -206 69 -131 -32 -81 -56 13 -95 -4 -228 132 138 192 -125 95 21 85 -46 105 -84 -19 58 -197 98
5383 98 -129 36 -14 24 -27 0 -20 -36 -39 -120 -101 -70 -189 -178 -238 -130 101 97 136 -45 80 -32 -51 -183 -94 24
5409 24 -91 172 -120 41 280 249 24 -58 220 -157 87 -6 -277 -166 -4 -86 104 -18 -13 153 -235 97
5431 97 -114 -18 -149 -24 -111 -95 204 -211 -98 237 -261 23 10 -151 -31 116 -5 -61 -297 214 -43 10
5453 10 270 -114 -42 -15 123 132 96 150 279 -112 -82 -10 1 -123 139 -77 -6 -231 -9 -246 -53 -44 -115 -100 -85
5478 -85 -23 -84 -122 188 178 -54 -310 -291 181 164 8 210 -159 211 -53 101 41 48 -18 -82 91 15 63 -96 13
5503 13 114 49 3 -62 66 -76 87 -132 97 56 161 24 37 26 -237 -137 181 90 -45 142 -112 -156 -144
5526 -144 -29 186 -219 -4 72 -75 149 -55 -76 -136 31 155 -150 -62 9 -35 -25 122 -180 86 -88 -95 -95 -39
5550 -39 182 67 35 43 -189 51 103 -87 -101 108 -203 -36 -100 26 -139 -92 44 43 62 111 -104 -233 208 152
5574 152 114 -316 -187 150 210 -216 77 -144 140 -6 -5 -95 -91 -24 -187 -6 0 76 20 142 -50 28 -70 -85 44
5599 44 105 0 63 95 64 -33 25 -31 -174 279 54 174 6 5 100 25 18 42 85 -134 274 50 -220 -117 -76 -163
5625 -163 103 -89 -194 -202 -142 81 -230 -55 339 190 5 25 -49 -170 132 -51 169 -128 -86 -47 -97 102 84
5648 84 -9 138 79 5 -61 9 40 315 130 12 -161 169 59 -132 -160 136 106 -76 -11 -87 85 96 -166 -241
5672 -241 48 217 61 23 218 136 -34 308 -31 -228 -38 40 -102 -146 -103 -43 6 170 -89 6 -19 73 72 -181
5696 -181 -96 -43 252 136 -107 -84 -45 31 -26 -164 -192 36 79 191 -57 224 -75 149 -52 -57 207 -80 -70 -229
5720 -229 62 -253 -102 35 -21 -36 -173 76 -120 -46 -30 -53 103 -221 26 -129 -29 38 -32 81 -139 40
5742 40 -35 -90 -64 -76 -29 139 -10 40 295 -235 77 -229 63 529 -46 71 35 -48 63 4 -95 83 -38 57
5766 57 119 -88 -81 83 116 113 -46 -27 -116 150 -86 249 4 273 19 -435 -77 176 68 47 69 103 -86 -48
5790 -48 41 -165 6 228 114 -135 -151 60 -19 28 94 -165 -67 -20 -3 79 186 160 75 83 -110 153 -257 219 -86
5815 -86 -108 -164 151 -128 86 147 -388 -45 -41 -31 -147 95 50 -61 -104 -171 -18 -256 81 -21 -226 126 -200
5838 -200 -18 75 34 26 56 -71 -95 246 -179 273 299 -120 151 70 -100 113 -65 -66 -194 45 52 -14 -13 -52 -110 28
5864 28 42 148 12 -83 7 65 82 20 8 -83 249 -16 -185 123 103 -75 -47 -161 -107 110 166 -40 55 72 144
5889 144 -3 13 -30 130 -112 -158 -5 154 -54 113 86 -66 -38 40 19 109 184 250 167 -76 -115 -1 -133 -73
5913 -73 -124 -106 200 -56 12 153 90 -217 -151 -206 65 -28 82 162 154 237 -12 12 -112 67 110 4 33 186 22
5938 22 115 96 34 -11 31 134 -165 -62 227 -45 -56 254 -52 -179 -61 -11 -212 -116 -201 -140 31 -80 0 171
5962 171 -65 -180 71 204 32 60 32 -110 -267 -15 47 -245 -72 126 72 30 53 -47 184 -196 79 61
5984 61 17 -232 89 -124 81 70 -145 -52 -93 -107 36 58 -69 10 69 282 196 -165 -305 148 113 -58 -14 -185
6008 -185 38 -40 114 -124 -149 120 20 115 -279 -74 -163 -194 230 78 -13 81 36 32 -16 -165 -147 -34 -94 -49 -123
6033 -123 115 0 -218 28 -14 -33 76 78 -181 61 79 -217 -3 255 240 -33 39 -156 -288 -104 -139 185 -81
6056 -81 -180 254 49 -129 -189 -133 -14 -324 96 -78 69 -104 104 110 -60 219 -35 192 -134 76 49 -48 88
6079 88 64 122 -157 -64 -131 69 116 32 59 -126 -260 -132 149 74 151 -124 -126 111 65 -5 -51 72 -124 52 -5
6104 -5 -91 -234 -213 -25 228 -76 -66 -110 -212 -170 75 147 63 -253 75 68 77 -86 -138 253 93 -95 3 155 -195
6129 -195 181 -45 148 -61 -104 142 149 103 -136 24 -15 24 -73 -227 100 50 40 269 -165 95 112 -203 258
6152 258 -310 -45 157 55 51 -32 125 77 13 -161 139 -39 -72 -165 -9 -23 110 -17 -176 29 -61 146 -184
6175 -184 -9 -297 -207 124 100 102 -151 -196 100 283 -67 51 26 85 180 56 -260 133 -25 -136 -70 -259 -4
6198 -4 116 46 -110 52 -19 113 4 -182 177 3 90 88 -141 -110 -198 -91 80 121 -154 -82 -108 105 140 -18
6222 -18 -93 54 63 -146 -10 -170 61 207 -46 64 75 -56 81 28 381 25 -224 16 122 -14 -8 11 -1
6245 -1 -272 -117 -307 135 -37 19 -170 -270 217 148 -65 -43 -71 -84 82 56 -221 -10 250 -47 -47 -128 18 174
6269 174 120 -49 12 35 -33 -47 -5 -56 -57 72 -88 142 46 272 -77 -63 256 -104 -21 -98 60 54 39 -122 -76 -250
6295 -250 -182 -175 -3 -3 37 23 -90 -71 -130 -150 -230 4 110 -10 -237 -73 76 -13 81 231 -69 28 -46 -109 -240
6320 -240 60 30 -55 -64 -64 -162 -88 -85 -154 -143 -34 13 79 19 -72 26 -276 73 -123 44 -129 -282 182 -65 -67 108
6346 108 -258 152 -229 46 5 -8 74 -96 -7 -252 -9 55 -48 44 -193 16 -7 92 337 245 100 17 238
6369 238 -131 -33 -36 154 -197 39 -34 -121 -31 -19 107 133 20 -103 -5 146 -81 -101 180 1 -79 -97 114 -162
6393 -162 -170 147 140 13 -102 207 -250 -181 93 -86 153 -45 -32 91 194 -321 -41 144 -257 64 -28 13 -55
6416 -55 -32 -137 44 56 -122 129 -366 -188 -177 -260 -224 -83 -132 -52 -131 -43 -140 81 -76 -52 87 -33 -20 -157
6440 -157 4 37 137 -18 -31 -67 -20 -64 1 86 -37 -42 -72 284 5 -7 40 -197 -34 -204 46 -61 54 -58
6464 -58 -90 -95 -15 37 27 122 -55 166 10 118 -154 -54 -113 57 -111 77 143 -87 122 -99 148 16 364
6487 364 87 33 -376 -211 202 -138 -107 -133 104 -62 -217 82 -75 -43 80 -42 200 193 -20 -118 -183 50 36
6510 36 -36 300 27 -55 -5 -173 -18 -136 -69 102 346 -123 17 2 -48 -21 -223 -6 42 44 112 123 123 40 -51 34
6536 34 -166 -14 -16 37 -145 -87 5 75 -74 63 -9 -62 -32 25 -23 -44 298 -11 -33 163 -7 84 -32 134 114
6561 114 -9 -28 -209 -106 -9 41 -360 47 271 32 -61 -163 -250 191 -70 68 182 -45 -43 -29 174 45 -96
6584 -96 -257 235 17 -55 33 -86 39 42 -26 -92 -4 77 196 238 -188 -102 -142 58 291 7 117 211 -16 -421
6608 -421 25 -5 -93 -34 12 126 114 -33 -182 135 -58 28 -21 51 -59 -87 -178 -41 150 256 269 -325 -51 66
6632 66 70 -64 -204 -44 -25 -56 -219 -29 -47 83 -186 -71 -156 36 -143 88 -76 -186 -99 -128 -7 75 -34
6655 -34 -168 -102 42 -121 -206 76 53 -94 -27 220 -7 -70 9 211 160 -155 109 50 -34 92 -7 191 183 137 -16
6680 -16 -249 264 30 74 -30 -109 -131 -34 51 -77 38 71 -149 -153 139 -92 -105 -5 -224 51 122 -15 -235 179
6704 179 -58 -52 127 -224 -210 7 -285 -101 152 51 -71 211 93 -19 68 -58 48 86 90 125 -177 -62 0
6727 0 40 94 -53 -68 46 27 -66 149 243 89 71 45 44 -107 212 198 117 -39 -78 169 -292 -139 -287 11 -137
6752 -137 132 42 267 -40 -101 -55 23 53 100 -110 -24 -93 241 193 304 -90 -130 -61 -19 -29 56 94 6 33 -351 47
6778 47 -227 69 27 100 -129 -110 -145 -21 158 -57 -202 -97 122 4 -24 87 10 -177 -92 -115 -104 -241 -142 177
6802 177 94 -27 49 -133 112 -33 -294 -313 -79 135 160 38 36 -61 128 179 85 241 -93 -81 -45 -127 96 -20
6826 -20 69 313 100 110 -82 19 74 95 -20 178 -180 -102 -41 142 -191 179 44 17 -38 -56 -73 -8 41 -18 -130
6851 -130 -126 -103 53 -132 111 -147 111 -200 -79 0 -33 -19 -23 -181 -87 37 28 -39 171 -189 -114 -27 196 74 90
6876 90 127 111 58 -349 145 -215 -141 90 373 -40 -137 199 175 48 31 -198 -169 -96 87 -22 -318 -47 2 40
6900 40 -168 142 37 -79 170 -243 295 221 26 -17 69 -68 99 133 -63 -94 107 -124 138 34 104 -230
6922 -230 -224 -8 -107 196 64 -80 3 -21 48 71 237 -73 -166 130 68 -50 100 -57 203 -104 -174 -102 125 104
6946 104 94 5 -7 115 -8 -68 -178 48 -66 71 -119 70 -54 35 -164 28 -28 -69 -350 -55 91 155 -48
6969 -48 327 -294 108 156 -158 63 -78 -230 -47 151 82 40 -74 -47 79 -87 -56 -166 63 -70 -122 205
6991 205 78 235 -4 68 -308 78 -68 -41 48 -48 96 283 74 23 79 148 85 82 162 -55 -81 -161 37 239
7015 239 -63 -8 -71 -134 132 141 -35 0 172 76 109 36 125 51 19 -99 -33 -125 56 73 -66 -79 229 -123 -25 -70
7041 -70 87 -45 54 -84 -191 41 72 -26 -86 51 -163 -63 -120 49 172 116 -133 -166 -19 74 -81 166 -217
7064 -217 103 -67 -9 130 -81 -44 36 -218 -94 31 81 -66 -90 -56 27 120 -92 28 41 -84 -93 113 155 247
7088 247 71 26 -20 12 75 17 11 -142 -11 -12 -155 178 -106 102 -103 -170 -156 -254 -135 -41 162 65 55 98 5 -113
7114 -113 -197 -123 -81 -44 209 61 -99 92 109 89 66 -97 13 -225 -201 -82 16 -199 -4 40 -323 -381 -160 -9
7138 -9 61 124 127 -260 25 -13 -105 153 84 -140 -42 105 -106 18 -156 -83 120 9 96 238 -91 98 -51 170
7162 170 -220 30 -111 67 -8 80 33 3 38 20 114 0 -77 197 166 -7 60 40 -121 -22 1 75 -90 -320 -249
7187 -249 -51 -18 90 4 -124 170 19 -45 145 208 95 -27 -101 -14 -94 90 -70 80 -286 -182 -73 -38 -26
7210 -26 28 -57 -17 -103 1 298 109 -95 -47 126 -259 176 346 20 -21 33 -23 24 -109 171 57 257 61
7233 61 26 -250 157 -116 -6 107 -132 77 224 34 -75 202 59 -2 39 -196 -343 183 79 37 156 89
7255 89 53 11 -214 -67 103 -113 -25 -31 12 -42 134 -144 309 252 -243 177 -61 -46 -150 92 96 280 -220 92
7279 92 25 -79 72 -100 7 -87 -46 221 29 160 105 29 197 -43 -155 -87 67 318 -130 -90 -9 -66 -112 -144
7303 -144 -127 -35 -41 37 1 40 -227 17 -12 118 -246 41 7 91 171 -377 -180 133 162 -290 209 130 103 86 58
7328 58 71 62 -308 -121 -259 -120 -60 -265 69 -368 91 92 121 -127 244 84 12 -124 -176 128 22 34 -74 20
7352 20 120 -82 -86 -121 -111 -38 56 32 202 -114 -302 268 -43 -50 -6 -76 93 -49 111 -151 78 204 103 115
7376 115 -289 -99 127 131 249 3 -296 84 -114 -160 -164 -10 -194 16 -129 -11 179 -23 85 100 -187 -99
7398 -99 142 226 234 -244 -160 237 32 37 -89 72 -36 127 -167 -59 -64 -110 -240 156 -21 68 185 -238 -172 -26
7422 -26 202 44 24 -139 19 -110 95 -18 124 -46 -163 -132 -171 16 -20 30 -44 -202 -165 -203 133 -252 47
7445 47 -94 -240 307 -110 -86 36 99 97 132 -18 186 178 0 6 -68 24 129 240 -246 -33 -228 85 -68 88
7469 88 -72 -88 96 -150 252 198 -127 -23 -183 -24 -227 97 111 238 -255 -150 210 59 179 27 -30 -56
7491 -56 80 26 130 -59 138 425 22 -56 149 11 -58 104 81 -306 -195 29 -38 94 129 -36 -219 54
7513 54 284 -115 -154 -138 220 76 216 -307 131 227 106 -242 -149 -18 -74 116 -82 -268 -19 -11 -227 -133 -294
7536 -294 21 -40 -20 -310 189 28 -68 -85 -119 -21 -245 -130 -84 71 -118 -269 18 25 243 -61 -36 -46 128 -149
7560 -149 -226 118 28 -58 -124 -113 -95 -229 -76 -40 65 -72 112 -130 -156 -106 92 -19 170 82 211 -125 -179 -259
7584 -259 59 58 17 -219 -85 -38 -92 -75 -174 -166 -34 140 104 220 -132 155 -153 -40 -32 98 -53 -27 -80 -133 -179
7609 -179 -151 326 -292 -3 158 -247 -140 19 -266 -166 -55 234 -154 -35 107 90 -162 3 92 -131 -23
7630 -23 -149 -202 140 168 -203 -115 -244 -32 59 44 337 146 -185 -1 33 -40 46 -124 -153 31 162 -146 5
7653 5 -190 115 50 124 2 -74 18 166 -51 -103 26 19 158 134 30 -96 41 122 -32 -135 -27 -142 -196 -307
7677 -307 16 55 -25 63 207 -10 61 157 -203 -94 -1 -241 -156 -41 -20 -186 53 165 25 -94 -269 -16 -113
7700 -113 -42 -121 250 140 37 160 5 -107 -167 -216 4 -72 25 91 23 3 1 133 55 190 309 14 19 -16 -73
7725 -73 83 -215 40 101 67 -80 74 50 -171 179 -140 -77 -34 -7 45 204 -116 -51 216 52 -125 26 -182
7748 -182 -14 -97 16 -26 -121 29 16 -139 111 -66 132 172 -105 118 56 -164 -15 -72 -50 -114 76 62 155 -89
7772 -89 -162 -225 -165 209 -137 -72 -54 43 54 -65 213 40 202 108 31 -114 -225 -129 -225 285 221 31 80 102 -149
7797 -149 -30 202 5 -37 -66 11 119 69 -31 -78 -173 -157 139 20 0 57 128 173 133 -2 -104 -64 186 134 14
7822 14 -110 -152 -42 163 160 -139 -102 51 -136 148 -32 -120 -109 -198 -37 31 98 29 -81 -90 -109 -24 -25 61 110 -50
7848 -50 41 47 66 -136 -205 -124 -9 5 -58 -76 44 108 -125 -38 213 104 24 -248 30 -77 83 -166 -185 3 78
7873 78 31 -39 -125 -7 33 -100 95 -94 29 -55 301 41 -35 17 26 82 -43 38 12 28 -156 -196 169 -107 -381
7898 -381 -128 -59 -138 -2 260 47 135 -27 105 144 -70 270 12 14 13 245 8 -205 -96 -79 359 206 -61
7921 -61 -14 -199 221 158 -20 5 -8 -61 41 10 -5 192 -60 -291 11 -15 -17 -77 35 -331 -209 -3 41 -218
7945 -218 298 -168 210 40 -117 -88 -19 -140 -153 125 -128 -46 -261 -47 159 48 239 14 -148 -132 -22 -91
7967 -91 248 -41 63 -2 70 286 -145 -12 -172 22 -131 67 -141 -10 -62 -2 9 49 -1 -16 -60 -220 93
7990 93 -132 -22 26 54 -109 46 169 24 -132 31 18 -69 -94 122 -65 -172 -86 -52 -26 253 76 168 49
8013 49 -143 -1 -135 26 -146 -107 -103 -5 53 -44 -176 247 12 228 -3 91 42 90 -33 -138 -104 -62 118 155
8037 155 16 70 187 -108 -30 -178 1 94 59 117 13 149 -110 92 201 149 138 99 -33 172 75 -285 3
8060 3 -115 108 -51 122 16 -266 12 5 -42 -129 -167 -13 -86 30 69 -140 -24 90 113 -45 -275 172 -24
8083 -24 213 194 54 77 78 -64 26 -108 3 -167 -3 22 180 116 174 55 75 -204 28 83 220 -30 99 188
8107 188 197 -237 8 208 156 40 -113 -302 87 -88 -105 85 -208 49 -5 -10 9 97 101 -39 -94 112 -9 50
8131 50 -146 -158 -11 23 125 285 85 -245 83 32 152 9 -26 -70 -104 -8 51 74 69 230 12 54 231 -126
8155 -126 -246 31 -182 -128 92 170 69 -3 -117 138 -238 62 -16 146 67 59 -19 13 27 57 -257 -120 -94 -36
8179 -36 78 -185 -358 133 -73 25 75 -215 -121 -29 -218 54
8191E4
##END NTUPLES=NMR FID
##END=
