##TITLE=1H_SR49_mat_rep
 CDCl3, 8 sc, 
 26.04.2021
##JCAMPDX= 6.0         $$ Bruker NMR JCAMP-DX V2.0
##DATA TYPE= NMR FID
##DATA CLASS= NTUPLES
##ORIGIN= UXNMR, Bruker Analytische Messtechnik GmbH
##OWNER= root
$$ XWIN-NMR		Version 3.5
$$ Mon Apr 26 14:35:15 2021 Russian Standard Time (UT+4h)  she@DPX200
##.OBSERVE FREQUENCY= 200.131506
##.OBSERVE NUCLEUS= ^1H
##.DELAY= (6, 6)
##.ACQUISITION MODE= SIMULTANEOUS
##.ACQUISITION SCHEME= undefined
##.AVERAGES= 8
##.DIGITISER RES= 18
##SPECTROMETER/DATA SYSTEM= spect
##.PULSE SEQUENCE= zg30
##.SOLVENT NAME= CDCl3
##.SHIFT REFERENCE= (INTERNAL, CDCl3, 0, 15.7039)
##AUDIT TRAIL= $$ (NUMBER, WHEN, WHO, WHERE, WHAT)
$$ ##TITLE= Audit trail, XWIN-NMR		Version 3.5
$$ ##JCAMPDX= 5.01
$$ ##ORIGIN= Bruker BioSpin GmbH
$$ ##OWNER= she
$$ F:/spectra/data/she/nmr/H-F/1/audita.txt
$$ ##AUDIT TRAIL=  $$ (NUMBER, WHEN, WHO, WHERE, WHAT)
(   1,<2021-04-26 14:33:49.12 +0400>,<she>,<DPX200>,
      <created by zg, POWCHK disabled, PULCHK disabled
       configuration hash MD5:
       00 E9 B6 7A A2 85 ED C7 34 08 36 98 17 FE 4E 26
       data hash MD5: 16K
       1B EA 2D 87 9F 94 12 D8 86 CE C2 76 10 3E AB 9E>)
$$ ##END=
$$ 
$$ hash MD5
$$ F5 28 6B 01 FA 8A A0 23 28 ED FC E2 3F 87 52 FF
##$RELAX= 
##$RELAX= 
##$RELAX= 
##$RELAX= 
##$RELAX= 
##$RELAX= 
$$ Bruker specific parameters
$$ --------------------------
##$DU= <F:/spectra>
##$EXPNO= 1
##$NAME= <H-F>
##$PROCNO= 1
##$TYPE= <nmr>
##$USER= <she>
##$AMP= (0..31)
100 100 100 100 100 100 100 100 100 100 100 100 100 100 100 100 100 100 
100 100 100 100 100 100 100 100 100 100 100 100 100 100 
##$AQSEQ= 0
##$AQ_mod= 1
##$AUNM= <au_zg>
##$AUTOPOS= <>
##$BF1= 200.13
##$BF2= 200.13
##$BF3= 200.13
##$BF4= 200.13
##$BF5= 200.13
##$BF6= 200.13
##$BF7= 200.13
##$BF8= 200.13
##$BYTORDA= 1
##$CFDGTYP= 0
##$CFRGTYP= 5
##$CHEMSTR= <none>
##$CNST= (0..31)
1 1 145 1 1 1 1 1 1 1 1 1 1 1 1 1 1 1 1 1 1 1 1 1 1 1 1 1 1 1 1 1 
##$CPDPRG= <>
##$CPDPRG1= <>
##$CPDPRG2= <>
##$CPDPRG3= <>
##$CPDPRG4= <mlev>
##$CPDPRG5= <mlev>
##$CPDPRG6= <mlev>
##$CPDPRG7= <mlev>
##$CPDPRG8= <mlev>
##$CPDPRGB= <>
##$CPDPRGT= <>
##$D= (0..31)
0 1.2 0 0 0 0 0 0 0 0.06 0 0.03 0 0 0 0 0.0002 0 0 0 0 0 0 0 0 0 0 0 0 
0 0 0 
##$DATE= 1619433228
##$DBL= (0..7)
120 120 120 120 120 120 120 120 
##$DBP= (0..7)
150 150 150 150 150 150 150 150 
##$DBP07= 0
##$DBPNAM0= <>
##$DBPNAM1= <>
##$DBPNAM2= <>
##$DBPNAM3= <>
##$DBPNAM4= <>
##$DBPNAM5= <>
##$DBPNAM6= <>
##$DBPNAM7= <>
##$DBPOAL= (0..7)
0.5 0.5 0.5 0.5 0.5 0.5 0.5 0.5 
##$DBPOFFS= (0..7)
0 0 0 0 0 0 0 0 
##$DE= 6
##$DECBNUC= <off>
##$DECIM= 32
##$DECNUC= <off>
##$DECSTAT= 4
##$DIGMOD= 1
##$DIGTYP= 9
##$DL= (0..7)
0 120 120 120 120 120 120 120 
##$DP= (0..7)
150 150 150 150 150 150 150 150 
##$DP07= 0
##$DPNAME0= <>
##$DPNAME1= <>
##$DPNAME2= <>
##$DPNAME3= <>
##$DPNAME4= <>
##$DPNAME5= <>
##$DPNAME6= <>
##$DPNAME7= <>
##$DPOAL= (0..7)
0.5 0.5 0.5 0.5 0.5 0.5 0.5 0.5 
##$DPOFFS= (0..7)
0 0 0 0 0 0 0 0 
##$DQDMODE= 0
##$DR= 18
##$DS= 0
##$DSLIST= <SSSSSSSSSSSSSSS>
$$ [...]
##$SUBNAM2= <"">
##$SUBNAM3= <"">
##$SUBNAM4= <"">
##$SUBNAM5= <"">
##$SUBNAM6= <"">
##$SUBNAM7= <"">
##$SUBNAM8= <"">
##$SUBNAM9= <"">
##$SW= 16.9725357007746
##$SWIBOX= (0..15)
0 0 2 0 0 0 0 0 0 0 0 0 0 0 0 0 
##$SW_h= 3396.73913043478
##$TD= 16384
##$TD0= 1
##$TE= 0
##$TE2= 300
##$TE3= 300
##$TEG= 300
##$TL= (0..7)
0 120 120 120 120 120 120 120 
##$TP= (0..7)
150 150 150 150 150 150 150 150 
##$TP07= 0
##$TPNAME0= <>
##$TPNAME1= <>
##$TPNAME2= <>
##$TPNAME3= <>
##$TPNAME4= <>
##$TPNAME5= <>
##$TPNAME6= <>
##$TPNAME7= <>
##$TPOAL= (0..7)
0.5 0.5 0.5 0.5 0.5 0.5 0.5 0.5 
##$TPOFFS= (0..7)
0 0 0 0 0 0 0 0 
##$TUNHIN= 0
##$TUNHOUT= 0
##$TUNXOUT= 0
##$USERA1= <user>
##$USERA2= <user>
##$USERA3= <user>
##$USERA4= <user>
##$USERA5= <user>
##$V9= 5
##$VALIST= <valist>
##$VCLIST= <CCCCCCCCCCCCCCC>
##$VD= 0
##$VDLIST= <DDDDDDDDDDDDDDD>
##$VPLIST= <PPPPPPPPPPPPPPP>
##$VTLIST= <TTTTTTTTTTTTTTT>
##$WBST= 1024
##$WBSW= 4
##$XGAIN= (0..3)
0 0 0 0 
##$XL= 0
##$YL= 0
##$YMAX_a= 507578
##$YMIN_a= -243594
##$ZGOPTNS= <>
##$ZL1= 120
##$ZL2= 120
##$ZL3= 120
##$ZL4= 120
##$ABSF1= 10
##$ABSF2= 0
##$ABSG= 5
##$ABSL= 3
##$ALPHA= 0
##$AQORDER= 0
##$ASSFAC= 0
##$ASSFACI= 0
##$ASSFACX= 0
##$ASSWID= 0
##$AUNMP= <proc_1d>
##$AZFE= 0.1
##$AZFW= 0.1
##$BCFW= 1
##$BC_mod= 2
##$BYTORDP= 1
##$COROFFS= 0
##$CY= 11.3945322036743
##$DATMOD= 1
##$DC= 2
##$DFILT= <>
##$DTYPP= 0
##$F1P= 15.9154993809931
##$F2P= -4.1035820241983
##$FCOR= 0.5
##$FTSIZE= 0
##$FT_mod= 4
##$GAMMA= 1
##$GB= 0.15
##$INTBC= 1
##$INTSCL= 1
##$ISEN= 128
##$LB= 0.24
##$LEV0= 0
##$LPBIN= 0
##$MAXI= 10000
##$MC2= 0
##$MEAN= 0
##$ME_mod= 0
##$MI= 1.114404
##$NCOEF= 0
##$NC_proc= 0
##$NLEV= 6
##$NOISF1= 3.799351
##$NOISF2= 2.8
##$NSP= 1
##$NTH_PI= 0
##$NZP= 0
##$OFFSET= 15.70392
##$PC= 1
##$PHC0= -11119.41
##$PHC1= 7.800951
##$PH_mod= 1
##$PKNL= yes
##$PPARMOD= 0
##$PSCAL= 0
##$PSIGN= 0
##$REVERSE= no
##$SF= 200.130013532006
##$SI= 16384
##$SIGF1= 3
##$SIGF2= 2
##$SINO= 400
##$SIOLD= 16384
##$SREGLST= <1H.CDCl3>
##$SSB= 0
##$STSI= 0
##$STSR= 0
##$SW_p= 3612.71676300578
##$SYMM= 0
##$S_DEV= 0
##$TDeff= 0
##$TDoff= 0
##$TI= <>
##$TILT= no
##$TM1= 0
##$TM2= 0
##$TOPLEV= 0
##$USERP1= <user>
##$USERP2= <user>
##$USERP3= <user>
##$USERP4= <user>
##$USERP5= <user>
##$WDW= 1
##$XDIM= 8192
##$YMAX_p= 0
##$YMIN_p= 0
$$ End of Bruker specific parameters
$$ ---------------------------------
##NTUPLES= NMR FID
##VAR_NAME=  TIME,          FID/REAL,        FID/IMAG
##SYMBOL=    X,             R,               I
##VAR_TYPE=  INDEPENDENT,   DEPENDENT,       DEPENDENT
##VAR_FORM=  AFFN,          ASDF,            ASDF
##VAR_DIM=   8192,          8192,            8192
##UNITS=     SECONDS,       ARBITRARY UNITS, ARBITRARY UNITS
##FACTOR=    0.0002944,     1,               1
##FIRST=     0,             0,               0
##LAST=      2.4114304,     0,               0
##MIN=       0,             -243594,         0
##MAX=       2.4114304,     507578,          0
$$ Real data points
##PAGE= N=1
##DATA TABLE= (X++(R..R)), XYDATA
$$ [...]
1826C59k55L76J62l10J35r1n64N71N2pP3n42k27J44J24L82l79N38k85q46N19J36
1848F5j42L91k25J26l66j02k8MN05K4l87K44o40N6K59M7J85k08l3l65k08M96K96
1871fk52K13J06l99J13O2k03N05Ml61j27M6k30Q0L28j22j77J60k80l97M44L65
1893a28J36k14K1k93r5L49j03M24k22j19j82j41K86pK61J46o03J65Jl69L68K03
1915a16j10K97k85n1k79N0L68L25J6M1q72K91K4J30M82k25k53K18m70K09P6K49
1937A15L11l32q2q9l82O50l00R6O58m23l78R8j32N72j34J16K72p03L27j9k30R59
1959I70o47p7N44p85j04K30M81K05m45K3j54k71L45J94k10N13k27o63M99l61J35
1980A95N02l87R6j47l19K51N3J19M57o00K98m34k27K92K75k42P0k18j44L26l44
$$ plain form
1826 359 104 480 642 332 467 376 -188 383 435 428 501 -41 -268 -124 0 382 3 541 256 -590 -71 65
1848 65 -77 314 89 215 -151 -253 -281 -277 228 252 -135 109 -531 -475 -216 -169 16 -192 -225 -590 -798 -302 -6
1871 -6 -258 -45 61 -338 -225 -163 -366 139 143 -218 -345 -299 -529 -449 -121 -243 -420 -260 -540 -937 -493 -128
1893 -128 8 -206 -185 -478 -573 -224 -327 97 -125 -244 -426 -567 -281 -288 -27 119 -484 -319 -318 -687 -319 -116
1915 -116 -226 71 -214 -265 -544 -494 -126 199 215 256 -616 -325 -301 -171 311 86 -167 51 -419 -210 -134 115
1937 115 426 94 12 -77 -459 191 -109 -13 645 222 -156 -58 -190 382 248 364 636 -67 260 241 11 970
1959 970 323 246 790 5 -99 131 612 817 372 395 241 -30 315 509 299 812 585 -78 421 60 195
1980 195 697 310 406 259 -60 191 244 363 820 220 518 84 -143 149 424 182 252 34 -110 216 -128
2001a28o6N85k3k91l21p4J73m51N49L84l22K08q10j2M73n8N18k91j84k99l26N41
2023b25L62m69N17l12n08M63k12K11K68m88L01k66r3N83m70J63L08r28P61j62
2043a96p62Q83j88N8K61m49j7J77m70O48k88L32n8n49L60j72L06L60o55K96j49
2064b72k22J46K7P0L42k84K34l29o11R57k36J65L47k79m28q5N4M60J12L6l59o5
2086b20J71j1l43O89k97l5K28k53O7J7k9K53J04j7P5n52J41J31Q9M38P6p18M04
2109D08l04r0N62j31j5K9j84p3j37M11j2l48L11j53j16J11j41M7M47k76o9j78
2131I9K8K44l0M34l24m71L47j60j74M31j69l81L09j31K7K88l4k35j15K7J13m70
2153c47M62J10r7K63l16q4J64n28L38J91j2L0m96K0Q5j19M00J79j90j12k81Q9
$$ plain form
2001 -128 -194 391 368 77 -244 -318 -145 -596 -47 337 15 223 -587 -599 -126 -184 334 43 -141 -440 -766 -225
2023 -225 137 -332 185 -127 -635 -172 -384 -173 95 -393 -92 -358 -451 132 -338 -175 133 -795 -34 -196
2043 -196 -958 -75 -263 -205 56 -393 -410 -233 -703 -55 -343 -11 -69 -618 -258 -430 -124 236 -419 -123 -272
2064 -272 -494 -348 -321 -251 91 -193 41 -288 -899 58 -178 -13 334 55 -373 -458 -404 56 168 204 -155 -220
2086 -220 -49 -60 -403 286 -11 -46 182 -71 -4 13 -16 237 341 324 399 -153 -12 119 208 646 722 4 408
2109 408 104 14 576 445 430 459 275 202 65 476 464 116 427 274 158 269 128 175 622 346 277 99
2131 99 127 371 341 775 451 -20 327 167 -7 424 255 -126 183 52 79 367 333 98 -17 10 123 -347
2153 -347 115 225 128 391 75 -9 155 -373 -35 156 144 174 -322 -302 -217 -336 64 243 53 -59 -340 -251
2175b51J49o3J71j01oO6k55j33OM46j17o4k3j10p0O9j82N40l05J92m11J15n4N34
2199A43l79J58k31r4NL60k17J25J15l3m28L83j69m27P35j54j36J49m86J79L84
2220a8m01L73k90J75M6p5j96R7M6K08k53K88l07J0M25r3k59L06k90P8L1J12J54
2243A67k00J71j32k35J96j45K43K77k54j45K26n19K66L24J97o1l22J81p3k66M18
2264C14J22j50J98m12K54j22J67j36J60Nm1k12J83k83K64k6n2N6k23k59K37J54
2286A98L01p6J14k95j72J88j44J35J04J1k79k9N9o3K15j40j63K09Lk93J47J56
2308A86k07K78K17n46j9K0j84K70J46R1R9n10J77j66q3N26k64P4k82K3N7N9J77
2331A39J33j7q9l34L35l65R4l7K88k76j95J73l26J79O9M08m0l42JJ40j69L33q6
$$ plain form
2175 -251 -102 -165 6 -95 -101 -35 -290 -423 -417 29 -88 -152 -175 -285 -355 -286 -468 72 -233 -41 -452 -337 -391 143
2199 143 -236 -78 -309 -403 -398 -38 -255 -130 -15 -48 -476 -93 -262 -689 46 -108 -244 -95 -581 -402 -18
2220 -18 -419 -46 -336 -161 -115 -190 -386 -289 -243 -35 -288 0 -307 -297 128 35 -224 82 -208 -130 -99 13 167
2243 167 -33 138 6 -229 -33 -178 65 342 88 -57 169 -350 -84 240 437 376 54 235 162 -104 314
2264 314 436 286 484 72 326 204 371 235 395 400 359 147 330 47 311 285 233 289 66 -193 44 198
2286 198 499 423 537 242 70 258 114 249 353 364 85 56 115 52 267 127 -36 173 176 -117 30 186
2308 186 -21 257 474 -72 -91 -71 -255 15 161 252 351 -159 18 -148 -231 295 31 105 -177 -154 -97 -38 139
2331 139 272 255 166 -168 167 -198 -104 -141 147 -129 -324 -151 -477 -298 -229 179 139 -203 -202 -62 -231 102 16
2354A6Q7j08m10J65k4K13J57k04L5j86Q4j98L1K53j26O0N5l53J82j76M25j04j76
2377c02L43n13J09R0J72p8MP5j72j2M23o3k02O1j80J33j16J71J05J69k28J8n9
2400e2k10J30j46M01Lj65J83l80j97M86j84J82Kj16R0k59N35q6j2Q7j93N2P6l33
2424a06K99J87k04J12l13j40M66j74O6rj41L41m36o0M44k51PJ27k34k1K96j75
2446H1J92j0J5l69QJ15j30J18nJ54k3j44K57m36K50J75J52l3m22J03k70M75k61
2469hJ92j19Qj45nP8OJ17PPJ79l88R4pK35jk23J67k58K2K42k44j21L70k60o4m5
2496a64j3l5J87K9L49l92J6Q4r6J26k88K77r3r4o6J99j46K23k49l2L1J4O0N6j3
2521c0J79j23l12K77k21N5N7J16O0k46K51j84P2N5j24k03K46j49j73L22j76K53
$$ plain form
2354 16 103 -5 -415 -250 -274 -61 96 -108 -73 -259 -175 -373 -342 -89 -215 -155 -100 -453 -271 -447 -22 -126 -302
2377 -302 41 -472 -363 -273 -101 -179 -175 -100 -272 -284 139 76 -126 -65 -245 -112 -228 -57 48 217 -11 7 -52
2400 -52 -262 -132 -278 123 126 -39 144 -236 -433 53 -131 51 53 -63 27 -232 303 217 205 292 99 151 227 -106
2424 -106 193 380 176 288 -25 -165 301 127 193 184 43 384 -52 -112 332 81 88 215 -19 -40 256 81
2446 81 273 263 278 -91 -83 32 -98 20 15 169 146 2 259 -177 73 248 400 367 -55 48 -222 253 -8
2469 -8 184 65 73 -72 -77 1 7 124 131 138 317 -71 23 16 251 250 27 194 -64 -42 200 -44 -165 205 -55 -119 -164
2496 -164 -177 -212 -25 4 353 -39 -23 61 -35 91 -197 80 -13 -107 -173 26 -120 103 -146 -178 -147 -133 -73 -17 -30
2521 -30 149 26 -286 -9 -230 -175 -118 -2 58 -188 63 -121 -49 6 -118 -321 -75 -224 -397 -75 -251 2
2543Bk15L7N0k22K98K20r6k28j5QR3L6l05L62j65K59l64LK58k09L64J76m21J42
2567F8M0k50P1j61L46ok33J19J1n6K1L02k49P6j43J37j3m06L83L21j43N7q2l20
2591a10L64j46rO5k01K14k65J16LL0j45L24l03J32j2qN7k22J02N9j6J64k3o3K40
2616C47m45M97o26J93O4l57N30j27K3j26P7l9j4P9J7K5J3k8k90J1M47l14K86k04
2640C9k17J86n4K06m2k71K36j45j49j24J53J21K69j72o6j22J7P1K7P6j74J15j7
2663c7j43R2j34O2N0l1j5M6k15M18l01M80j25k35l4k4J18k15K26N5N8l57R9J27
2687c5LJ22l60L31k50J1K43r7o7N2P1j99M5K27k89J41L6j31Q0N1j71J76P6k44
2711a78J36q0J21L1m6L3k35J86JJ12k14J85J5O3p0n0N85n11L8l36k3J19K92LJ00
$$ plain form
2543 2 -213 -176 -126 -348 -50 170 74 -154 -169 -161 -68 -32 -337 25 -140 119 -245 -242 16 -193 171 347 -74 68
2567 68 108 -142 -71 -232 114 108 -125 -6 5 -51 -30 272 23 99 -44 93 80 -326 57 378 235 292 210 -110
2591 -110 254 108 99 164 -37 177 -88 28 31 61 -84 240 -63 69 57 49 106 -116 -14 45 29 193 170 107 347
2616 347 -98 399 -227 -34 30 -327 203 76 99 -27 50 11 -3 76 93 118 131 103 -187 -176 271 -43 243 39
2640 39 -178 8 -46 160 118 -153 83 -62 -211 -335 -182 -61 208 36 -30 -152 -135 -64 -37 39 -135 -20 -37
2663 -37 -180 -88 -222 -160 -110 -141 -156 -110 -325 93 -208 272 147 -88 -122 -146 -28 -243 -17 38 96 -261 -162 -35
2687 -35 -32 90 -270 61 -189 -178 65 -32 -99 -47 24 -175 -130 97 -192 -51 -15 -146 -66 -15 -186 -10 66 -178
2711 -178 -42 -122 -1 30 -16 17 -218 -32 -31 81 -133 52 67 130 60 10 595 84 122 -214 -237 -118 174 177 277
2736B77l64oM8K75J02k67k49L6J95J25j30J88q8m9J02p2j00K89n5j17qk55M2q2
2760a63K60j19K62j09k05n0Q3O3J07o1L1J00j83k37K0L74K7r2k17K3Q7n7qK79
2784B15j00l5j81K56n10M50m8p9Q2k32K74j96J01J33j54q3K34k56K26k6j99K17
2806H9J59k56J10J2k21q5M05k64j1N8k46M01M0j88j26k6Rq7k0J03J49o9l4o5J70
2831Gk22k20M37l9mp0K4l6J9j44J02K85m50L34k01K00RRr7q2J34m8q1J55p7J23
2857F7j1j74J2k05L07J22k03M1N8p3J63k62J17J93q9Kk35j35N01l80O4J35J26
2880A41r2o2O9j90J01L3J90l58N7r0J62J54JK94l96j47L90p6l10J18rj33P6j19
2904a96L66n2j64L37k66L02m03K69j42p7K37j47J21l25L87j63k6j40K59Q4n29
$$ plain form
2736 277 -87 -93 -45 230 332 65 -184 -148 47 172 42 230 142 93 195 123 23 312 257 140 132 -123 -81 -163
2760 -163 97 -22 240 131 -74 -124 -41 22 129 68 99 199 16 -221 -201 173 200 108 -109 -86 1 -56 -64 215
2784 215 115 80 -101 155 -355 95 47 -32 50 -182 92 -104 -3 130 -24 -107 127 -129 97 71 -128 89
2806 89 248 -8 102 114 -107 -192 213 -51 -62 -4 -250 151 191 3 -123 -149 -140 -227 -247 -144 5 -64 -98 -163 7
2831 7 -215 -435 2 -37 -41 -111 -87 -123 -104 -248 -146 139 -311 23 -178 22 31 40 -57 -139 -5 -53 -134 21 -56 67
2857 67 56 -118 -106 -311 -4 118 -85 -44 14 -59 104 -158 -41 152 63 65 -170 -305 196 -184 -120 15 141
2880 141 49 -13 56 -134 -33 0 190 -168 -111 -201 -39 115 116 410 14 -133 257 181 -129 -11 -20 -153 -77 -196
2904 -196 170 118 -46 291 25 327 -76 193 51 -26 211 64 185 -140 247 84 58 -82 177 261 -268
2925b68J23P0j29J19j9K00k24L51k55K00l18J50J80l19m7L1M2m8J18J17K08j82
2947A00o8j15j07J97j09K68j74O7p3qJ81r1k52l7J18j03J77L03k24r5K74k61J75
2970A43n61O86l09Q1n9Mk25K53qj57K90k80K23m61M70Ml65K65Q8k62J70%J07k78
2994a81r9M08k56J21j97j2R6o4M12k60n0Q0Q1k74K64O6l7m9m4j84L17q1j63J47
3018D1j15K98l42J43j46K1j7R8j67Q6K7K7J34j18K4M9q4K55k68mL12r1l34L40
3042A69n9j46Q8K07l29R6j18q2J95oo8K45l78J96j02j26K15j08K37k14K02m6m9
3065A9k3Q0R1j12k64K28k41M13k09k34K60j19P5O6R1j28O7p5j2J4l4j21J86m4
3089b6J88Mp3j38LNJ29j87L48k33K65j99j63K68k9k28K24p9P3k13K0J55j31k16
$$ plain form
2925 -268 -145 -75 -204 -85 -104 96 -128 223 -32 168 -150 0 180 -139 -186 -155 -113 -161 -43 74 282 100
2947 100 32 -83 -190 7 -102 166 -8 59 -14 -22 159 68 -184 -221 -103 -206 -29 274 50 -45 229 -32 143
2970 143 -418 268 -41 40 -19 -15 -240 13 5 -152 138 -142 81 -380 90 94 -271 -6 82 -180 -10 -10 97 -181
2994 -181 -280 128 -128 -7 -204 -216 -120 -184 228 -32 -82 -2 79 -195 69 135 98 49 5 -179 138 57 -106 41
3018 41 -74 224 -118 25 -121 -100 -117 -19 -186 -100 -73 -46 88 -30 -6 43 -41 214 -54 -58 254 163 -171 169
3042 169 110 -36 52 259 -70 26 -92 -174 21 15 -53 192 -186 10 -92 -218 -3 -111 126 -88 114 68 19
3065 19 -4 76 167 55 -209 19 -222 191 -18 -252 8 -111 -36 30 121 -7 60 -15 -27 -13 -47 -168 18 -26
3089 -26 162 166 93 -45 -42 -37 92 -95 253 20 285 86 -77 191 162 -66 158 79 152 -61 -41 114 -17 -233
3113b33K50N0m0R6j17J1J35k62K30j74j1K73l27J47M5j37K06k39J10R4j74R5J68
3136A96k00J89l93J27K26k67Rk3J31L7J21j53L9j61J18j64L3q3rJ04j99K72J14
3159F4J9k50L56k81n6O8j6p7J49k7K09o5j31k94qM08k28P1J18M6k94K91j4m0k32
3184b14K76r3J78l83J99J55p2j4M3J42l63q7K12n0J24k6j38J95L2l63J66O3N5
3207C7k79J21L23k67j4J73j12J28j44L15k75j4P5j71j78J54P6l0P4l8L59k89k43
3230b19K58L2k33K80k8l0j01R3j31J13K09k18k28K72Kr3L5Rj53O5O3J2R5p7p1
3255d4J24JoK2K74l15nk50R6K39l1j40j53M07k06m6L0J10J02k67N7p8N8N2k65
3280b34L20p6J13r8j9J1p6K99j67j60o6j05L82r9o3o1q9J49J65j66J89j7l41O3
$$ plain form
3113 -233 17 67 27 123 6 17 152 -110 120 -54 -65 208 -119 28 73 -64 142 -97 13 107 -67 28 196
3136 196 -4 185 -208 -81 145 -122 -113 -136 -5 32 153 0 39 -122 -4 -168 -135 -218 -227 -123 -322 -50 64
3159 64 83 -167 189 -92 -148 -80 -96 -173 -24 -51 158 93 -38 -332 -340 68 -160 -89 29 75 -219 72 58 18 -214
3184 -214 62 -31 147 -236 -37 118 46 32 75 217 -146 -233 -21 -71 53 27 -111 84 116 -247 -81 -18 37
3207 37 -242 -121 202 -65 -79 94 -18 110 -34 281 6 -8 67 -104 -282 -128 -52 -82 -8 -46 313 24 -219
3230 -219 39 71 -162 118 90 60 -41 52 -79 34 243 25 -203 69 71 -22 13 22 -131 -66 -3 9 104 27 -44
3255 -44 80 81 75 97 371 56 51 -199 -103 136 105 -35 -188 219 13 -33 -3 107 209 -58 -1 -79 -21 31 -234
3280 -234 86 10 123 25 6 17 -59 240 73 -87 -153 -258 124 25 -38 -99 -188 -39 126 -40 149 132 -209 -146
3304a46K56k89K75J1J81m14n9O4K15k04J20J78k15J34k02l4J51Pj33J90j24L61
3326C23m57J24l39M61j22P7K01l29K60j01j98J98j23k5M7J9J12j48K89l79j04
3347b14K69k16J40R8k68Q9kK9J15kk66O0Q2P7j75J23j28N8M5K65J21m38J33K08
3371B03j26j80K11N2k22K08n3q2Q9j33k4L19k50K85j63k44L25j01k39J26J17r0
3393B8j96Q7R7m4O8j25J31M1j63K07J11j48k74J12N7J63j72Q0l3j27K2J64j00
3416a4j74M12k04p2O3kj50J76l9Q6O8o5j09M1K2k56M91m51K07k47J79K03k07M0
3440bL5j39J90%j46K43j62L0R6n8M7k04Q8J6j77J59j04j09J97j09J25j85J72m16
3464d13N88l69r2K77l9r8J33j12O2K6r7k85J71M02l02L9L05j69K9k02N3K58l60
$$ plain form
3304 -146 110 -179 96 107 288 -126 -185 -121 94 -110 10 188 -27 107 -95 -129 22 29 -104 86 -38 323
3326 323 -134 -10 -349 112 -10 67 268 -61 199 98 -100 98 -25 -50 -3 16 128 -20 269 -110 -214
3347 -214 55 -161 -21 77 -191 -102 -104 -75 40 38 -228 -168 -86 -9 -184 -61 -189 -131 -86 179 300 -138 -5 203
3371 203 77 -103 108 160 -62 146 93 11 100 -33 -57 262 12 297 134 -110 215 114 -125 1 118 28
3393 28 -168 -81 16 -28 40 -85 46 87 -76 131 242 94 -180 -68 -11 152 -20 60 27 -100 -78 86 -14
3416 -14 -188 224 20 -52 11 9 -141 35 -4 82 150 85 -24 17 39 -217 274 -177 30 -217 -38 165 -42 -2
3440 -2 33 -106 84 84 -62 181 19 49 145 87 134 -70 18 34 -143 16 -88 -197 0 -109 16 -169 3 -413
3464 -413 175 -194 -286 -9 -48 -146 -13 -125 -63 -37 -134 -419 -248 154 -148 -109 196 27 56 -146 -93 165 -195
3487a95K15O7l8k14J78l0J91k41J20j39K68k64J59k54J47N4O3k83M06j41l36K18
3509d9l3m6K11P8k44j93N38p5j11M2j14J12j64K47R6l70j04J95j53N4K04j86J89
3532A24j68J83j15j82K00L3j9L5j88M8L68k39J43o1oK66l72J16j45Q5j23L3j47
3555a31Q2j65R6K15l05K27j44J54M0j7l83K79M9m1j01L74q7j92J52J6Q1j12O9
3578A56k55n9J73r6J80M3L7k34lR5J23m47L54lJ02M8j82Q9j50P8j27LJ12j36N
3603i4jp9J96j89J17K68j8ll28M67l75q4J46j74J16J36j10O4K6n4J99k36L0N1
3627G1k23L65n18J57L46k94p8N4j67J65Q6M2J34J21l57m1QK80j30j6J11k35J93
3650G4o0J01J00j88J54Rj10j6j64Q6l18J74K49N0k15j60J05R4l0pNo0K04K9k12
$$ plain form
3487 -195 20 87 49 -165 13 -17 174 -67 53 -86 182 -82 77 -177 -30 24 87 -196 210 69 -267 -49
3509 -49 -82 -128 83 161 -83 -276 262 187 76 118 4 116 -48 199 295 -75 -179 16 -137 -83 121 -65 124
3532 124 -44 139 24 -158 42 75 56 91 -97 -49 319 80 223 162 156 422 50 166 21 106 -17 16 -131
3555 -131 -49 -214 -118 97 -208 19 -125 29 69 52 -331 -52 -3 -44 -145 229 142 -50 102 118 199 87 156
3578 156 -99 -158 15 -81 99 142 179 -55 -58 37 160 -287 67 64 166 214 32 121 -29 49 -78 -75 37 -99 -94
3603 -94 -95 -174 22 -167 -50 218 200 197 -131 336 -39 -123 23 -151 -35 101 -9 55 81 27 226 -10 20 71
3627 71 -152 213 -305 -148 198 -96 -174 -120 -287 -122 -36 6 140 261 -96 -137 -129 151 21 5 116 -119 74
3650 74 14 115 215 27 181 190 80 64 -100 -14 -332 -158 91 141 -74 -234 -129 -35 -65 -72 -67 -127 77 106 -106
3675a06K02k18pK38P6r5j67J90k8j10j38M9j05M67L6l45j11L56j46k06K39j00
3697b9J04J04k51J34m7k24K57L1j91K48k25M2m4m2k6K04j18K14k26J10N2K49l60
3720c4K63q7k08J33m7J12M4k95J6Q2J02j23J46o6jJ70p8q1ll2Q2J40k39J06K6
3745A28o3q2O8K6N8O4Kl37K72q6K0k66J20R6j44Q3J91l19jJ16J92J20k35j20J35
3770C8k16O6K64j30O3j5j78J79j95K59j28R8k35N4J02K9P0j25k05N46l34K05k38
3793b6N3J32m7j03m3j0j58K78M6j77J0K5j08J18J89q7q4O4J46j28o9J9k32K60
3817F8kr4j17Q6JJ62q5QN0L4l6J50k13J03o8Qp6l7j61K71j11N9K0K5N9P9k06m2
3845f5P8k0k44K03J42l15K66r5M2p4K72j24Nj56J92%j85J75n0o9J25N7l30R4K95
$$ plain form
3675 -106 96 -122 -129 109 185 90 -77 113 85 -25 -163 -114 -219 248 284 -61 -172 184 38 -168 71 -29
3697 -29 75 179 -72 62 15 -209 48 79 -112 136 -89 -47 -91 -133 -159 45 -73 141 -85 25 77 326 -34
3720 -34 229 142 -66 67 20 132 176 -119 -103 -21 81 -42 104 38 37 207 129 48 45 13 95 235 -4 102 128
3745 128 65 -17 51 77 135 199 201 -136 136 50 70 -196 -76 20 -124 -41 150 -169 -170 -54 138 258 23 -97 38
3770 38 -178 -112 152 22 85 70 -108 71 -124 135 7 105 -130 -76 26 55 125 0 -205 341 7 212 -26
3793 -26 27 159 112 9 -34 -44 -202 76 122 -55 -45 -20 -128 -10 179 92 8 72 218 90 21 40 -192 68
3817 68 66 -28 -145 -59 -58 104 19 27 77 111 75 225 12 115 47 55 -21 -58 -219 52 -59 0 20 45 104 183 -23 -65
3845 -65 13 -7 -251 -48 94 -221 45 -50 -8 -82 190 66 71 -85 107 107 -78 97 47 -22 103 160 -170 -76 219
3870B19k75k0K32l43N16l88j05J65k5l23L94J0J06k82k07J78M3J29k01L18j56
3891a5k47L65r2J43l32J23K75j34l3k13O9Q8J07k5L0k43J32o1K08j45j39J56N5
3914G2J8o7K04m06J38J86k17J46J0M2j68l0j02J21J73O1k38J89j44J74j7r3O1
3937A13j10J21np8M9K32q7p5J0m01J43K38J2l99J06K91j87J54m1Mp2Q6k05o3J15
3962d9O2K03r5k5k0K48m90K6L00j93K8J01J47k53k29J87K57o1Kj38j01j52K08
3985c7J89lj38k76J58J78n1l5J27k01K48l07K38j75K1R1K6J65n11J85M7j7J96
4008A18m2k71Q2K17O1l09J73j3n2K06m0r4p2P3J46k69PK18j72l8J79L8k1o4q5
4033b4L6Q5r4k33K62J03k02m6J17Q6J29k48O1J64n3m7j80Jr7J1J84O4m4k06J36
$$ plain form
3870 219 -56 -76 156 -187 329 -59 -164 1 -24 -347 47 57 163 -119 -326 -148 -105 24 -177 141 -15
3891 -15 -262 103 11 154 -178 -55 220 86 53 -160 -91 -3 104 79 109 -134 -2 -63 145 0 -139 17 72
3914 72 90 23 227 -179 -41 145 -72 74 84 126 -42 -72 -174 -53 120 181 -57 132 -12 162 145 52 113
3937 113 3 124 119 41 90 322 235 160 170 -231 -88 150 162 -237 -131 160 -27 127 86 90 18 104 -101 -164 -49
3962 -49 13 216 121 96 76 324 -166 -140 160 -33 -5 96 243 -10 -239 -52 205 144 146 8 -93 -245 -37
3985 -37 152 149 11 -265 -107 71 20 -15 112 -89 159 -148 90 -85 -64 27 53 218 -293 -108 -61 -78 118
4008 118 76 -195 -113 104 165 -144 29 16 -36 170 130 36 -36 37 183 -86 -79 139 -33 -71 108 146 125 61 -24
4033 -24 12 97 3 -230 32 135 -67 -113 4 90 219 -29 32 196 143 96 -84 -83 -180 -169 15 79 35 -171 -35
4058c5K7P8L17m18N0O6j00m3J74j66j4K20k10LL07Lj39l6r4n6J50k02o3M7J08
4083b6k00N6J41J47k3j78J44j60L11q6k93K47j58K39j46j45K15j62q1K9J00m1
4105g0m6J50o9J79j99k3J29j93K41n5K65j10k45J00q2J68K4j07mj13O0j16Q8j59
4129a87J85r0l0j77L31m27L15J27j84N4M1J38o4J05j41kK42l53K2J46J00K4k52
4152g7J65r3p9K17k5k49P6M9J7M1J73k34P8o5n6J33j21k22L11p7J12k01L4Q2Q0
4177F9J71j50lk62K37k33Q9K14k20k45L27j24L7J11N0m5j0q5J91k5o1K05k60j89
4201b11J58k3J38P1k12R2P8q2j83J59J48j59J11o5K10j94p9q0J11J05p1j30k6
4224a34L16k13r2Q9R6k41J55K46k11J91r3Q9l81J59J09K7J3k31K23l31J50p8J86
$$ plain form
4058 -35 -8 70 387 -31 19 85 -15 -58 116 -50 -64 156 -54 -51 256 259 120 84 -10 -66 84 -118 -181 -134 -26
4083 -26 -226 -170 -29 118 95 -83 61 -99 212 126 -167 80 -78 161 15 -130 85 -77 -158 -129 -29 -70
4105 -70 -116 34 -35 144 -55 -78 51 -142 99 44 309 199 -46 54 -28 140 164 57 53 -60 0 -116 -28 -187
4129 -187 -2 -92 -122 -299 32 -395 -80 47 -137 -83 -42 96 32 137 -4 -6 236 -117 -95 51 151 175 -77
4152 -77 88 -5 -84 133 108 -141 -65 -16 1 42 215 -19 59 -6 -62 71 -50 -272 39 -38 74 -127 -93 -11 69
4177 69 240 90 87 -175 62 -171 -82 132 -88 -333 -6 -130 -93 18 68 23 13 -72 119 94 33 238 -22 -211
4201 -211 -53 -76 62 133 -79 13 91 9 -174 -15 133 -26 85 20 230 36 -43 -123 -12 93 22 -108 -134
4224 -134 182 -31 -123 -34 62 -179 -24 222 11 202 109 198 -183 -24 85 112 125 -106 117 -214 -64 -142 44
4247D4j6l0j4p0J43k02L42j30j47K98j50l4j20K8J45n3K8l2r2J03O8n9M3n4J20
4272A59l89L26k37p1L40r7j38M08m19P3m5M4j70K98j57J06n1N7j17j65K29K04
4294A88k01Q8Nk9M3n4J2o5o5N9J28j26m6O1K04k74o7J56j15n1K13Q3j56r4J8J85
4320A00j56o9J59j70K82O6J15k62k2q8P5j34J85q2l0M1l0J76o1l2J3Q1j25K07
4344B39q5p3l21M21j65J12j48l8M8N9q8l51L19QO4K3N2mP0j45o4K63k84M00m23
4369a11K34k28J23J27j49P3k01J65N0O4j29j90J96J48l35K42j00Q2j63L4P5p3
4391f6N5j38lK33J01j01J07m9k99K86k84J26j81M03j42j84L15j55Q8k22m7J67
4413A0k81l3M27l48p0M62r4j15K81l40J74j87J64M9j85J19p1J52p3pJ1k99M10
$$ plain form
4247 44 28 -2 -16 -86 57 -145 197 67 -80 218 68 34 -86 -58 87 34 62 30 -62 41 109 50 93 39 159
4272 159 -230 96 -141 -212 128 31 -107 301 -118 -45 -90 -46 -216 82 -75 31 -20 37 -80 -245 -16 188
4294 188 -13 75 80 51 94 40 52 -13 -78 -19 109 -17 -63 -2 202 -72 -139 17 -98 -149 64 147 -9 -103 -85 100
4320 100 -56 -125 34 -136 146 212 327 65 43 -45 30 -104 81 -1 -31 10 -20 156 95 63 76 157 32 239
4344 239 154 81 -240 181 16 128 -20 -58 -10 49 -39 -390 -71 -63 1 24 76 72 142 -3 -67 196 -88 312 -111
4369 -111 123 -105 18 145 -4 69 -132 33 83 147 18 -172 24 172 -163 79 -21 61 -102 -68 7 -66
4391 -66 -11 -149 -152 81 182 81 188 139 -160 126 -158 -32 -213 190 48 -136 179 24 112 -110 -157 10
4413 10 -271 -304 123 -225 -295 167 73 -42 239 -101 73 -114 50 99 -86 33 -38 114 41 34 45 -254 156
4436A56k87M2k0m7j3J66j63J41kQ7j44P0L11k11k00J07j7j16J56J21k14LM02m25
4460i7kK30r6Q9P6l82P8J24p8J99K7k08J8P0L6rQ8j08j2l1q8k44L81k03L42j3
4486A87k47N2J91r6j00P1j26J9P3M8j32J38k6k68Q3L10k68K14r6J59l07j07L48
4509A20k07J43q3j2N4j9J10O4l32J31J25l5j33L04k35J65L1mo6nl51P8K26j92
4533a23K1R5o0O0l3k2J00j22M8o2L16l32O8r7L29l07j2J42J66j73j3K60m2l06
4557i9J95L5k10L44k44p8K0J57j70q8M8N2j08N25m94J52j71N1J23J2j04n5J8K63
4581A74j81J37j16k4j12J09J05m3k7P9k4k78K07j09J05O1j67KP1J58m6l25L14
4604G0N8j42LJ34j42q1K15Qj22j73K7Q8N5J39k93K14N3r4j29J95r8j58L34Oj30
$$ plain form
4436 156 -131 -89 -109 -156 -169 -3 -166 -25 -27 60 -84 -14 297 86 -114 -7 -24 -140 16 137 -77 -74 328 -97
4460 -97 -99 131 35 124 200 -182 -104 20 -58 141 168 -40 -22 48 84 75 163 55 43 12 -76 -320 61 -142 200 187
4486 187 -60 -8 183 87 -13 58 -68 -49 24 72 -60 78 52 -216 -133 177 -91 123 27 186 -121 -228 120
4509 120 -87 56 -27 -39 15 -4 106 170 -162 -31 94 59 -74 230 -5 160 191 187 121 116 -235 -157 69 -123
4533 -123 -102 -7 -67 -7 -40 -62 38 -84 -36 -98 218 -114 -46 -143 186 -121 -133 9 175 2 -11 249 207 -99
4557 -99 96 131 -79 265 21 -57 -37 120 -50 -138 -90 -38 -146 379 -115 37 -134 -83 40 52 -52 -107 -89 174
4581 174 -7 130 14 -10 -122 -13 92 49 22 101 77 -201 6 -103 2 63 -104 -102 -31 127 81 -244 70
4604 70 128 -14 -11 123 -19 -100 115 123 1 -172 -145 -57 -2 137 -156 58 111 17 -112 83 -15 -173 161 167 37
4629C7K07l98J41J66j33K3k47nJ40mJ17Q5l8J19k88r1K40j89j07R3J8j24n7K22
4653g3O7K2j3j36J44O2j86K44k68K95j46N0m54K76L64l55J67n5J24j95k22K75
4675a3k30J62O8j5L9j15K02k13J53k4M1k47N9K29r3m0Q2r9Mp0K42J86j40l13P5
4700g0j5o0pK08l3q8M3J98j62m2J99k08MJ43M8k86K52j96J86Qj35R4M4j90J50
4725H5j40J16n1J39j3k35K20o0r4K21j77R2j91k0O2J29j90l5O6j71J58J66q9l8
4749e0L7R1m87L31NL6k19K25l7N5R0j87Q5J14k73M24j85N4M8o2k16K16Q4k10j7
4774d8Q1k14L26j52Q9K13k26O3j83Q2J04k00j74N3l58N54J9R0l81M79k08J8j03
4797g6O3L18m03N5J60N9k81P3r3J42K2L4k60nL12j36k48L05q0R6k74J30J27rJ12
$$ plain form
4629 37 244 -154 -13 153 20 43 -204 -209 -69 -73 44 129 91 210 -78 -169 71 -118 -225 -132 -114 -238 -295 -73
4653 -73 -6 16 3 -133 11 73 -113 131 -137 158 12 62 -392 -116 248 -107 60 5 129 -66 -288 -13
4675 -13 -243 -81 -13 -28 11 -104 98 -115 38 14 55 -192 -133 96 3 -37 45 -54 -50 -120 122 308 168 -145 -70
4700 -70 -85 -145 -152 56 23 -65 -22 176 14 -28 171 -37 -33 110 158 -128 124 -72 114 122 -13 81 125 -65 85
4725 85 -55 61 10 149 136 -99 121 61 -33 188 11 103 -88 -108 -46 83 -107 -142 -76 -247 -89 77 -12 -50
4749 -50 -13 78 -409 -78 -73 -37 -256 -31 -68 -13 77 -110 -25 89 -184 240 55 109 157 95 -121 95 179 -31 -48
4774 -48 33 -181 145 -7 82 295 69 132 -51 31 135 -65 -239 -186 -544 10 29 119 -262 217 9 27 -76
4797 -76 -13 305 -98 -43 117 176 -105 -32 -125 17 39 73 -187 -192 120 -16 -264 41 -39 57 -217 -87 40 31 143
4822A43j58L8j52m8K55o0K04Jk66j17o8L05p7n9J87L7j11j19N4J38Q5j29j37J36
4846H2k25L96l88J13J64k81OM75k06j48l43L19j19J90m6k3N7j47P2K22j93L49
4868C26k88M0J28j75j19m0K24j95J16J6j62k8K05n5M1j77K08q1j9m3L02l33R5
4891a4J86l96M13N3j78j34J67j8j6l47O06p11M93J17j97k1K6M6j59JJ94k29K05
4914H7l7J90j04j45ml14K07J06m6p7K58l63J57P7Q3m4j39J28j2J78l08J22K38
4937B38j38K3l32Q2j22J71K20O8k66k45M87j36jj5l2N8r1k67L84l64K75j8j30
4960a51L03O7j09m17K52J22%k29J06J05p4o2k89P63n55K29p2p9K43l30L37l29
4982a69J45K33K1k46r7K21p6j30L76l1n04K15N7j38M0o7L22m96K34n2J54j79L83
$$ plain form
4822 143 -15 23 -129 -177 78 18 222 223 -43 -160 -228 77 0 -59 128 165 54 -65 -11 127 212 83 -54 82
4846 82 -143 253 -135 -22 142 -139 -133 342 136 -12 -355 -36 -155 35 -11 -34 23 -124 -52 170 -23 326
4868 326 38 78 206 31 -88 -128 96 -99 17 33 -129 -157 48 -7 34 -143 65 -16 -35 -78 224 -109 -14
4891 -14 172 -224 189 242 64 -70 97 79 63 -284 322 -389 104 221 24 3 29 75 -84 -83 111 -118 87
4914 87 50 240 136 -9 -13 -327 -120 -14 -60 -137 121 -242 -85 -8 75 31 -108 20 8 186 -122 0 238
4937 238 100 123 -209 -127 -249 -78 142 210 -56 -301 186 50 49 34 2 60 -31 -298 86 -278 -3 -21 -151
4960 -151 152 219 110 -307 -55 67 67 -162 -56 49 -25 -87 -376 387 -168 61 -11 -90 153 -177 160 -169
4982 -169 -24 209 230 -16 -113 108 32 -98 278 247 -257 -42 15 -123 -83 -150 172 -324 -90 -142 12 -167 216
5005B16p1l5K43p11P77n36k2R2j45J14m4L4K60J47k92j79j22K43J55l10L56L3
5027B03j84j9K13k57K21m3Qk17j9L27k41r1lp3L32r2l39J76J13j73J98k27J72
5050a5k1m1q7l8J77l7K72l29K06K4k30K0R8Q1L0J4p1j39K91l58K60P0l23J67N
5075B6mj10J86j00M6J0LJ50j82j47K11j67O7j2n6J30m6%j22KO1q6Q0K17j93j42
5101a78K06L2J6k27L23j79l7r0J83Q8j47L38l03j64M21l47K9m0K1K2J27m9k1K45
5125B69k16n6r2M5j49J08J67p1l9J54j84J9Q4P0p8q9J80j29j5N2j5J06jk65J82
5150C7j19J15M3j1j28j6j68K32k4J50k8k41L7K77P0j86q6o4J78j38K86j86k20
5173a90Q3J57j63nJ62J31j92O3J9k35L74l62K80j8j22j37K26n6o7R1qo9j2q1K02
$$ plain form
5005 216 145 110 353 -358 419 -117 -139 -47 -192 -78 -122 -88 172 319 27 -152 -274 -31 124 -186 170 203
5027 203 19 0 213 -44 177 134 142 -75 -94 233 -8 -99 -102 -175 157 65 -274 -98 15 -158 40 -187 -15
5050 -15 -36 -77 -164 -202 -25 -62 210 -119 87 111 -119 -99 -1 80 110 124 53 -86 205 -153 107 177 -146 21 26
5075 26 22 -88 98 -2 44 54 57 207 25 -122 89 -78 -11 -23 -79 51 5 5 -117 -115 -54 -140 -60 157 -36 -178
5101 -178 28 60 76 -151 172 -7 -44 -134 49 137 -10 328 25 -139 282 -65 -36 -76 -55 -33 94 45 24 269
5125 269 53 -3 -95 -50 -199 -91 76 5 -34 120 -64 -45 39 109 31 -58 122 -7 -22 30 15 121 120 -145 37
5150 37 -82 33 76 65 -63 -79 -247 -15 -39 111 83 -158 -121 156 226 40 -46 -110 68 -70 216 30 -190
5173 -190 -107 50 -113 -118 44 175 -17 46 65 -170 204 -158 122 104 -18 -155 71 15 -52 39 31 -38 -50 -131 71
5198G1L13j06l54K83m6j70j2q9M13k71k5j70L13l46K90R1k19l2p3L84k29m93L45
5221a32P5K28k06r8K69P0l42O9n7K29o0J11j52n1j20J96j02K60k8j13q8J8P2j10
5245f2J67m3nk26J57J18k35L96m07K44L7k50P2n6J28r1J70q3j0J26o4K4j03J08
5269A12j02L3m1k5k19J00J43M1j86J9J58j22k09N24k33k9J30N5p2L4Jj11m4Q0
5293C7J89o26J87K26K05l30J18K3j27O4ol0J80j1r0j13L23k30j28J92j4P7l4k5
5317E7j46K5L6K32m16L71k47L7J61l28K60k09K73Q1j73R0m5M4l76L43n9Lq6K3
5341d9n2j05P6L11n61K65K11k62K39j72J60k04N35l52m4J1K4m1rj05L86m17L84
5364B29j47p3J36j91l5L9K64O6k23K00j37q7j04K10j27m9k71M62j00r1J69k16
$$ plain form
5198 71 384 278 -76 207 161 -9 -21 -110 303 32 7 -163 150 -196 94 185 -34 -66 -139 245 16 -477 -132
5221 -132 -57 171 -35 -133 136 206 -136 -67 -124 105 45 156 4 -47 -167 29 -73 187 159 46 -42 -24 48 -62
5245 -62 105 62 57 -169 -12 106 -129 267 -140 104 141 -109 -37 -93 35 -56 114 31 21 147 83 107 4 112
5269 112 10 43 2 -23 -242 -142 1 42 -144 -125 33 -89 -298 226 -7 -36 94 149 77 111 112 1 -43 37
5293 37 226 -400 -213 13 218 -112 6 29 -98 -34 -40 -70 110 99 9 -104 219 -11 -139 53 39 116 82 57
5317 57 -89 -64 -28 204 -212 159 -88 -51 110 -218 42 -167 106 187 14 104 59 103 -273 70 11 14 -72 -49
5341 -49 -101 -206 -130 181 -380 -115 96 -166 73 -99 61 -143 392 40 -4 7 31 -10 -19 -124 262 -155 229
5364 229 82 9 145 -46 -81 -42 222 288 65 265 128 41 -63 147 20 -29 -300 162 62 -29 140 -76
5386g6J02k6k01K98j8J49k70l12O63k06j00J13k09K38j72J08K22l02K1L8q6Q8
5408F2j96J17k8k93L79L3J67k21J99m84K95k24J46K53N9k96N2K8K5j9j37K7j6
5431g2O7j4n2R8M2k61J56J20j55LJ9K05l19J77j40K43j36J55n6P8pl63K59k5j
5456B1n8k24J28N6M8J2K8O9j05l1K36p3k84L06j02j96J67L8J8j94M1J78M2j72
5480e1K43m18J11J00O6j56L6M3M1K50l32L2J99j11l75J49L33j74j01J28K2k93
5502b58N17k00j23J35j71n0L29k70J26j06j67L02Pq8j3j62L26NM1o2q5J3Q7L6
5526A69m44K48P6J7J09l9j07p8O6k64L21j84L0J72Q1l06J90N5j71K41j91r5K3
5549h1Q6K10m02J29J50j53N1j35NL02J9l18m7N5o0J55l5P2P6j49J10j28J82l6
$$ plain form
5386 -76 26 0 -201 97 79 228 -42 -354 309 103 3 116 -93 145 -27 81 303 1 22 60 -26 62
5408 62 -134 -17 -45 -338 41 74 241 20 219 -265 30 -194 -48 205 264 -32 20 48 73 54 -83 -56 -72
5431 -72 -5 -19 -71 27 69 -192 -36 84 -71 -68 -49 156 -163 14 -126 117 -19 136 80 158 151 -212 47 22 21
5456 21 -37 -261 -133 -77 -29 -17 11 80 -25 -56 180 107 -177 129 27 -169 -2 36 54 -140 -99 79 121 -51
5480 -51 192 -226 -115 -15 51 -105 -69 -26 15 265 -67 -35 164 53 -322 -173 160 -14 -115 13 35 -258
5502 -258 259 59 -64 71 -100 -150 179 -91 35 -71 -238 64 71 -17 -30 -192 134 139 180 118 33 46 133 169
5526 169 -275 -27 49 66 175 136 29 -49 17 -247 74 -110 -80 92 173 -133 57 112 -59 182 -9 -104 -81
5549 -81 5 215 -187 -58 92 -61 -10 -145 -140 162 181 -137 -184 -129 -189 -34 -69 3 79 -70 40 -88 94 58
5573E8p2j23K20k29J44k2k2q1Q9j6k07M69o33L05J66k24K57N9p5k09K17j07j6
5596e2k1J52k27qK68J33k57l4K95l11p8J73j13J19j53J55j3o9K0j92%K82J25j57
5620C7j00p7M05l59j33J44J24J88k70Q8Q8k19n5K06J6J30m59K96Oj39J58J91k53
5643A3k63J69M9P9L0j76J61j43l6k7K13J3n8l19J88P5j96K31J33p9j5Oj28L07
5667B27q7l7k55O7j15k4K11J02l0j8k50L64j75R3k91L82l52K53P7M2n0j55n4J65
5691I0j54k04J85j1K24k03L2j82J20JK06J0q2q0K17m0L8M6m20K84k20L27k58J4
5715f0K83m6j59R6nl51J20l4M8K9J76l17M70l53j1j1m6Lm0K20j0n0N2L1k96K59
5741br2o9K53m5o8j20O0Q5J27p2j12j0J08L0k2o8o9l5j10O3K36j70r1J8L67k64
$$ plain form
5573 58 -14 -137 83 -146 -2 -24 -46 -127 -38 -54 -261 208 -425 -120 46 -178 79 138 63 -146 71 -36 -52
5596 -52 -73 79 -148 -156 112 245 -12 -46 249 -62 -140 33 -80 39 -114 41 28 -41 -21 -213 -213 69 194 37
5620 37 -63 -140 265 -94 -227 -83 41 229 -41 47 135 -84 -139 67 83 213 -246 50 56 -83 75 266 13
5643 13 -250 -81 -32 47 77 -99 62 -81 -117 -144 69 82 24 -295 -107 -32 -228 3 136 57 42 48 -80 227
5667 227 140 103 -152 -85 -200 -224 -13 89 59 41 -209 155 -20 73 -218 164 -188 65 142 184 134 -21 -75 90
5691 90 -64 -268 -83 -94 130 -73 -41 -223 -103 -102 104 114 32 -48 169 129 167 213 -207 77 -143 184 -74 -60
5715 -60 223 177 18 114 109 -242 -122 -156 -108 -79 97 -220 250 -103 -114 -125 -171 -168 -208 12 2 -48 4 35 -261 -2
5741 -2 -94 -163 90 45 -23 -143 -83 2 129 57 -55 -65 43 73 51 -17 -86 -121 -231 -168 68 -102 -193 -175 192 -72
5767g2kj3qM7J10j9J75k32o7L14k8n8k87J17l7L2J46q9n6J03k85L98n2k41J15
5792A1pj31J18J4L23j53lqk11O6o5O5k44p5K31j39J3K70q4J17n7k41Q9Q1K39k02
5818A7L44m45n1M4J79k63J79j69L79l10P7j58J74J87J5p0j64Qj07q9L50Nk69N4
5842h3P9O2l02L54j73Q2k50K58M3j52K76m45O06n07J66q5Q5j9l2J9J07q5n6P1
5866A9O6l48K22J15K0K8j34J89k91K20l18K95K8j78J97o7j2j18J71K04n04L12
5888A16j72J61J15j81O4o8k6j81J03J24l7k1J5J55k34J66m0M0m6k6L2K2r5j03
5912a17jO7j08J93l36M30K3j98PK29j42r6k6k65O47k83l1j46J67r6P0L1P4o9J38
5937A62j71j11O9J44r7M0O9j56Q3o0J00P7m37K76J64k22p9J28k2Mj8m4J8j6J13
$$ plain form
5767 -72 -74 -87 -95 -48 62 43 218 -14 -81 233 205 147 -140 -23 -60 -28 118 29 -27 76 -209 189 137 -104 11
5792 11 4 -127 -9 5 328 175 172 164 -47 19 -46 19 -225 -300 -69 -208 -195 75 -9 108 51 -190 -101 -20 219 17
5818 17 361 -84 -135 -91 88 -175 4 -165 214 -96 -19 -177 -3 184 199 129 -35 -27 -134 -223 127 132 -137 -83
5842 -83 -4 58 -244 110 -63 19 -231 27 70 -82 194 -251 355 -152 14 -71 14 -5 -37 -18 89 4 -52 19
5866 19 85 -263 -41 74 94 122 -12 177 -114 106 -212 83 111 -67 130 63 51 -67 104 308 -196 116
5888 116 -56 105 220 39 103 35 9 -172 -69 55 18 -3 12 167 -67 99 59 99 53 27 59 81 -14 -117
5912 -117 -118 -51 -159 34 -302 128 151 -47 -40 189 47 -49 -75 -340 307 24 -7 -153 14 -82 -12 19 93 24 162
5937 162 -9 -120 -51 93 -4 36 105 -51 32 -28 72 149 -288 -12 152 -70 -149 -21 -43 -39 -57 -101 -83 -99 14
5962A4K45j83j19O8Pj56L67l03j42J24L2P4l0k2j1j51K4J88j51J63r7M1k16L71
5986A37k39K27R9j73j27M0o5o0M49k76J18j00q6M18m74J93L0l96N18j41m9Q2j19
6009FM3r0j28J81J2j14K58p7O6j29QJ3p7J3J25N6r9j92K82n4r6K9M3M8k38O7n
6036d9R6j94J99N0l46J70J73o2R6J96j43j40J20k10J22l9j85K32P6j33J43j02
6058G0pj82j46K35J74M7k64j2J32R8J54j50k58QO5J43J0k64j1M99l55n0N8j39
6082a45J89j65K39J45k46m6N1j98J31o2K10q4k30K14N2J10j62k3J25j47J8O7k8
6105A5O1N6nQ8m05K09p4O1J24n2Ll39M25j86j6n3Q6Q8o9L9O2l65M22k26P3l0R0
6132H2m9k46J50J95J82l18m3K3K08m24M05k25j44J94l51K89j29M36P7l04M8Jj15
$$ plain form
5962 14 259 76 -43 25 32 -124 243 -60 -202 -78 -46 28 -2 -24 -35 -186 -162 26 -125 38 -59 -18 -234 137
5986 137 -102 125 224 51 -76 -36 -101 -161 288 12 130 30 -56 362 -112 81 111 -285 233 92 43 125 6
6009 6 49 -41 -169 12 24 -90 168 91 157 28 36 49 -28 -15 110 166 67 -125 157 103 7 36 79 127 -111 -44 -49
6036 -49 47 -147 52 102 -244 -74 99 37 133 329 186 46 166 -44 78 39 -146 86 162 29 172 70
6058 70 63 -119 -265 -30 144 191 -73 -85 47 145 299 149 -109 -101 -36 107 117 -147 -158 341 -14 -64 -6 -145
6082 -145 44 -121 118 263 17 -29 22 -176 -45 -107 103 19 -211 3 55 165 3 -20 105 -42 -24 43 15
6105 15 76 132 127 215 -190 19 -55 6 130 78 81 -258 167 -19 -35 -88 -2 86 17 56 118 -247 175 -51 22 -8 82
6132 82 33 -213 -63 132 314 -4 -47 -24 184 -240 165 -60 -204 -10 -361 -72 -201 235 312 8 56 57 -58
6155e8n1O2J56N2k76J07j78K04J24Pj38m2j45k1K80k23P7j01L15k54j69L40MJ0
6179H2nJ7j23j75J97J7Nk52K92j3o5o0qJ6m7J13L52k32l9Pr8J12q2k21K23J49
6205A62j89J33N4j67M3q3K17p6K9J63l61J01J30k20K67k26rp2QJ02J74l11L6K01
6229A06k06J80r5p0k48L45rL5j15J25Q4j06K12p4k66J58J36k07j9J84j73k42L97
6252A32l63L72j56J35j5J01k22M6k85L04j2l25J63J56j32N4nQ4j98J64L4k7M3
6275D8j78J25j2kJN3j84K92JJ2p9K34n57K10K04P4l24j17M44k48j37K19n2lOJ05
6301A35k11N8j02K25j48L6o5JJ17k08j69K92j45J46L7K3J39n4j30K82l05j33K65
6324H6PN5j89J36j35K68l16J16J20l90K98r0r1J01n8K28j74K3L2n6j9L22l28j45
$$ plain form
6155 -58 -109 -47 109 161 -115 -8 -186 18 142 149 11 -31 -176 -197 83 -140 -63 -164 151 -103 -272 68 72 82
6179 82 77 94 -29 -204 -7 10 15 -237 55 42 -23 -83 -91 -75 -122 -9 343 111 72 79 -19 93 11 -210 13 162
6205 162 -27 106 160 -7 36 -47 170 94 123 286 -75 26 156 -64 203 -23 -32 -104 -96 6 180 -131 -95 106
6229 106 -100 80 -15 -85 -333 12 3 38 -77 48 132 26 238 164 -102 56 192 -15 -34 150 -23 -265 132
6252 132 -231 141 -15 120 105 206 -16 30 -255 49 37 -288 -125 31 -101 -47 -52 32 -166 -2 32 5 48
6275 48 -130 -5 -17 -19 -18 35 -149 143 144 156 77 311 -246 -36 168 242 -82 -199 245 -3 -140 79 27 24 30 135
6301 135 -76 -18 -120 105 -43 -7 -72 -71 46 -162 -331 -39 -184 -38 -1 22 161 107 -23 259 -46 -179 86
6324 86 93 148 -41 95 -40 228 -88 28 148 -242 56 -34 -125 -24 -82 146 -28 -5 27 -29 -48 274 -54 -199
6348a99K88l7J23k05J63J78k96o8q6K8j55K46k8%J01j45J8M8J29J8o1k27j62L18
6372a1M5l04J69J38q7o0rJ60J17k91n8K93p9K84l58J31k07q5J53q8K18o9R4r6
6396@J76l44K33j39J61j72R5R0k97J02K28o6o8l53N90k47J26J13l05L31j53j1
6418I0p9j72L19M3l66J37J48kj80J4J60j28J04k27%K05j08R1Mo7Q4r4J8k3k1K69
6444B19l09L28l19J93k46K14l9m9O7j15J69K08m27J29O9k69J43j4N2l2p6J8L07
6467B21j42p9j40J9r6K88j02m7Q0j10j95M43j39k00O0j09J75K28l35P6j30L85
6489A51P7m08L20j57Q3j66J7J43k51J22O4k5l8K32o6L1j77K66l74J23l6K02Q2
6512B15l47L1K02k05n1L65l92J76J00p2%O7Q3k88J29J22M3j20p4j88J22l4M3q7
$$ plain form
6348 -199 89 52 175 -30 133 311 15 -53 -139 -111 -266 -20 -48 -48 53 -92 -74 -26 103 121 60 -167 -329 -11
6372 -11 34 -270 -101 37 -50 -110 -119 41 158 -133 -191 102 23 307 -51 80 -127 -212 -59 -147 71 2 96 0
6396 0 176 -168 65 -74 87 -85 10 100 -197 -95 133 67 -1 -354 236 -11 115 228 -77 254 101 90
6418 90 11 -161 158 201 -165 -28 120 118 -62 -48 112 -16 88 -139 -139 66 -42 49 53 -14 70 -24 -6 -29 -50 219
6444 219 -90 238 -81 112 -134 80 41 -8 59 -56 113 321 -106 23 92 -177 -34 -48 4 -28 -104 -86 221
6467 221 79 0 -140 -121 -217 71 -31 -78 2 -108 -303 140 1 -199 -139 -248 -73 155 -180 -104 -234 151
6489 151 228 -180 140 -17 66 -100 -83 60 -191 -69 -5 -30 -68 164 98 129 -48 218 -156 -33 -69 133 215
6512 215 -132 -101 101 -104 -155 210 -182 -6 94 22 22 89 172 -116 13 135 178 58 -16 -204 -82 -116 -73 -160
6536a60L8J84l3L7m9o9N7K43k74Nj70QJ28R8r1R1j2J60k56R0J40j65M0K17k20
6561C7l12L78q0k73K33P1p8m4J18k86K07O4l34L14j06J6J75j55P5j78J48J02J0
6584A02j81j51L97l00J20J38M7p9j04N3N0k46L25k91K88j46p4n6j2J59j67L44
6606B16l77J43K14nk02J13l6Mo4j69J58r7K73l06J88l0o6m6Q0P7k74j15L05j64
6630a80K65r5%k36K64j20kl6O4K65k16j11M14m35K92j06l3O6m5J12j64l0O7O6
6654F6QJ31j33j88j11J63J17r3n0J41j67J58k0L6R7k46K69j08Q4P8k17k12L39
6677A42j32r2j84L44J23j20O5K44k19j78J18R6j48k70J29K38m7j61M2j4n3O8L5
6700B6r4M2j21K09NK8J8l25K02Jj35J76j50P0J32mj05j90L7O2k24M90N7n66M06
$$ plain form
6536 -160 -122 62 29 66 17 -52 5 248 -26 -21 -191 -183 -55 43 -48 43 31 191 -65 25 165 0 40 257 37
6561 37 -275 103 23 -250 -17 54 -24 -68 50 -236 -29 35 -299 15 -91 -75 100 -55 20 -158 -10 92 102
6584 102 -79 -230 167 -133 -13 125 172 93 -11 42 92 -154 171 -120 168 22 -52 -108 -120 39 -128 216
6606 216 -161 -18 196 191 -11 102 66 70 6 -163 -5 -102 171 -135 53 23 -43 -89 -9 68 -206 -321 -16 -180
6630 -180 85 -10 -10 -246 18 -102 -104 -140 -76 189 -27 -138 276 -159 133 27 -6 60 15 127 -37 -67 0 66
6654 66 74 205 72 -116 -227 -64 53 -40 -90 51 -116 42 22 58 155 -91 178 70 154 232 15 -197 142
6677 142 10 -82 -266 78 201 81 146 390 171 -7 111 207 59 -211 -82 156 109 -52 -10 -24 -77 -9 26
6700 26 -68 -26 -147 62 67 95 113 -212 -10 -9 -144 32 -118 -48 84 80 -25 -215 -178 -116 -340 150 207 -359 47
6725D7o0k25K13O8k37K04L06l19J12k39P2LP9J01K6q9k34M30k03q5j59K66l8q9
6749e0K5J48j45O7L8p3j13N6J78o3K27m10J01j01j9O6l9K28M4l36L10n7l48K47
6773a9J5M5J9P8j55J05n5Kk48J1K03Q0k07K46n9nj59M6K6n9J29Q0K4j96J38K9
6799A14j35q5J86n0JM3j46L5M4P8k18J65o2J89Ll16K49Rn0q6J74j03j71K41J19
6824B28o5q0J68l03l30M95N6j66N9O6k92J47j15K37j10j21K39L8k37j19R7M9j16
6847a75K10j33R7P7j42K67j03J4k95n3K17L2m9K8k50K38j00o8M09k87K45pj77
6870eJ02r2J29n9j42P6k52J23N7K61k1p1j1Mm3l1N5j18J17j74J44n6j68L96j74
6895D7j76k8K67kj94J91j41Qr0R0K58j48o1j92O3p8O4J37k29Q8J71r3J77k48o2
$$ plain form
6725 47 -13 -238 -25 43 -194 10 316 -3 109 -130 -58 -55 24 125 151 62 -172 258 55 -30 -189 77 39 -50
6749 -50 -25 123 -22 45 83 10 -103 -47 131 68 295 -115 -14 -115 -134 -68 -107 121 165 -171 139 82 -266 -19
6773 -19 -4 41 60 138 -17 88 33 35 -213 -202 1 81 -126 120 61 56 -103 -57 -31 -90 39 119 143 -53 85 114
6799 114 -21 -106 80 30 31 74 -72 -37 7 85 -133 32 -30 159 162 -154 95 104 54 -32 142 39 -132 109 228
6824 228 163 83 251 -52 -382 113 169 3 62 128 -164 -17 -132 105 -5 -126 113 151 -86 -205 -108 -59 -175
6847 -175 35 -98 -1 76 -66 201 98 112 -183 -236 -19 13 -36 -8 -258 -20 -120 -188 221 -66 179 172 -5
6870 -5 97 5 134 75 -67 9 -243 -120 -63 198 177 106 95 99 56 25 80 -38 79 -95 49 -7 -175 221 47
6895 47 -129 -157 110 108 -86 105 -36 -28 -118 -28 230 82 21 -171 -108 -186 -122 15 -214 -126 45 -48 129 -119 -181
6920a81J93Nj7J07k27J47j90J60J67k42M3J03m0j04K30j98J55j23J6N3L7K3k40
6943a23k1J38j72L59N2l78K34j81J77k49L00j86p3Q4j74L37j89j78L76j63nR0
6965E5m9J49l86J09P2N6k8K14K36l39K5k15J35j73K44k45N4N5r8J41j65K44j27
6988c6O8J86k63M0j02J74j09k9K7j02K05m2Q9k99j04M94j44Ok6J04J8r3Rpm7N2
7014F9J05j85J9j06J53j68J87p9k1J7j52L31l59J95k7o7p5K11p9L6J17k71K5m7
7038a71M58p68N66p3j93K90l8j86J82j7J52l89K76q1M8j82K48P0q0m7j67J61p7
7061a8K1j17q6OJ58J88j89P5r3J56j22J9K3j44L74k97K51M4n9j09n3k00M6J57
7085C1N9j38KL40l68J27j49J66R6k21p8l0K03j19l2N2M4M24k26j49p0J02r5j09
$$ plain form
6920 -181 12 17 0 107 -120 27 -163 -3 164 -78 -35 68 28 -76 154 -44 111 -12 4 57 94 117 -123
6943 -123 -144 -6 -178 181 233 -145 89 -92 85 -164 136 -50 -123 -39 -213 124 -65 -243 133 -30 -35 55
6965 55 6 155 -231 -122 -50 6 -22 192 428 89 114 -101 34 -139 105 -140 -86 -31 -129 12 -153 91 -36
6988 -36 32 218 -45 -5 -107 67 -42 -71 -44 -146 59 17 106 -193 -297 197 53 59 33 137 155 62 71 64 17 69
7014 69 174 -11 8 -98 55 -113 74 -5 -26 -9 -161 170 -189 6 -21 -88 -163 48 -31 5 122 -149 -124 -171
7038 -171 287 -481 85 12 -181 109 71 -115 67 50 202 -187 89 8 56 -126 122 192 112 65 -102 59 -18
7061 -18 3 -114 -200 -194 -36 152 -37 38 -55 101 -21 -2 21 -123 251 -46 205 249 190 81 28 -172 -126 31
7085 31 90 -48 -46 294 -74 53 -96 70 166 -55 -133 -163 40 -79 -111 -59 -15 409 183 34 -36 66 -29 -138
7109a38k0J29l57M55p1J74l04R4n5J37K84j56k47N0j37l3O3J26M9P4j98J79j36
7132c8j16K01R3P5j28j15k69M91K0j86Q2m86L65R5k8j82K91l14R9K05k91K09j31
7155e8K56l75J71j58K34J3k94J04Q9l9J82J24k31P9k73Q6P0k26N82m51n5J36j8
7178e2q5k62K80K11j16J76j83j18OJ31N3m4J57p3j82J55j8k87L68M8j14J40j38
7201E3k8j4p3K7J21k24J1P4o6K4nJ45k48L54l78K32P4j7O7j80J25j67K4J75k67
7226a61J79k8J24l08K76p7j03K19m4j75j20P2Q8K21k41k4K00M8o3l7o7j2K19j41
7250D5o6K39k05N4l1q4N3K68o4j76J37l85L23J41j32J35k15q1J92K0N3j00k19
7273i8J90j23J18M4m56L00J17r1j64J1J06r1K41j75j48L87l35L08k16R6R2k92
$$ plain form
7109 -138 -158 -29 -386 69 -2 172 -132 -38 -93 44 328 172 -75 -25 -162 -195 -132 -6 43 117 -81 98 -38
7132 -38 -154 47 140 215 87 -28 -297 194 214 28 110 -376 -11 84 56 -126 165 -149 -50 155 -136 73 -58
7155 -58 198 -177 -6 -164 70 83 -211 -107 -18 -57 125 249 18 97 -176 -90 -20 -246 336 -115 -170 -34 -52
7178 -52 -137 -399 -119 92 -24 152 -31 -149 -143 -12 41 -3 154 81 -101 54 36 -251 117 165 51 191 53
7201 53 25 11 -62 -35 86 -138 -127 -53 -119 -95 -100 45 -203 151 -227 5 79 62 129 -51 74 -93 -69 106 -161
7226 -161 18 -10 114 -194 82 5 -98 121 77 -98 -218 -146 -58 163 -78 -102 98 146 83 46 -21 -33 186 45
7250 45 -21 218 13 67 36 -48 5 273 209 33 170 -215 108 249 117 252 37 -44 148 168 221 121 -98
7273 -98 92 -31 87 131 -325 -25 92 1 -163 -152 -46 -137 104 -71 -219 168 -167 141 -75 21 113 -179
7295a79J69j06R4k23J09R5L68l92k16K28M3k41L10O4k34J41L7J63m12L64m15J84
7317d9p1K55j36K6k2K2J09j63J84j38K41q5l13K17j17J27j95J19j5N8n1Ok31M00
7341A78p1J7l2j79L56k42j4n5N2q8J12l03K35k20K04r1K95k13P5p3K11l41K32
7364D5J69m35J67J79j3j2r3J08Nj63J08J07K7k81j2n1J12j10J6K08J67k37K11
7387B22n0k50R3j22R3PN9r8J25m9R7q9l2j56L57k05M0O7j68Q2j69O8J23J13l06
7412a48J87k42J52m9J68j54J26r5r8N3J02Np9K08k00K14k50M0P2l25J69K42j72
7435g4J09J49k13nJ54k14J32K02j87J58k27m9N6j42K61l51J91J48l51L33j71J03
7457A2o5K53k89L0L3k73M04L4j96p0J46m2O5j37q5K41j65R8j8Lr8M7J51n1J77
$$ plain form
7295 -179 -10 -116 -22 -245 -136 -41 327 -65 -281 -53 -10 -251 59 123 -111 30 67 230 -182 182 -233 -49
7317 -49 -120 135 -1 25 3 25 134 -29 155 17 258 173 -140 77 -40 87 -108 11 -4 54 3 9 -222 178
7341 178 107 124 92 -87 269 27 13 -42 10 -78 34 -269 -34 -254 -50 -141 154 -59 16 -57 154 -187 45
7364 45 214 -221 -54 125 112 100 7 115 120 -43 65 172 199 -82 -94 -145 -33 -143 -127 81 248 11 222
7387 222 172 -78 15 -107 -14 -7 52 -46 79 30 127 38 6 -150 207 2 42 109 -59 23 -146 -78 45 158 -148
7412 -148 39 -203 -51 -100 68 -86 40 -55 -153 -100 2 7 -72 136 -64 150 -100 -60 12 -313 -144 98 -74
7435 -74 35 184 -29 -34 120 -94 38 240 53 211 -16 -65 -9 -151 110 -241 -50 98 -253 80 -91 12
7457 12 -53 200 -89 -59 -26 -299 105 139 -57 -127 19 -23 42 -95 -180 61 -104 -6 -24 -21 -119 -72 79 28 205
7482B05k93k21K89J7j98L00j66J16j08L09j42k27K53n7R1o7l73M46j75Q6j73J31
7504D3j16J30J92l46P4r5o3K98P6m58K65l9J11k95K75o0k09J67J36j94J86j9J02
7527A61j38l31L65J8k03K3k5J84j93R3k61L57j46J65q7P7j21K50l58M71l71J56
7549H6q3j9m1K26j96J25j69K03q0k81J79R2K17j57L9M1M1r0j69l4NP6L7N5k96
7574a93J5L67k2K5k95P8k93M87j42N1o1J3J16j31J80l26J84k10K38L0k59L37k78
7597h9j57K89K1j39j2J92l0j10R6j70j53L02O3j24M9j79J14oJ10nk4O4k55L60
7621B07k04P4rk4j40P8jn1k9J61N9l9J23k39K52m1j50j3J78j74k5J89j99p2K92
7646B03l73R5K09l99K31L23k06L1J04k27k00L00j19%q3Q7J69L0l25Q6j54K51k8
$$ plain form
7482 205 -88 -309 -20 -3 -201 99 -67 49 -59 250 108 -119 134 77 168 101 -272 174 -1 85 -88 43
7504 43 -73 57 249 -97 -23 -118 -181 117 193 -265 0 -39 72 -223 52 -8 -217 -50 86 -108 78 59 161
7527 161 23 -308 57 75 -128 -105 -130 54 -139 -46 -307 50 -96 69 -18 59 -62 188 -170 301 -70 86
7549 86 3 -16 -57 169 -27 98 -71 132 52 -229 -50 42 259 102 141 182 223 133 -36 -70 -65 11 48 103 -193
7574 -193 -178 189 167 192 -103 -25 -318 169 27 78 17 30 146 15 195 -131 53 -157 81 111 -148 189 -89
7597 -89 -246 43 64 -75 -87 105 75 -35 61 -109 -262 40 103 -21 28 -151 -37 -43 67 62 38 102 -153 207
7621 207 3 77 68 44 -96 -18 -19 -70 -99 62 121 82 205 -34 218 177 27 14 192 18 -7 182 -17 -89 203
7646 203 -170 -75 134 -265 -34 289 83 114 218 -9 -209 91 -28 -28 -111 -24 145 175 -150 -64 -218 33 5
7669El3L7j37K15j41J50j31O4p2m5J80j98J63j06RM0R2No8L6O2N8q1j87P5J82
7695A74k21K21k13M6l69N15j70m1L2j37j4L1K90j16p9L07k39J68n6p6k30K69l5
7718E7r0j17m9L54k17J85j72N4K40k02o2j5r2J71R6j90j5K71k23pK29l0M6j9k36
7743c3P8m4J54k30j37K69Q0j30j65P5J75j20L8k8n6K14l32K58l6J97l54K94p1
7766I6Rr8nK48l33K62k52j36J87j42J56o8J55j78J02J15lk00N3R9K6oj04m8j0
7791g5o6J17j19K54j19Q8j37r2J43j19K20j77K12l0j03N7m1K05k38J53k45J6N
7814i1J4k5K5P8j14K68n4k54M23l59P7M7J35j12J55j89n2j44L76J1l62Q3R1l9
7838a2O2j09P7J30j37J26j37O3p2j31K12j36J98k3j65J71k19r2K43j39K41k18
$$ plain form
7669 5 -28 9 -128 87 -54 96 -35 29 -43 -88 92 -106 57 -49 -40 0 92 97 29 65 127 185 104 -83 -8 174
7695 174 -47 174 -39 7 -362 153 -17 -58 -26 -163 -177 -146 144 28 -51 256 17 185 129 53 -177 92 57
7718 57 -33 -150 -199 155 -62 123 -49 5 245 43 -19 -34 -126 45 141 -49 -64 207 -16 -23 206 176 222 203 -33
7743 -33 45 1 155 -75 -212 57 137 7 -158 -83 92 -28 10 -18 -74 140 -192 66 30 227 -127 167 96
7766 96 105 7 2 250 -83 179 -73 -209 -22 -164 -8 -76 79 -99 3 118 115 -85 -32 67 93 87 -17 -65 -75
7791 -75 -141 -24 -143 111 -8 80 -57 -149 -6 -125 95 -82 130 100 -3 54 13 218 -20 133 -112 -96 -91
7814 -91 -77 -102 -77 1 -113 155 101 -153 270 -89 -12 35 170 58 213 24 -28 -172 204 215 -147 -64 27 -12
7838 -12 50 -59 18 148 11 137 0 63 -9 -140 72 -64 134 111 -54 117 -102 -194 49 -90 151 -67
7860f7O2L1k7K30%j31o2k35L71l3k99K1k5M34k51j00q7J46n2R3n2n9K92k29R0
7885F1n00O71j72k27K17n3j13K24j09k86K35K23k58j11J69j26q2K39J2J92j2j58
7907C6J8l87K69L42j61n7n1p5R6J03l80J42N7J27l36L41q6L8RR3l17K79Ql3j44
7932f9K8o3j20M01l29r7K73jJ37j90K28j43k7Q7k98J25K11j59j37l7K30k67M24
7955B07k87j34L96k03M5p3P7j50O8J34Mj58j96J29K09j39L42k84J46k19k3k42
7977c51K88o1J14jq2n0p5Q0J21O8k9JM6k2J48o5n7k4J4m9OK6j30k4n1J96%k51
8005b14K91Q9k55j84K07M1M9k7o3L68k89J6r2K89j48Q5m7l2lN2q1lJ03R2q4q8
8031G2k15M9J87M0j11j22J16K8k34J83R9p5k11J30j23M3O5rP8p1P1J34m8r3R9
$$ plain form
7860 -67 -5 26 -1 229 229 98 36 -199 172 139 -160 -139 -164 270 19 -81 -168 -22 -74 19 -33 -92 200 -29 61
7885 61 -439 232 60 -167 50 -3 -116 108 -1 -287 -52 171 -87 -198 -29 -155 -237 2 14 206 194 36
7907 36 54 -333 -64 278 117 60 9 -66 30 133 -247 -105 -48 79 -257 84 -2 36 45 138 -179 100 108 75 -69
7932 -69 -41 -104 -224 177 -152 -249 24 23 160 -30 198 55 28 115 -183 -58 153 -6 -143 -180 50 -217 207
7955 207 -80 -214 182 -21 24 -49 28 -122 -54 80 84 -74 -270 -141 68 -71 271 -13 133 -86 -109 -351
7977 -351 -63 -124 -10 -11 -93 -143 -218 -138 -17 51 22 23 69 47 195 130 73 49 63 14 20 46 -84 -108 -159 37 37 -214
8005 -214 77 166 -89 -273 -66 -25 24 -3 -66 302 13 29 -63 226 78 163 116 84 81 133 52 49 152 244 160 72
8031 72 -143 -94 93 133 22 -100 16 44 -190 -7 92 17 -194 -64 -187 -144 -79 -88 -10 -81 -10 124 76 -17 82
8056H2k8J0k03M75j66l43J87J51j6j29r6J31l23M11k02J51l82J98qK90j00m4j61
8079a15J64m9k6k18M65j37j31P1j12j56L36r3k49k3J54O3M5j1O0P7j50K07q2j41
8103e1J6K97j62k14K6L57m04L96M5k40J21m39L70j52j36J16J81j16j41J23J74
8124A67k63p8j84K61P0K61m67J96k1L5p2J38Lp5R1j43P4n6K25j20j21J06n8m7
8148g8J28m8J82j02j42PP6j8j55K61J2j12p7J1KJ22o7N4j74L82q8k30n8L8K59
8173A85l39P5J49OP4k39J49K66k05j80j39P9o9K44l2J5J24n8
$$ plain form
8056 82 54 64 -139 336 170 -173 14 165 149 20 -76 55 -268 143 -59 92 -290 -92 -100 190 90 46 -115
8079 -115 49 0 -26 -244 221 84 -47 24 -88 -244 92 -1 -250 -273 -119 -56 -11 -22 38 115 -35 172 90 -51
8103 -51 -35 262 100 -114 -88 269 -135 261 306 66 187 -252 118 -34 -170 -54 127 11 -130 -7 167
8124 167 -96 -174 -358 -97 -27 234 -233 -37 -58 -23 -95 43 46 -29 62 -81 -7 -63 162 42 -79 27 -31 -78
8148 -78 50 2 184 82 -60 -53 23 5 -150 111 123 11 -66 -55 -53 69 2 56 -118 264 176 -54 -112 -74 185
8173 185 -154 -79 70 76 150 -89 60 326 121 -59 -198 -119 -188 56 24 39 163 105
8191A05
$$ Imaginary data points
##PAGE= N=2
##DATA TABLE= (X++(I..I)), XYDATA
0@%%%%%%%%qJ6j6J6k4L2m0N6p2Q8j07J31j60J92k27K70l18L73m37N07n86O75p76
31d15Q87j008J145j299J469j654J858k082K326k595K889l210L561l942M361m819
47b528N316n860O458p114P833q630R514j0496J1596j2836J4246j5865J7745j9958
61a0579K2612k5869K9972l5324M2656n3417P1065j07186L17680l08029J05040
72D8621R9695l20798N71899l88555J5417K36311k70341R0523j25544M1443K73727
83B72398l30056J58292J2400k15265J24007r3950J17764Q4331j97424J01807j01981
94f7677J8801L3898j41654K40127m1330j76295J36461j22165n826O5937j5982
105g5705R1707r9500j4785J1943q2380J32857o1298j6756J19019j46017J4155
$$ plain form
0 0 0 0 0 0 0 0 0 0 -8 8 -8 8 -16 16 -24 32 -40 48 -59 72 -88 104 -123 147 -171 202 -235 272 -314 361 -415
31 -415 472 -536 609 -690 779 -875 983 -1099 1227 -1368 1521 -1689 1872 -2070 2291 -2528
47 -2528 2788 -3072 3386 -3728 4105 -4525 4989 -5507 6089 -6747 7499 -8366 9379 -10579
61 -10579 12033 -13836 16136 -19188 23468 -29949 41116 -66070 251610 -56419 48621
72 48621 148316 -172482 399417 10862 26279 262590 -7751 82772 -42772 -1329 272398
83 272398 -57658 100634 113034 -102231 21776 -72174 45590 129921 -67503 34304 -67677
94 -67677 -48876 -14978 -156632 83495 42165 -134130 2331 -119834 -125660 -59723 -75705
105 -75705 16002 -83498 -98283 -86340 -168720 -35863 -97161 -113917 5102 -140915 -126760
116a26760K0822o7509J09693k5939R586K7030j09272M2302j1998j2131J04410
127c9766m9305j2467K3811n5520K962J8072M4004J254k4287K7683n5566j1418
139a30543N1578j0350L2089J0729l0065p014j2786K0288N674J3969M1354l3538
151d8615j1947J0497l1019K5200L3571L656M751j1750j2487j2529K2788K9686
163A802p512J5191n612l1890J2635J1893J539K2140J0484j2330j2117M655k292
176H586M263K9810K398j3460L392p911r139J3857K0622R31n73P89k0873l194J6560
191D6058J0680R659k96p456j7643o613K1424k05Q827J8418l0505o563O972j8212
205C4545K3159J3243q907P361j9859j1210J676j730K2682J846o319q93k9131J91
$$ plain form
116 -126760 -105938 -173447 -63754 -89693 -80107 -53077 -162349 -120047 -132045 -144176 -39766
127 -39766 -89071 -101538 -77727 -133247 -130285 -112213 -68209 -66955 -91242 -63559 -119125 -130543
139 -130543 -78965 -89315 -57226 -46497 -76562 -83576 -96362 -76074 -70400 -56431 -15077 -48615
151 -48615 -60562 -50065 -81084 -55884 -22313 -18657 -13906 -25656 -38143 -50672 -27884 1802
163 1802 -5710 9481 3869 -28021 -15386 -3493 -1954 20186 30670 18340 6223 10878 8586
176 8586 12849 42659 45057 31597 34989 27078 17939 31796 52418 53349 52776 53565 32692 29498 46058
191 46058 56738 66397 66101 58645 41002 34389 55813 55608 64435 82853 52348 45785 52757 34545
205 34545 57704 70947 62040 69401 49542 38332 40008 38278 60960 62806 56487 55594 26463 26654
219B6654J2804k163K2210j180k0286q427j5677O648R369O724J3132k1484j3186
232A5138K338j8034J2524J9263r287K080p687j9950l374N313Q601N726L889q516
246H024k0479n648M03P294J4997N91o156j5052j3100N748K363J0290J1954j5973
260a4744q612m099j1812J2531J1909j351N022q986j5259q35J160O026J2426L488
274a3136q930j0061o304l140R558J4774K177m502q823j2635r9R538J2011R367
288a0205o773r189o975j0242J0511J5593M47P757k681j9942l78L218J279J7212
302a0368O987p756n283j0686m557J1354J1392R287J690j1827j0747l308L861J3328
316f633J1579J395o815r557p463K103R922R370O760j609j0148n222k166R89J3850
$$ plain form
219 26654 39458 37295 59505 58325 38039 29612 13935 20583 29952 36676 49808 28324 15138
232 15138 17476 -558 11966 31229 21942 24022 16335 -3615 -6989 -1676 6925 12651 16540 8024
246 8024 -12455 -18103 -17700 -10406 4591 5182 -974 -16026 -29126 -23378 -21015 -10725 1229 -14744
260 -14744 -23356 -27455 -39267 -26736 -14827 -16178 -11156 -20142 -35401 -36236 -35076 -29050 -16624 -13136
274 -13136 -22066 -32127 -38431 -41571 -32013 -17239 -15062 -19564 -28387 -41022 -41121 -31583 -19572 -10205
288 -10205 -16978 -26167 -33142 -43384 -32873 -17280 -16833 -9076 -11757 -31699 -32077 -28859 -27580 -10368
302 -10368 -3381 -11137 -16420 -27106 -31663 -20309 -8917 370 2060 -9767 -20514 -23822 -19961 -6633
316 -6633 4946 6341 -474 -10031 -17494 -15391 -5469 3901 10661 9052 -1096 -6318 -8484 -7495 6355
331F355Q975l846n14p235j2594P706J1695J607Q971k262j5485k443J76N731J2627
346A9464J659J64p139j2040N895J978J992J2973m938o562J821p897J783Q557J787
361A9497K895l304o459l887k448P547O403L21J033q673p111L313J638N249O017
376B2031o018m543l927l734N730L958L003l00q372j421k806k283J0716j84k815
391I035M181j0546n344M737j51N835L159k962n159r147K988L131R14J0198m292
406F577r920Pl670J506N714L580j095p584J34k981l885J0516M21j648K838q612
422h102k547N31P41Q241p66P62l781r971M017p07L558J0350q038j582j609p953
438a6856P293L461J493K491p357J45m452j400J1688l095J764L780j1349j76J724
$$ plain form
331 6355 15330 11484 10970 3735 -8859 -1153 10542 12149 21120 18858 3373 930 1106 6837 19464
346 19464 21123 21287 14148 2108 8003 9981 11973 24946 20008 13446 15267 7370 9153 17710 19497
361 19497 22392 19088 12629 8742 6294 13841 20244 20565 21598 12925 5814 9127 10765 16014 22031
376 22031 16013 11470 7543 3809 9539 13497 16500 16200 7828 6407 3601 1318 12034 11850 9035
391 9035 13216 2670 -2674 2063 1912 7747 10906 7944 2785 -6362 -3374 -243 671 10869 6577
406 6577 -3343 -3336 -7006 -5500 214 3794 2699 -4885 -4751 -7732 -11617 -1101 -680 -2328 510 -8102
422 -8102 -10649 -10118 -9377 -1136 -1902 -1140 -4921 -14892 -10875 -11582 -8024 2326 -5712 -7294 -8903 -16856
438 -16856 -9563 -6102 -4609 -2118 -9475 -9330 -13782 -15182 -3494 -6589 -4825 -1045 -12394 -12570 -10846
453a0846o79O146J215J859n305n441M001l488N247J0157p072k200j319o601M151
468a0175O095M198j137l227j400n542J738O166J739K529j299k355m495j993P528
483a630m04L799N921j1560J520J93o745J2955R85j877M679j0505oL23J566J2104
499A1318p035K141O21j5083J1985J614m080J2954r478K73J631r960J1148l171
513D878J609J0759j5204N563j494j1143J9294m847k875J0172j6088K477L263m390
527A974J3015o296M7L044j5571R097K911n280J1704o039m300R02n195N693o66
542E040L326K918q784M030m983n565J2553l426P44N480j1771q86J013K50O874
557F813k640K558l959r155O371j646N34Q842m619k398k196m791M458k96L770L387
$$ plain form
453 -10846 -11525 -5379 -4164 -2305 -7610 -13051 -9050 -12538 -7291 2866 -4206 -6406 -7725 -14326 -10175
468 -10175 -4080 118 -1019 -4246 -5646 -11188 -9450 -3284 -1545 984 -315 -2670 -7165 -9158 -1630
483 -1630 -2034 1765 7686 -3874 -2354 -2161 -8906 4049 5034 3157 7836 -2669 -2675 -2352 -786 11318
499 11318 4283 6424 7045 -8038 3947 5561 1481 14435 4957 5230 6861 -3099 8049 4878
513 4878 6487 17246 2042 7605 6111 -5032 14262 9415 6540 16712 624 3101 6364 1974
527 1974 14989 8693 8740 11784 -3787 5310 8221 2941 14645 8606 4306 5208 13 5706 5040
542 5040 8366 11284 2500 6530 1547 -4018 8535 5109 5853 11333 -438 -1324 -311 -61 6813
557 6813 4173 6731 2772 -6383 -12 -1658 -1124 7718 3099 701 -1495 -6286 -1828 -2124 1646 5033
573E033p621J435k056o609Q070J488k081N384n064o616J473J491J092M524J582
588A525n722l485M35j271L171M083r09j670k605j204q17J379L843o92O57j194
604d476m938R64J229N24L882p5j710l457o13J958j043N512K365p725J914j343
620g032l711P352J265j173N57l043M3j921L089M476m344L785rp654N316J28r78
637c854O399k197r80j969k369M229j453M557L583p376K254j909l414Q169m10M43
653C703K342o132J006j13N37N646k600J360l08n518L909n08k70O346k540j796
669E064J65l704J555J850K930J336l439J134l611k811P114n23l83L161n343k016
685B479J239P21K297j26J330j859m472L120j169q13O201k452j748L88m202O80
$$ plain form
573 5033 -2588 -1153 -3209 -9818 -1748 -260 -2341 3043 -2021 -8637 -7164 -5673 -4581 -57 1525
588 1525 -4197 -7682 -7247 -8518 -5347 -1264 -2173 -3843 -6448 -7652 -8469 -7090 -3247 -3939 -3282 -4476
604 -4476 -9414 -8450 -7221 -6697 -2815 -2890 -4600 -8057 -8670 -6712 -7755 -2243 122 -7603 -5689 -7032
620 -7032 -10743 -3391 -2126 -3299 -2742 -5785 -5742 -7663 -4574 -98 -4442 -657 -666 -8320 -3004 -2876 -3854
637 -3854 2545 348 -632 -2601 -4970 -741 -2194 2363 5946 -1430 824 -1085 -4499 3670 3260 3703
653 3703 6045 -87 919 806 1343 6989 4389 5749 5441 -77 3832 3324 3054 9400 6860 5064
669 5064 5229 1525 3080 4930 7860 9196 5757 6891 3280 469 7583 7060 6677 9838 4495 2479
685 2479 3718 4439 6736 6610 7940 6081 1609 4729 3560 2747 8948 6496 4748 5136 934 1614
701A614J963J092K038k391r97j505l226M277R47o30K835m920l119K704j400K117
717A399K927k502j411j094j307R8R43L143r78j777P46l922j506M740r40O49J739
734I47l540k427OJ509J358O08J413l049m027K158k44J07M829j137l665O49j775
751f280n38K596R61mk54j446j743r73K178J017J119Q47k470k644O20O88J048K946
769b332L27k984j154j85m96K432K893q80j437m31j936J32L098J504r20J206j118
786b281l444J511J740l15K938J255k830j455m38N85J671K913J414l014j074k16
802a040j896L266L398r70K83j273k373M09J936J723M78R59j238k471M48P95r8
819B336L428M74j820q19j386q13J881K493J135j459q14j861j744K854K132K7P04
$$ plain form
701 1614 3577 4669 6707 4316 3319 1814 -1412 2865 3812 3182 6017 1097 -2022 682 -718 1399
717 1399 4326 1824 413 -681 -1988 -1890 -947 2196 1218 -559 187 -3735 -5241 -501 -1441 -792 947
734 947 -2593 -5020 -5014 -3505 -2147 -1539 -126 -3175 -7202 -5044 -5288 -5181 -352 -1489 -5154 -4505 -6280
751 -6280 -6818 -4222 -3261 -3265 -3519 -4965 -6708 -7681 -5503 -4486 -3367 -2520 -4990 -7634 -7014 -6326 -5278 -2332
769 -2332 -2005 -4989 -6143 -6328 -6824 -4392 -1499 -2379 -3816 -4247 -6183 -6051 -2953 -1449 -2369 -1163 -2281
786 -2281 -5725 -4214 -2474 -2789 149 1404 -1426 -2881 -3319 -2734 -1063 1850 3264 250 -824 -1040
802 -1040 -2936 330 3728 2758 3041 1768 -605 -196 1740 3463 3941 4900 3662 1191 1639 2434 2336
819 2336 5764 6238 4418 3599 2213 1400 3281 5774 6909 5450 4636 2775 1031 3885 6017 6044 6748
836F748j272l090m4J705K95J081J685k423j996P89j302N85K590Nr54q13j023j553
854A013N12L142l40n08L41l386o38J883M82R24K6j384j895m79J264n76J641O05
872B627k357m39r6j361J691N75M9l07j353l01j919J438J703j119J922j430l813
889d490K345j178J015K397j730m9k238r84K677j885K535J400m500J954j078k115
905e924L486n05L96L00k242R73k139P49L008k054J858m79l736J933l71J187K441
922a119j414L2j868j258K214k05J734J390k789J24o66o81K248R09N5J42n01j183
940b836p37J212J128N99J417j413j220j69P3R78K341Q68k015j094L00j110K027
957C49K091m74K26j630q5n09j57L792j141l44J791l935O07J645j365L396j89j183
$$ plain form
836 6748 5476 2386 2342 4047 4342 5423 7108 4685 2689 3478 2176 2761 5351 5356 4402 3589 2566 1013
854 1013 1525 4667 4327 3819 4160 774 136 2019 2501 3425 3451 2067 172 -307 957 381 2022 2627
872 2627 270 -169 -265 -1626 65 640 689 382 -971 -1272 -3191 -1753 -50 -1169 753 -677 -4490
889 -4490 -2145 -3323 -2308 89 -1641 -1690 -3928 -4912 -2235 -4120 -1585 -185 -4685 -2731 -3809 -5924
905 -5924 -2438 -2943 -2547 -2247 -4489 -3516 -5655 -4906 -1898 -3952 -2094 -2573 -6309 -4376 -4747 -3560 -1119
922 -1119 -2533 -2501 -4369 -5627 -3413 -3618 -1884 -494 -3283 -3159 -3825 -4506 -2258 -1349 -1294 -1152 -1653 -2836
940 -2836 -3573 -2361 -1233 -634 783 -630 -1850 -2019 -1946 -968 1373 2241 226 -868 -568 -1678 349
957 349 2440 1966 2192 562 477 -32 -189 3603 2462 2118 3909 -26 581 2226 861 4257 4068 2885
975B885L69l074J549Q71j66L367k477j208J025l585L523J376j524K475l096r01
991A409J443j799K816L11j249J034k740K82O76r81K593j76j060J64k254Q19k36
1008A052P84K564k796L84l62l286L545M80p68J830k823p17M9j053L270q03M6R17
1026B313l957Q01J056j447K415k62p49J93k151J02L50Q87J797j243j019r87j013
1043b914J248Q93Q69K39j807n81j176M81J772m58J215o55j878J64k91l4J702O06
1061f05p16m11p74j085J37J978J9P2M02k329l39O52N95J374M3o6j478j573J810
1080b294J95L27J883j871k89k02r41J482j20J122P73j877Q03q66r43K839o62N60
1098h1O92k707P52n9J14K683r96K78m55j907J467LP11J952k348L37K44j799K110
$$ plain form
975 2885 3254 180 1729 2600 2434 5801 3324 2116 3141 -444 3079 4455 2931 5406 2310 1409
991 1409 2852 1053 3869 4180 2931 3965 1225 1507 2183 1202 3795 3619 2559 2723 469 1288 1052
1008 1052 1836 4400 1604 1988 1626 -1660 1885 2365 1597 3427 604 -113 -64 -1117 2153 1350 1396 2313
1026 2313 -1644 -843 213 -1234 1181 919 170 363 -1788 -1686 -1336 -449 1348 105 -914 -1901 -2914
1043 -2914 -1666 -773 96 335 -1472 -2053 -3229 -2748 -976 -1434 -219 -874 -2752 -2588 -2879 -2913 -1211 -605
1061 -605 -1321 -1732 -2506 -3591 -3454 -1476 -1457 -1385 -983 -3312 -3651 -2999 -2404 -1030 -987 -1053 -2531 -4104 -2294
1080 -2294 -2099 -1772 111 -1760 -2049 -2251 -3192 -1710 -1830 -708 65 -1812 -1009 -1875 -2818 21 -641 -81
1098 -81 611 -2096 -1344 -1403 -1289 1394 398 676 221 -1686 -219 -216 495 2447 99 436 680 -1119 991
1117I91M17j93J029j432J4m57n74K310q05R37Q66k661K91M93o27J942L64r56j84
1136A765j276J014m49P27J838j436q05K03j693J428J480j022Q34p06j044nl72
1153D81J201K21L6O14j709o66J193j115J354J508k198K53o14j106J507L26Q61
1170B147k11j452mj168L90K115j102M24O16k576M78L39o14J625K31p55j76j614
1188a307Q48l83M67K209j760m28K6j954R93J801m69N14p61j363l94K26J192J60
1206c83K67J40j667j49K84n11J148Q11o43m17q26l11nR48J118n89p8n80j483P06
1226b220J215j06M48Kj497n37Q20N76p2J109j82j493R6M26o71J421O16n66o40
1245a255L15r42lJ288N00M8n9o35j189N56J193J77M45J72j378l70N11K90P84O38
$$ plain form
1117 991 1408 1215 2244 812 826 369 -205 2105 1300 2237 3103 442 733 1226 599 2541 2905 1949 1765
1136 1765 489 1503 1054 1781 3619 2183 1378 1581 -112 1316 2796 1774 2608 1902 858 853 481
1153 481 1682 1903 1939 2553 844 178 1371 256 1610 3118 920 1173 559 -547 960 1286 2147
1170 2147 1936 484 480 -688 -298 1817 715 1139 1755 -821 -343 -4 -618 1007 1238 483 307 -1307
1188 -1307 -459 -842 -375 1834 74 -354 -328 -2282 -1289 512 43 557 -204 -1567 -1961 -1735 -543 -383
1206 -383 -116 24 -1643 -1792 -1508 -2019 -871 -60 -703 -1120 -1946 -2257 -2262 -1314 -196 -785 -863 -1443 -2926 -2220
1226 -2220 -1005 -1111 -663 -661 -2158 -2695 -1875 -1299 -1371 -262 -444 -1937 -1841 -1415 -2086 -665 -49 -615 -1255
1245 -1255 -940 -1882 -1885 -597 -97 -49 -108 -743 -1932 -1376 -183 -6 439 611 -767 -1137 -626 -336 448 1086
1265A086k39j008j89k0r1J358N68p65J29l28j117L47J090K93K97J76j011q38N36
1284B74K34O99J144l12j568j30qk10J315R29j012m13J54j198L09J399K92m55P5
1303A518k98j294J92J090k99Q32M26j272q22K99J21N00J376l51j264m40p7l16
1321g9J293M78l59j94n65r09K21R59L39j81J82p50j009R60m10J96R62j07r04m75
1341c52q3J7L15J061k63j063M10o37r55K013Q7o64N52j219m50L01O02N03p96J028
1361D07q16j600J467k03n59J452m94n39p3j045M31N62N08M44j068Q2q62m84K052
1380c38l11k38O65j448M6K85m2R15J93p3p41r19J043m31L8J611p16o46L66p42
1400a483J08R63K3N33or07o07k21J463K68o4O38j533n78Q39J31K24R37k21n30
$$ plain form
1265 1086 847 -161 -350 -370 -461 897 1465 700 829 501 -616 -269 821 1114 1411 1587 576 -262 274
1284 274 508 1207 2351 2039 471 341 333 123 1438 2367 1355 942 1096 -102 207 1606 1898 1443 1518
1303 1518 1220 -74 118 1208 909 1741 2167 895 73 372 493 993 2369 2018 754 314 237 -79
1321 -79 1214 1692 1333 1139 574 -335 -114 845 1184 1003 1185 435 -574 386 -24 172 1134 1027 123 -352
1341 -352 -435 -418 -103 958 695 -368 42 -595 -1550 463 550 -114 438 -781 -1231 -930 -328 175 -621 407
1361 407 -409 -2009 -542 -745 -1304 148 -346 -885 -958 -2003 -1572 -1010 -502 -58 -1126 -1044 -1906 -2390 -338
1380 -338 -649 -887 -222 -1670 -1624 -1339 -1381 -466 -273 -346 -1087 -2006 -963 -1394 -1356 255 -461 -1107 -741 -1483
1400 -1483 -1375 -412 -389 144 138 -769 -1376 -1597 -134 134 70 708 -825 -1403 -564 -433 -209 728 507 -23
1420b3m56J25pN99Q06p6p69R0l82j45O69O99m67N75n83r61M88K45M62Q16o73l74
1442F58o95o7O66RJ314o91p41M12q59m1J378j16O2l28k74k99m91R90O48o62J098
1463A971j253r85J175j200J306R19j022O05j555L2P11p45J974n84j334J096j300
1480a89k09J248n84Q86l08p86L84q43O81N70o66Q98m00j259M11l70M96Q29m74
1499C15R2p62o98O04J88Q07k6o22J31j162L33J026n32M67J77j035j54j34J89L23
1519d73M39L1p74n73L16l30K65J298k46n53m22o41J18P22M67K20m96k77m81l53
1539a743J126L24j94O14r06p72O78m47P50O43l74J71q47n16N05j31J150L31p99
1558d37K64o99k88J006k48Q87J06j212j1j15K0Q87pL54l75q57N18j97K23Q82j92
$$ plain form
1420 -23 -479 -354 -361 238 1044 968 199 289 -93 -238 431 1130 663 1238 655 -306 182 427 889 1705 1032 658
1442 658 -37 -104 562 571 1885 1194 453 865 6 -35 1343 1227 1289 961 687 388 -103 887 1535 873 1971
1463 1971 718 -267 908 -292 1014 1933 911 1516 -39 -7 704 -41 1933 1349 15 1111 -189
1480 -189 -398 850 266 1152 844 58 442 -401 280 850 184 1082 682 -577 -166 -536 -40 789 315
1499 315 407 -355 -1053 -449 -261 546 520 -102 29 -1133 -800 226 -306 161 338 -697 -851 -985 -796 -473
1519 -473 -34 -3 -777 -1350 -1034 -1364 -1099 199 -47 -600 -1022 -1663 -1545 -823 -356 -136 -632 -909 -1390 -1743
1539 -1743 -617 -293 -487 127 -779 -1551 -873 -1320 -570 73 -301 -130 -977 -1493 -988 -1119 31 362 -437
1558 -437 -173 -872 -1160 -154 -402 485 591 -621 -632 -747 -727 160 153 507 132 -725 -207 -404 -181 701 509
1579E09j33p0q65O13K13j64R98m78o1l15q09R63J80k17J016j197k90L42n57Q46
1599E24P35o13L25p13p4K17l27J120k38l46M83j046j37P82k52P15j15n20l02m29
1619b11N59M86JM37n84o51K39j19N52P19o29j42M0q10J96K62J95L22m60Q9k84
1640B07o71M52O30J94J39l41p54l9J31K46K09L45Np98k53nK18M70J47m83m3l16
1662c10j96M35l5L44J0n85l58j61K64K65L18K4k83p30N26n51L21O65R9n74m2l64
1684i18k60L54Q25j25m22J93o09k52P35L45k16K90m59k27m59L95N11j48N34n7
1704C0p00O4r0j32P49K16p7l07p86J87K65M40L20J05k64p50k4N86J07K12L09n93
1726a33j12np0q8Q15r8n0l53Jl15J14Q05M8j77j75k17n34N43J76O9L78k63q53
$$ plain form
1579 509 376 306 -559 54 267 103 1101 623 562 247 -562 401 581 364 1380 183 -107 235 -322 524
1599 524 1259 646 971 258 184 401 74 1194 956 610 1093 47 -90 692 440 1155 1040 520 218 -211
1619 -211 348 834 835 1272 688 37 276 157 709 1428 799 657 697 -113 83 345 540 862 402 491 207
1640 207 -464 -12 618 812 951 610 -144 -183 -52 194 403 748 753 -45 -298 -303 -85 385 532 49 6 -310
1662 -310 -506 -71 -106 238 248 -337 -695 -856 -592 -327 -9 15 -268 -998 -472 -1023 -702 -37 62 -512 -554 -918
1684 -918 -1178 -824 1 -124 -546 -353 -962 -1214 -479 -134 -350 -60 -519 -746 -1205 -810 -299 -447 87 30
1704 30 -670 -606 -696 -828 -79 137 60 -247 -1033 -846 -581 -141 179 284 20 -730 -754 -168 -61 151 460 -133
1726 -133 -245 -250 -320 -408 407 309 259 -94 -93 -408 -294 511 559 382 207 -10 -544 -1 175 244 622 359 -494
1749d94L64M0J81L53J10J08o45k7K17k54O18L3j16k2l03j06J77L48P5j0r0m69
1771H8l19K64K22K42M18m70l00k95J74K45M00K42l20l35Ok01l9N91J72m31M23
1792G77o84l48L95J48J96O6N1m08n07L07J4N53L08m03m05l12m5n0K18O53k26m70
1814a72m2L3q7M34j16K54l27K3n01O7K77j2L04R8n20k01m2l21Q11j59j89J09K9
1837b50o02K19O5R98n86k22L1q12Q46Q7l33L95N0n17J4L54r5q4K13K22n35j20
1859f62J99j92L40L95q9j3l67l43K75J53M63l37J6J8q52P69J50L2J95l52l27j0
1881e39M16j18J30N49k35l67J65k48o0M68J21K13m43J5m93J23O82m00M15j55m18
1902a79M1J46J21K37k22J48k36k36N32k81N9O98l96K0k74m65K61L67K9L50l25
$$ plain form
1749 -494 -130 -90 91 444 554 662 17 -10 207 -47 571 604 488 466 163 57 234 582 657 647 557 88
1771 88 -231 33 255 497 915 445 145 -150 24 269 669 911 591 256 262 61 22 613 785 354 777
1792 777 93 -255 140 288 484 550 601 193 -314 -7 7 560 868 465 60 -252 -297 -347 -129 524 298 -172
1814 -172 -214 -181 -268 166 50 304 -23 0 -501 -434 -157 -169 135 233 -287 -488 -530 -851 -40 -199 -388 -279 -250
1837 -250 -852 -633 -568 430 -156 -378 -347 -1159 -313 -226 -559 -164 -114 -631 -617 -263 -358 -442 -229 -7 -542 -662
1859 -662 -463 -655 -315 80 -9 -22 -389 -732 -457 -304 159 -178 -162 -144 -996 -227 -77 -45 150 -202 -529 -539
1881 -539 -123 -241 -111 438 203 -164 1 -247 -307 161 282 495 52 67 -426 -303 379 -21 394 239 -179
1902 -179 -138 8 129 366 144 292 56 -180 352 71 130 828 432 452 178 -287 -26 341 370 720 395
1923C95L4m98l5O31LK87k77o48K32O4l3P44m06K61k94n56L49k39L32M01o38M84
1945E93k11n17M29r5M20Q8m42J94q32L34M06k65M22R3q75M04j49m03R46k43j49
1966A48l04l3L13l10Q5M49q17P25k71m30J55K1p0P79l66k62k58j01M32P7J69j17
1988A4m77pk3p7O3N83o67N46k16j83p7q9L77j06J84k4o87M15L15n83O37P3o07
2011f16L43l48J82K05K13j44r4l51K94Pj00O57m46R5j7m87O24o5k51O10o68J04
2033b53P1m51M72OQ7Q11j073R2R3l59Q78K7n18M42p44J49K64m5N19k22mq9n18
2056c65L65j38n3O04K7n15M00l31N4L19j40J46j71M8r2m55M24L08l88O80p58j32
2078a63K96p0N43J10k69j32l35O7L20l47O66kl91m7j15J77J73pM2k88K8j64j06
$$ plain form
1923 395 429 -69 -104 527 530 817 540 -108 124 188 155 899 493 754 460 -96 253 14 346 747 109 593
1945 593 382 -135 294 199 619 707 265 459 -373 -39 367 102 524 617 -258 146 -3 -406 540 297 148
1966 148 -156 -189 124 -186 -101 348 -469 256 -15 -445 -290 -269 -339 440 74 -188 -446 -547 -115 -38 131 14
1988 14 -463 -470 -493 -570 -507 76 -591 -45 -261 -444 -521 -610 -233 -339 -155 -179 -866 -451 -136 -719 -82 -9 -616
2011 -616 -273 -621 -439 -234 -21 -165 -259 -610 -316 -309 -409 248 -198 -103 -120 -607 17 -48 -299 311 -357 -253
2033 -253 -182 -633 -161 -155 -68 743 -330 -238 -145 -504 374 401 -117 325 -419 -270 -6 -51 468 246 242 153 -365
2056 -365 0 -138 -191 413 440 -75 325 -6 48 367 227 373 202 250 158 -297 127 435 47 727 -31 -163
2078 -163 133 63 606 716 447 315 -20 47 367 20 686 684 293 246 131 308 481 474 516 228 256 92 -14
2101a4P2L89K8j42q6l61L10k5m7J60J17k75Q1k56l6K46J7%j43r5J19j44K00J40
2125B55l10Jm7j00k58M28r3Q3J69k48n46J66M36k05L40j12n63K04l9j19M20Q2
2147e6K5l61J77j15K6J05q2R2R0m17M5K73j48k0K26Jq2j81P8J08j9M6K65k12k47
2172c83N2l98N89j05j12K55j53N7l2N9K9k55M61r6k35J87k56O9L05o2l3j32k07
2195c96o1L83J54J2j08qj26R3M5K55M1m01R8j60K73J57m47K37J57k22k03j51M84
2218A06K23k70K8J28k92k3O2K13j4K84r5l19q5J20k30N08J19J76n25P5O5pj24
2241A23K32L81l91k49Q0l9J34k2J72q7R5l43n3N07p8j18j08L9q4j17J84J12j06
2264B64J02p5j79j6L9j99M64o4k54l10J75L04j8q2J68k53m6p5j60L38K67k81J32
$$ plain form
2101 -14 58 447 475 333 247 -114 196 171 124 284 401 126 207 -49 -85 161 178 178 35 -60 59 -85 115 255
2125 255 -55 -54 -101 -201 -459 -31 -124 -41 128 -120 -666 -500 -64 -269 71 -41 -604 -400 -439 -558 -138 -56
2147 -56 -31 -392 -215 -330 -304 -199 -281 -189 -99 -516 -471 -198 -346 -366 -140 -139 -221 -402 -324 -216 -235 -189 76 -136 -383
2172 -383 -331 -729 -140 -245 -357 -102 -255 -198 -230 -171 -142 -397 64 -32 -267 -80 -336 -267 38 -24 -57 -189 -396
2195 -396 -457 -74 80 92 -16 -24 -150 -57 -12 243 284 -117 -19 -179 94 251 -196 41 198 -24 -227 -378 106
2218 106 329 59 87 215 -77 -100 -38 175 161 445 350 31 -54 66 -164 344 463 639 114 189 254 247 123
2241 123 355 736 345 96 176 137 271 249 421 334 429 86 33 540 462 344 236 275 191 74 258 370 264
2264 264 366 291 112 96 135 -64 400 336 82 -228 -53 251 233 151 319 66 20 -55 -215 123 390 109 241
2287B41k11k50o1K01J35k44K04k82q0OJ61J87O8l5k30J13k1k21K38J74j13k35
2309b55J99j30J0l6j00L38j6j94M5r4k09N19k68J68n0j15J19n85L68K78k88L3
2331b63N0K4Rj40K69K3J42l62K31l89N12n23L45O6k49J39j80K38p7k56M22j3k34
2354b16J63p1R2qj47J79K21l95J79K8j10k1q7L54Kl90J05M4r7j8K44L1k71P3J21
2379EL81k54l7R8k15r8K30Q9P9k14K60l22L5K11k4L1N2k44K50k26J92p5N6R5j50
2404B05k32K17r7j36M17j71n5k6k10J24j6J80K11l52L96n29P0K13m6k78O10m33
2426F2K5Q4k04J2mM0J69j33j24M6k75L29K73l75J25j60K5N3j62L28j25Q6n4k00
2450a59J08J9j2k6j03P6M19n37M1R8J97R7k56q5Q3j53K07K8N2J4k12k30K05L37
$$ plain form
2287 241 30 -220 -281 -80 55 -189 15 -267 -347 -341 -180 7 75 40 -190 -77 -98 -319 -81 93 -20 -255
2309 -255 -56 -186 -176 -212 -312 26 10 -184 -139 -233 -442 77 -191 -23 -73 -188 -69 -654 -286 -8 -296 -263
2331 -263 -213 -189 -180 -320 -51 -28 114 -248 -17 -406 106 -417 -72 -6 -255 -116 -296 -58 -135 -391 31 18 -216
2354 -216 -53 -124 -32 -40 -187 -8 213 -182 -3 25 -85 -106 -193 161 163 -227 -122 -78 -175 -193 51 82 -189 -116 5
2379 5 386 132 95 193 -22 -120 110 199 278 64 324 2 37 248 224 255 307 63 313 87 279 204 260 355 205
2404 205 -27 190 93 -43 374 203 148 122 -88 36 20 200 411 59 455 -74 -4 209 163 -115 495 62
2426 62 87 171 -33 -21 -25 15 184 51 -73 -27 -302 27 300 -75 50 -110 -85 -32 -194 134 9 95 41 -159
2450 -159 -51 -32 -44 -70 -173 -97 322 -215 -174 -76 121 218 -38 -123 -40 -193 14 42 94 108 -104 -334 -129 208
2474B08l36L01k86J64k38Q5j9J08O2n1k78K83o6k82M70R4l62J64k85M2m1J13J85
2497C5J42m60K84k67K40j29j86L38k16m3L9O7q2K84l09K79j27J13J27l59P0J22
2519c8m9J09k45p6M49k88k12M10j45j31O9j1L38j59M3J78l93P0k26J11M61l83
2541a18J15K82k39J87j89J98M7k68K91k16l98L59p0K0K94k10J58j89J4j43Q3L48
2563C56M3k16j85l00N01j29J16P1j57J40l44L62l38m0K56l7K01m38R2P6j88K95
2585A37p0j74L47k08m88O95j56j67M1q1J72j55J26l4nJ36j12j35K05r6K2O1j97
2608a36R4J52l85N19k02j45J59k44M65l37j90K75j16M5J1j34K0M0QK63j23p3j31
2631a65R8j25J43J79j42O1l6k73N0n0J54J13l2q0m7J19m51L73R3RK11n35K05J19
$$ plain form
2474 208 -128 173 -113 51 -187 -102 -121 -13 49 -2 -280 3 -63 -345 125 219 -143 21 -264 -222 -263 -150 35
2497 35 177 -283 1 -266 -26 -155 -341 -3 -219 -262 -223 -156 -238 46 -263 16 -111 2 129 -230 -160 -38
2519 -38 -87 22 -223 -299 150 -138 -350 60 -85 -216 -147 -158 180 21 64 242 -151 -81 -307 -196 265 -118
2541 -118 -3 279 40 227 38 236 283 15 306 90 -308 51 -19 1 295 85 243 54 68 -75 8 356
2563 356 399 183 -2 -302 199 70 186 257 100 240 -104 258 -80 -120 136 99 300 -138 -46 30 -158 137
2585 137 67 -107 240 32 -456 239 83 -84 -43 -124 48 -107 19 -15 -20 116 4 -131 74 -22 0 61 -136
2608 -136 -42 110 -275 244 42 -103 56 -188 277 -60 -250 25 -91 -46 -35 -169 -149 -109 -101 162 39 -34 -165
2631 -165 -67 -192 -49 130 -12 49 13 -260 -210 -260 -106 7 -25 -105 -152 -33 -484 -111 -18 -9 202 -333 -128 -9
2655ik36K54o9j79K86q5o4p3R9J94j25K2%j64n1j98K63J36p8L6j32J32k4O9Ql4
2681b2N1k5j21OM1K26n6k14K16j59j6O1j7N0K68j63j61j72Q7L68P7p1j01k79N01
2706C75o50J71K11Nj2j39K53j32p1O0J44k43K7J29K22k44n1L61j24k87J57k14
2728e2k1M65m46J2Q1M7j24K96j35j23l5J85m6r7l70L86j14j99L13J03l6k6Q7k75
2752a24J68p0Mj26K28k1j32R8m1O6j93J64NJ60j40q7j4O8l7o9R3j83K80j49K36
2777A84l46K3j15J18L75l91r1J81o3M2K39j92j05r6K05J49k36J27K02k23j36l2
2799a81N9k34M18k90J48m5K13k23M0J17l07J33K68k13j13J47K10k85m3l6J13J44
2821D0r1o0m2O2Pk6n0J68K0m2k30K89l2j83J43P1k6k0k05M59r7l68J26L8j61K96
$$ plain form
2655 -9 -245 9 -60 -239 47 -38 -102 -175 -76 118 -7 15 15 -149 -200 -398 -135 1 -77 -41 -173 -41 -65 4 12 -22
2681 -22 29 4 -117 -111 -70 156 100 -114 102 -57 -73 -12 -29 21 289 126 -35 -207 -120 248 325 254 153 -126 375
2706 375 -275 -104 107 112 100 -39 214 82 11 71 215 -28 -1 128 350 106 55 416 292 5 162 -52
2728 -52 -73 392 -54 -42 39 86 -38 258 123 0 -35 150 104 7 -363 23 -91 -290 23 126 90 64 151 -124
2752 -124 44 -26 -22 -148 80 59 -73 25 -16 50 -143 21 26 186 46 -41 -55 13 -24 -93 0 -183 97 -52 184
2777 184 -162 -139 -254 -136 239 -152 -243 -62 -125 -83 156 -36 -141 -237 -32 117 -119 8 210 -13 -149 -181
2799 -181 -122 -356 62 -228 -80 -125 88 -135 -95 22 -285 -152 116 -97 -210 -63 147 -138 -181 -217 -104 40
2821 40 -51 -111 -153 -91 -84 -110 -160 8 28 -14 -244 45 13 -170 -27 44 18 -2 -207 252 155 -213 -87 -49 -210 86
2847H6J10m8J7n7m9J48j94L63k57K58l56j06J88o6J34j3j63J72m31J58J90J5N0
2870A49j83J96j31j74L59mr6j7q2l20K78j49L81N7j38L00m72j65J80K42j3n9k48
2893a09K77j44J10k50L4k1J32J46l3k01L0J35J63L1k87o1J22M9k53L29j7j07j36
2916f1J16%k60K69o8o1n2j5J96Lk10K08j85m5J50k12p3N32l10J41j53Q0M0k04
2940a74R6P9M7j05K14l6o3l28K23j38J27q1L7o3K78k39L18j7k65k4j67J89k38
2963c30K64q5L00j46j47L9K9n3M53k93l1jq2O3L7j21N8j08J46K54m35K87k65j25
2987b92L40J03j48l35J42K74k74J94m21L77L26l78J3M06l09l4Op5J10o0J86j84
3009c3J02j03P5l51L65M0j33K78j11l27L10J06j45j73L52j60k34K79J21m75L5
$$ plain form
2847 86 196 148 165 108 59 207 13 376 119 377 21 -85 103 37 171 158 -5 167 -264 -106 84 99 149
2870 149 -34 162 31 -143 216 212 116 99 17 -303 -25 -174 207 264 126 426 -46 -211 -31 211 198 139 -109
2893 -109 168 24 134 -116 -82 -103 29 175 142 -59 -29 106 269 300 13 -48 74 123 -130 199 182 75 -61
2916 -61 55 55 -205 64 -4 -65 -117 -132 64 67 -143 65 -120 -165 -15 -227 -300 232 -78 63 -90 -10 30 -174
2940 -174 -78 1 48 -57 157 121 58 -270 -47 -185 -58 -139 -102 -165 113 -126 192 175 -90 -114 -281 -92 -330
2963 -330 -66 -151 149 3 -144 -105 -76 -129 324 31 0 -1 -83 -20 17 -104 -46 -154 -8 246 -189 98 -167 -292
2987 -292 48 151 3 -332 -190 84 -190 4 -417 -40 286 -92 -79 327 18 -16 -10 -85 25 -35 151 -33
3009 -33 69 -34 41 -310 55 95 -38 240 129 -198 112 218 73 -100 252 92 -142 137 258 -217 -182
3030a82L55q3k71J06J27o3K17r8K48k16j16J40j46j5n8P9J08L1j34R8j12j59j93
3053c37N25l30o4J61J90j38Q3k8J46k98k08M43k25P3J49m6j3j91O8l0K63k73J43
3076F3l54L66J42l72N2j1K4K31k88L7O5J14j41J47k0k25K18lj81J0J19Q4P8r5
3100F0p2J39k92l1L83k74j89J06J55o1K61j98o6l2K78k41R0O9l05K42L7m6j69
3123a56l0J09rn7M7J21j31k07O06l74M3l4L4R2n8LM3l5k04Q1M4J05J06n6M5l10
3149a82P5L2OJ55J32r6j67N6j95K73M3j56M9M3N3j03j64M08k86P8P9m30N5M69
3173B27K7j93j78K6K13j79jL0j74L8K27O5Jl3l25j8K39k17K14J72l3j28l42L17
3197b5j54K03k33R3n0K86K8j58r4O2k09N4L56m73M43k60K15R7p7M1k63K53m42
$$ plain form
3030 -182 173 90 -181 -75 52 -11 206 108 356 140 24 164 18 3 -55 24 132 163 29 127 15 -144 -337
3053 -337 188 -142 -206 -45 145 7 90 62 208 -90 -298 145 -80 -7 142 96 83 -108 -40 -70 193 -80 63
3076 63 -291 75 217 -155 -103 -114 -90 141 -147 -110 -45 69 -72 75 55 -170 48 45 -136 -126 -7 77 155 60
3100 60 -12 127 -165 -196 187 -87 -276 -170 -15 -76 185 -13 -79 -111 167 -74 16 85 -220 22 59 13 -156
3123 -156 -186 -77 -86 -143 -96 25 -106 -313 293 -81 -38 -72 -38 54 -4 -1 42 7 -197 -116 -72 33 139 83 128 -182
3149 -182 -107 -75 -69 86 218 122 -45 11 -184 89 132 -24 25 68 121 18 -146 262 -24 54 133 -297 -242 227
3173 227 254 61 -117 -91 122 -57 -58 -28 -202 -164 63 128 129 96 -229 -247 -8 -225 -11 161 128 0 -342 -25
3197 -25 -179 24 -209 -116 -166 120 148 -10 -104 -42 -251 -197 159 -314 129 -131 84 181 104 145 -118 135 -307
3220c07L78j67K89j12m7J8k17M7l2K08j11L1mJ72j6k86L59k07J03o6O4j59O3l9
3244c8m3Q8J85l50O4J82J38k21Mj41L3q5K49J9rR0m9PJ0m32J22J56k84M22l24
3269b07J71k37K76j64M5r8K13QJ0j68K65q4K31n3j60p7J24j06q5n6nK31j69M00
3293C05l91J76Oj67l5%L25l09q0P7K40k40K47k3j5o6j3j8j44J03k5N7O7j23j02
3318a48L09r6j53R0j03N0L1K71k88R1N3L5K9j50j35K04k89J08QK99k19M7K92m37
3342a01M5J42l38K00J10k69J57K46j22P9j22J2j92j0K96rk27K3O6j25R2J29J15
3365A97k28L3l6lJ3l0N0P5l58M27m90L63J70j08pq5j03n8K72p8n5j63K47j22R
3390f8M6j48nK02J16n1J06Lj90Jn9j32Q1K2K1K48k65j96J20J90Lk2J9Lk19K42
$$ plain form
3220 -307 71 -96 193 81 34 52 -165 -118 -150 58 -53 -22 -26 146 130 -156 203 -4 99 33 97 -62 1 -38
3244 -38 -81 7 192 -158 -94 88 226 5 9 -132 -99 -184 65 84 75 165 116 123 133 -299 -177 -21 -305 117 -207
3269 -207 -36 -273 3 -161 -116 -214 -1 7 17 -151 114 30 261 208 48 -29 95 -11 -96 -152 -157 74 -95 305
3293 305 -86 90 96 -71 -106 -106 219 -90 -170 -93 147 -93 154 131 116 50 37 19 -125 -22 -47 10 77 -46 -148
3318 -148 161 65 -88 2 -101 -51 -20 251 -37 54 107 142 171 21 -114 90 -199 -91 -83 216 -3 44 336 -101
3342 -101 -56 86 -252 -52 58 -211 -54 192 70 149 27 39 -153 -163 133 124 -103 -80 -14 -139 -47 82 197
3365 197 -31 2 -34 -37 -24 -54 -4 71 -287 140 -350 13 183 75 68 -17 -120 -178 94 16 -39 -202 45 -77 -68
3390 -68 -22 -170 -175 27 143 92 198 201 11 12 -47 -179 -98 -76 -55 193 -72 -268 -148 42 45 23 42 45 -174 68
3416F8J02k3r8j24P0m0J86k58r6K57k09J61Kp2N5O2J79l57L26r2j96J56j19kj49
3441b11L00N0k61NmJ26m8J29JJ66n71M46P7k54m1K47Q3l31J96m15M75k23K5k26
3465b59M60k83L19r8j85n0K53j77k50M80j77J12j69K2R5j02m1J33j13m4J7R9l
3488C9k02J11M2J89j16j5j9j19N1j92R7L3L02k03k25L80j96N8O2k3j2r7R1j91
3512a55kJ13K19k05J69k59K34N7j68k5J21l8k22M93m03k1p4J13j61J34J51J14
3534A85l27L9R9j91K90o9K8k1O5r1n4k0K24j07l23M47k93K16L30k67p1P3k28J64
3558I8o1k84L16N6o4O8j14j29R7n6j8K17j18n0J53Q4l75K64j76P1Jj85L04J50
3582B49k58k4O6l08K51rO6k88L50J00m82L65j3m7j23JP5o9K91m55K60j23K44J03
$$ plain form
3416 68 170 147 49 -75 -5 -45 141 -117 -213 44 -165 -4 -2 -74 -19 43 222 -135 191 99 -97 59 -60 -62 -211
3441 -211 89 139 -122 -117 -121 5 -43 86 87 253 -318 128 205 -49 -90 157 240 -91 105 -310 165 -58 -33 -259
3465 -259 201 -82 237 139 -46 -96 157 -20 -270 210 33 145 -24 -2 93 -9 -50 83 -30 -74 -57 42 39
3488 39 -163 -52 -10 179 63 48 29 -90 -39 -231 -134 -101 201 -2 -227 153 -43 15 77 54 42 -55 36 -155
3512 -155 -157 -44 175 -30 139 -120 114 171 3 -22 99 61 -161 332 -71 -92 -166 -53 -214 -80 71 185
3534 185 -142 -103 -4 -195 95 26 54 33 98 7 -47 -67 157 50 -273 174 -119 97 427 160 89 162 -66 98
3558 98 37 -247 69 125 61 129 15 -114 -17 -73 -91 126 8 -42 111 195 -180 84 -92 -21 -20 -205 99 249
3582 249 -9 -33 33 -275 -24 -33 33 -255 95 195 -287 78 65 18 -105 -104 -29 -98 193 -262 -2 -125 119 222
3606B22k49j54J90p6k9l3J72p3m1L3l7K36l35R3n5J3P4r5J56j80K86k11q3K54
3630G8k00P6n1K53j49L8k32J67J22k00R2J49K0o3o9n0J6j82K29J51j76n8J62J22
3654B45j69k49K42r8J55j41j48J11j19K75k06K85q6j12J80k68q1m3L51j66JKj9
3677e8K15m1j5K06j62r2J1J41k52p4O9Q1Lq9K63m3k56M5m2K1K81j44l34M46k40
3702f0J7j33M30j20k67L67L7n1k40O8r0J25P3j23O0k3k49K31j41O5P6L5k19K19
3726H7j59Pr9J33oR9k54K17j27p0J52L18l15j84L28j07l8J38N7KM4k96pJ21k16
3751a75K96j59J71j07j62L40m97L75n7j16J84k0j06K30l06M4JlK56k57J91j98
3773g5J19k26K3J95j20L6J35Q6j5l66K68Q8j25k48L14m8j41o2L58j57l1j65J01
$$ plain form
3606 222 -27 -181 9 -67 -96 -129 43 -30 -71 -38 -75 161 -174 -81 -136 -123 -49 -144 12 -168 118 -93 -176 78
3630 78 -122 -46 -97 156 7 45 -187 -20 102 -98 -6 143 163 100 31 -19 -3 -185 44 195 19 -39 123 245
3654 245 76 -173 69 -29 126 -15 -163 -52 -171 104 -102 183 97 -15 165 -103 -184 -227 124 -42 -41 -39 -58
3677 -58 157 116 101 307 145 53 64 205 -47 -121 -52 29 32 -57 206 163 -93 -48 -90 -69 212 68 -266 180 -60
3702 -60 -43 -176 254 134 -133 234 271 220 -20 48 -42 83 156 33 93 70 -179 52 -89 -24 52 87 -132 87
3726 87 -72 -65 -164 -31 -37 62 -192 25 -102 -172 -20 298 -17 -201 127 20 -18 120 177 179 223 -73 -80 41 -175
3751 -175 121 -38 133 26 -136 204 -293 82 25 -91 93 73 -33 197 -109 -65 -64 -67 189 -68 123 -75
3773 -75 44 -182 -159 36 -84 -48 87 173 158 -208 60 148 23 -225 89 41 -100 -162 196 39 8 -157 -56
3796e6K5j31k9n3L63l26K47k18K95K1mj47J33j62K13l35K02j39K99j68j36K03
3818I7j32J15k2j61N7j59L37m31N77o12L10j15j1L30j07P8j80K7k1n5M19m61Q6
3841c4J38L8j29p8j61K60K67m32O3j2K52p6j90J61k27K91p0Rj25K09l05l0K12
3864C1r9Q1J6K16k17K2J87l26J33j73J48k36L66o9N2l43L10J25m22K64J5j80J77
3887G8k00Q7k0m3J65J52l50P7K53O9m74JJ64O5j10j88M66k14J05j15l7o4P5K14
3911A56k07J92k97K11O3j44J34k18J6l4o1N0K40k41K41k13m2J01l68M55j53L1
3933h8L18k46K56j00j38J7q7N3m5J32Mk57K63k63K32K32k26O2k27K42j48L2j9
3956ao9RJ31m74N84m10K50N2j50O5J29nj04j56J95l6j5J60k00K40k97m4K81o7
$$ plain form
3796 -56 -31 -162 -191 -244 119 -207 40 -178 117 138 134 -13 120 -42 171 -164 38 -101 198 30 -106 97
3818 97 -35 80 58 -103 -46 -205 132 -299 278 -334 -24 -139 -150 180 73 151 -29 -2 -23 -78 341 -120 -34
3841 -34 104 142 13 -65 -226 34 301 -131 -68 -80 172 96 -94 67 -160 131 61 70 -55 154 -151 -181 31
3864 31 -68 13 29 245 28 50 237 -89 44 -129 19 -217 149 80 132 -211 99 224 -198 66 81 -99 78
3887 78 -122 -35 -55 -98 67 219 -131 -54 199 268 -206 -205 -41 24 -86 -274 192 -22 83 -32 -69 -133 -58 156
3911 156 -51 141 -156 55 118 -26 108 -110 -94 -128 -189 -139 101 -140 101 -112 -154 -53 -421 34 -119 -88
3933 -88 230 -16 240 140 2 19 -68 -15 -60 72 76 -181 82 -181 51 283 57 119 -108 134 -14 18 -1
3956 -1 -70 -61 70 -404 180 -230 20 72 -78 -13 116 111 7 -149 46 10 -5 155 -45 195 -102 -146 135 68
3980F8k46k30M24M0j10K21j93K07j4j00j95K35l6N6j30Q9L7om8J05k28J65j31
4003b0K02k07K30l1m6o4o4j79K10j84J64R4J19k91J1R5J14k8k36K1J15K0j00r1
4027a46J27n4o0J97L4K9k53O1j40L2L94j71M3j7J7K13n98L14N7q7P1m4p8J78j34
4052a5K20k27K09o3k30J49K7n0J08j23k69j4K19rJ63k11L7j6N8j58N5jj26N0J10
4077a07Q2J31j28l7M5J77l87K37J05k86M3J3J33K52q7k51J48j16l8J53m1j44M
4100i9N1j54M7J18kJ26k50jJ41l33K21k17L58J64k6k74J47m3k04R1L35r7l5l6
4124B8j46j70N4J62j5N6K23k36M7J24l86L53l66J08j04K10K5J77m20J74L0n4M0
4147h6J42j13M7J02r3P4j81J80l89L11J36q3j61P7j15Q0J84j24N8j0J19m9k51
$$ plain form
3980 68 -178 -408 16 56 -54 167 -26 181 167 67 -128 107 71 127 -3 86 123 117 69 174 -54 111 -20
4003 -20 182 -25 205 174 128 64 0 -179 31 -153 11 105 224 -67 -56 39 153 125 -111 -90 25 45 -55 -146
4027 -146 -19 -73 -133 64 98 127 -126 -65 -205 -173 221 50 93 76 93 306 -292 22 79 -8 63 19 -59 119 -15
4052 -15 205 -22 187 124 -106 43 70 20 128 5 -264 -278 -59 -68 95 -116 -79 -95 -37 -195 -140 -141 -267 -217 -107
4077 -107 -25 106 -22 -59 -14 163 -224 13 118 -168 -125 -112 21 273 186 -65 83 -33 -71 82 41 -103 -99
4100 -99 -48 -202 -155 -37 -39 87 -163 -164 -23 -356 -135 -352 6 170 144 -130 17 -26 -230 -139 196 99 64 28
4124 28 -118 -288 -234 -72 -87 -31 192 -44 3 127 -259 94 -272 -164 -268 -58 -33 144 -276 -102 -72 -126 -86
4147 -86 56 -57 -10 92 -1 73 -108 72 -317 -6 130 47 -114 -37 -152 -72 112 -12 46 36 155 106 -145
4170a45L8J66J70j46o7j5j0j82J45Q3j51K33J42k86j13K68m52J56r9L43J98m87
4192b11l1K33J13J09j73j77L75l30M1K47k11k48K03j56J61N8J8q1J00O1j22R6
4214G5k53J95J80j53O6k85J52J69o3j70r1L26r6m2J4k7J48k58Q8j00J27lk43M02
4238A58M5j72K84j28j35n9j88L66j11j76Q9L1NK00k54J01j48J35J95r9k49J24
4260A4j43J98r3M6J79k37RJ59l78L64r4k3j64O1L4j27L01k29J46J70j91R8o5J57
4284A92k06K11j32O4r0J05k47K04n0j16L9j05K8Q3J62k20J75kM0k03J60l5m7L6
4308D6j07O7J31p9l9J70j44k98K66J65n5k77J01k1k0j1J67k58L53l5J41j53j52
4331d2Q6j24J09J8J43j67q8K05j12q2j89K66J58j58j6R3j09j33J67J5pOj26J76
$$ plain form
4170 -145 -107 59 229 83 16 1 -9 -191 -46 37 -114 119 261 -25 -138 130 -322 -166 -265 78 276 -211
4192 -211 -242 -9 104 213 40 -137 238 -92 -51 196 -15 -263 -60 -216 -55 3 21 -60 40 101 -21 75
4214 75 -178 17 197 44 110 -175 -23 146 83 -87 -178 148 52 10 24 -3 145 -113 -25 -125 2 -1 -244 158
4238 158 203 31 315 187 52 -7 -195 171 60 -116 -27 4 9 209 -45 56 -92 43 238 139 -110 14
4260 14 -129 69 -24 22 201 -36 -27 132 -246 118 24 1 -163 -102 -68 -195 106 -123 23 193 2 100 35 192
4284 192 -14 197 65 129 39 144 -103 101 51 -65 -26 -131 -103 -20 142 -78 97 95 135 -68 92 57 10 46
4308 46 -61 6 137 58 19 189 45 -253 13 178 123 -154 -53 -74 -94 -105 62 -196 157 122 263 110 -42
4331 -42 44 -80 29 47 190 23 -65 140 28 -54 -243 23 181 23 7 100 -9 -142 25 40 33 39 -87 89
4355H9K7M7j79J17p0K11k81N0J71l25K08PP0j09O7J30lk01j58M04k80J39k63L44
4379B12p1M0l65Q2N8j06M60j55n1K3l9r9J5j34Q2rK29j2j69P0qr7r1K79q7r5L6
4406bJ10N6j80k44J51L2J82m3J1M3j98J46J7m71M54K24m73J98K1j09J01j58K0
4429a12L49m70J60L86k91j13j1J66n1J04N9l6m1k05pk0j52K42J11j12J03L3K3
4452A15k36J14p0N9P8k1l2J94k35O4n3J05Jl19K10J04p7m6q3J77j04J6Q2J22k90
4477a25J59j40K46k80J79o5j76K07o6N0J16K3%l21N0K56j24l2J55k84J78J90j44
4500E2K7N0o4n2j59J30o0N6m1k98J24o6L72j3M9j90K11k56K12j2l9k8j05l06K47
4525a59J36r4O0l7J05k62L33j28M7M1j57J94M9k02l6K10L4k25J79r4K80k28J33
$$ plain form
4355 89 116 163 -16 101 31 242 -39 11 182 -143 65 72 142 33 100 230 227 26 -132 272 -8 131 -132 212
4379 212 141 181 -184 -102 -44 -150 310 155 104 127 88 -11 4 -130 -48 -57 172 160 -9 61 53 -44 -135 144 57 -38 -2
4406 -2 108 164 -16 -260 -109 -77 105 62 73 116 -82 64 81 -390 64 288 -185 13 34 -75 26 -132 -112
4429 -112 237 -233 -73 313 22 -91 -102 64 13 117 176 140 99 -106 -113 -133 -285 -43 68 -44 59 92 115
4452 115 -121 -7 -77 -18 60 39 7 201 -34 30 -23 82 83 -236 -26 78 1 -45 -128 49 -55 -39 43 165 -125
4477 -125 34 -106 140 -140 39 -26 -202 5 -61 -11 105 128 128 -193 -143 113 -11 -43 112 -172 6 196 52
4500 52 79 129 65 13 -146 -16 -76 -20 -61 -359 -235 -301 71 58 107 -83 128 -128 84 72 33 5 -100 -406 -159
4525 -159 -23 -117 -57 -94 11 -251 82 -46 1 42 -115 79 128 -74 -110 100 134 -91 88 -6 274 46 179
4548A79J00m89J66J71j45Qj60K86j07l0J03P0k48J27j51L28l96J97P0r6J4K52
4570B49j20K9J62k66J68m66N95j67j53q8n8Q4k9J16j41P8Nlk01L68j32J14j45
4593aNR9j67j42M75k98o4j4J76n7L07j98k39J0P0q9K06km6J48j27j28j6L39l28
4618h1M6%j53J13N1r4n8J03P9O1j70P9R8J02k21J81j3j67J82j02j35K63k44K01
4642A21o0n7J3J40j36j14k27J64L59p4n7RN9k3K1k36K04j33o8J75J4j80o2K17
4666F9j26K09j26LRj73K48k75Q8L1mj26L27j58J99L0J8j27j66o8J78p5L8J64k69
4691h2J59M3j38q6K19l19L26o3j15PKK6J11M3q0k16n1K4J83o1n8J41N5j46N6K4
4717Dj3j73J34j24K79J54k68O6Rj25J49k98K94m9j22P6J58Pp8r8J11j51M4q8j9
$$ plain form
4548 179 279 -210 -44 127 -18 -10 -170 116 9 -21 82 152 -96 31 -120 208 -188 9 79 -17 -3 249
4570 249 129 158 320 54 222 -244 351 184 31 -57 -115 -31 -60 56 -85 -7 -2 -5 -206 162 30 144 -1
4593 -1 4 103 -64 -206 269 -29 -93 -107 69 12 319 121 -118 -108 -38 -127 79 77 31 179 52 -76 -92 247 -81
4618 -81 -35 -35 -188 -75 -24 -118 -176 -73 6 67 -103 -24 74 176 -45 136 123 -44 138 36 -99 164 -80 121
4642 121 61 4 17 157 21 -93 -320 -156 203 129 72 81 140 117 138 -98 106 -27 -95 80 94 -86 -148 69
4666 69 -57 152 26 29 38 -135 113 -162 -74 -43 -47 -173 154 -4 195 225 243 116 -50 -118 60 -15 23 187 -82
4691 -82 77 120 -18 -104 115 -204 122 59 -56 -49 -47 -21 90 133 53 -163 -214 -190 -7 -68 -126 15 70 -76 -20 4
4717 4 -9 -182 -48 -172 107 261 -7 59 68 -57 92 -206 88 39 -83 -7 151 158 80 -18 93 -58 -14 -102 -121
4742a21n9L02k49J4J20O9r8J24l49K99M4l55J01J64j00o2K49l23J47M2r2L33k55
4765e5q7J81m6j75Q8p3J54j22J69l21L79j21Q1Q2j54K85j97k29R5J66j00j29K05
4788G6J3l3P8j09j06k61N90L5k14k63J32J65l9k98J12J18M1j80K7k5K2L03l54
4811a70P3L18l05O0m8J48N4J4j15Q9j83J44Kk08K70J1j08k33J36J84R6p3J9j24
4835E1j69j0L26j86p0J88l67K53J15R5j94r2QM1Q2l10L22k67Q6j51J03K53q7k55
4859b35jK2K13O7j34L8K82l03K67k14j86L58j10k0q3j1J13o6P4j9R4k44J88J7
4883A07l49K66j45N4J32r8J12j01K36j89m9o2r8P7p2M05l26K92l22jo4L44j65
4906a6n5N8J71j67J71k35P6K63l43Q2q2J42O6k27Ll4J42k5K33l03Q7R3m1K06k06
$$ plain form
4742 -121 -180 122 -127 -113 7 76 -22 102 -247 52 96 -259 -158 6 -94 -156 93 -230 -83 -41 -133 200 -55
4765 -55 -142 39 -7 -182 -94 -167 -13 -135 34 -287 92 -29 52 134 -20 265 68 -161 -66 100 0 -129 76
4788 76 89 56 134 25 -81 -342 248 283 69 -194 -62 103 64 -234 -122 -4 37 -143 -116 -141 -119 184 -170
4811 -170 -97 221 -84 -24 -72 76 130 144 29 118 -65 79 81 -127 143 154 46 -187 -51 133 229 156 175 51
4835 51 -118 -128 198 12 -58 130 -237 16 131 226 32 -60 -52 -11 71 -239 83 -184 -98 -249 -146 107 20 -235
4859 -235 -236 -214 -1 66 -68 -30 252 -51 216 2 -184 174 64 44 -39 -50 63 -3 71 52 146 -98 90 107
4883 107 -242 24 -121 -67 65 -33 79 -22 214 25 -24 -86 -184 -107 -179 226 -100 192 -130 -131 -195 149 -16
4906 -16 -71 -13 158 -9 162 -73 3 266 -77 5 -77 65 131 -96 -93 -127 15 -10 223 -80 7 100 59 265 59
4931E9L2j63J42j03M0q2K26qO5j60J8k73J41j5J62j99N6j03J70j50K04n4N6N6
4955A17m1p8J96j84j64j34L21J4K0P4l12L70k90K97Nl09p3N1p1K32q2jJ3P1k35
4980a93L22k33k5K01R6m66J81R1j82K17j43K28k25J55J00Nj01Rm1J08j15j75L92
5003B06j9Lj32k34K70p7j09K18J45j02j80Q3j3k02L63k36J54j01N6k21J46m8M
5026b6R8r9L01m79j23N39j62o6k0N8j40L08l71J07l7P0L20l20P4j04J42n4j18
5049a02J71R8j50k11L51O9or6j65j07P3K07J53k93k35L91r6J3j58L29k74J43k03
5072i8O4m5Q2j44K04J26j77k26J34J77k61J04j03J42J23l40J07N3l6M4K63k81
5094h8n8K25n8p0j07K89j92j02K15J04p3m4O6j8k12K0Oj1J54j8j68K47l1n8J01
$$ plain form
4931 59 91 -72 70 -33 7 -75 151 143 208 48 66 -207 -66 -81 81 -118 -62 -165 5 -145 59 5 61 117
4955 117 76 -2 194 10 -154 -288 33 47 67 141 -171 199 -91 206 211 -98 -171 -120 -191 41 -41 -42 -29 42 -193
4980 -193 129 -104 -129 72 168 -298 -117 -26 -208 9 -134 94 -131 24 124 129 28 37 -4 104 -11 -186 206
5003 206 187 190 58 -176 94 17 -92 126 271 169 -11 72 59 -143 220 -16 138 37 93 -128 18 -30 -26
5026 -26 72 -27 274 -205 -328 211 49 -17 -37 21 -119 189 -182 -75 -112 -42 278 -42 32 -72 70 16 -102
5049 -102 69 167 17 -194 157 226 220 124 -41 -148 -75 132 285 -8 -243 148 52 65 -93 236 -38 105 -98
5072 -98 -34 -79 3 -141 63 189 12 -214 -80 97 -164 -60 -163 -21 102 -238 -131 -78 -114 -70 193 -88
5094 -88 -146 79 21 -49 -156 133 -59 -161 54 158 85 41 107 89 -123 -103 -97 -108 46 28 -140 107 76 18 119
5119A19Q8m09J17J66o4n9kq5J96k74K80j11J01j50K56N6j20r3jJ64j17j3R0j60
5143b5j34K08mJ02P1j47J46m02J39J29N0p5p3N1N5l58J74J38k26J39OQ1j13J29
5167F1N1k25J72Ok36P3L4K27k21J99r4m9KK37m2r6nk00o3R2j75k2L05R8L3l07
5193a45L15j61RJ8L0k65J35J11r5j14J48J68j81j7j19J45M9L8Rj03L6j62R9oj51
5218b09L90J13l80MR0j6J73k57K61l07J59j70J0n3P5J80l12K08k4N4k3j6j54L90
5242A86k43o0L96l71O8l0m7K4M8p3qM1L0k1k8j53L07p4m9l02K40j2M04k98Ko0
5268h3K05J7k06j34L15j60J90j68N6M9q4j11K9P2j40K54K8j29q2J19m7K67j69
5291H8k23LJ08J2J20l9p9j72K38l58L81l14K90j9K45k94j08J22P9l6p9K18j5j66
$$ plain form
5119 119 207 -202 -85 81 17 -42 -44 -129 67 -207 73 -38 63 -87 169 225 105 12 11 175 58 45 135 -25
5143 -25 -159 49 45 147 218 71 217 -185 -46 83 133 58 -15 36 91 -267 -93 45 -181 -42 -36 45 -68 61
5167 61 112 -113 59 65 -171 -98 -64 163 -58 141 47 -2 0 237 195 99 94 -106 -169 -77 -252 -274 31 129 162 -145
5193 -145 170 9 18 36 66 -199 -64 47 -48 -162 -14 154 -27 -44 -163 -18 31 69 78 -25 11 -151 -52 -58 -209
5218 -209 181 294 -86 -82 8 -8 165 -92 169 -138 21 -149 -139 -192 -117 63 -249 -41 -65 -11 -34 -50 -204 186
5242 186 -57 -117 279 -92 -24 -54 -101 -77 -29 -102 -110 -69 -39 -60 -88 -241 66 -8 -57 -359 -119 -131 273 -25 -23 -83
5268 -83 122 139 -67 -201 114 -46 144 -24 32 81 -3 -114 -85 -13 -153 101 129 0 -82 37 -10 257 88
5291 88 -135 -132 -24 -12 108 69 -10 -182 56 -302 79 -235 55 36 281 -13 -121 1 80 44 -35 183 168 2
5315Bj53J24O5k53J58O9j15pJ67j03Q9k00L20k37l0J08N0K30k69q2J31j14J67
5338A17Nj51%J08k50J91J02j96K21m09M72o1j48o0j1K59L1l43N8K44j70l1O0j30
5362i2J42o1p5P7j66J96K0J42j79J41j45j1J54M1Lj62j18O6k34J16J79k63K31
5385BK8L12l03j17K3J45k36oK27J7J03k57o2J74J55l63J84K04l17K64j81O8j90
5408a26j95K03k6K62l63P8N2J46L4K3j87m9K51J3j48L6j30J26p4KK79M7j90Q4
5432A48k28PjN0P7J42j60K7J61k01MJ12l02J08J06n6K19l65J74J89o3k78Q3RJ64
5457A26j07k9J07j99J8j0n8P7rJ50j16K41r1j41J28q6K25k05J5J44k94K7K16o4
5481F5PR9q6P3j47o6k48M73L5q3P7q1j27M7J33r3m40K67K0kJ55j55L3J59k21J07
$$ plain form
5315 2 -151 -27 38 -215 -57 12 -103 -110 57 -46 43 -157 163 -74 -104 4 54 284 15 -67 64 -50 117
5338 117 122 -29 -29 79 -171 20 122 -74 147 -262 210 149 1 -59 -70 189 220 -123 -65 179 9 -22 38 -92
5362 -92 50 -11 -86 -9 -175 21 41 183 4 145 0 -11 143 184 187 25 -93 -27 -261 -145 34 -229 2
5385 2 30 342 39 -78 -55 90 -146 -152 75 92 195 -62 -124 50 205 -158 26 230 -87 177 -4 64 -126
5408 -126 -321 -118 -144 118 -245 -167 -115 31 65 88 -99 -148 103 116 -32 4 -126 0 -74 -72 207 254 64 148
5432 148 -80 -73 -74 -24 53 195 35 62 223 22 26 138 -164 -56 50 -6 213 -152 22 211 148 -130 -47 -38 126
5457 126 19 -10 97 -102 -84 -94 -152 -75 -84 66 -50 191 100 -41 87 1 226 21 36 180 -114 -87 129 65
5481 65 72 171 85 158 11 -55 -303 170 205 122 199 118 -9 38 171 78 -362 -95 -75 -77 78 -77 -44 115 -106 1
5507AM0J46k74J3J37J0j96K46ok46L11L4r1o4j30K7j01L23l70J55L6N5K9m20L73
5532C8J17k31R7r6j15J99R0j0j37P7j41K04n5j7j93R9K57k11R2j59o4O5q4K69
5556I1mL7j4k95K54Jj73J75p8k5j45J39K28Q1k90O1no5L14r4r8j20L9R6n8L9k52
5583a61LL68l0j22J60l43J46n1N2K47JR7l37j25L12j25j06J17p4l8J76k66J85
5606H6j35J16k18J76j63L06l22j00K38Ml9N9kP5j21l7j01R9M9K88j19j87J08K8
5630H8j28J49j80j04K76M5k04O5n9p2J82j64K09O9K0p4L6m66L14J86j13j22o7
5653a14N8L5J52m6p6J87n2j05k0k60K46r1l8K80n2Lr5K09j89J88l89L22O6k58
5677c9QM8J94l90J31J81o4M7k14J96k12J56j80K20k71L1K11j06n3n7P5K1L3j33
$$ plain form
5507 1 41 187 -87 -74 63 73 -123 123 117 -129 182 216 125 61 -69 -42 -143 180 -190 -35 1 56 85 -335 38
5532 38 155 -76 21 -75 -190 9 99 89 -48 29 -112 92 37 20 -173 -74 183 -28 64 -95 -159 -94 -178 91
5556 91 87 124 110 -185 69 70 -103 72 -6 -31 -176 -37 191 272 -18 43 38 -27 287 193 95 -25 14 110 52 91 -161
5583 -161 -158 210 180 58 218 -125 21 -30 22 269 270 367 30 -95 217 92 -14 103 29 -9 167 -99 86
5606 86 -49 67 -151 25 -138 168 -154 -254 -16 -12 -51 8 6 81 -40 -77 -178 -79 -30 258 139 -48 60 88
5630 88 -40 109 -71 -175 101 146 -58 7 -52 -124 58 -106 103 172 192 118 154 -312 2 188 75 -47 -114
5653 -114 -56 -21 131 85 9 196 144 39 19 -241 5 -86 -124 156 104 107 12 221 32 220 -169 153 219 -39
5677 -39 -31 17 211 -179 -48 133 69 116 -98 98 -114 42 -138 82 -189 -158 53 -53 -106 -163 -88 -67 -34 -167
5701a67J43J37j60OO2jK7M9j20ok66M17k73l0L48j02q7q7p5L78l45O4M5J43k70
5726a70K12k4k86M18pj50K02k79Q5J8j35n1l8N41l93j2%q2J81j33J5j56J03K21
5750H0j10L8j62P0j39N7K66l01J54J2p5m8M5J30J3J12J11m88J50J23J13j76J14
5773H9j33o0J76k73N20l48J15nj16Mj2j1P1K1p0K25j64j41J80L1l19K81q9J46
5797A18j10J12j12m0J92k36R8j42n6J07L0K14j62q2q2J42%J15m6K8r9L5j98k8
5821b02NNJ75K87m39K29Kj10K64j31r4J07p2p3J45O0j59k49L98j36j26k3K21j69
5845h5k1L79p7m45K01N0j05K44k53R5J38k13J7L6J53Q9o3O6j36O1k02j01J99j34
5869a07J34P1n9kr1k00L81j50P1Q3k47J63o0QJ46k22J99J0j20R0j28plJ97j72
$$ plain form
5701 -167 -24 113 -47 -41 21 20 47 96 -24 -30 -296 121 -152 -182 166 64 -23 -110 -185 193 -152 -88 -43 100 -170
5726 -170 42 18 -268 150 143 -7 195 -84 1 19 -116 -167 -205 336 -57 -69 -69 -151 30 -103 -88 -244 -141 80
5750 80 -30 8 -154 -84 -223 -166 100 -201 -47 -35 -110 -158 -113 17 30 142 253 -235 -85 38 151 -25 89
5773 89 -44 -104 72 -201 319 -29 86 81 -35 -31 -43 -54 17 38 -32 193 29 -112 68 99 -220 61 -28 118
5797 118 8 120 8 -32 160 -76 22 -120 -176 -69 -39 175 13 -69 -151 -9 -9 106 60 88 -11 24 -174 -202
5821 -202 -197 -192 -17 270 -169 60 62 -48 216 85 -9 98 26 -47 98 158 -1 -250 148 12 -114 -137 84 -85
5845 -85 -106 273 196 -249 -48 2 -103 141 -112 -17 121 -92 -75 -39 114 203 140 206 70 131 -71 -172 27 -107
5869 -107 27 98 39 37 -54 -254 127 -23 48 131 -116 47 -13 -5 141 -81 118 128 8 98 -30 -37 -40 157 -15
5894a5j13L4K54q0k36J01Q5J18p6n3R0k40n3O0K91q7m3J21n1l29L47O0m6j17O4
5919H6L1Mk15Qo3M7j96K91J25R9l25r5J80j2K53l09J88j65J95k70M56m40J14L03
5943B90q6K1j31L0j00k33J49K43MQ6k88l9L6O1j88K53p9M8JQ1p4k57K79j20k17
5968b30K46o0K9qK22J4j94r3J28lj71l7p3K54p9P3p3p0J49J45j35K82k56k50J77
5993a3m4M3J02J71Qk15J7l1j04L7JL3q1J62j42j14J27j02J83j43M17m54O4K24
$$ plain form
5894 -15 -128 -94 160 80 -156 -55 30 148 72 19 109 -131 -184 -124 167 80 37 158 107 -222 125 185 139 22 86
5919 86 117 121 -94 -86 -149 -102 -298 -7 118 217 -108 -203 -23 -35 218 -91 97 -68 127 -143 313 -127 -13 290
5943 290 204 225 94 124 24 -209 -60 183 187 273 -15 -54 -18 43 -145 108 29 77 78 159 85 -172 107 -13 -230
5968 -230 16 -44 -15 -23 199 213 19 -74 54 51 -120 -157 -230 24 -55 18 -55 -125 24 169 34 316 60 -190 -13
5993 -13 -57 -14 88 259 267 52 69 38 -66 -29 -28 5 -76 86 -56 -170 -43 -145 38 -105 312 -142 -78 146
$$ [...]
8191A83
##END NTUPLES=NMR FID
##END=
