##TITLE=1H_SR49_k+TFA
 CDCl3, 8 sc, 
 8.04.2021
##JCAMPDX= 6.0         $$ Bruker NMR JCAMP-DX V2.0
##DATA TYPE= NMR FID
##DATA CLASS= NTUPLES
##ORIGIN= UXNMR, Bruker Analytische Messtechnik GmbH
##OWNER= root
$$ XWIN-NMR		Version 3.5
$$ Thu Apr  8 14:04:43 2021 Russian Standard Time (UT+4h)  she@DPX200
##.OBSERVE FREQUENCY= 200.131506
##.OBSERVE NUCLEUS= ^1H
##.DELAY= (6, 6)
##.ACQUISITION MODE= SIMULTANEOUS
##.ACQUISITION SCHEME= undefined
##.AVERAGES= 8
##.DIGITISER RES= 18
##SPECTROMETER/DATA SYSTEM= spect
##.PULSE SEQUENCE= zg30
##.SOLVENT NAME= DMSO
##.SHIFT REFERENCE= (INTERNAL, DMSO, 0, 15.7039)
##AUDIT TRAIL= $$ (NUMBER, WHEN, WHO, WHERE, WHAT)
$$ ##TITLE= Audit trail, XWIN-NMR		Version 3.5
$$ ##JCAMPDX= 5.01
$$ ##ORIGIN= Bruker BioSpin GmbH
$$ ##OWNER= she
$$ F:/spectra/data/she/nmr/H-F/1/audita.txt
$$ ##AUDIT TRAIL=  $$ (NUMBER, WHEN, WHO, WHERE, WHAT)
(   1,<2021-04-08 14:03:51.29 +0400>,<she>,<DPX200>,
      <created by zg, POWCHK disabled, PULCHK disabled
       configuration hash MD5:
       00 E9 B6 7A A2 85 ED C7 34 08 36 98 17 FE 4E 26
       data hash MD5: 16K
       E2 78 A0 F7 8F 91 3C C3 7C 08 D3 89 4F 5D AC BA>)
$$ ##END=
$$ 
$$ hash MD5
$$ 7B 98 D0 66 A7 1A 32 A9 86 60 9D 1D D8 F6 07 A9
##$RELAX= 
##$RELAX= 
##$RELAX= 
##$RELAX= 
##$RELAX= 
##$RELAX= 
$$ Bruker specific parameters
$$ --------------------------
##$DU= <F:/spectra>
##$EXPNO= 1
##$NAME= <H-F>
##$PROCNO= 1
##$TYPE= <nmr>
##$USER= <she>
##$AMP= (0..31)
100 100 100 100 100 100 100 100 100 100 100 100 100 100 100 100 100 100 
100 100 100 100 100 100 100 100 100 100 100 100 100 100 
##$AQSEQ= 0
##$AQ_mod= 1
##$AUNM= <au_zg>
##$AUTOPOS= <>
##$BF1= 200.13
##$BF2= 200.13
##$BF3= 200.13
##$BF4= 200.13
##$BF5= 200.13
##$BF6= 200.13
##$BF7= 200.13
##$BF8= 200.13
##$BYTORDA= 1
##$CFDGTYP= 0
##$CFRGTYP= 5
##$CHEMSTR= <none>
##$CNST= (0..31)
1 1 145 1 1 1 1 1 1 1 1 1 1 1 1 1 1 1 1 1 1 1 1 1 1 1 1 1 1 1 1 1 
##$CPDPRG= <>
##$CPDPRG1= <>
##$CPDPRG2= <>
##$CPDPRG3= <>
##$CPDPRG4= <mlev>
##$CPDPRG5= <mlev>
##$CPDPRG6= <mlev>
##$CPDPRG7= <mlev>
##$CPDPRG8= <mlev>
##$CPDPRGB= <>
##$CPDPRGT= <>
##$D= (0..31)
0 1.2 0 0 0 0 0 0 0 0.06 0 0.03 0 0 0 0 0.0002 0 0 0 0 0 0 0 0 0 0 0 0 
0 0 0 
##$DATE= 1617876230
##$DBL= (0..7)
120 120 120 120 120 120 120 120 
##$DBP= (0..7)
150 150 150 150 150 150 150 150 
##$DBP07= 0
##$DBPNAM0= <>
##$DBPNAM1= <>
##$DBPNAM2= <>
##$DBPNAM3= <>
##$DBPNAM4= <>
##$DBPNAM5= <>
##$DBPNAM6= <>
##$DBPNAM7= <>
##$DBPOAL= (0..7)
0.5 0.5 0.5 0.5 0.5 0.5 0.5 0.5 
##$DBPOFFS= (0..7)
0 0 0 0 0 0 0 0 
##$DE= 6
##$DECBNUC= <off>
##$DECIM= 32
##$DECNUC= <off>
##$DECSTAT= 4
##$DIGMOD= 1
##$DIGTYP= 9
##$DL= (0..7)
0 120 120 120 120 120 120 120 
##$DP= (0..7)
150 150 150 150 150 150 150 150 
##$DP07= 0
##$DPNAME0= <>
##$DPNAME1= <>
##$DPNAME2= <>
##$DPNAME3= <>
##$DPNAME4= <>
##$DPNAME5= <>
##$DPNAME6= <>
##$DPNAME7= <>
##$DPOAL= (0..7)
0.5 0.5 0.5 0.5 0.5 0.5 0.5 0.5 
##$DPOFFS= (0..7)
0 0 0 0 0 0 0 0 
##$DQDMODE= 0
##$DR= 18
##$DS= 0
##$DSLIST= <SSSSSSSSSSSSSSS>
$$ [...]
##$SUBNAM2= <"">
##$SUBNAM3= <"">
##$SUBNAM4= <"">
##$SUBNAM5= <"">
##$SUBNAM6= <"">
##$SUBNAM7= <"">
##$SUBNAM8= <"">
##$SUBNAM9= <"">
##$SW= 16.9725357007746
##$SWIBOX= (0..15)
0 0 2 0 0 0 0 0 0 0 0 0 0 0 0 0 
##$SW_h= 3396.73913043478
##$TD= 16384
##$TD0= 1
##$TE= 0
##$TE2= 300
##$TE3= 300
##$TEG= 300
##$TL= (0..7)
0 120 120 120 120 120 120 120 
##$TP= (0..7)
150 150 150 150 150 150 150 150 
##$TP07= 0
##$TPNAME0= <>
##$TPNAME1= <>
##$TPNAME2= <>
##$TPNAME3= <>
##$TPNAME4= <>
##$TPNAME5= <>
##$TPNAME6= <>
##$TPNAME7= <>
##$TPOAL= (0..7)
0.5 0.5 0.5 0.5 0.5 0.5 0.5 0.5 
##$TPOFFS= (0..7)
0 0 0 0 0 0 0 0 
##$TUNHIN= 0
##$TUNHOUT= 0
##$TUNXOUT= 0
##$USERA1= <user>
##$USERA2= <user>
##$USERA3= <user>
##$USERA4= <user>
##$USERA5= <user>
##$V9= 5
##$VALIST= <valist>
##$VCLIST= <CCCCCCCCCCCCCCC>
##$VD= 0
##$VDLIST= <DDDDDDDDDDDDDDD>
##$VPLIST= <PPPPPPPPPPPPPPP>
##$VTLIST= <TTTTTTTTTTTTTTT>
##$WBST= 1024
##$WBSW= 4
##$XGAIN= (0..3)
0 0 0 0 
##$XL= 0
##$YL= 0
##$YMAX_a= 97345
##$YMIN_a= -117465
##$ZGOPTNS= <>
##$ZL1= 120
##$ZL2= 120
##$ZL3= 120
##$ZL4= 120
##$ABSF1= 10
##$ABSF2= 0
##$ABSG= 5
##$ABSL= 3
##$ALPHA= 0
##$AQORDER= 0
##$ASSFAC= 0
##$ASSFACI= 0
##$ASSFACX= 0
##$ASSWID= 0
##$AUNMP= <proc_1d>
##$AZFE= 0.1
##$AZFW= 0.1
##$BCFW= 1
##$BC_mod= 2
##$BYTORDP= 1
##$COROFFS= 0
##$CY= 11.3945322036743
##$DATMOD= 1
##$DC= 2
##$DFILT= <>
##$DTYPP= 0
##$F1P= 15.9154993809931
##$F2P= -4.1035820241983
##$FCOR= 0.5
##$FTSIZE= 0
##$FT_mod= 4
##$GAMMA= 1
##$GB= 0.15
##$INTBC= 1
##$INTSCL= 1
##$ISEN= 128
##$LB= 0.24
##$LEV0= 0
##$LPBIN= 0
##$MAXI= 10000
##$MC2= 0
##$MEAN= 0
##$ME_mod= 0
##$MI= 1.114404
##$NCOEF= 0
##$NC_proc= 0
##$NLEV= 6
##$NOISF1= 3.799351
##$NOISF2= 2.8
##$NSP= 1
##$NTH_PI= 0
##$NZP= 0
##$OFFSET= 15.70392
##$PC= 1
##$PHC0= -11119.82
##$PHC1= 12.20092
##$PH_mod= 1
##$PKNL= yes
##$PPARMOD= 0
##$PSCAL= 0
##$PSIGN= 0
##$REVERSE= no
##$SF= 200.130013532006
##$SI= 16384
##$SIGF1= 3
##$SIGF2= 2
##$SINO= 400
##$SIOLD= 16384
##$SREGLST= <1H.CDCl3>
##$SSB= 0
##$STSI= 0
##$STSR= 0
##$SW_p= 3612.71676300578
##$SYMM= 0
##$S_DEV= 0
##$TDeff= 0
##$TDoff= 0
##$TI= <>
##$TILT= no
##$TM1= 0
##$TM2= 0
##$TOPLEV= 0
##$USERP1= <user>
##$USERP2= <user>
##$USERP3= <user>
##$USERP4= <user>
##$USERP5= <user>
##$WDW= 1
##$XDIM= 8192
##$YMAX_p= 0
##$YMIN_p= 0
$$ End of Bruker specific parameters
$$ ---------------------------------
##NTUPLES= NMR FID
##VAR_NAME=  TIME,          FID/REAL,        FID/IMAG
##SYMBOL=    X,             R,               I
##VAR_TYPE=  INDEPENDENT,   DEPENDENT,       DEPENDENT
##VAR_FORM=  AFFN,          ASDF,            ASDF
##VAR_DIM=   8192,          8192,            8192
##UNITS=     SECONDS,       ARBITRARY UNITS, ARBITRARY UNITS
##FACTOR=    0.0002944,     1,               1
##FIRST=     0,             0,               0
##LAST=      2.4114304,     0,               0
##MIN=       0,             -117465,         0
##MAX=       2.4114304,     97345,           0
$$ Real data points
##PAGE= N=1
##DATA TABLE= (X++(R..R)), XYDATA
0 0 0 0 0 0 0 0 0 0 0 0 0 0 0 0 -8 8 -8 8 -8 8 -16 16 -21 24 -29 32 -40 43 -48 56 -64 75 -87 96 -111 123
36 123 -137 155 -172 192 -214 238 -264 291 -322 355 -394 434 -477 525 -578 639 -705 777 -858
55 -858 950 -1054 1175 -1315 1481 -1683 1927 -2236 2640 -3193 3995 -5268 7591 -13183 55603
70 55603 3566 -117465 28611 88517 62439 -30141 -81973 23275 94854 59106 -17474 -85343
82 -85343 16552 94501 46358 -18788 -60715 14703 94762 32791 -34741 -41134 31590 81783
94 81783 27539 -28279 -45100 13698 83451 24548 -37095 -22664 24508 56935 6758 -38758
106 -38758 -17896 24427 57380 10247 -42722 -17103 21839 42082 6838 -39427 -9155 26803
118 26803 24419 -4164 -35150 -8869 28078 20470 -8367 -34660 -15473 25259 17498 -15125 -22344
131 -22344 -2988 16725 7224 -19083 -23573 -287 19343 8450 -20389 -24025 857 11660 -2
144 -2 -18070 -17900 4298 9966 -6579 -20226 -14503 7510 10053 -7351 -19602 -14799 6661 8602
158 8602 -11332 -14985 -7262 5442 4647 -16161 -17672 -5221 7642 6176 -15837 -17421 -2182 4280
172 4280 2841 -14325 -15736 2396 5259 -758 -14962 -15622 4997 7264 -2622 -13527 -15101 4312
186 4312 8395 -4472 -11159 -10628 5435 8644 -7388 -11963 -6651 7551 11065 -6549 -11698 -3926
200 -3926 6699 10416 -4877 -10299 1 8191 8746 -5131 -9383 4338 11140 8753 -3817 -9121
214 -9121 4855 12227 7879 -1451 -6316 6347 13037 5373 -2412 -3533 8377 15060 4802 -2712
228 -2712 -2646 7399 14789 5410 -2100 -279 7801 12636 3254 -3351 1870 9587 11876 2225 -5000
243 -5000 636 8421 10521 2658 -4233 1316 7587 6477 -307 -4394 2872 8774 5499 -2479 -6992
258 -6992 324 7646 4759 -2218 -5115 -27 5098 617 -5079 -4611 1767 5851 22 -6740 -6191 -67
274 -67 4806 250 -5971 -4811 74 2057 -2694 -7006 -3190 2440 2623 -3106 -8423 -5048 1329 2482
290 2482 -1842 -5592 -2897 1173 -90 -4736 -5944 -971 3732 1626 -5000 -6693 -2605 2555 1741
305 1741 -3347 -4316 -1206 1593 -841 -4948 -4240 1256 3731 277 -5222 -5706 -483 3052 675 -3178
321 -3178 -2882 311 1392 -2103 -4576 -2495 2426 3481 -1174 -4994 -3968 695 2384 -595 -2999
336 -2999 -1566 1086 918 -2336 -3928 -340 2996 2193 -1855 -4552 -1808 2068 2063 -330 -1655 632
352 632 1932 -19 -2140 -1955 1889 4356 2127 -1169 -2252 661 2992 1860 276 351 1889 3088
368 3088 1111 -1087 563 3291 4794 1919 -864 8 2346 3934 2427 790 1851 3157 2593 1018
384 1018 -394 1587 4096 3995 1174 -836 575 2962 2189 1189 577 1296 2654 1534 -651 -527
400 -527 1339 2849 1766 -785 -1198 -6 1643 939 -718 -422 768 200 -602 -1975 -1226 635 980
417 980 -262 -2148 -2206 -257 -337 -802 -1307 -1805 48 -514 -2267 -2202 -1381 155 248 -2080 -2256 -2185 -534
436 -534 92 -1996 -1153 -516 -797 -372 -1973 -1573 -203 141 386 -1541 -2055 -400 -254 115 -668 -1386 650
455 650 7 -1147 -504 -821 685 898 -421 -359 -1103 226 1519 -880 -64 430 -198 364 -1407 -601
473 -601 724 -148 1293 -367 -1940 212 -220 533 145 -994 1288 19 -1085 254 -1222 634
489 634 729 -386 -249 -2208 136 1362 -1663 398 -268 -295 914 -1771 79 -27 -604 2313 -656
506 -656 -1298 413 -715 1507 -307 -810 1759 -642 267 658 -1229 1356 1118 1200 951 -1613 1154
523 1154 1480 59 1612 339 1116 1167 -251 1249 -105 813 2826 413 155 -241 609 1852 -201
540 -201 1273 979 -450 1534 415 -423 969 809 1859 -20 -1114 237 -259 596 621 -233 389 -41
558 -41 -538 -114 -1066 -142 974 737 -737 -1145 -515 -329 -97 197 -621 -721 -611 -466 -1296 -1083 439 -49
578 -49 -217 -807 -1499 -517 -442 -517 71 -446 -240 -496 -778 -681 -1065 448 593 -766 -549 -809 -348 -29 -30 471
600 471 -230 349 526 -928 374 447 363 1300 -217 25 221 -214 1141 95 312 871 -275 433 3
619 3 -515 1046 355 345 354 -728 183 46 169 755 -537 333 -4 -655 -70 -327 294 548 -278 -131 -728
640 -728 -233 238 -406 190 -26 -418 -97 -1012 -517 -71 -91 466 -558 -590 -9 -630 68 -29 -191 249 -230
661 -230 -225 -405 -300 137 534 288 -23 -585 61 389 -238 397 325 195 381 -234 -127 103 539 936 347
682 347 -1 235 281 302 399 365 736 270 283 -95 -52 296 597 573 281 -244 453 -118 105 522 82 557 259
705 259 -75 -177 -168 277 371 -14 -29 -619 -237 -392 -409 -91 -183 -217 -246 -476 -436 -386 -188 90 -200 -494 -455 -564
729 -564 -333 -238 -321 -142 -421 -353 -456 -455 50 -64 170 -190 -311 -123 -177 -106 94 -61 260 246 -139 -269 246
752 246 215 431 419 39 380 43 101 463 244 513 298 244 85 14 278 701 425 296 53 43 178 215 320
775 320 337 255 262 -36 -217 -87 166 160 -30 -3 -154 77 -291 -196 -106 -44 28 -108 -394 -574 -274 -247 -279 -197 -270
800 -270 -474 -293 -455 -299 -266 48 -107 -206 -677 -640 -125 -33 -55 -15 -226 -210 -225 -40 110 144 -8 -168 22
823 22 -133 -232 79 86 323 -157 -57 41 -5 267 261 281 317 195 90 -54 260 579 568 287 85 329 96 47
847 47 357 409 225 548 -200 192 -27 136 134 358 407 -113 -293 221 -26 -110 291 -88 107 -66 -196 -212 -371
870 -371 49 -54 -118 38 -248 -115 -29 -43 128 -45 -219 -337 -647 -70 -132 -74 50 -195 -314 -304 -231 53 80
893 80 142 136 -401 -128 -161 -179 371 230 86 -11 -443 29 -94 139 404 53 73 60 -148 198 153 475 330 4
917 4 96 64 -170 335 -19 371 74 -39 -261 -158 -327 471 260 -131 110 -316 -124 -149 -247 181 64 150 -79
940 -79 -486 -180 -296 -31 110 -99 -281 1 -655 -43 181 -163 181 -392 -43 -432 -345 169 -51 314 -23
961 -23 -429 -193 -365 -481 289 -271 -123 193 -128 64 -167 -70 204 -308 92 249 -164 212 299 426 128
982 128 -105 78 -21 131 211 -18 355 16 141 399 -368 173 178 62 459 193 44 284 -12 122 239 225
1004 225 438 -5 -3 126 268 263 86 86 263 31 198 -159 -107 211 -4 -180 -50 -101 -174 -100 -37 -8 -112 -112 -369
1029 -369 -241 -272 -79 124 -176 -65 -245 -278 -78 -323 -47 4 -137 -163 -184 148 -129 233 -38 -59 189 -200
1051 -200 33 9 -220 398 146 -39 -23 171 -145 385 -74 293 69 -22 -59 26 324 342 8 291 93 28
1073 28 73 -262 145 124 190 -11 74 -180 36 111 -105 185 97 -9 -393 62 94 -115 -20 -63 -114 -86 -244 -3
1097 -3 74 174 19 67 -244 -69 -381 78 96 -64 -217 -353 -104 -165 -196 -164 -115 84 -43 -400 -168 -215 -91
1120 -91 -103 -72 -76 -47 -279 14 -29 -48 212 -6 -95 70 175 151 204 65 22 98 196 -187 119 130 58 569 124
1145 124 -75 261 60 41 -31 138 136 78 43 -192 10 75 16 -132 230 70 -5 91 14 9 218 183 141 -97 -85
1170 -85 -63 -93 225 217 -35 -88 -364 -41 189 95 93 -291 -317 -80 -209 -133 -52 -224 -226 -101 -149 -159 -41 -64 47 67
1196 67 36 199 -29 -295 -53 307 -95 -102 22 130 276 131 38 188 206 198 58 72 447 279 64 120 240
1219 240 -31 185 38 18 92 244 172 -208 70 -43 295 136 -115 80 -84 -79 83 -107 110 -23 -13 133
1241 133 -86 54 26 16 101 48 -204 -166 2 -304 117 -260 -27 91 -98 -265 -344 -85 91 -237 -84 -243
1263 -243 -182 -332 17 16 130 -375 12 -69 -175 58 49 -140 23 -151 -230 -108 97 177 70 365 45 -105 324
1286 324 -31 -2 40 153 154 23 269 5 230 -150 38 206 -12 143 -48 10 66 77 216 200 -25 -142 -91
1309 -91 -111 170 8 224 -19 116 11 -246 -109 183 97 -82 -220 9 127 -223 13 -294 -109 -149 -131 -101
1331 -101 -84 -247 -7 -190 -174 20 -332 -117 213 8 91 -26 -352 -209 -105 -214 -46 42 59 59 315 170
1353 170 137 26 -154 45 161 -79 -5 -126 102 -24 89 242 221 201 8 -78 36 129 96 -25 -52 -9 -48
1376 -48 -128 -144 15 175 -252 -149 -140 87 -4 -67 -134 48 35 -55 -128 -234 97 -5 24 -243 -69 -121 -144 30 -140
1401 -140 82 -81 -181 -144 -128 14 -48 -183 -142 -260 -302 -146 53 -319 76 -186 -164 250 40 179 162 -127
1423 -127 28 106 123 79 -42 53 -170 -51 74 94 224 -28 91 40 -90 2 1 -67 197 204 48 126 -14 -85 -18
1448 -18 -82 101 62 153 140 191 -168 -9 -4 -39 167 -271 29 -238 135 -185 -16 -126 -172 64 51 -90 106 138
1472 138 -31 131 54 24 124 -129 -249 -242 -20 0 163 -174 -229 -41 -64 -214 -24 90 5 -237 -83 -179 201
1495 201 79 -77 15 -306 31 105 221 -125 89 -27 -84 -158 127 105 27 202 36 -315 90 5 276 179 65
1518 65 120 -73 74 35 111 75 85 -15 -27 -194 6 160 104 197 -9 -35 97 -171 -14 -19 87 -104 90 47
1542 47 -314 -70 -124 63 -105 -143 -124 64 -101 169 183 -81 125 -30 -195 -105 -5 -30 -22 34 235 39 -112
1565 -112 -57 -21 -74 -1 -250 151 -13 -202 69 3 -23 263 -179 -49 71 -183 -379 -85 -53 34 137 6 -207
1588 -207 -33 123 97 219 -8 -131 8 19 276 -178 236 279 27 -47 106 178 106 -66 -54 120 101 -29 230
1611 230 -110 115 144 6 -143 112 -232 -153 111 144 237 -175 18 333 29 142 -78 196 79 -154 69
1632 69 133 -240 -334 24 29 -129 208 -291 28 76 68 -11 15 -11 -219 -233 92 -52 75 -73 -102 5 -130 146
1656 146 287 184 152 92 21 -85 278 72 161 115 164 63 -178 -101 206 -124 -38 57 64 -96 63 98 -74 21
1680 21 32 145 92 54 109 -76 168 67 60 -1 141 -75 22 -191 44 -75 -280 237 -16 49 -76 -57 113 -188
1704 -188 39 69 -87 -199 -77 204 -219 -54 -204 -222 134 -141 -197 -82 46 267 -47 16 185 273 -162 166
1726 166 176 -64 159 4 -138 -84 -88 87 -48 -134 -85 -161 -150 148 73 -16 100 36 139 -46 -99 115 186 106 -50
1751 -50 -82 55 226 58 -176 -43 242 32 115 129 -7 -133 -139 77 102 -208 -82 -87 209 158 -41 45 13 -8
1775 -8 131 127 162 45 -65 231 105 -78 -131 36 31 -46 -18 -81 -181 -104 -75 -212 -4 -69 -206 -110 -27 -136 214
1800 214 5 -79 152 162 -23 89 -58 45 -151 -231 54 -123 -26 7 -21 -166 151 -71 198 -3 -72 8 -15
1823 -15 76 131 -109 200 109 -149 10 32 23 59 365 -23 -49 -138 137 45 -14 16 -14 37 -93 -56 -118 -35 -35 -5 20
1850 20 -34 -73 -35 3 -206 74 0 0 -251 53 224 -172 -120 -11 248 47 -44 -45 45 302 -23 -17 67 162 270 -15
1876 -15 -142 -66 -101 128 -160 46 178 -3 -181 35 207 101 140 -93 -145 -126 107 48 -107 -221 92 -25
1898 -25 -124 211 139 -6 -42 36 73 -173 108 205 -198 6 129 -45 -6 190 134 16 98 294 34 194 36
1921 36 -294 -80 387 11 -173 -146 186 -26 -13 -108 126 -180 -220 -262 154 -202 174 -123 -211 -112 -179 28 11
1944 11 -199 110 -146 -124 106 -98 44 -82 64 -112 18 -76 37 -135 56 50 -209 -12 56 -117 -13 228
1966 228 13 251 -96 -318 -162 16 43 224 -39 -71 68 -60 -61 -162 -18 -37 117 9 104 -163 73 -40
1988 -40 -22 185 42 -58 62 24 -124 -56 162 -99 78 50 30 8 46 90 -291 -1 -240 -56 186 -15 -103
2011 -103 -92 -95 -92 74 54 145 -116 -95 46 -143 223 56 233 94 -73 173 95 -23 -140 39 263 -122 11
2034 11 -27 81 -251 77 228 -33 301 -44 234 -115 -17 42 -39 8 173 53 21 -8 -101 204 313 -251 -43
2057 -43 44 -166 37 93 15 127 -7 -115 3 65 -123 -23 -14 -101 -223 -28 4 -125 295 311 -167 18 -174
2080 -174 -102 -52 132 -7 -167 180 68 -79 133 106 -116 -28 39 -22 -83 35 138 102 -172 36 276 63 -11
2103 -11 36 35 262 -7 132 90 244 322 -84 -103 31 391 134 -59 -131 271 26 -27 160 72 4 -116 168 -153
2127 -153 -122 -161 45 -54 8 -183 -24 -151 -90 -6 18 -23 205 220 -17 -96 -202 -103 53 321 -340 -142 100 19
2151 19 68 41 -153 -51 -126 -167 -43 -102 6 -122 -15 -93 -170 51 -172 98 -5 -2 13 -22 -66 -52 -76 -222 -36
2176 -36 126 103 59 95 38 -31 -149 100 25 -77 138 -40 -34 36 230 -171 25 -125 -170 113 44 -212 -9 -80
2200 -80 -48 -54 -31 171 -166 -200 28 2 51 165 -17 155 -59 32 -106 27 -169 -101 172 25 92 136 174 -81
2224 -81 -153 -169 -29 -102 -10 19 -147 60 -131 166 218 101 102 51 -195 4 -129 40 -18 67 -28 -114 9 -34 -9
2249 -9 69 163 140 91 -44 -45 -9 196 -20 -88 92 -26 -109 -11 -27 125 -197 164 41 14 -87 -51 -61 124 78 136
2275 136 -23 200 108 176 -18 -179 -36 -103 -163 155 25 -43 -75 -310 -103 -109 -18 -28 32 53 -61 -17 146 -427
2299 -427 15 -218 -10 -145 89 91 83 -246 -55 -35 -213 -45 -73 -102 3 -113 -35 -81 -78 151 -88 -115 -67 211
2323 211 126 171 -319 -184 -274 -57 -67 -116 258 95 -42 355 234 -163 -532 -250 663 434 -58 419 170 -401
2345 -401 326 -112 -107 -304 -106 -183 -207 301 60 -220 6 -181 -134 -51 -78 -1 -12 -209 20 -24 72 25 -70 179
2369 179 -54 -157 -210 -16 29 107 -92 39 66 -18 -63 -62 -132 -135 72 40 58 -22 -10 -170 -31 -168 -41 55 -43 27
2395 27 -201 21 7 51 -2 184 214 -131 105 -128 204 98 -324 124 -273 60 -278 -191 -235 -322 208 -10 -200
2418 -200 162 13 181 60 -190 1 131 -143 -112 -28 186 274 12 -11 -47 13 2 23 95 -108 105 230 -94
2441 -94 -75 49 -55 92 42 48 98 83 -6 -150 252 -231 -12 -130 46 243 -9 61 212 155 0 297 88
2464 88 108 193 -58 7 88 15 -176 72 8 -226 -125 42 -242 -156 -398 -36 -91 182 17 -202 24 101 -207
2487 -207 -181 138 92 -78 43 49 -151 -18 -104 -48 43 -155 -87 -103 108 -128 36 36 311 -54 141 -35 20 -211
2511 -211 152 23 -247 174 -185 -131 139 17 8 236 13 -52 -8 261 99 -167 -158 -76 99 59 154 38 55 45
2535 45 59 245 -4 -86 -42 -48 56 235 -198 -55 -48 43 255 -55 -29 -116 -164 -291 -31 -10 58 230 -63 -101 123
2560 123 -133 -130 -31 -114 -115 109 90 -34 -44 56 -10 169 -130 163 -130 137 298 -40 63 202 -32 117 -131
2583 -131 -28 -137 -72 65 47 85 -188 112 -16 -117 174 -135 112 -238 -123 151 -7 36 167 -202 -117 -64
2605 -64 -73 -73 -251 -134 -15 4 -161 -16 15 -188 -12 -27 138 306 89 75 -73 112 39 -47 32 4 -161 145
2629 145 37 -266 -75 -201 -33 -71 -55 -49 -113 -53 -109 -122 199 148 88 -84 -188 62 180 -106 -130 -157 -14 8
2653 8 185 -174 -24 85 -83 146 89 -4 40 81 -72 165 58 -115 -36 100 20 -3 -150 35 -157 1 84
2676 84 -33 178 -106 -4 -23 -87 -167 -43 -88 -27 -121 111 -192 -169 84 112 -49 -33 -168 32 -18 -33 215 -28
2700 -28 -122 -100 -265 9 110 214 -175 207 56 -59 -161 -64 -121 -256 52 -1 35 -72 -37 -74 226 -83 -43
2723 -43 -40 -85 -146 -61 0 79 -74 35 387 -181 -111 -118 -16 -55 -168 132 112 -102 34 45 -14 -46 18 93 72 -81
2749 -81 -76 -46 -261 -21 60 -32 -191 33 -72 110 38 -129 -355 259 363 38 -39 48 162 -10 -22 34 -99 -54
2773 -54 -53 -121 57 125 -12 -75 66 -2 189 207 -95 204 116 153 26 35 -51 43 176 -236 -76 -38 -31 -120 35 -211
2799 -211 -168 291 95 71 -150 55 -126 -210 -134 -43 -111 -394 -138 -38 155 9 126 -176 73 -116 36 -4
2821 -4 -31 -205 -67 -105 -18 -1 10 265 79 -41 -103 179 96 203 71 125 -77 -25 -94 -68 -95 -9 -37 128 45 120
2847 120 41 211 292 92 43 14 -34 76 -44 2 95 100 -86 -119 28 -289 54 -26 10 66 256 55 29 72 -233
2872 -233 62 51 126 2 -100 -25 227 -163 131 138 -225 -151 -45 -103 -205 215 212 35 -32 -134 -50 42 -195 209
2896 209 109 -131 -95 -179 -144 99 -30 -28 159 -42 137 42 139 -76 29 5 -114 -99 101 -234 43 127 -128
2919 -128 -123 -85 -11 77 16 -109 -193 96 -22 25 -291 -11 47 39 146 49 27 35 31 -8 -33 -111 128 128 -90 48 45 61
2947 61 37 -169 164 -10 47 -167 -69 -120 -30 44 38 174 -165 -142 96 108 12 327 14 17 -11 -110 298 28 103 -101
2973 -101 142 43 -76 -58 109 -177 -54 175 191 11 106 169 -553 -102 -15 101 13 60 224 -85 -137 9 245
2996 245 -103 -2 105 -89 90 75 221 -171 128 45 -172 -110 3 19 253 119 34 -94 91 24 -80 51
3018 51 -34 114 -36 95 105 -229 -186 -51 -229 118 -115 -161 12 -152 27 -86 -360 -206 102 51 -177 -147
3040 -147 177 142 97 105 264 -49 -138 175 -15 -88 162 -53 194 -71 117 -326 111 95 -80 175 39 -51 217
3063 217 132 4 -62 54 105 -99 19 -168 94 76 137 26 -131 -111 87 97 -47 161 -106 -28 -54 -180 12
3086 12 178 -26 -26 -8 -49 47 2 63 -55 -144 -312 131 -7 40 33 158 261 173 -80 -117 -203 66 57 3 179 -23
3112 -23 123 29 150 97 -18 54 -52 -315 47 87 -137 77 -147 -71 -19 -90 83 -154 31 272 38 34 -86
3135 -86 -89 -226 45 131 104 210 -97 -173 -115 -178 39 -78 87 148 -90 92 -155 -163 325 -132 -29 -308 -46 -72
3159 -72 -18 254 169 27 106 72 49 -65 78 -60 -119 34 131 32 -102 223 69 54 215 15 160 -43 5 14
3183 14 82 54 -149 -86 82 -187 -62 172 37 -184 112 -57 -17 -22 2 50 164 -15 51 71 -250 -137 22 157
3207 157 26 -9 -126 235 -11 67 -144 39 208 14 -63 142 -148 8 65 73 73 35 -88 -129 -66 103 -140 -67
3231 -67 -127 45 -36 -107 -18 122 25 6 33 -96 230 -170 134 222 50 193 -113 47 -58 129 -64 3 -57 -78
3255 -78 440 85 64 100 308 -217 306 -17 8 213 -101 -131 -52 -45 -67 -59 -80 -46 -1 -119 -229 3 -26 17 -33 138
3281 138 66 -168 -91 -37 -78 217 117 109 -100 125 190 -101 71 -94 -83 43 -12 77 28 -150 -112 72 178 45
3305 45 -1 -70 -57 18 387 -302 -17 149 35 -31 -67 82 107 -11 -173 -87 -78 66 25 7 -22 163 128 -76 148
3330 148 81 66 -26 63 -272 108 -48 22 -107 -193 -95 -149 102 -273 -65 -261 125 124 64 8 -136 -50 -30 340 -124
3355 -124 -18 25 -334 59 -112 -62 -58 68 19 -28 25 -78 -48 -155 -50 78 145 -147 77 -122 198 0 90
3378 90 12 77 9 216 147 38 -313 -190 247 1 90 -102 -68 -130 200 93 41 -61 145 -268 60 90 -78
3401 -78 14 -158 -111 -18 22 -357 69 -7 -174 -96 -94 -125 219 -23 -272 436 181 44 -40 -71 -12 -40 -192 -90 205
3426 205 -100 -215 -222 -177 -89 410 120 -91 -25 78 -24 -76 133 -57 33 -251 80 139 37 148 26 -111 59
3449 59 -119 -78 37 -147 -83 186 -94 -197 -57 -109 -252 -126 23 -258 -98 52 177 -30 -147 9 217
3470 217 -269 -49 -72 23 322 -198 -28 -2 14 221 215 131 -53 -179 78 11 -179 135 71 57 63 28 12 -87 73
3495 73 35 16 -58 -9 72 -89 44 -152 -71 -117 -42 -129 52 128 69 58 -10 84 178 -65 121 250 -12 -80 109 21
3521 21 -69 -65 220 10 27 178 4 -104 -99 -44 22 260 -123 -11 -52 78 -121 134 -263 43 -123 103 -18
3544 -18 62 -114 10 -6 -22 127 -62 -124 -191 132 134 144 -86 159 -15 -159 -227 189 216 -188 60 -115 -1 -101
3568 -101 164 -86 -38 157 220 -84 258 154 -55 -341 -24 253 -61 3 30 -124 -32 -146 -100 310 -25 -63
3590 -63 45 76 -92 233 -164 161 -124 -11 37 -85 -136 -121 141 -113 -13 -174 -23 -80 -60 -92 -13 206 -77
3613 -77 148 -26 88 -89 -146 -86 -57 -5 120 -74 -56 308 -92 -45 -9 36 132 78 169 11 -37 40 -191 149 74
3638 74 -173 -307 -18 67 117 -67 101 45 76 -42 -68 63 -110 -216 81 -60 204 167 -91 96 -110 78
3660 78 -142 -91 101 -3 -49 66 136 35 143 57 -137 2 138 -95 -38 24 -295 -118 -76 77 126 20 140
3683 140 34 -316 -36 -168 -232 38 340 -2 229 -240 141 273 -107 -166 17 166 -181 -344 -40 -17 -286
3704 -286 -35 -38 114 214 -118 -27 73 -15 140 91 -93 93 48 65 -209 64 15 -60 -56 198 -81 -75 73 42 222
3729 222 -84 45 32 152 298 -9 142 -3 -34 -63 60 236 43 118 -82 -45 -38 120 -32 -90 -109 72 80 -137
3753 -137 74 -56 160 -17 -182 -32 133 61 6 -23 6 -77 4 21 251 -77 67 93 50 -304 -30 137 -194
3776 -194 34 26 -18 -50 187 -120 -107 -323 -329 -286 -14 -2 83 23 115 -1 -232 13 -101 242 47 -178 -62 -25
3800 -25 -115 59 214 109 -55 29 4 169 233 49 30 -4 135 -43 11 21 -305 184 119 -52 28 -97 -33 33
3824 33 2 -260 -20 13 -260 9 38 -48 71 46 -129 168 -65 -17 -95 -96 -48 16 -43 175 -4 64 44 -65 206
3849 206 -282 -139 -131 -198 -87 -95 34 1 -150 48 66 -103 -71 109 306 -13 305 77 94 14 38 20 -148 218
3873 218 -36 126 3 247 302 -117 1 6 -45 162 -160 48 -37 119 -78 123 29 -194 -9 -138 -31 -209
3895 -209 -278 -77 179 -98 -142 -39 -235 51 74 105 66 88 86 -164 -285 323 -62 96 80 -89 -85 56 112 -173
3919 -173 159 31 -52 147 -92 24 -15 252 150 -17 12 37 -4 -205 -174 101 -149 -91 -165 34 168 62 12
3942 12 46 58 -33 -78 75 -86 259 245 -84 72 -40 49 105 14 -95 203 2 -47 38 -5 -297 -109 -259 124
3966 124 215 160 199 106 -128 31 49 109 39 -122 200 15 7 129 163 -45 51 -4 -189 100 -79 -36 -7 -147 82
3991 82 -92 57 -85 -58 29 76 -195 -68 61 -87 -66 76 -58 -81 -178 -87 44 21 -86 150 188 -44 -18 -77
4015 -77 -177 -53 40 -112 -208 162 110 -24 -53 205 -114 -25 -15 27 -102 30 57 -50 133 271 14 -151 187
4038 187 19 19 -79 -37 176 320 -154 162 -222 286 130 51 13 124 25 -35 -258 -4 -26 -126 28 167 87
4061 87 6 96 -239 -142 171 172 -58 117 52 94 29 50 70 157 77 57 -168 64 159 170 67 6 -50 62 163 -67
4087 -67 -101 41 -163 -204 169 -123 -133 -75 85 112 -48 -61 -59 95 -33 -255 183 85 203 80 -17 217 52 -4
4111 -4 -12 1 181 -160 -55 197 46 -36 153 -114 -104 88 -66 101 -149 -15 -89 125 23 176 -218 21 -18
4134 -18 109 133 -94 -217 -60 -52 -76 -104 -41 179 108 -16 -40 -92 -107 108 123 116 -77 49 -147 -145 147 75 -172 -118
4160 -118 54 2 -162 151 -182 13 159 -157 -117 -107 48 -211 -297 -85 -142 -27 6 -164 -85 107 -57 62
4182 62 -150 74 239 433 -87 -80 -18 123 42 -137 -17 -60 -121 -50 116 -76 61 -119 -98 55 -40 70 -331
4205 -331 23 45 206 -161 388 -160 -139 105 26 -102 -22 48 197 233 -73 118 33 343 -149 -118 79 -107 1
4228 1 78 -135 10 -89 -29 -57 -151 193 295 59 16 -14 11 1 11 -150 71 166 -82 68 45 -16 -77 0 -168 167
4254 167 -43 -6 170 -21 -146 66 61 125 -2 -47 10 -12 49 -43 101 -61 113 200 28 75 40 26 88 -34 -125
4279 -125 46 340 -81 256 40 -46 -73 25 -80 103 185 12 -144 3 -101 311 -267 -20 89 146 120 148
4301 148 -152 -184 43 -99 46 -259 118 -45 75 -12 -30 -22 115 31 257 -26 -224 -215 -30 -104 21 18 -189 -18
4325 -18 -49 -231 -198 134 112 104 94 -30 13 -41 127 -79 -118 54 -120 157 -61 81 199 -182 26 51 179 -121
4349 -121 -77 130 -15 -18 -44 -134 -151 -60 -211 -1 -84 15 -153 -42 288 110 -75 -38 49 -116 -113 267 -47 116
4373 116 -104 -127 -23 211 88 -226 -105 -65 -196 -77 -26 -18 -307 163 -93 -211 65 -131 131 -264 156 150
4395 150 17 -26 232 -66 -13 102 6 96 -31 -23 -80 -54 125 -222 6 73 14 53 55 15 86 -132 22 189 -89
4420 -89 158 -188 120 94 89 255 255 -7 -108 -135 29 233 -173 -99 -191 157 -122 31 -67 -311 98 140 -109 -75
4444 -75 165 -2 -84 -16 -222 49 21 -40 -70 404 -160 71 7 -59 -48 153 -60 163 70 205 238 -225 54 -4
4468 -4 -104 -62 24 201 138 66 -2 -184 154 -219 -232 1 -44 86 47 -186 19 1 41 245 59 21 193 -72
4492 -72 58 134 20 8 -168 -144 79 -298 -188 -89 -460 -45 18 -338 26 -14 109 -313 15 79 -39 58 141
4515 141 -25 -21 13 -44 125 285 35 -41 -120 -19 -127 -169 91 52 -118 141 80 96 131 27 154 92 217 -117
4539 -117 -146 28 -42 -51 -42 231 -14 161 -19 -145 44 -98 50 -49 -77 -156 112 56 -104 -53 92 129 35 -85
4563 -85 87 97 -44 45 -171 62 253 -146 -131 128 94 -42 -5 -2 -6 64 -145 -95 113 98 -76 -5 -92 195 -36
4588 -36 -50 39 123 162 55 29 -19 -39 253 1 -98 -150 -219 34 -121 254 130 -82 279 -25 139 58 39 -127
4612 -127 -59 -21 -18 16 6 -130 113 -16 102 37 -240 -178 46 119 -94 223 -15 -29 -13 66 111 -222 175 35
4636 35 271 12 176 313 -124 254 72 221 -252 -259 104 43 100 34 251 242 70 958 -318 266 214 104 -27
4659 -27 -559 -129 444 -63 120 -24 -579 152 -245 98 36 -15 -7 128 -123 -398 -658 321 -83 -383 -588 -114
4681 -114 -161 -7 246 147 -89 -60 96 91 62 -44 134 -86 -62 44 17 215 71 23 -146 137 -176 -96 10
4704 10 43 106 45 100 -28 -16 90 13 204 -64 52 -184 105 -35 -55 -32 259 -56 75 248 -190 -148 -168 -45
4728 -45 -290 171 5 37 31 293 -43 -403 229 -217 -101 218 -249 -162 144 152 -291 -14 62 187 -126 42 85
4751 85 -221 -298 -283 -103 1 -115 -81 -66 155 52 -132 46 319 -95 63 -99 -94 53 -28 117 109 -151 -251
4774 -251 -19 -32 41 80 174 -167 -162 -16 1 -98 -91 -67 74 152 -87 -200 74 55 166 127 196 -184 77 27 338
4799 338 57 -138 60 101 103 -35 -82 -27 -138 -90 -67 62 171 98 3 -35 -33 -330 -127 -247 315 -213 -8 61
4823 61 -164 56 14 28 108 69 69 -203 -74 -84 76 90 -17 -163 18 184 18 167 78 147 -43 -168 -35 -134
4847 -134 -141 -104 -33 50 114 151 -42 42 -125 128 36 1 127 -269 -85 161 -93 -218 -22 69 59 -32 162 -54
4871 -54 -57 -51 -68 94 -48 8 44 91 35 -129 -33 11 88 -161 -123 233 -213 -166 40 188 35 133 -44 -104 -196 -47
4897 -47 -58 90 79 0 206 199 168 285 -108 -159 -217 -129 -297 -51 -22 -43 58 -156 130 0 -50 74 108 -150 -111
4922 -111 217 -134 155 220 42 -84 -10 -13 144 -45 -5 99 -215 -65 -228 135 -42 22 168 -61 223 128
4944 128 -19 37 0 87 -171 60 183 45 -12 -273 -25 32 -90 -26 65 -127 31 -52 -7 50 -123 254 -287
4967 -287 56 -31 -173 145 -4 -92 -13 164 84 73 79 82 19 -44 -42 -130 239 0 -8 226 51 21 -17 115 -18 244
4993 244 12 -59 1 152 -199 -5 78 -42 -243 -315 -42 -103 -116 101 -87 -88 90 68 -120 111 70 -158 -116 -112
5017 -112 204 -240 35 -80 52 -89 249 -49 -37 103 -19 -214 -10 -122 -252 184 -66 31 35 -111 15
5038 15 -39 -52 -69 104 43 183 -103 11 145 -69 133 -11 -58 -8 -171 -31 81 11 -38 251 -126 -127 -75 148
5062 148 -11 11 78 -11 -156 123 -3 -64 -74 34 231 -64 13 289 -23 -35 146 -2 -260 73 -182 124
5084 124 174 -162 -135 23 -1 -12 69 86 -205 34 215 -174 -170 338 17 182 105 21 -20 13 105 -78 53 -125
5108 -125 117 74 137 -107 81 -135 137 -190 116 212 -52 147 -58 170 -149 83 129 160 -16 118 155 -191
5130 -191 -25 -86 176 61 -94 82 -22 162 19 -104 75 -24 243 76 -211 74 -72 125 -1 59 183
5151 183 -78 -142 228 -47 -152 144 137 33 -40 -12 -16 56 198 36 -203 -1 31 124 -31 142 -16 -146 -198 32
5175 32 -54 127 273 123 -171 86 -111 -20 -221 -67 -97 68 -108 -197 -151 142 88 55 66 -16 200 126 -91 -3
5199 -3 -24 182 147 -190 -70 74 119 -204 5 -89 2 135 -83 -10 52 48 147 144 -126 14 53 -33 -61 -6 64 -140
5225 -140 -200 -143 22 -75 -126 -3 41 85 6 -57 255 -53 39 245 -89 252 -48 -14 -67 173 192 186 137 -230 45
5250 45 -267 -359 33 -41 180 106 357 -80 -183 -130 -17 -125 -128 82 -20 -187 238 265 27 177 171 9 -238
5273 -238 -70 135 167 -4 116 134 159 161 -128 35 -15 -148 -67 -69 65 182 -180 71 -72 -181 -108 -110 233 140
5297 140 -137 82 92 10 205 -193 309 -106 -13 62 6 135 -46 221 153 3 -64 -170 14 -4 -142 -48 48
5320 48 143 -102 52 -109 -26 -77 -40 144 164 317 85 -127 -18 58 159 -54 156 115 4 72 -263 212 71
5343 71 -116 -176 -80 145 -66 -65 56 40 66 -27 137 -164 -100 42 132 -38 243 -126 -170 -148 21 84 12 -56 18
5368 18 -78 53 -24 163 46 240 15 53 -22 -149 -67 -389 223 -398 -335 -283 -200 -214 -93 10 38 122 274 60
5392 60 80 -218 -33 9 53 -98 183 25 238 111 -52 195 5 -126 -110 127 -169 -37 124 279 -3 -212
5414 -212 -151 149 -3 -75 -131 -84 -191 -21 34 -24 -15 -17 195 112 35 -8 -277 203 -67 20 -160 38 236 -3 54
5439 54 -111 154 -207 -239 -42 -130 72 196 -26 -96 42 20 -39 -143 -23 85 -106 -63 44 -407 -234 -273 -10
5462 -10 118 -252 -41 148 -154 7 4 183 9 120 -58 144 98 197 -88 -77 28 -30 95 68 -211 -160 149
5485 149 4 -264 -49 15 86 129 88 26 -18 15 -64 230 24 -394 56 125 194 -55 127 -62 -37 26 260 177
5509 177 -314 79 166 415 33 111 33 -81 -7 91 81 -62 64 89 -7 71 -15 -174 -135 229 63 47 47 -124 40
5534 40 112 46 -59 -55 100 -75 68 82 -51 39 25 -42 -300 211 -72 -75 265 -219 -176 36 -208 149 -149 52
5558 52 -59 -92 148 -13 79 179 189 -223 95 77 279 113 81 67 -120 -44 75 14 47 120 -144 29 -5 264
5582 264 68 -149 5 -72 -51 -173 12 -180 1 83 136 -52 -94 53 132 -77 404 -33 6 75 125 80 -1 -79
5606 -79 -74 42 -268 -20 -88 -75 89 171 192 -37 -83 -211 -153 3 16 -15 26 -132 223 -12 258 198 102 -100 66
5631 66 16 -185 11 -20 10 318 8 -236 -181 -91 185 -66 253 27 -203 109 60 18 -35 72 207 72 -160
5654 -160 -206 -19 -189 -78 -104 -22 56 -95 -97 14 -63 15 2 -88 120 -153 -325 -62 150 92 96 230 62 136 30
5679 30 30 -156 195 -163 114 -207 -48 250 -39 -29 -150 147 62 -12 -205 72 -331 -91 -23 -21 75 -32 -110 -64
5703 -64 78 27 62 -18 -212 -30 -45 75 369 40 -124 71 101 -32 -3 160 163 78 90 99 -95 72 17 -254 -261
5728 -261 45 -63 -87 -54 -137 -1 -443 -72 -116 242 26 61 -6 -170 120 159 -91 77 49 -46 -123 -58 -52 147
5752 147 -53 21 107 107 7 141 76 34 -171 231 120 158 287 115 135 -17 59 -29 8 -63 -81 126 47 -57 195
5777 195 -170 -41 -66 205 222 -68 -191 -15 -101 158 -3 241 180 -31 -74 -146 150 -18 128 144 -38 -32 47
5800 47 -42 33 15 261 127 -154 226 -206 261 19 160 -54 153 -28 112 -155 -112 26 133 112 13 300
5822 300 -7 63 -130 -62 27 -150 -144 7 -158 -135 22 37 132 150 -207 -160 -17 -40 -172 -130 -9 40 171 75 -282
5847 -282 56 -11 -146 96 51 27 114 -57 401 -187 238 93 -31 33 24 -7 -187 348 123 273 216 -104 291
5870 291 2 10 -134 37 30 -318 158 66 7 85 -75 196 149 15 -3 -141 -117 17 24 137 -248 86 -188 -85
5894 -85 -1 0 -165 -59 12 188 -50 -87 223 -95 -50 173 -56 -79 -323 -29 118 -20 -33 -3 42 -317 247 64
5918 64 12 -175 142 93 -65 217 78 -35 -237 53 19 -145 12 -65 -93 -69 -63 37 46 -269 -75 -37 51 72 -69
5943 -69 -21 113 -29 2 -136 158 42 184 -257 -75 95 -214 84 115 172 -48 3 -115 84 226 -89 102
5965 102 -110 125 178 -162 58 -75 172 71 23 -97 36 3 16 38 61 -190 -39 98 155 65 170 263 -148
5988 -148 170 2 -57 108 -122 -134 -47 116 16 228 -53 -67 -49 126 -144 -87 -60 -82 -14 -241 139 -97 -64
6011 -64 191 112 68 -43 -114 137 31 149 -30 -63 -205 -110 -130 -83 -36 90 -79 92 128 176 47 -55 124 110
6035 110 36 -61 137 166 0 91 219 110 48 148 -50 -94 -140 120 -251 -7 -117 7 258 -10 -84 125 -177
6058 -177 27 -90 -2 -126 -108 -55 192 -270 165 -170 -223 265 -229 -53 -255 95 25 -129 -158 53 139 -35
6080 -35 -143 -5 13 58 -82 -60 -12 105 -96 -61 9 2 62 -8 -320 -124 -178 42 -146 19 58 -264 -82 -75 -171
6105 -171 -110 -3 -314 -42 60 79 -183 -130 15 -64 -6 298 98 51 -131 24 28 -47 117 49 20 118 -48 -38
6129 -38 233 58 181 -148 93 56 -118 29 131 -140 -171 27 -233 -6 -36 164 34 -73 181 -51 -242
6150 -242 -82 194 139 -41 14 -83 -13 199 138 130 169 -196 -45 -32 -37 29 -34 77 -140 -84 97 52 -135 -64 -116 88
6176 88 239 101 180 46 12 56 -30 75 -71 4 -118 -122 1 -252 -2 135 140 115 -191 201 -77 72 6 -24
6200 -24 24 -170 79 307 -4 -320 -141 -64 -248 -66 -57 -208 112 -53 373 39 0 -117 84 266 9 -118
6222 -118 -106 -140 -42 118 40 -65 58 57 -96 87 233 -133 -159 131 206 -27 120 21 81 56 -197 -65 -92 30
6246 30 80 -79 52 96 -181 -1 93 -29 52 -262 -75 -84 -88 -44 -167 6 -243 127 49 134 -141 249 68 -67
6270 -67 -83 49 11 -84 -136 -73 235 -187 -285 -128 199 17 25 29 -44 -255 109 242 -370 -105 -201 -31 -21 23 -137
6295 -137 17 159 -57 145 83 -215 -141 -58 237 65 105 10 -231 -16 34 -29 41 209 22 -37 -42 279 137 154
6319 154 -24 -148 174 100 166 72 -60 170 220 -8 -52 12 49 28 -170 17 43 225 91 -20 77 -65 -95 180
6343 180 43 -78 222 -162 -139 -19 53 46 -208 -118 115 67 16 121 -149 -152 152 -188 23 9 363 112 173 206
6367 206 94 -130 -156 -49 164 226 -60 -48 174 -23 12 -175 18 -50 147 247 17 95 -86 4 -148 -43
6389 -43 -149 73 169 227 -78 77 50 -42 -185 -40 265 -63 36 -47 79 178 -97 55 107 113 59 4 156 143 157
6414 157 -7 -33 -43 -64 -292 -60 -191 -153 104 -87 89 -25 -87 22 156 -76 93 -133 57 205 297 -51
6436 -51 115 -2 -88 -48 26 -117 -44 -55 34 -60 -197 192 -118 352 -124 130 75 -162 -54 -76 -301 -200 -111 -30
6460 -30 -68 -6 -97 -268 -49 -79 89 -118 -110 208 118 -39 47 4 68 -66 90 -64 -179 -46 55 226 -216 50
6484 50 -55 27 -102 -150 -69 -155 -108 -48 -190 155 106 -73 116 -168 97 -151 -17 121 -83 -328 -107 -465 336
6507 336 -136 85 33 -52 145 72 128 -17 138 -162 -130 -106 82 -77 91 67 21 119 -59 -62 147 -148 187 -254
6531 -254 87 122 41 121 -104 -251 -56 172 174 80 100 -104 14 150 -206 290 -89 -179 61 36 -224 -91 -47
6554 -47 57 -135 -19 128 -18 -114 -82 262 130 139 -113 -230 143 -304 54 242 116 33 150 111 -70 -172
6576 -172 235 209 72 -63 160 60 -130 122 101 41 323 123 -103 -26 -112 -71 -191 -16 29 63 206 -122 9
6599 9 96 43 182 -205 27 178 -64 116 -117 -87 118 63 19 -249 115 3 -66 60 73 141 -29 213 124 70
6623 70 53 -185 38 206 -311 155 -26 -67 75 -47 5 22 9 -47 -153 -178 -81 -93 -10 -270 126 -153 -76 149
6647 149 74 39 -209 145 -10 -45 12 -23 -140 108 175 -414 -287 -104 166 79 155 45 -211 -41 -23 -109 0
6670 0 26 157 -92 59 -259 78 -110 -32 16 -157 -133 86 -73 -76 143 -77 -24 44 -29 49 -87 50 119 -58
6694 -58 123 267 159 -62 61 95 -42 12 35 -12 -36 -146 30 -55 -1 -127 152 -240 -198 288 71 239 50
6717 50 -38 129 -87 227 -282 -6 -103 -49 124 202 147 -103 -151 -220 60 329 216 -120 120 -154 -235 -214 90
6740 90 16 21 123 101 159 189 67 4 14 -318 188 -44 10 116 -72 -106 130 -21 -163 -95 18 -133 185 -23
6764 -23 -248 97 24 153 -55 -111 109 -50 14 132 -27 -45 -84 -227 -28 225 46 226 -11 -153 116 -90
6786 -90 -206 -13 -55 42 -69 1 152 -84 210 -88 -195 8 36 58 9 -27 104 39 -147 -46 -159 -24 -77
6809 -77 99 72 9 -150 204 -106 -93 -253 0 -288 75 157 126 -106 183 -79 192 103 -391 -78 -353 -91
6831 -91 24 81 249 212 -171 69 162 28 10 25 -161 -131 -40 -191 225 107 -83 -148 34 71 -67 138 80 -25
6855 -25 -204 8 -10 -38 -12 61 -31 -45 -90 52 98 -320 74 -61 -89 109 -132 34 55 -114 46 32 149 35
6879 35 90 -68 146 42 -2 -94 -308 24 20 -95 7 -73 -53 73 -87 49 12 -82 99 -16 -51 -10 22 5 -264
6904 -264 142 -77 -50 -95 93 60 37 528 -78 91 98 54 158 -47 109 71 -276 -175 -296 -20 640 104 -50
6927 -50 -24 24 174 -206 -18 218 -5 17 -172 286 44 -124 -46 -72 173 116 138 -456 -172 211 62 137 -1
6950 -1 -41 48 -42 60 36 16 -11 4 -35 80 -119 -316 138 41 -39 55 -78 -66 266 -34 252 65 22 232 -73
6975 -73 106 27 -47 106 56 -13 -98 28 -40 -104 -76 90 99 -176 -6 27 -47 -148 278 -56 179 56 103 -174 41
7000 41 144 -177 123 45 -369 -42 -150 178 110 -136 56 -238 77 183 -111 172 -130 -181 243 -121 -91 -130
7022 -130 116 40 43 -35 143 -3 13 -193 -107 -144 243 70 55 -61 -97 -71 -1 -136 -5 -6 275 -82 50 57 -119
7047 -119 -113 33 254 47 -28 -27 322 -61 30 299 154 -204 42 140 -204 24 209 18 79 -26 174 101 45
7070 45 -203 5 236 223 142 61 -57 18 47 -156 -96 100 29 -93 198 -36 136 90 40 -62 -107 117 196 63
7094 63 147 -167 149 -132 80 -128 71 -60 -50 -160 29 168 66 -34 -91 -175 38 194 168 -46 84 -131
7116 -131 -151 17 27 55 -7 -121 -155 -60 -19 -125 12 -198 89 -101 176 127 57 27 116 -192 -125 -3 44 264
7140 264 35 -124 -114 -181 -137 -68 -114 51 222 265 -186 -79 -37 -55 -36 146 -57 -70 -182 -35 27 -111 177 41
7164 41 -59 -197 -106 -41 82 83 22 32 6 66 -63 -60 17 -308 197 6 -403 -23 176 -164 -227 31 211 -80
7188 -80 -35 -152 -40 -39 64 -23 119 -144 325 -34 -254 1 99 266 -8 15 92 24 -70 58 203 -67 -20 -104
7212 -104 -59 4 171 73 -430 126 55 33 40 -117 -90 -125 -79 -225 -121 -113 5 9 57 -38 -139 -35 -176 68 94 153
7238 153 219 78 19 134 -59 -92 -67 -136 96 25 58 -195 -99 204 96 23 118 -74 17 -183 51 139 81 18 116
7263 116 4 -45 3 -51 16 -38 30 -180 -151 206 297 77 24 27 -100 -170 117 88 12 -14 -232 99 -171 92 139
7288 139 220 -125 177 -94 -196 53 69 -104 -220 144 -229 -123 160 -115 -213 119 188 -29 102 126 -42 -120
7310 -120 -21 135 -25 -132 53 -121 98 146 -169 10 153 3 186 -61 45 135 -33 89 -98 117 79
7331 79 -86 26 -66 -265 141 -70 -23 67 137 58 -98 -51 160 90 35 100 31 182 76 108 269 -189 -19 -169
7355 -169 -184 127 169 32 -56 -46 200 117 174 -41 -277 -57 -36 -43 -87 204 -85 -152 27 77 130 126 -100 -28 -107 -160
7381 -160 18 -115 -207 133 -173 128 122 118 173 189 69 -14 118 16 -221 35 168 44 -373 -80 -8 167 135
7404 135 95 -13 13 -174 271 178 -6 196 -37 -25 -71 -174 -62 93 -10 107 150 -11 101 238 31 -181
7426 -181 -86 -2 -147 -168 27 -167 58 115 -5 54 -153 128 -195 -236 19 -20 -201 24 -59 -101 43 150 27
7449 27 -17 -58 -34 179 -86 311 -133 -77 235 -144 126 -23 10 78 -73 64 -35 -22 120 -177 -75 -78 -35 98
7473 98 124 -40 90 -23 150 300 -147 149 135 -92 64 139 4 24 57 110 -190 -16 16 89 128 104 -99 -169
7497 -169 30 -246 -56 -88 -8 22 -57 -237 -54 -71 82 178 -104 26 -37 -129 18 -191 -185 110 -213 -79 140
7520 140 72 72 156 126 -150 37 86 -6 72 -128 -61 4 -134 -29 254 185 -2 89 -43 69 -57 -152 -96 -46 -79
7545 -79 105 -336 53 45 -37 -271 68 -163 124 164 295 131 112 -28 -184 268 -68 -82 17 316 -4 86 -127
7568 -127 26 -88 39 -181 -54 -339 154 -22 -133 29 -96 37 -68 161 -33 -170 42 -116 -180 79
7588 79 32 -72 -193 -218 91 -58 -204 -1 -79 -122 -107 -57 -75 -249 45 -300 161 -121 108 -138 -236 92 -45
7611 -45 327 97 47 -56 -177 -8 105 -156 -28 156 -21 -4 -52 148 227 44 15 -61 -10 -16 -93 -101 89 -169
7635 -169 -131 28 189 44 117 32 29 -104 -53 -134 -122 -43 11 67 77 -144 33 394 -67 -233 25 -67 -144 -20 198
7660 198 98 -192 41 166 94 -155 169 -104 -51 75 45 152 -41 -184 173 26 27 23 -63 -17 10 -65 138 94
7684 94 50 -133 -60 118 61 265 75 -36 -60 13 -109 39 -70 -70 -42 -314 -149 -196 98 -83 -226 -34 9 142
7708 142 113 -15 -17 52 -214 -45 -102 -132 67 42 -34 -142 -19 -41 173 323 -229 -254 13 224 90 34 63 153
7732 153 169 67 -18 -160 -304 -85 31 14 -37 -4 11 47 218 90 89 234 121 34 28 40 53 -46 159 -14 141
7757 141 -145 318 243 31 -70 -62 160 -66 -78 -7 5 -49 15 191 -139 -116 -206 -113 97 31 -9 -127 232 217 -135
7782 -135 284 71 -13 -104 35 -178 72 73 -228 134 -31 -20 20 186 40 271 -22 -212 86 -204 -152 -1
7804 -1 -58 52 -5 146 16 22 63 135 44 -80 -29 -186 50 -112 247 -37 28 284 -96 -59 -24 -85 -14 131 82
7829 82 52 16 25 138 -184 -51 -69 -110 -102 50 109 -97 -270 33 15 108 67 16 106 -171 -148 77 4 -123 -173 -48
7855 -48 84 -37 -71 161 -199 8 77 -212 -63 -41 39 -179 -114 -53 -250 -227 -61 28 167 -65 -136 223 67
7878 67 143 -36 249 121 -185 -173 20 -146 32 33 217 83 -44 -196 128 251 -146 -128 136 106 -204 -46
7900 -46 -76 151 -61 18 162 -7 130 -35 -50 185 -9 190 -77 106 170 196 150 -161 -46 46 -32 -24 -58 -121
7924 -121 124 0 235 -22 -135 263 -113 55 98 15 72 61 122 -94 -5 84 9 -9 88 -17 39 -111 205 86
7948 86 -176 -190 132 -204 0 117 78 97 -260 275 47 115 23 149 10 56 -70 -247 122 -154 62 47 -153
7971 -153 -304 -58 -21 -123 142 -97 -250 -39 12 25 76 -152 33 278 87 52 -36 -78 117 -41 -22 288 28
7994 28 -35 182 10 28 58 -31 -176 132 -65 57 0 48 111 229 -35 -97 133 -208 76 20 -63 -51 195 34
8018 34 -121 -23 -12 -89 -8 41 25 -113 39 -72 -108 -172 318 74 -82 -328 -129 152 248 -76 233 -232 -10
8041 -10 233 216 188 -37 135 94 -126 218 -16 56 -254 13 -152 -39 -157 169 177 -21 -25 -212 -74 202 -19
8064 -19 17 42 160 -34 38 10 -129 227 -32 8 -137 -186 159 86 -46 63 79 -164 -13 -47 -83 256 -32 135
8088 135 182 38 -42 92 -7 -120 100 -37 10 -6 81 -56 -284 116 56 -326 -137 35 133 45 104 83 35 51
8112 51 -56 46 214 241 106 -68 251 168 77 151 3 -126 16 -159 -85 59 -12 -23 -65 128 53 -20 42 -23
8136 -23 92 -99 111 -222 -93 124 -97 -277 19 -33 27 43 -193 37 18 -120 1 14 329 132 -253 58
8158 58 -171 48 98 30 153 59 -45 -77 96 -106 66 0 -81 -196 13 68 -155 68 28 -110 137 -96 122
8181 122 -226 -70 -115 56 191 -1 27 -64 -119 -24
8191b4
$$ Imaginary data points
##PAGE= N=2
##DATA TABLE= (X++(I..I)), XYDATA
0 0 0 0 0 0 0 0 0 0 0 0 0 0 0 0 -8 8 -8 8 -8 16 -16 16 -24 24 -32 32 -40 48 -56 64 -72 80 -94 104 -119 135
36 135 -151 168 -188 211 -234 260 -290 322 -355 392 -432 476 -525 579 -637 702 -774 853 -942
55 -942 1043 -1157 1287 -1441 1618 -1833 2094 -2423 2848 -3422 4253 -5567 7974 -13922 65038
70 65038 73542 -15801 -68610 -56207 97345 81013 -10140 -77633 -36455 88004 64535 -38174
82 -38174 -62826 -28127 81785 63895 -46969 -65638 -18278 60337 61317 -37529 -68545 -19413
94 -19413 57032 37680 -55967 -51256 2605 39290 31586 -49240 -64514 -4098 40455 26297 -44949
107 -44949 -49876 7314 25387 7475 -42677 -44522 13548 24908 -664 -38263 -44557 8825 26317
120 26317 -6465 -34048 -31819 8469 18765 -16281 -29835 -14790 10239 18262 -12440 -35295
132 -35295 -16281 12935 13343 -11778 -25496 -7101 11589 3639 -15309 -22711 -3441 17075 4268
145 4268 -16602 -19081 -1610 15641 3951 -14756 -13278 2444 13380 -2099 -15894 -6714 6526
158 6526 14603 -927 -19351 -7340 8184 12020 -164 -14314 -986 10822 8037 -2296 -14423
171 -14423 1076 16365 7548 -3301 -11741 639 16993 7007 -3743 -7492 2607 17475 5113
184 5113 -6223 -3262 6145 18620 6781 -8463 -2892 7425 17189 7790 -7130 382 9850 14177
198 14177 6024 -7716 956 13445 13616 4989 -7418 223 14262 12657 4316 -5590 213 14050
212 14050 9985 1105 -4588 1636 14895 9390 -2628 -5470 573 13037 9273 -3465 -4972 721
226 721 9838 6232 -6051 -4816 3132 8690 3627 -8454 -7057 2513 7035 3071 -8012 -7621 1535
241 1535 4217 -705 -8630 -6575 3176 3243 -3872 -10291 -8022 2603 3945 -3405 -9710 -7644 931
256 931 1260 -6026 -8535 -4785 2441 787 -7817 -10296 -4718 2493 2473 -5729 -8244 -3967 842 -251
272 -251 -6604 -6367 -79 3280 -354 -7200 -7640 37 4263 1157 -4854 -6013 -34 2656 -846 -4296
288 -4296 -2979 3165 4465 -1635 -6282 -4027 2825 5424 713 -3645 -2564 1913 2837 -1250 -3114
303 -3114 483 4631 3451 -2062 -4906 -1195 4478 4475 -52 -3038 -304 2791 1585 -1655 -1436 2432
319 2432 5091 1851 -3165 -3633 808 4784 3118 -867 -1238 1384 2851 604 -1690 -274 3756 4749
335 4749 958 -2999 -1730 2886 4758 2321 -714 -116 2815 2598 416 -827 1568 5065 4232 248
351 248 -2356 -58 4208 4441 1538 161 1128 3341 2276 -334 -287 2070 4659 3203 -862 -1524 913
368 913 2863 2990 238 -592 1033 1901 874 -1407 -795 2295 2592 605 -1975 -2609 398 1828 193
385 193 -1209 -1279 122 12 -1924 -2430 -1346 874 944 -2083 -3550 -2095 -498 31 -1325 -2691 -1842
402 -1842 -881 -1149 -2794 -3359 -985 -284 -736 -2492 -4030 -1764 -92 -751 -1722 -2241 -1317 -423 -1591 -2228
420 -2228 -1968 -420 1003 -1156 -2032 -1712 -1356 866 -108 -1266 -543 -345 357 -378 -1379 805 918 869
438 869 615 -1842 -275 1199 675 695 -239 464 1088 -60 -41 -59 506 2124 315 -278 109 -153 1831
457 1831 1032 -298 312 661 1334 157 -995 1140 889 839 944 -1569 -378 804 910 1233 -1048 221
475 221 1448 -427 162 -296 22 1906 -81 185 -620 -1151 1981 759 -408 264 -414 1187 -89
492 -89 -868 1618 -131 1140 1468 -1512 164 368 1138 1797 -1044 994 1220 -747 1127 -356 902
509 902 1914 218 1610 -711 -1136 2534 427 371 888 -238 1527 -221 287 1186 -480 1885 1139
526 1139 -687 -358 -1032 1365 683 -970 760 -612 -471 293 -997 42 -309 534 834 -2276 -1280
543 -1280 163 -880 535 -641 -829 -577 -1491 -345 -1359 -1197 572 -196 -622 -1896 -1651 -152 -269
560 -269 -540 -352 -981 -1049 -603 -610 -969 -447 378 -97 -879 -1528 -296 -249 -72 601 -232 -378 260 -460 -355
581 -355 -30 252 729 227 -395 -603 -126 1068 597 545 637 -131 562 9 -336 651 874 1389 103 -684
601 -684 361 -202 852 937 -133 618 123 -279 339 -880 1037 834 -32 427 -1050 -369 680 -501
619 -501 648 180 -614 404 -698 -497 145 -241 615 -361 -578 -169 -733 129 262 -384 305 -344 96
638 96 -466 -592 329 -2 387 253 -874 -181 -242 80 470 -93 197 213 -362 107 -116 90 985 298 263
659 263 -191 -150 665 343 545 534 261 385 167 18 423 423 813 254 -136 -51 101 438 757 145 377 107
681 107 83 -8 -347 30 498 341 301 -669 -239 -175 -206 369 165 -171 -152 -314 -455 -394 -243 254 13 -316 -495
704 -495 -796 -157 -88 -306 -135 -447 -604 -542 -569 -374 -33 -54 -221 -739 -441 -203 10 -70 24 72 -182 -381 -393
727 -393 -362 50 308 144 -85 -211 -173 -18 219 123 544 245 236 187 208 48 413 799 385 104 -43 283 141
750 141 502 85 413 387 311 80 -192 256 504 59 190 -257 -390 -187 135 25 140 -297 -52 -371 -391
771 -391 -559 -143 105 -18 -323 -473 -484 -411 251 -92 -253 -437 -416 -121 -268 -452 103 -88 -75 -320 -499 -522
793 -522 -310 68 374 -38 5 -279 -205 -67 -205 247 379 248 -180 -218 -50 318 334 409 327 108 127 119 84 295
817 295 354 343 436 161 121 407 540 630 455 222 307 135 122 251 255 397 423 232 12 65 272 262 250 45 -154
842 -154 98 -262 -337 -106 312 92 -13 -229 -435 -212 -341 -307 44 -310 -282 90 -608 -75 -347 -10 64 -347
864 -347 -344 -440 -337 -18 -193 -174 -164 -116 -370 -214 -219 19 198 208 -158 -420 -297 -47 32 252 -92 142 105 -277
888 -277 60 -15 92 181 -77 246 -284 -45 107 160 409 39 209 181 -48 86 170 288 326 209 -107 -66 -243
911 -243 147 239 -1 295 -308 -226 -10 -166 -11 162 -207 114 -400 -97 -107 -397 38 -227 -132 -191 -100 -296
933 -296 -34 -308 -100 -92 -108 19 -475 94 77 -9 189 -13 15 -130 -449 -29 -59 62 133 113 -323 222 -108
956 -108 155 355 85 265 -294 182 101 119 412 449 -55 277 110 205 236 180 330 287 105 125 -1 379 286
979 286 -9 553 -154 211 68 -205 221 153 -31 -49 86 325 -130 -107 426 -131 16 33 -9 -118 -121 11 -40
1002 -40 -186 40 17 -365 20 -102 -148 136 -322 -195 -389 -189 -72 -296 -178 -157 -405 -140 -440 -373 -236 -125
1024 -125 -92 -79 -309 -242 -3 12 -231 416 -192 -207 -122 -34 -178 -55 273 -112 64 259 -74 157 53 22 508
1047 508 -77 -153 48 9 359 201 78 342 -213 -15 -79 -88 300 79 203 333 -178 -16 3 -93 120 -39
1069 -39 127 -264 -342 -52 -277 -193 -2 -139 -39 -63 -320 -35 -224 232 -172 -364 -219 -552 -276 -121 -318
1090 -318 238 -103 -139 77 -272 -54 -126 83 -126 -327 -361 -4 -140 -15 59 279 71 -124 -26 38 404 152
1112 152 -46 78 12 19 -25 257 403 247 315 178 101 -14 271 -67 42 364 44 357 128 131 150 6 299
1135 299 400 -96 100 208 -19 320 -206 29 -45 -40 70 142 139 -77 80 43 167 -448 -117 24 148 -168
1157 -168 -190 -192 67 -373 -112 156 -357 -122 -300 -178 -46 -195 -177 -99 -92 -86 -148 -69 -277 38 -217 85 -98 -65
1181 -65 -235 54 123 -26 71 29 18 -37 -88 -93 -74 184 99 -53 126 47 251 25 -3 73 161 63 124 109 245 283
1207 283 146 50 109 55 -23 -6 135 291 -32 57 70 196 -64 -72 -44 203 169 -238 -211 -232 -202 38 -8 13 -170
1232 -170 -131 -115 -210 -165 169 -12 -82 -26 -309 -106 -60 -174 -130 -83 3 -162 -148 -134 -29 -162 -78 33 -202 -128 -40
1257 -40 84 76 -1 -107 115 -274 207 64 -111 261 174 -13 24 134 -43 20 210 279 -184 -140 63 151 201 428
1281 428 270 242 266 54 124 107 150 123 434 102 11 57 187 165 166 -118 -14 -58 -346 -1 32 -5 233 22 67
1306 67 16 64 -39 -188 111 -70 94 -69 -118 132 65 -69 56 -146 -129 -82 -105 -254 120 92 -45 45 -130
1329 -130 -179 -7 -6 -37 55 -41 -163 -39 58 78 232 142 183 15 -43 94 78 39 -47 154 -45 -148 192 143 95
1354 95 187 31 -95 -38 207 -28 116 29 358 27 -85 -100 76 117 16 134 108 42 -61 18 34 -101 -124 240
1378 240 29 -92 -54 -42 -68 179 152 87 -115 -313 -4 -109 -2 -82 -404 -130 -357 210 -146 -63 111 133 58
1401 58 -142 72 -161 137 -64 -206 117 -108 -120 155 -77 2 83 -184 -60 111 -32 0 20 184 -194 -128
1423 -128 47 52 80 34 -22 249 131 28 138 -39 60 181 328 37 12 121 -54 -67 61 -74 100 31 -170
1446 -170 71 -93 -134 212 -207 117 -308 -100 0 90 -68 -167 -150 -5 55 -32 8 -143 -179 -173 114 -63 -4 84
1470 84 -23 30 -8 -127 -172 36 -68 19 -28 -145 -213 -49 -112 -161 11 171 -364 -172 -87 -73 -72 32 67 59 156 -147
1496 -147 -201 -65 351 306 50 -23 82 -94 -116 -23 54 182 31 82 -106 -147 9 -229 205 200 66 79 -75 67
1520 67 -18 -59 221 113 76 -20 -209 -264 -89 61 52 59 19 -21 -86 -12 -29 -134 51 -89 -165 230 -117 -23 -371 -57
1546 -57 -72 -226 -72 74 -56 -198 -135 109 -25 9 -227 119 -52 -200 -42 81 89 -259 79 -171 -112 178
1568 178 -39 135 -48 50 91 -29 83 17 -75 67 -250 3 72 -84 83 -132 182 30 -141 137 114 177
1590 177 110 -69 -225 -26 -144 -176 -78 -59 74 -36 86 -81 -73 173 -247 26 60 -109 -26 -282 183 180 -3
1613 -3 -121 34 26 83 211 48 -9 -114 -140 -219 -220 45 51 -7 99 -16 -52 -361 -206 -136 -80 241 -1 -151 142
1638 142 138 -25 -29 -131 74 129 -108 29 73 -140 36 -33 100 80 87 156 -52 125 4 21 62 -241 -97 178
1662 178 26 -179 -75 260 181 -73 -13 -92 197 165 -41 -140 -207 28 -126 -45 -85 -62 -45 -175 -116 -33 32 -33 46
1687 46 87 -161 84 153 234 146 56 -41 -255 -17 -166 183 275 134 120 -136 -48 17 155 74 291 -25 -52 -23 113
1712 113 201 69 153 -192 378 -54 -53 115 -338 137 144 -22 97 95 146 120 140 1 -106 19 -242 157 -150 -114
1736 -114 54 -7 194 28 141 51 -72 166 -40 272 -230 -102 258 206 80 25 43 -39 -9 -16 -32 98 21 16
1760 16 -150 31 84 98 -102 186 346 -124 -21 -412 5 -228 -26 136 160 47 -144 1 -193 173 -8
1781 -8 -134 -69 -12 -170 -105 30 6 -71 39 65 27 -41 -89 -2 148 61 -152 -89 -135 59 99 45 139 -231 161 194
1807 194 7 86 34 -34 110 -22 -86 -84 -54 -126 23 27 -216 9 -4 101 -194 149 -9 -11 96 -117 -129 111 -168
1832 -168 2 -56 -1 125 33 245 210 14 -253 47 -173 -156 -155 198 137 -111 -193 -129 -91 -381 69 -89 -22 92
1856 92 45 -73 48 -151 55 119 30 95 98 -6 79 40 21 45 270 -104 4 -138 157 92 -108 76 191 102
1880 102 28 141 -109 4 195 1 45 156 -17 -71 -64 74 -26 20 -88 -77 -42 111 -100 108 -80 -128 -25
1903 -25 -83 -131 71 -245 -220 43 -82 -250 -58 -80 -162 -96 -64 82 219 364 31 -216 26 -96 59 -33 -167
1926 -167 -151 -16 79 -148 63 -203 32 -39 -338 111 -112 9 -34 -217 -91 107 -66 -32 -257 -7 107 -153
1948 -153 60 140 230 -73 -16 -302 104 -149 36 -13 81 8 -118 29 162 -54 -13 230 164 -211 338 60 -71
1971 -71 135 79 122 172 -192 -113 266 31 -2 -169 163 27 32 -230 195 266 -92 -69 139 -29 -122 -178 2 -119
1995 -119 227 -77 51 -162 113 -7 -128 -27 -90 191 80 -141 139 126 31 -7 -146 259 27 42 60 37
2017 37 -107 46 83 94 164 -63 -163 120 -62 208 37 -22 50 126 -10 212 146 -123 -153 -135 -36 84 73 113
2041 113 -42 -85 79 -28 155 -88 15 -96 -67 -210 48 -58 147 133 115 -189 -8 234 -203 -63 224
2062 224 -1 -16 26 -381 108 -128 64 -73 -103 127 17 -315 149 61 5 -126 -206 107 301 125 12 8 18
2085 18 -112 181 -129 244 -124 62 -79 -12 29 96 -227 153 90 50 175 -42 -114 -62 14 -59 -192 33 46 149
2109 149 410 -216 163 -124 132 -54 -137 134 99 -56 119 7 -22 91 96 -197 47 41 25 -46 57 194 -52
2132 -52 117 56 62 -6 -191 -128 -127 -43 -317 -196 -153 -180 -24 -133 0 193 -61 207 -94 -116 -2 -77 26 57 163
2157 163 30 -55 -44 115 27 226 -82 22 61 26 -83 -19 44 214 144 73 37 -117 -162 104 -80 -131 68 140
2181 140 62 -242 -156 -244 74 -40 27 65 25 -164 40 -35 172 36 221 -22 152 -44 -33 378 -154 64 -66
2204 -66 -48 -57 85 -120 16 30 90 -63 -284 -166 70 107 158 -264 59 7 -100 -59 -51 18 76 -5 53 54 7 44 106
2231 106 -58 116 -69 33 -67 -11 75 -123 13 -94 107 -115 178 125 228 8 113 -113 17 92 -191
2252 -191 173 -73 -87 59 -25 -159 208 -131 4 101 -74 -49 -37 108 -60 45 165 -194 41 91 -15 -94
2274 -94 66 107 -48 53 142 88 -18 202 -223 -121 -68 42 80 361 -4 -87 17 177 190 91 -60 -28 237
2297 237 21 -152 -67 237 -78 -200 125 -22 -127 -40 -233 33 -4 -65 6 130 -87 107 103 32 216 428 198
2320 198 102 91 -228 262 294 -2 -63 278 -234 -185 34 313 -101 49 -85 -439 273 -516 200 -121 -324 268
2342 268 -1111 -106 138 43 -33 166 -50 35 -89 -52 278 -256 -349 -173 11 120 -18 -9 5 278 288 43
2364 43 60 -336 -178 34 57 -115 -167 -14 222 -81 3 -137 -30 113 -63 -57 -238 -4 -88 -88 -54 20 -124 97
2388 97 178 109 -168 66 225 -71 68 -193 168 -98 144 82 37 -29 34 77 31 -100 56 142 -224 330 -46
2411 -46 166 37 173 -62 391 34 -5 -80 -79 99 68 96 6 59 295 99 171 -209 43 126 8 180 61 168
2435 168 29 -40 -103 14 158 -62 -111 94 80 -7 118 -233 76 137 67 68 19 15 30 235 -113 256 93 47 -172
2460 -172 -35 34 50 207 239 192 -255 37 -178 -77 -345 1 22 -134 86 120 -128 182 -77 -72 -11 159 -206
2483 -206 2 -49 189 -103 -92 98 -169 -153 -247 213 73 -94 -195 70 295 208 178 -69 -268 -17 49 37 -131
2506 -131 -6 -102 121 63 -192 119 -47 -1 321 174 -23 -1 8 -95 20 294 31 -115 -203 109 -5 -65 127
2529 127 55 -97 -106 -2 -143 171 30 -104 -73 -119 133 116 -268 -10 80 -107 -11 115 -17 152 -141 88 79
2552 79 -93 -125 -204 -133 160 262 71 192 -276 36 121 -137 183 -23 -2 -76 128 -169 -26 155 -102 75
2574 75 -95 106 -182 115 36 -178 -89 -150 -170 -119 -143 -211 -13 -109 -178 198 21 -186 -135 279 103 -7 133 -101
2598 -101 -130 -136 13 90 287 118 43 -141 -146 3 10 -189 -43 130 -96 66 -197 35 -42 306 25 -219 -108
2621 -108 97 -23 382 -102 -50 -70 -170 253 -134 -19 -43 119 -22 -42 -117 -167 41 -60 -18 44 108 74 -254
2644 -254 -190 -92 10 -121 55 -3 -86 -85 -69 -68 162 124 97 16 -40 -34 -17 -169 -47 -173 41 212 73 98 97 121 -52
2671 -52 -121 -202 101 -356 -132 -318 64 -78 -252 -52 -10 24 -43 98 10 245 -25 10 -40 -49 -38 -153 195 13
2695 13 190 168 87 223 -35 -83 -61 93 188 -215 -18 -4 -227 34 72 -51 13 93 -123 99 -201 -178 -74 -170
2719 -170 103 129 124 27 -63 57 -4 274 112 -49 -120 -43 -158 -53 232 -13 35 25 -63 105 -122 31 3 -147
2743 -147 -121 141 76 7 86 9 -63 136 292 -213 38 -237 31 -188 -33 181 99 131 -84 -190 170 -70 -60
2766 -60 213 81 364 132 185 164 -229 99 17 -124 -21 -61 101 -165 -84 40 -81 89 -162 -195 -32 -243
2788 -243 -7 273 125 -16 75 -103 -46 -307 51 102 -64 -206 100 -33 -177 284 85 -33 -93 160 45
2809 45 -72 -125 182 334 173 -122 -90 -100 -29 208 -87 -230 -15 -58 -10 -15 -19 -153 -73 -113 6 13 -124 150 177
2834 177 57 35 12 168 -81 -137 228 93 274 4 -352 22 67 -12 214 -43 124 6 32 -15 123 -26
2856 -26 -54 -23 67 -130 377 141 104 14 10 153 16 -48 251 2 -164 -50 222 20 13 -106 107 209 -48 -167
2880 -167 -51 131 43 95 -73 102 -90 -23 70 -30 165 -21 -266 -113 -23 -110 -35 50 170 -251 12 -61 -4
2903 -4 50 24 19 90 -124 60 -111 -68 -83 -54 39 55 -129 -180 70 -48 134 -344 59 -171 121 117 44 143 -15 -92
2929 -92 -63 17 -51 -177 130 -101 -20 -35 -150 34 121 -77 -179 185 -146 28 -131 -150 107 -4 -51 109 -81
2952 -81 -94 25 -246 205 5 50 65 -80 -27 131 -63 133 337 66 128 -149 215 -59 -72 200 154 92 -105
2975 -105 10 5 280 190 -3 -18 189 -68 -133 75 -68 -135 -380 109 86 22 62 -155 47 4 10 -49 55 32 164
3000 164 198 137 -249 -187 -197 28 86 49 119 -145 110 -36 62 21 40 218 72 21 -118 -70 0 -35 208 85 -198
3025 -198 -95 53 55 -66 -90 185 -77 117 65 302 -126 83 -28 56 -235 -66 -12 -20 -83 -9 161 -56 53
3048 53 19 27 -89 103 -131 230 34 218 48 38 295 37 -89 59 -94 -189 224 -63 -19 80 103 55 -11 145
3072 145 -28 -20 37 -90 -168 -171 -36 -16 84 -152 -93 45 -27 -87 157 -47 43 -115 -297 129 2 48 -44 -68 -176
3097 -176 -129 -50 -68 -7 -31 -182 -10 -77 149 131 86 -127 2 -113 25 31 -25 -15 -138 -56 27 105 50 69 75 17 -123
3124 -123 64 48 253 -48 -131 -6 -34 -153 -216 37 -48 -153 -45 -4 11 -111 77 -130 168 38 60 167 -320
3147 -320 152 154 56 21 -43 -74 -167 -10 31 31 -157 -116 26 118 90 -173 -26 -174 -201 -131 114 -197 2 51 75 -250
3173 -250 -89 -5 30 -157 58 -154 -135 139 -126 85 -74 -112 54 217 2 78 -51 47 -105 83 -79 -11
3195 -11 -327 -146 92 -46 -24 230 164 -85 -35 -147 -86 -110 57 149 30 -188 -133 59 -147 -71 125 51 -133
3218 -133 -229 -163 317 125 4 -15 -79 -96 94 151 -144 23 73 378 -135 157 110 -39 -290 -23 -164 -136 159
3241 159 60 122 25 108 32 -76 188 138 48 -72 101 55 163 64 -140 114 -95 117 -32 -110 104 -94 176
3264 176 -134 24 29 232 36 208 183 -6 -88 70 105 184 -160 214 159 48 193 9 159 -232 63 23 -241
3287 -241 114 45 5 106 107 12 103 136 194 59 -132 -30 115 -153 -2 -160 -94 -134 -113 186 56 43 -48 3 -248
3312 -248 -15 -178 -59 -156 65 -44 54 -75 -4 -19 183 -44 -504 21 161 21 36 153 -106 -183 254 178
3334 178 -31 23 96 -15 139 -99 -93 -129 -93 -177 -168 263 97 189 -73 -1 -359 7 28 16 -138 -228 216 113 -118
3359 -118 -95 232 -166 -45 249 37 117 7 -228 58 110 -27 38 2 156 -50 -150 -3 172 -9 256 -127
3381 -127 -171 96 -139 50 107 -178 -11 56 173 -27 37 -344 23 -15 -256 -48 -77 -50 174 19 144 69 -57
3404 -57 145 -1 -44 -160 -153 23 8 153 -8 -89 -68 -92 35 16 111 192 -394 217 45 -49 118 -137 -60 -83 -63
3429 -63 271 66 38 -142 -8 197 -94 44 -51 73 -32 365 -20 244 -172 -66 53 -4 -67 -32 254 -98
3451 -98 39 -153 177 -105 -11 214 31 -34 152 43 97 -187 -53 168 235 -158 -31 191 44 45 -116 -87 -30
3474 -30 66 -161 38 -219 -9 36 94 58 -88 -105 -82 4 125 -80 -5 -92 59 103 -21 -124 -12 -2 -173 -150
3498 -150 -179 57 -80 -231 -118 -78 -222 -110 180 138 -213 90 25 48 -136 154 -28 23 20 70 67 69 107 -24 228
3523 228 -56 31 78 296 123 -54 81 19 40 -123 115 83 245 -119 -15 13 25 25 -163 88 202 -72 -93
3546 -93 28 -9 153 -54 92 24 13 -12 271 167 -210 -124 -22 159 -121 -217 -134 -281 305 88 36 -38 82
3569 82 -38 98 -11 150 -114 185 77 107 -45 41 34 101 99 -17 93 89 17 77 -79 2 15 12 50 162 -159 -129
3595 -129 -42 -18 65 -154 37 -113 -56 295 97 105 46 -146 43 5 47 15 -86 141 273 83 -19 -179 -211 91
3619 91 -63 30 27 116 -1 121 -42 -206 260 -179 -78 141 -21 137 -74 -198 -40 -217 119 -118 -4 -7
3641 -7 26 55 38 -120 -120 202 -157 224 -219 -188 171 -7 250 231 -142 -146 -301 -118 -100 -58 -12 -76 -209 56 -140
3666 -140 31 -83 -110 172 19 26 -31 -85 137 61 -166 -42 134 36 -151 -111 -108 -16 57 -44 16 -46 65 -67 -174
3691 -174 -36 69 108 204 11 205 -41 -52 10 105 91 245 -53 3 -33 -145 -105 172 105 164 -207 10 197 95
3715 95 -88 -114 131 40 11 68 34 -36 0 -54 -37 -43 236 84 47 -158 53 127 260 -52 134 -54 181 417 24
3740 24 -90 -22 -87 126 6 -110 9 -110 -242 95 -186 -24 206 35 -69 35 106 9 -182 -114 104 -30
3762 -30 -3 2 -60 -55 -150 136 33 44 89 146 39 38 221 266 -141 130 340 -98 -21 73 200 143 100 -99 90 -36
3788 -36 -316 -20 -61 -244 74 -137 -87 219 -48 159 229 -313 96 -29 -17 217 59 -9 -207 131 -32 20
3810 20 131 20 -25 171 104 106 10 238 -108 65 27 -149 -189 -151 -53 23 77 -346 190 -72 -149 52 145 -134 -178
3835 -178 52 15 -165 80 -226 -135 -93 12 428 -241 -28 134 -115 155 -64 63 139 -28 -72 163 3 -92
3857 -92 31 -8 19 -189 5 178 -75 -67 -69 -21 69 -34 25 -50 -77 49 -215 103 140 25 124 -7 -86 -315 -303
3882 -303 -329 -128 -45 -65 128 -224 -53 175 71 -80 -68 -130 22 160 -12 -41 217 219 10 183 87 51 -132
3905 -132 26 154 2 74 -240 165 7 -119 51 147 -94 61 123 34 142 -67 -89 82 -44 -144 325 -3
3927 -3 8 128 -111 11 94 -128 -64 -64 -51 -192 94 -30 75 -306 181 66 88 369 135 -129 -24 -62 5 -50
3951 -50 -86 97 161 181 75 62 -52 163 21 -210 49 -175 116 82 106 145 -49 8 19 -4 265 104 -54 138
3975 138 -129 -65 155 -43 -63 1 60 -162 -44 -49 -237 -74 169 130 -3 11 -12 -119 -201 21 7 70 -203 -82
3999 -82 -7 -14 -196 71 208 -74 59 9 123 -207 -169 222 79 169 101 171 -237 -181 53 23 201 -69 184 -167
4023 -167 -243 107 173 -23 -46 0 143 -86 86 29 -89 -29 219 -141 -189 -23 -58 255 -201 102 73 -78 -183
4046 -183 75 -14 -199 -56 163 33 -25 102 214 103 -124 -9 -73 82 124 -31 -117 61 47 1 28 100 -227
4069 -227 -48 -83 52 -107 -36 -135 105 -56 200 -144 91 153 40 81 -56 -21 -143 124 -1 55 25 142 4
4092 4 -5 -53 91 -71 -179 45 142 29 94 -169 19 94 149 128 -121 104 -101 -120 57 -313 20 -19 -124 251
4116 251 -22 -79 -283 400 -65 -193 -41 159 69 37 61 -35 -120 25 31 -142 -49 -133 -117 182 108 65 -44 93
4140 93 101 17 78 132 5 -230 55 -192 132 19 -12 46 -24 40 -87 -64 -105 -45 210 -310 -324 231 8 195 77
4165 77 -172 144 18 41 74 -103 -3 -102 159 -32 -48 10 71 62 -3 -194 51 -59 331 -88 -18 148 -168 120
4189 120 -16 -63 -175 137 108 -110 219 -157 -167 164 -45 -59 97 54 -62 -174 -12 50 -26 -151 -16 130
4211 130 -169 -133 22 171 138 136 -66 132 -30 87 21 -92 -21 142 -45 147 91 147 76 206 179 -22 -89 -92
4235 -92 -21 -44 159 102 -79 51 157 -14 174 271 225 -56 -122 14 218 -101 41 31 40 50 128 -92 -117 55
4259 55 -51 122 246 -304 -305 61 -25 -164 -194 -26 -204 103 -13 -120 177 -105 76 -63 48 57 -6 4 34
4282 34 -276 -171 307 167 75 26 -25 -90 -141 -130 -34 -91 -123 -30 -83 158 -42 -5 104 -29 92 -38 44 32 25 -88
4308 -88 120 -62 -101 -115 45 -145 -18 -134 138 52 160 98 186 46 57 -4 93 36 -105 -173 -52 73 -252 -138
4332 -138 292 12 272 76 238 159 7 113 -212 62 -56 35 32 -35 240 -148 51 -57 -105 -66 -171 54
4354 54 -64 65 -282 58 36 -86 61 120 32 35 76 -89 139 -74 -212 263 -43 -121 -38 84 -301 103 158
4377 158 61 -9 228 -193 -48 147 2 -160 -13 87 28 13 0 57 184 167 108 -131 -322 64 348 -128 -114
4400 -114 -23 -235 231 -137 -117 8 42 -14 157 138 -20 71 -108 56 37 -170 -76 99 -2 15 -126 -133 -15 -86
4424 -86 22 126 85 -246 -53 188 -57 46 -94 -139 32 76 -10 -22 60 22 131 74 135 179 81 119 -163 157
4448 157 -136 -159 -94 219 135 -22 246 -96 33 9 -22 -43 22 -108 154 -103 16 16 68 -149 -88 266 93 -115
4472 -115 167 -14 -93 -16 83 -31 157 -22 77 88 -304 -90 21 100 -11 141 64 -110 59 57 -71 115 144
4495 144 -21 62 220 -33 -76 -162 230 -97 55 -91 46 133 82 -33 30 -120 41 -112 10 208 -26 92
4517 92 67 -24 32 -55 149 426 -138 -43 -44 -6 133 -173 -38 0 -16 60 -80 140 165 203 96 19 -202 38 263
4542 263 -64 21 100 -97 223 -157 -43 473 -73 177 9 173 190 -30 239 41 38 121 42 -20 150 -64 50
4565 50 7 101 96 -96 -150 -230 -174 -245 -19 91 76 -38 -124 100 48 273 -145 145 53 58 -5 -112 -82 153 204 2
4591 2 109 -50 109 63 -44 223 196 9 210 96 71 -84 -59 21 -19 1 184 -95 129 205 0 42 202 91
4615 91 -90 228 -113 56 -175 -126 -27 -209 131 353 -279 25 -69 81 -260 174 -21 -201 -175 -60 54 64
4637 64 239 9 146 -140 -37 136 -66 52 -286 -252 183 -482 604 -45 266 -57 238 -109 148 449
4657 449 -240 -561 -501 3 -107 -28 -315 363 -14 21 -4 55 -187 -57 3 -25 -108 -268 -81 899 198 -275 -645
4680 -645 24 529 -52 108 -31 -3 48 61 44 -44 85 -319 49 132 77 130 -48 155 -168 194 29 132 -19
4703 -19 10 -127 -32 6 6 -12 -58 -265 -287 38 -225 155 -34 -39 -145 -160 36 -160 309 -167 136 -368 34 -40
4727 -40 -44 20 -125 59 173 66 155 -151 12 149 -123 23 107 103 -179 -167 87 185 104 158 -124 99 56 94 -13
4752 -13 -134 -162 -35 -41 88 -191 -89 -119 231 -33 -39 245 -33 60 -64 3 -27 -181 -118 177 -111 6 -61 -119
4776 -119 188 -27 150 172 -200 167 29 -290 -344 202 213 217 36 -84 -15 264 86 -281 138 -48 109 94
4798 94 -149 -74 208 147 -1 5 -162 3 -133 74 239 -183 -85 -8 -58 33 -33 -150 -70 255 -43 115 182 127
4822 127 -61 12 -76 9 -29 65 170 74 51 32 -33 -223 147 -55 51 -262 -120 217 178 229 -34 208 -349 83
4846 83 -49 -33 -70 193 -111 41 86 -7 -312 54 50 -200 77 -158 -38 -242 83 41 6 27 -32 -93 -20 -15 -141
4871 -141 -161 121 -3 -123 -56 65 168 -13 -114 -273 98 -47 -159 95 11 56 -64 133 10 9 -55 -99 135
4894 135 102 -8 173 54 85 -44 -112 -111 -135 22 -79 -26 45 287 -167 -155 42 -132 111 35 -158 -36 78
4917 78 -25 42 -99 -13 -95 31 -74 -112 116 192 205 205 54 167 -89 231 10 39 -101 -179 241 157 -41 -92
4941 -92 -21 133 177 -17 -31 -204 -17 99 -361 222 109 93 295 -75 -126 -80 -84 -72 10 197 -38 227 66 -66
4965 -66 -104 -40 12 207 95 -91 -53 -114 37 -82 -84 143 152 175 -95 -121 23 102 76 -265 -52 129 -247 -126 -163
4990 -163 20 107 -98 -8 48 -238 -258 -15 9 184 -70 -241 35 -147 73 -32 67 119 199 1 -166 -152 -115
5013 -115 -176 94 -22 91 -163 -56 -47 -196 125 -79 113 80 172 -176 -91 -106 -105 408 -119 119 -74 -56 58
5036 58 -207 -42 37 -70 159 -116 -20 74 -73 -191 -130 115 -69 175 29 -30 -43 -13 -266 -137 322 -263 -17
5059 -17 -103 0 122 44 -107 32 -201 74 113 135 -138 134 -1 81 -67 28 -84 125 77 57 -13 48 -124 -198
5083 -198 -239 178 358 162 -133 224 139 36 52 77 -64 47 -53 35 -45 -98 36 130 -51 132 -60 -32 -157
5106 -157 194 146 -162 2 155 -70 -5 243 -171 37 -12 96 -76 59 175 -10 121 30 -71 -62 115 -10
5128 -10 2 12 -70 -86 -289 45 -81 140 44 -58 71 -408 76 -134 -238 106 97 214 162 172 58 -95 129
5151 129 390 17 33 -92 -318 131 -2 -121 31 50 -42 -157 107 92 -244 -15 -246 -46 -74 -70 330 -174
5173 -174 229 61 42 -26 52 -139 183 260 -47 11 -129 124 -98 -220 -23 -89 49 164 -32 52 25 -85 -130
5196 -130 191 -62 83 87 29 385 -189 -176 5 34 -87 5 43 137 156 -76 -177 -152 60 78 140 -42 219 -35
5220 -35 42 -67 -87 45 165 -5 -57 263 -24 -131 -100 -10 210 84 138 12 148 75 -76 194 81 -224 -107
5243 -107 218 73 -120 108 163 -207 1 -55 -159 -282 72 -232 -44 97 128 190 255 -8 -95 73 -1 89 206
5266 206 57 -106 383 -140 1 40 -186 -62 -87 -22 35 240 -32 -261 -109 -19 20 -138 87 80 -316 -142 235
5289 235 -33 -13 -46 -89 105 -170 -41 124 -147 -51 -127 198 -79 65 -216 75 37 109 -76 -88 68 -209 65
5312 65 -117 189 34 -149 299 -94 -39 -46 -143 -89 -7 -99 194 67 0 -219 -19 -147 -178 -33 70 148 -1 -82
5336 -82 -83 89 45 98 -130 187 -187 163 55 149 51 -269 107 59 0 12 -82 -77 330 13 -141 -39 -181 -93 -31
5361 -31 -97 98 3 92 45 -140 -29 -72 152 1 -11 -103 89 -69 57 -157 -145 -685 -317 272 258 334 -148 75
5385 75 -222 -146 -371 -73 -66 -92 -91 23 59 126 202 87 177 -163 19 -224 -32 -73 69 260 -16 -188 -51 -215
5409 -215 -372 -17 43 -6 154 -85 11 145 31 -104 113 -188 71 109 -51 -6 -121 -81 -197 -111 8 336
5431 336 339 36 115 -94 -109 141 -5 -54 -62 -19 -104 -138 232 104 -201 -25 -89 -48 211 -75 4 263 -2 -159
5455 -159 -113 -72 114 -3 139 188 58 77 -166 118 -211 -266 -232 -133 148 39 105 -43 49 209 120 -125 113
5478 113 45 16 -99 158 168 -61 -166 94 344 34 -139 274 -51 127 36 -44 89 -356 141 31 -79 -122
5500 -122 -55 158 17 -51 146 -105 138 -161 12 -68 -63 -156 122 -116 -59 -252 -150 20 -106 -25 -261 -89 -256
5523 -256 238 76 79 300 110 -111 30 239 -38 74 86 232 -166 3 -129 17 -33 72 147 41 -244 213
5545 213 168 113 15 -187 36 -118 126 126 -58 82 99 102 -66 67 -54 24 -249 -133 -41 76 -31 119 122 95
5569 95 368 140 -191 -166 69 56 36 -14 56 -161 -40 251 40 124 52 -37 81 59 144 -87 -97 -123 -138 44 -57
5594 -57 245 115 -237 131 -41 -72 38 128 -111 61 -20 100 3 -110 150 -220 -210 98 172 190 148 156 251 -74
5618 -74 134 -224 190 -65 179 -81 -228 -109 -145 72 5 -74 314 122 50 181 35 3 192 50 -104 31
5640 31 76 44 56 -247 -107 -66 301 -176 -124 102 -93 180 -36 257 37 2 35 -100 -214 -23 -230 196 -56
5663 -56 231 197 -47 -33 39 -145 -188 -96 -157 -49 -57 41 217 -66 -182 99 -61 177 56 -55 -185 114 13
5686 13 182 146 -94 155 14 -152 -2 56 -219 185 59 366 366 -154 -1 -104 230 68 334 -24 -189 -116
5708 -116 108 -169 -9 38 27 -11 42 40 2 -17 40 -21 -134 24 4 25 -160 -75 -44 -14 -242 122 -95 74 9
5733 9 359 90 -231 231 -9 170 -234 137 194 -96 -42 43 68 308 -67 105 44 -32 83 -135 7 14 -119
5756 -119 0 27 66 30 144 214 -34 75 -182 -107 -28 4 124 -139 226 222 45 -140 11 149 102 -65 -27 136
5780 136 -170 -5 129 53 52 181 65 -20 80 183 -78 -194 -98 -25 290 -181 -148 -77 -101 3 -319 139 -123
5803 -123 114 181 -120 -150 14 61 -172 -27 -7 -54 -63 -65 -75 -16 121 29 145 -120 122 210 55 166 200 -63 -205
5828 -205 -178 -90 124 -25 222 140 191 295 -176 -292 57 132 -121 -6 54 192 -281 101 171 75 128 -136 147
5851 147 -281 -26 -63 -126 -144 26 -27 141 50 210 -156 -23 -69 -75 86 -121 62 -136 230 -139 181 123 60
5874 60 50 -147 -188 -177 -10 212 36 97 37 -66 6 10 72 57 -53 -111 -134 44 114 -57 -15 323 -177 70 11
5899 11 36 -198 82 12 6 296 132 34 -223 104 91 -84 -5 3 101 -151 320 43 64 -7 -110 7 30 -60 -120
5924 -120 -33 92 -126 242 -114 -213 75 -61 26 60 -14 -147 127 251 -121 182 -130 -37 -4 98 5 12 20 102
5948 102 44 124 -52 6 165 -72 -69 -294 -36 -31 -131 319 68 118 -145 -189 -37 -118 238 108 -3 -190 -24
5971 -24 16 245 48 78 110 171 -21 130 146 171 136 43 -208 141 47 -86 37 -220 -287 -84 101 -12 -59 -101
5995 -101 42 116 -161 -6 459 31 62 -46 45 -69 8 -182 33 40 29 57 129 -70 -124 -21 -209 -27 220
6018 220 -49 125 122 -128 203 -132 61 -44 -135 -41 -107 123 -124 -93 -45 39 -146 -103 -2 -2 74 103 93 -134 -32
6043 -32 42 0 42 -2 -131 66 -134 -52 -18 -13 -27 101 62 145 -27 105 -92 -69 1 -31 -101 150 -50 -243 32
6068 32 -174 -333 238 -13 -65 80 -171 -66 4 66 104 -27 -8 -179 -12 -138 -59 109 197 -165 -53 -209 82
6091 82 171 53 -88 102 -103 -283 214 193 37 -89 -70 -75 -12 50 66 -36 38 -65 1 -96 -30 161 178 -74 -67
6116 -67 -236 211 3 158 213 134 -166 29 1 39 -102 16 -188 -124 -22 -95 63 -22 -37 -120 64 -71 69
6139 69 -187 141 242 106 -166 -70 -197 -68 -71 -95 63 -137 9 142 -121 155 -141 -55 49 -114 18 272
6161 272 124 154 -21 96 12 29 54 131 32 -186 65 122 235 92 -12 20 -133 -40 126 -164 -122 -84 -8 111
6185 111 221 -130 -90 13 185 -123 -262 -15 20 -74 -13 92 -96 151 -37 -116 69 -99 -81 -65 89 24 8
6208 8 155 186 -63 44 133 158 155 -94 314 178 -12 -101 -249 69 -91 236 121 119 -9 7 117 90 -57 69
6232 69 -33 -9 172 59 35 126 93 -113 -339 -74 5 -64 172 0 45 23 -32 -256 -84 -139 107 136 35 105
6256 105 -96 -184 92 -76 149 169 7 -19 -186 131 113 -232 26 -83 13 -4 -106 -64 286 -28 157 99 56
6279 56 -16 -94 83 -109 54 124 -104 -143 -315 -17 -21 -106 93 26 224 24 3 -132 -232 11 -77 88 -108 117
6303 117 150 -107 8 -3 -170 177 56 -297 -239 45 -205 -141 -19 -130 -42 -128 129 -358 -145 141 26 167
6325 167 58 19 -48 -22 19 160 117 41 -99 -26 -90 -87 -59 92 120 -5 -76 39 -105 -99 33 -34 -145 -96 -197 -156
6351 -156 154 -251 -47 -134 -109 22 74 -94 -51 -68 83 23 -51 41 25 -89 -15 -36 -67 -161 -207 177 0 -4 -92 -59
6377 -59 119 -20 -58 37 -50 10 143 139 55 84 -405 118 -111 -8 -209 -15 -14 105 128 -3 -145 8 -169 -65
6401 -65 3 74 88 113 171 37 -26 139 35 -155 73 -86 -135 18 -51 42 67 118 -153 183 53 60 -104 -191 42
6426 42 -114 38 315 -4 -143 -59 -35 -64 48 -106 61 -191 -152 -128 -60 194 -91 90 -267 -86 107 -157
6448 -157 -10 -223 -94 25 -10 -57 -60 -8 -168 -13 8 77 -62 -57 -84 38 64 107 128 217 -25 -235 21 157 129
6473 129 113 45 -236 68 -12 -178 9 129 -187 23 -199 210 58 110 -198 -247 117 129 5 1 -1 8 105 247
6497 247 -237 -79 -198 -146 -172 35 -135 -5 -39 -56 -152 -38 100 125 259 56 92 46 -88 -23 -91 -183 -169 -280
6521 -280 41 141 -136 -31 212 2 -140 -30 124 251 -66 95 -165 -285 -26 149 -103 8 -135 -82
6541 -82 22 105 122 -153 226 91 -102 54 -149 264 114 29 -71 114 -15 -339 91 -212 -3 158 181 145
6563 145 -217 380 -22 151 260 111 -76 58 162 152 -66 -120 45 13 175 111 -8 43 -62 14 -143 -249
6585 -249 -188 -93 4 -118 -84 65 -181 120 -116 -246 75 -69 18 -15 -79 -24 73 -88 -6 78 -125 -168 30 317
6609 317 70 9 271 -161 -129 -61 357 -78 -74 191 -25 103 -154 49 77 14 47 148 58 25 -133 48 -32 -94
6633 -94 49 136 72 -74 72 -62 -44 0 -92 -137 -166 -150 41 -13 133 -54 91 -139 41 86 3 -87 -97 -181 32
6658 32 26 -290 -124 -106 -147 52 -91 -169 92 23 146 176 179 143 -22 -90 -59 27 165 -105 -35 -67 51 -92 -175 98
6684 98 -37 61 99 95 -129 -102 -80 467 294 61 -90 -196 189 23 118 -112 288 136 -164 124 -91 30 57
6707 57 91 -81 -85 213 -106 -3 128 65 -5 -89 -113 -100 -36 -122 -36 61 -47 -94 -273 47 10 -65 -55 79 -112 78
6733 78 123 -147 -18 -185 197 143 -135 49 -43 24 -41 -50 241 52 -43 -113 -61 32 -13 163 -135 -147 272 53 -288
6758 -288 101 -125 -150 -143 -128 379 2 -87 6 -279 81 203 -183 53 55 91 204 -28 81 149 262 44 76 -112
6782 -112 313 -444 -160 -28 -184 86 -152 -62 -84 82 41 9 -4 -22 -33 80 30 169 72 409 196 -26 -21 18
6806 18 -283 -88 -217 17 -65 -156 146 7 -85 143 -64 36 -1 66 190 -271 100 26 64 -66 118 161 -117
6829 -117 -58 122 -87 23 28 65 17 -160 -142 -107 114 -243 130 123 97 49 18 166 104 126 304 373 -3 79 31 102
6855 102 -137 -28 -174 -80 -104 -143 23 17 287 161 -34 299 85 49 106 78 -172 -96 116 -86 31 184 92
6878 92 51 -84 211 72 -84 6 113 125 113 97 44 -178 199 -169 160 -41 105 194 283 74 35 -119 -98 -128
6902 -128 -222 -179 -166 59 127 180 108 4 -2 96 125 -160 52 74 85 101 -36 -80 106 -152 368 91 -1076 -10
6926 -10 -57 -6 -212 -150 -297 -40 -62 -14 42 21 -152 -119 -143 133 158 1 228 5 -58 158 -144 216 -63 -58 -47
6951 -47 111 -179 -44 157 -27 71 61 -171 -83 81 -156 62 64 261 -61 -21 6 -174 -19 -66 140 -30 18
6974 18 -90 -57 214 121 67 128 -37 56 -24 143 -13 164 95 27 -95 -61 -80 91 223 149 131 375 24 -1 17
6999 17 113 32 -51 -207 -12 387 57 358 18 -222 40 147 -7 -131 -31 -137 -119 25 157 -59 116 -146
7021 -146 -62 -82 -339 0 237 61 58 136 -182 134 86 116 -207 29 -35 244 -39 -44 106 195 -172 -3 -82 -43
7045 -43 52 60 66 258 -112 -27 -180 66 125 -5 243 -219 52 -81 31 237 -11 -89 -123 -43 215 -114 -65 32
7069 32 -154 189 -36 -57 -132 56 23 -44 -172 34 70 -158 117 204 14 -182 -47 -25 196 -16 44 -135 -62
7092 -62 -80 -181 82 -10 -186 -3 119 111 75 -51 135 4 8 -149 203 -85 -66 74 -104 -50 40 139 -50 -169
7116 -169 -23 125 155 76 -70 -304 135 -57 -205 -66 84 -55 66 -24 -28 128 61 84 -113 51 32 -11 -113
7139 -113 -57 116 216 -4 -148 142 222 44 140 73 66 -136 249 -125 -82 14 54 224 45 323 -18 56 30 54
7163 54 22 134 -147 -260 -21 -25 -211 -175 -110 -30 -30 145 -99 24 -56 -64 35 53 -41 -154 -203 -35 -74 52 -25 -36
7189 -36 -227 131 -42 1 -1 -43 -103 -94 -79 -205 15 -36 -65 -72 -141 70 20 -176 -123 -253 85 -27 42 15 -30 -202
7215 -202 60 147 -125 -35 12 90 98 81 23 30 318 0 -156 4 -182 34 76 -78 -27 -85 166 104 -11 -143 6
7240 6 -78 -139 -150 205 -33 -216 -26 -129 192 -128 -95 49 -196 -91 -112 -88 88 -34 -8 -433 -160 56 -6
7263 -6 -91 152 -74 -217 29 -123 -63 -113 229 106 -193 92 59 -97 -47 -32 -188 74 130 4 47 112 -23 -153
7287 -153 30 -211 -46 101 -161 -116 101 -165 0 6 -158 146 67 21 -72 111 -173 -114 161 -10 152 -42
7309 -42 -36 26 48 65 -170 -183 -5 119 -39 -178 103 32 -37 78 75 57 -199 50 -20 119 -252 46 -76 51
7333 51 124 -49 -161 -192 103 -39 255 108 -77 -169 160 -103 -171 57 53 30 -178 79 -92 68 114 151 126 108
7357 108 3 -181 -239 -144 -180 94 34 -138 39 -293 143 -75 142 14 172 -30 201 176 -19 23 5 111
7379 111 97 10 -204 -75 -3 -119 -32 -173 -105 140 -85 -284 75 -139 152 -18 79 -2 176 -126 111 -190
7401 -190 233 -141 99 -84 -172 40 39 161 68 1 -107 -14 52 -190 -51 7 -185 38 -103 -54 -107 -73 246 -98
7425 -98 -32 155 12 -88 -119 -58 45 115 6 270 162 -20 198 -151 265 122 182 -115 -47 -7 25 -10 69 -58
7449 -58 -266 132 14 -11 16 18 -28 118 -61 -37 159 -9 -97 205 99 4 -115 70 -42 125 -286 0 88
7472 88 -40 46 -184 -77 -13 58 109 -3 123 -72 137 -69 -104 297 -88 0 -43 -65 -120 -18 -74 72 -29 43
7496 43 47 -137 -149 23 76 -183 79 -205 140 148 -8 240 -5 -1 26 -442 54 -169 72 -140 -28 -109 31 27
7520 27 87 47 206 -177 -177 -111 89 -84 -36 219 138 5 247 -25 173 -75 -110 50 -45 -125 32 105 248 40
7544 40 96 -19 23 172 10 160 221 115 -157 -188 -64 43 -96 17 69 -74 99 -215 65 -44 51 142 240
7567 240 49 -167 -161 60 54 -221 158 -1 -75 -40 -109 242 -269 -3 -96 197 -11 93 65 -76 -114 10 -3 67
7591 67 16 -202 146 14 102 312 20 44 110 -213 -155 -128 119 -259 63 96 13 95 -22 272 90 -23 76 -8
7615 -8 -45 149 129 61 -237 -145 -220 97 22 -8 -458 -136 -132 75 -76 -99 188 -214 82 23 -167 -208 31 -132 86
7640 86 -6 106 -156 14 -98 33 120 193 74 -176 26 -160 -38 104 177 -91 -88 -167 -143 -21 48 -151 -6
7663 -6 71 -240 244 -140 -225 -67 39 81 139 391 -78 -89 -60 70 137 -9 63 -153 -19 -15 -56 -51 107 20 80 79
7689 79 -2 -89 89 -2 28 47 -23 204 -104 8 178 204 -4 5 14 -110 -68 -186 17 112 131 -98 62 -54 -122
7714 -122 204 -233 22 63 268 -83 117 -75 57 -75 53 49 258 -44 -28 -180 2 -15 -26 35 191 176 -41
7737 -41 19 41 -180 100 55 143 -282 -20 121 73 131 -182 51 -35 77 -203 110 7 328 -177 -9 124 -248
7760 -248 -78 -32 -46 -128 81 27 233 200 -370 -137 120 -68 107 -14 -163 -38 -9 49 166 -152 16 260
7782 260 -161 102 -190 -77 26 -80 -15 20 -128 12 50 -105 25 -40 -101 -13 14 76 -102 158 -17 111 169
7805 169 -78 -37 209 -177 -59 -131 -26 -45 -118 50 10 -36 254 63 -130 120 66 39 185 -97 -25 -126 -331
7828 -331 144 -151 76 51 89 -28 5 30 41 -142 -149 -193 -9 323 50 161 -70 -110 -37 20 -157 -18 100 -252
7852 -252 165 -308 -92 89 -57 245 187 60 155 -82 97 27 -34 61 -93 54 87 -139 -16 194 1 -34
7874 -34 -50 -182 -122 84 -220 46 -114 -253 -61 171 35 22 13 19 -144 152 66 87 -346 103 187 38 49 165
7898 165 -39 -27 -285 49 -117 256 142 106 184 185 14 -97 -3 42 -69 -163 -152 -1 187 65 -180 4 -154
7921 -154 -88 -13 19 12 -35 -27 -29 -33 38 -428 77 18 -7 87 -35 -48 -56 -170 75 163 109 136 -81 253 -275 51 -61
7948 -61 172 -83 14 -74 -72 -151 -84 86 -61 -142 26 208 38 -131 -51 4 36 -123 151 -13 -86 179 177 175 43
7973 43 -137 -126 97 104 -45 -66 299 178 -32 253 -185 -22 82 122 32 186 -25 91 -57 -73 44 -272 297
7996 297 13 53 83 -76 -128 -184 56 36 -12 -160 -127 -215 -7 -237 26 209 -51 268 -26 -111 0 -109 -63
8019 -63 44 -178 13 -175 -112 252 186 -151 66 -98 130 -316 27 -30 141 -98 5 -95 -84 -156 -12 71
8041 71 -89 138 -99 5 -9 -44 -102 81 50 -14 126 21 125 63 -36 187 -142 10 156 343 162 -39 -109
8064 -109 -32 -57 125 -72 3 -47 27 60 -74 -19 -127 -65 138 120 9 -44 6 41 21 -38 -238 -31 16 49 -137
8089 -137 -34 -26 99 -69 -93 -93 188 -54 92 -277 22 -360 43 -6 -208 189 -134 25 -60 -34 -5 187 -326
8112 -326 -67 126 -206 -174 44 89 113 97 -10 51 100 36 -100 -119 -88 103 65 86 92 -86 -34 -49 -114 144 -182
8137 -182 -13 101 75 13 -130 188 11 254 159 -92 96 -98 -21 95 1 -119 159 11 261 -120 -65 -62 -85
8160 -85 56 -152 -58 161 16 -46 -134 -4 107 -15 -38 -96 -23 -204 215 119 -59 101 80 195 -261 -161 155
8183 155 -121 -140 9 421 -143 3 -65 1
8191A
##END NTUPLES=NMR FID
##END=
