##TITLE=1H_SR48_Km
 CDCl3, 8 sc, 
 9.04.2021
##JCAMPDX= 6.0         $$ Bruker NMR JCAMP-DX V2.0
##DATA TYPE= NMR FID
##DATA CLASS= NTUPLES
##ORIGIN= UXNMR, Bruker Analytische Messtechnik GmbH
##OWNER= root
$$ XWIN-NMR		Version 3.5
$$ Fri Apr  9 13:25:40 2021 Russian Standard Time (UT+4h)  she@DPX200
##.OBSERVE FREQUENCY= 200.131506
##.OBSERVE NUCLEUS= ^1H
##.DELAY= (6, 6)
##.ACQUISITION MODE= SIMULTANEOUS
##.ACQUISITION SCHEME= undefined
##.AVERAGES= 8
##.DIGITISER RES= 18
##SPECTROMETER/DATA SYSTEM= spect
##.PULSE SEQUENCE= zg30
##.SOLVENT NAME= CDCl3
##.SHIFT REFERENCE= (INTERNAL, CDCl3, 0, 15.7039)
##AUDIT TRAIL= $$ (NUMBER, WHEN, WHO, WHERE, WHAT)
$$ ##TITLE= Audit trail, XWIN-NMR		Version 3.5
$$ ##JCAMPDX= 5.01
$$ ##ORIGIN= Bruker BioSpin GmbH
$$ ##OWNER= she
$$ F:/spectra/data/she/nmr/H-F/1/audita.txt
$$ ##AUDIT TRAIL=  $$ (NUMBER, WHEN, WHO, WHERE, WHAT)
(   1,<2021-04-09 13:23:21.87 +0400>,<she>,<DPX200>,
      <created by zg, POWCHK disabled, PULCHK disabled
       configuration hash MD5:
       00 E9 B6 7A A2 85 ED C7 34 08 36 98 17 FE 4E 26
       data hash MD5: 16K
       2E A2 FD 88 8B 4B 06 C1 DD 19 E8 54 DA 6C 99 D5>)
$$ ##END=
$$ 
$$ hash MD5
$$ 26 EA 1F 53 70 38 19 86 D1 EE 3F F2 CD 52 31 8D
##$RELAX= 
##$RELAX= 
##$RELAX= 
##$RELAX= 
##$RELAX= 
##$RELAX= 
$$ Bruker specific parameters
$$ --------------------------
##$DU= <F:/spectra>
##$EXPNO= 1
##$NAME= <H-F>
##$PROCNO= 1
##$TYPE= <nmr>
##$USER= <she>
##$AMP= (0..31)
100 100 100 100 100 100 100 100 100 100 100 100 100 100 100 100 100 100 
100 100 100 100 100 100 100 100 100 100 100 100 100 100 
##$AQSEQ= 0
##$AQ_mod= 1
##$AUNM= <au_zg>
##$AUTOPOS= <>
##$BF1= 200.13
##$BF2= 200.13
##$BF3= 200.13
##$BF4= 200.13
##$BF5= 200.13
##$BF6= 200.13
##$BF7= 200.13
##$BF8= 200.13
##$BYTORDA= 1
##$CFDGTYP= 0
##$CFRGTYP= 5
##$CHEMSTR= <none>
##$CNST= (0..31)
1 1 145 1 1 1 1 1 1 1 1 1 1 1 1 1 1 1 1 1 1 1 1 1 1 1 1 1 1 1 1 1 
##$CPDPRG= <>
##$CPDPRG1= <>
##$CPDPRG2= <>
##$CPDPRG3= <>
##$CPDPRG4= <mlev>
##$CPDPRG5= <mlev>
##$CPDPRG6= <mlev>
##$CPDPRG7= <mlev>
##$CPDPRG8= <mlev>
##$CPDPRGB= <>
##$CPDPRGT= <>
##$D= (0..31)
0 1.2 0 0 0 0 0 0 0 0.06 0 0.03 0 0 0 0 0.0002 0 0 0 0 0 0 0 0 0 0 0 0 
0 0 0 
##$DATE= 1617960201
##$DBL= (0..7)
120 120 120 120 120 120 120 120 
##$DBP= (0..7)
150 150 150 150 150 150 150 150 
##$DBP07= 0
##$DBPNAM0= <>
##$DBPNAM1= <>
##$DBPNAM2= <>
##$DBPNAM3= <>
##$DBPNAM4= <>
##$DBPNAM5= <>
##$DBPNAM6= <>
##$DBPNAM7= <>
##$DBPOAL= (0..7)
0.5 0.5 0.5 0.5 0.5 0.5 0.5 0.5 
##$DBPOFFS= (0..7)
0 0 0 0 0 0 0 0 
##$DE= 6
##$DECBNUC= <off>
##$DECIM= 32
##$DECNUC= <off>
##$DECSTAT= 4
##$DIGMOD= 1
##$DIGTYP= 9
##$DL= (0..7)
0 120 120 120 120 120 120 120 
##$DP= (0..7)
150 150 150 150 150 150 150 150 
##$DP07= 0
##$DPNAME0= <>
##$DPNAME1= <>
##$DPNAME2= <>
##$DPNAME3= <>
##$DPNAME4= <>
##$DPNAME5= <>
##$DPNAME6= <>
##$DPNAME7= <>
##$DPOAL= (0..7)
0.5 0.5 0.5 0.5 0.5 0.5 0.5 0.5 
##$DPOFFS= (0..7)
0 0 0 0 0 0 0 0 
##$DQDMODE= 0
##$DR= 18
##$DS= 0
##$DSLIST= <SSSSSSSSSSSSSSS>
$$ [...]
##$SUBNAM2= <"">
##$SUBNAM3= <"">
##$SUBNAM4= <"">
##$SUBNAM5= <"">
##$SUBNAM6= <"">
##$SUBNAM7= <"">
##$SUBNAM8= <"">
##$SUBNAM9= <"">
##$SW= 16.9725357007746
##$SWIBOX= (0..15)
0 0 2 0 0 0 0 0 0 0 0 0 0 0 0 0 
##$SW_h= 3396.73913043478
##$TD= 16384
##$TD0= 1
##$TE= 0
##$TE2= 300
##$TE3= 300
##$TEG= 300
##$TL= (0..7)
0 120 120 120 120 120 120 120 
##$TP= (0..7)
150 150 150 150 150 150 150 150 
##$TP07= 0
##$TPNAME0= <>
##$TPNAME1= <>
##$TPNAME2= <>
##$TPNAME3= <>
##$TPNAME4= <>
##$TPNAME5= <>
##$TPNAME6= <>
##$TPNAME7= <>
##$TPOAL= (0..7)
0.5 0.5 0.5 0.5 0.5 0.5 0.5 0.5 
##$TPOFFS= (0..7)
0 0 0 0 0 0 0 0 
##$TUNHIN= 0
##$TUNHOUT= 0
##$TUNXOUT= 0
##$USERA1= <user>
##$USERA2= <user>
##$USERA3= <user>
##$USERA4= <user>
##$USERA5= <user>
##$V9= 5
##$VALIST= <valist>
##$VCLIST= <CCCCCCCCCCCCCCC>
##$VD= 0
##$VDLIST= <DDDDDDDDDDDDDDD>
##$VPLIST= <PPPPPPPPPPPPPPP>
##$VTLIST= <TTTTTTTTTTTTTTT>
##$WBST= 1024
##$WBSW= 4
##$XGAIN= (0..3)
0 0 0 0 
##$XL= 0
##$YL= 0
##$YMAX_a= 110572
##$YMIN_a= -69455
##$ZGOPTNS= <>
##$ZL1= 120
##$ZL2= 120
##$ZL3= 120
##$ZL4= 120
##$ABSF1= 10
##$ABSF2= 0
##$ABSG= 5
##$ABSL= 3
##$ALPHA= 0
##$AQORDER= 0
##$ASSFAC= 0
##$ASSFACI= 0
##$ASSFACX= 0
##$ASSWID= 0
##$AUNMP= <proc_1d>
##$AZFE= 0.1
##$AZFW= 0.1
##$BCFW= 1
##$BC_mod= 2
##$BYTORDP= 1
##$COROFFS= 0
##$CY= 11.3945322036743
##$DATMOD= 1
##$DC= 2
##$DFILT= <>
##$DTYPP= 0
##$F1P= 15.9154993809931
##$F2P= -4.1035820241983
##$FCOR= 0.5
##$FTSIZE= 0
##$FT_mod= 4
##$GAMMA= 1
##$GB= 0.15
##$INTBC= 1
##$INTSCL= 1
##$ISEN= 128
##$LB= 0.24
##$LEV0= 0
##$LPBIN= 0
##$MAXI= 10000
##$MC2= 0
##$MEAN= 0
##$ME_mod= 0
##$MI= 1.114404
##$NCOEF= 0
##$NC_proc= 0
##$NLEV= 6
##$NOISF1= 3.799351
##$NOISF2= 2.8
##$NSP= 1
##$NTH_PI= 0
##$NZP= 0
##$OFFSET= 15.70392
##$PC= 1
##$PHC0= -11115.85
##$PHC1= 5.800946
##$PH_mod= 1
##$PKNL= yes
##$PPARMOD= 0
##$PSCAL= 0
##$PSIGN= 0
##$REVERSE= no
##$SF= 200.130013532006
##$SI= 16384
##$SIGF1= 3
##$SIGF2= 2
##$SINO= 400
##$SIOLD= 16384
##$SREGLST= <1H.CDCl3>
##$SSB= 0
##$STSI= 0
##$STSR= 0
##$SW_p= 3612.71676300578
##$SYMM= 0
##$S_DEV= 0
##$TDeff= 0
##$TDoff= 0
##$TI= <>
##$TILT= no
##$TM1= 0
##$TM2= 0
##$TOPLEV= 0
##$USERP1= <user>
##$USERP2= <user>
##$USERP3= <user>
##$USERP4= <user>
##$USERP5= <user>
##$WDW= 1
##$XDIM= 8192
##$YMAX_p= 0
##$YMIN_p= 0
$$ End of Bruker specific parameters
$$ ---------------------------------
##NTUPLES= NMR FID
##VAR_NAME=  TIME,          FID/REAL,        FID/IMAG
##SYMBOL=    X,             R,               I
##VAR_TYPE=  INDEPENDENT,   DEPENDENT,       DEPENDENT
##VAR_FORM=  AFFN,          ASDF,            ASDF
##VAR_DIM=   8192,          8192,            8192
##UNITS=     SECONDS,       ARBITRARY UNITS, ARBITRARY UNITS
##FACTOR=    0.0002944,     1,               1
##FIRST=     0,             0,               0
##LAST=      2.4114304,     0,               0
##MIN=       0,             -69455,          0
##MAX=       2.4114304,     110572,          0
$$ Real data points
##PAGE= N=1
##DATA TABLE= (X++(R..R)), XYDATA
0@%%%%%%%%%%%%%%qJ6j6J6j6K4l2L2m0M8n6O8p6Q8j04J20j36J52j75J99k24K54
$$ 0 0 0 0 0 0 0 0 0 0 0 0 0 0 0 -8 8 -8 8 -8 16 -16 16 -24 24 -32 36 -40 48 -56 64 -72 80 -95 104 -120 134
36A34k84L17l55L96m39M89n42N99o63P33q10Q92r82J081j189J309j443J593j760
$$ 134 -150 167 -188 208 -231 258 -284 315 -348 385 -425 467 -515 566 -623 686 -757 836 -924
55i24J948k165K413k699L036l439L936m561N371o468Q044j0503J4877k4899Q6760
$$ -924 1024 -1141 1272 -1427 1609 -1830 2106 -2455 2916 -3552 4492 -6011 8866 -16033 70727
70G0727L9845j07273Q0800j06241K3905P9671n0630O0735k4978n8026M4842m2443
$$ 70727 110572 3299 84099 -22142 1763 81434 30804 91539 66561 8535 53377 10934
82A0934M0627K5911l0338K5013l5720n581K0098k2094L0589o731m962O476k3604
$$ 10934 51561 77472 47134 72147 36427 30846 50944 28850 59439 52708 47746 54222 30618
95C0618Q608r883M890K0887j3055J0694k1777j5492Q181q473L2381n476j3128
$$ 30618 39226 29343 34233 55120 42065 52759 30982 15490 23671 15198 47579 42103 28975
108B8975O143m4630K0852J0666j2707M5286l8901j5393J5910m6380L9898J2540
$$ 28975 35118 -9512 11340 22006 9299 54585 15684 291 16201 -30179 9719 22259
120B2259k2529L2895m2468j0939J9613k4857L6049P61k0499J3122l2014K410J4585
$$ 22259 -270 32625 -9843 -20782 -1169 -26026 10023 10784 -9715 3407 -28607 -26197 -11612
133a1612p474K2001r198j3120o63j4523R695Q803L651K553j1028n800q474M799
$$ -11612 -19086 2915 -6283 -19403 -20066 -34589 -24894 -16091 -12440 -9887 -20915 -26715 -35189 -30390
147c0390R246J302R818j1976p304k99j0620J8881L880q96R423k4737R50M361o829
$$ -30390 -21144 -19842 -10024 -22000 -29304 -29603 -40223 -21342 -17462 -18358 -8935 -33672 -32722 -28361 -35190
162c5190K7864n449p100O136k5838J1272J0113l393K2636j4508r288N705j5752
$$ -35190 -7326 -12775 -19875 -13739 -39577 -28305 -18192 -21585 1051 -13457 -22745 -17040 -32792
175c2792J7889R020n437J1984j5737n658Q148o012J4790O240o655K574r297l322
$$ -32792 -14903 -5883 -11320 664 -15073 -20731 -12583 -18595 -3805 2435 -4220 -1646 -10943 -14265
189a4265P655M040P185L374n798o818q25J024P100J1491l147j792m311j0158R197
$$ -14265 -6610 -2570 4615 7989 2191 -4627 -5452 -4428 2672 14163 11016 9224 4913 -5245 3952
204C952M943L611R850j1054m458N36o476J4150L819j462N340j3995j239L882l020
$$ 3952 8895 12506 22356 11302 6844 7380 904 15054 18873 17411 22751 8756 7517 11399 8379
219H379J4707q85n240K973j3647K679P381k410J2375m866r755K505r144N502J0411
$$ 8379 23086 22201 16961 19934 6287 8966 16347 13937 26312 21446 11691 14196 5052 10554 20965
234B0965l496L743n989j0526L423M5M061Q001n150m417l310o610L798N822O23
$$ 20965 17469 21212 15223 4697 8120 8165 12226 20227 15077 10660 7350 740 4538 10360 10983
249A0983K134m305q563J72r95K319Q204l036k714l894q392L888K992J675O554
$$ 10983 13117 8812 249 421 -574 1745 9949 6913 4199 305 -8087 -4199 -1207 468 7022
264G022p347m972j248n735Q237M233j777K665r824m002L524k284Q924K066o117
$$ 7022 -325 -5297 -6545 -12280 -4043 190 -1587 1078 -8746 -12748 -9224 -11508 -2584 -518 -6635
279f635R53p751j568P111o30N472L25q128l34k623O8Q620J75L48q12q274L08K986
$$ -6635 -5682 -13433 -15001 -7890 -8520 -3048 -2723 -10851 -11185 -13808 -13740 -5120 -4945 -4597 -5409 -13683 -13375 -10389
297a0389J228P094o99n127o52n008J667P217P17K952j958p224R79j56K287P454
$$ -10389 -9161 -2067 -2766 -7893 -8545 -13553 -11886 -4669 -3952 -1000 -2958 -10182 -9203 -9359 -7072 382
313C82j382j892j146o122K826L790J522M994l099m059m26k785M278N639o24J606
$$ 382 -1000 -2892 -4038 -10160 -7334 -3544 -2022 2972 -127 -4186 -4612 -7397 -3119 2520 1896 3502
329C502m109n020K536L98M486M637l501j329k823l361N560K212J563L090o344
$$ 3502 -607 -5627 -3091 -2693 1793 6430 2929 1600 -1223 -4584 976 3188 4751 7841 1497
344A497j942O12j815O953K067k073J874o510j341L860n64N650J218n222L52l998
$$ 1497 -445 167 -1648 5305 7372 5299 7173 663 -678 3182 2618 8268 9486 4264 4616 618
360F18J7N617O47J958n63n997n6j03J333N334n8k225j583l586j30L442J630J676
$$ 618 635 6252 6899 8857 8294 2297 2241 2138 3471 8805 8747 6522 4939 1353 1223 4665 6295 7971
378G971j12m479j582o75N74M904L85j156r70n770Q00J938P14N183l117k804j50
$$ 7971 7859 3380 1798 1123 1697 6601 6986 5830 4860 -910 -110 1828 2542 7725 4608 1804 1654
395A654n299L596L168j329M353n743l394J729l469N558K902l331J867n558k439
$$ 1654 -3645 -49 3119 1790 6143 400 -2994 -1265 -4734 824 3726 395 2262 -3296 -5735
410e735L457j012M294J091m430k94l534J62L444J390J222j257k937k228J72K084
$$ -5735 -2278 -3290 1004 2095 -2335 -2629 -6163 -6001 -2557 -1167 55 -1202 -4139 -6367 -6195 -4111
426d111K094K087k069k517q99k305L271K875k52J890m562j868J262j714N938R10
$$ -4111 -2017 70 -1999 -4516 -5415 -7720 -4449 -1574 -1826 64 -4498 -6366 -5104 -6818 -880 30
442C0k258J513n742L53L107j367N861j175l497J453n130L051L639j072M190l843
$$ 30 -2228 -715 -6457 -6104 -2997 -4364 1497 322 -3175 -1722 -6852 -3801 -162 -1234 2956 -887
458h87l267K239k878M302K398j392J738m292j744K196N0L521O29j264j588j966
$$ -887 -4154 -1915 -4793 -491 1907 515 2253 -2039 -3783 -1587 -1537 1984 2613 1349 -239 -2205
474b205m3J586L162N92o93j082l780J221J603N47M201k589j989P1l874L941K254
$$ -2205 -2248 -662 2500 3092 2399 1317 -2463 -1242 361 908 5109 2520 531 602 -3272 669 2923
491B923n84L219m921j337J313k162N106O50j714J733n184N75J806j239N628j584
$$ 2923 2339 5558 637 -700 613 -1549 3557 4207 2493 4226 -958 -383 1423 184 5812 4228
507D228k194Q87m879K363K584j78K753k698k199J40j159K517J789N42n00k687
$$ 4228 2034 2921 -1958 405 2989 2811 5564 2866 667 807 -352 2165 3954 4496 3996 1309
523A309j451r5K022J502O76P8l254o24p7m61M385o39q52L37n005J363J508n93
$$ 1309 -142 -237 1785 3287 3963 4041 787 163 86 -375 4010 3371 2519 2856 -2149 -786 722 129
541A29M386k459j898J37l866L404J119k59K909m335q43L19k599M877j68q98J111
$$ 129 4515 2056 158 295 -3571 -167 952 693 3602 -733 -1576 -1257 -3856 1021 853 -45 1066
558A066m482L11P74l32L869j172j162k91l232J505J319N16J799j608j616j058
$$ 1066 -3416 -3105 -2331 -2663 1206 34 -1128 -1419 -4651 -3146 -1827 -1311 488 -1120 -2736 -3794
574c794o53J478J958J089j157j582j126j288K810J038M39J182l532m17K36o94
$$ -3794 -4447 -2969 -1011 78 -1079 -2661 -3787 -5075 -2265 -1227 -788 394 -3138 -3555 -3319 -4013
590d013L898l28l85M43l571P36J148N6L225j288j114j7k643J813J715k4K386k290
$$ -4013 -115 -443 -828 -385 -3956 -3220 -2072 -2016 1209 -79 -1193 -1210 -3853 -2040 -325 -349 2037 -253
608b53j317P8j513L233R74O2L87k712o28R83L74K213L60j319r80q36k94J626J429
$$ -253 -1570 -1492 -3005 228 1202 1264 1651 -1061 -1689 -706 -332 1881 2241 922 -58 -894 -1188 438 1867
627A867M69l64j142j565N68L82J143J670j335l14q90j542J837J033M74J061k322
$$ 1867 2336 1972 830 -735 -167 215 1358 3028 1693 1379 489 -1053 784 1817 2291 3352 1030
644A030o02j64o76K702P78p30L43k527m07J255n2K411m11j362N1j888N87J405
$$ 1030 428 264 -412 2290 3068 2338 2681 154 -253 1002 950 3361 2950 1588 1639 -249 338 1743
662A743J76J512j206j301n95m20J277J485n18M3j132j456L11O91J248R95j058
$$ 1743 1919 3431 2225 924 329 -91 1186 2671 2153 2196 1064 -392 -81 610 1858 2853 1795
679A795j007p00j076J281J269KM53j497j588L97M6J160J508j053q37o12j723J438
$$ 1795 788 88 -988 293 1562 1564 2017 520 -1068 -671 -625 535 2043 990 153 -459 -2182 -744
697g44O58L10J154j923r19r6q85J982O45n25N20k051p84M39L17J578K89j198p85
$$ -744 -86 224 1378 -545 -1464 -1560 -2445 -463 182 -343 177 -1874 -2658 -2219 -1902 -324 -35 -1233 -2018
716b018r86o9J534O23N48o86j533J28n54P89J169Q3o6n34j200j81R67R63P94m37
$$ -2018 -3004 -3073 -1539 -916 -368 -1054 -2587 -2459 -3013 -2224 -1055 -972 -1038 -1572 -2772 -2953 -1986 -1023 -229 -666
736f66j014k82p33P29J429J05L94o75j669M73M16P15J560m34o12p08r22J174R09
$$ -666 -1680 -1962 -2695 -1966 -537 -432 -38 -713 -2382 -1909 -1493 -778 782 348 -264 -972 -1894 -720 189
755A89L70R74j011j092K42l53J165Q34P8N7j167q35O80L53J061P52j095k34j012
$$ 189 559 1533 522 -570 -328 -681 484 1318 1396 1453 286 -549 131 484 1545 2297 1202 968 -44
774d4k99J308M79L47M17j190o64n1K01J665l2j28o04j442K12P98M91N68J46j084
$$ -44 -343 965 1444 1791 2208 1018 354 303 504 2169 2137 2009 1405 -37 175 973 1464 2032 2178 1094
794A094l13m94J61J116K27J54n59j236j12L92O54O87j87m07n65j201N84J055m7
$$ 1094 781 287 448 1564 1791 1945 1386 150 38 430 1084 1771 1584 1177 612 -589 -5 1050 1003
813A003R21q81j283J52l89P73J142l04l96n07j105M34N92O34L61p71m33m01p89
$$ 1003 1924 1043 -240 -88 -477 296 1438 1134 738 231 -874 -440 152 786 1147 376 -57 -458 -1247
832a247R63N77L82J15j471n15j7J14J218L54n69l96j094j51M85P20N68j3r61l68
$$ -1247 -284 293 675 790 -681 -1196 -1213 -1099 119 473 -96 -492 -1586 -1737 -1252 -532 36 23 -938 -1306
852a306l26J9R41N30j90l42j177k9M00j39J256K26q34k36j024J35J041M33M88
$$ -1306 -1632 -1613 -672 -142 -332 -674 -1851 -1880 -1480 -1619 -363 -137 -971 -1207 -2231 -2096 -1055 -622 -134
871a34J23j765J36l9L29J253k89n3j60j164N72L70K03J022q03j96k11m74Q24M78
$$ -134 -11 -1776 -1640 -1679 -1350 -97 -386 -439 -599 -1763 -1191 -821 -618 404 -399 -595 -806 -1280 -456 22
891B2K63L11j034k1l45K14Q94P37k53j25p64n96O95L79P32L42m04o19l84K4Q08
$$ 22 285 596 -438 -459 -804 -590 304 1041 788 663 -101 -697 -2 377 1109 1451 1047 428 44 68 876
912H76O73j61J5r24m37O51J44N80M30q44J32n63n62J345K15P4L16j498J23o1k19
$$ 876 1549 1388 1403 479 42 693 837 1417 1847 1003 1135 572 10 1355 1570 1644 1960 462 585 524 305
933C05J338l0K3m75j237K76M24J46J057p80l89n34k82L97M48K65J68p15m95m22
$$ 305 1643 1613 1636 1161 -76 200 624 770 1827 1047 658 124 -158 239 687 952 1120 405 -90 -512
953e12O0Q22L58j02n06k00n48M6O14M64P7m49m38m15j33P22N10k53l6p22n92L71
$$ -512 -452 370 728 626 120 -80 -628 -582 32 496 573 124 -314 -729 -862 -140 370 117 81 -641 -1233 -862
975h62m9P10P31j028k30l58k69Q28J88J43K19j082J13k39J87P65Q4j64l78m94
$$ -862 -911 -201 530 -498 -728 -1086 -1355 -527 -339 -196 23 -1059 -946 -1185 -998 -233 -149 -313 -691 -1185
995a185j62J09O81L89R8m85p20j0RQ22L75l04k5n54l96K42J93Q96N9m56j61o42
$$ -1185 -1347 -1238 -557 -168 -70 -555 -1275 -1285 -1276 -454 -79 -383 -408 -962 -1358 -1116 -923 -27 32 -424 -585 -1227
1017a227K86K93L57O58n54q77K36k19P28N50j9j87j48r24M26J16P87L65k18l08
$$ -1227 -941 -648 -291 367 -187 -1064 -828 -1047 -319 231 212 25 -123 -1047 -621 -505 282 647 429 121
1037A21m97K4L62K41O65J64n71o01O6J29L93P48j97l19k17o47L34Q36M00M8o31
$$ 121 -376 -352 10 251 916 1080 509 -92 -26 103 496 1244 1047 728 511 -136 198 1034 1434 1482 851
1058H51n67K44l98Q79M3J22J74q41k01K81K1P00Q4p12J44l48m08Q50O7M30l83
$$ 851 284 528 130 1009 1052 1174 1348 507 306 587 608 1308 1392 680 824 476 68 918 985 1415 1032
1079A032q85K74n07L76O14lo5o44k98J4L81M6N51p5o16m85J84r9O01K45n95L5
$$ 1032 147 421 -86 290 904 901 836 192 -106 -92 289 335 886 811 195 -290 -106 -205 396 641 46 81
1101H1o90k30J65K44Q32O1p91K2m79J15K87K72J62n21k45j73j78N12L40Q7p8n62
$$ 81 -609 -839 -674 -430 402 463 -328 -306 -785 -670 -383 -111 51 -470 -715 -888 -1066 -554 -214 -127 -205 -767
1123g67l98K78P8N13M6n2k29o90L67K78K48M00j55l22m70O0J69N18j52L51m91
$$ -767 -1165 -887 -809 -296 -250 -302 -531 -1221 -854 -576 -328 72 -83 -405 -875 -815 -646 -128 -280 71 -420
1144d20n40l6L47L56J83J75j64n99J0MM36K74r4N25j001qj17K05R03j42k23p2
$$ -420 -960 -996 -649 -293 -110 65 -99 -698 -688 -684 -248 26 -68 457 -544 -552 -669 -464 439 297 74 2
1166Bo77L78J86M67K25l45m10j94j32M11L12J86J24p01k43L17j21N38L52k94K0
$$ 2 -675 -297 -111 356 581 236 -174 -368 -500 -89 223 409 533 -168 -411 -94 -215 323 675 381 401
1187D01k99l14M21M75N2o0m82j68K1K83K61M09m08M1l14k12M02K02pL6kk98l86
$$ 401 102 -212 209 684 736 676 194 26 47 330 591 1000 592 633 319 107 509 711 704 740 738 440 54
1210E4J32L05J89J8Q3n13j4j25M04K60J8M7n36k19l5L46l8M85j65o26J64o13M40
$$ 54 186 491 680 698 781 268 254 129 533 793 811 858 322 103 68 414 376 861 696 70 234 -379 61
1233F1J74J35j70j92j05k38K21K38K80R5p31j84l3K41J36k2M2j46m20o3O8J74
$$ 61 235 370 200 8 -97 -335 -114 124 404 499 -232 -416 -449 -208 -72 -94 -52 -198 -618 -681 -613 -439
1255d39O85l05j79k81l30K30K23L18o0k73p0k05j99M50N18l04J62n72j52j31L95
$$ -439 246 -59 -238 -519 -849 -619 -396 -78 -138 -411 -481 -686 -885 -435 83 -221 -59 -631 -783 -914 -519
1276e19M43P9k38j7l30j67L76K79J71Jj67m60Q8k0L97J42K77k81n03m8L73K68
$$ -519 -76 3 -235 -252 -582 -749 -373 -94 77 78 -89 -549 -461 -481 -84 58 335 54 -449 -497 -124 144
1298A44m1lj22R8o47K63M44%k49M2p2k72J33N48m08J89J87p6o49M79l24J008o00
$$ 144 103 100 -22 76 -571 -308 136 136 -113 -71 -143 -415 -282 266 -142 47 234 158 -491 -12 -336 672 72
1321G2K01k77K61o31K47O30j57L9m24j58J65l3P19q50Q69n36k34l36K47P40l58
$$ 72 273 -4 257 -374 -127 503 346 385 -39 -197 -32 -65 654 -196 673 137 -97 -433 -186 554 196
1342A96K96o07l01N43K6J20K6M50j60p3r84N16M1O76p30L66n30j07L46K17J41
$$ 196 492 -115 -416 127 153 273 299 749 589 516 -468 48 89 765 35 401 -129 -236 110 327 468
1363D68J38k69l80L81p86M23N70l61J14L7n16J64j36N02o3k57p1j34J44j37J47
$$ 468 606 337 -43 338 -448 -25 545 184 298 335 -181 -17 -153 349 286 29 -42 -176 -32 -169 -22
1384b2N21q5m12n49P13j75O1K41j313Q22l16r5N58K19o38J618j309o09p3L80q9
$$ -22 499 414 2 -547 166 -9 52 293 -1020 -198 -514 -609 -51 168 -470 1148 -161 -770 -843 -463 -552
1405e52R22j40m46q60L05N46l81Q95j36r7m62m70J89L35N83l04k72j99L59k86
$$ -552 370 230 -216 -1076 -771 -225 -606 289 153 56 -406 -876 -687 -352 231 -73 -345 -544 -185 -471
1425d71M31m0r9k04k08M38O4M72k64J00k49k59J03k33K20K43O4l17J31j72O6J17
$$ -471 -40 -80 -179 -383 -591 -153 -89 383 119 219 -30 -289 -186 -419 -199 44 108 -209 -78 -250 -184 -67
1447f7R6M46m25J27k70lJ43l9o0J90k20K6n2j1M15J67j22l62l9k3K39r8J31j1
$$ -67 29 475 50 177 -93 -96 47 8 -52 138 -82 -56 -108 -119 296 463 341 -21 -60 -83 156 58 189 178
1471A78K07l37o2O7L7J20J23l78K08l39K6p0K24L15o7o3j98k29J84K73j80J61
$$ 178 385 48 -14 53 90 210 333 -45 163 -176 -150 -220 4 319 252 189 -9 -238 -54 219 39 200
1493B00j5l55L87l01K98M5L9k33k18N2R7m4K90K9M1m58p8L33p8K78R7k42k01J7
$$ 200 185 -170 217 -84 214 259 298 65 -153 -101 -4 -48 242 271 312 -146 -224 109 31 309 406 164 -37 -20
1517b0k5j18L90J16j10r0p3j92J50K85j47k74J58q4KJ31N3J3N6j68k22o4L09o
$$ -20 -45 -163 227 343 233 143 70 -122 28 313 166 -108 50 -34 -32 99 152 165 221 53 -169 -233 76 70
1541G0k29L0O7l9k27L00J28p7j61m4k21J36m5K12j55L49j04l56K63j52K09l9j55
$$ 70 -159 -129 -62 -101 -328 -28 100 23 -138 -182 -403 -267 -312 -100 -255 94 -10 -366 -103 -255 -46 -85 -240
1564b40P0k9l08K51oP3K52j57l3k56m7M80Q5O6m22P4J46k17M8P0J27J32k06k68
$$ -240 -170 -199 -507 -256 -262 -189 63 -94 -127 -383 -430 50 135 201 -221 -147 -1 -218 -170 -100 27 159 -47 -315
1588c15L29k19J82J77J15l91j60J33Q8L88k0k81M0j7k23m4K87K71j09j95j03J75
$$ -315 14 -205 -23 154 269 -122 -282 -149 -61 327 307 26 66 49 -174 -218 69 340 231 36 -67 108
1610A08J66j56O4J0J3r4R0l50L12N4k50K25k28j31J90P3J86Mk99J51j08J9j65
$$ 108 274 118 182 192 205 111 201 -149 163 217 -33 192 -36 -167 23 96 282 286 -13 138 30 49 -116
1633a16J78J36J5j38Lq6K56j12j49J22k15K53j14J37L2j65OJ4j83K47j67J8K28
$$ -116 62 198 213 75 78 -8 248 136 -13 109 -106 147 33 170 202 37 43 57 -126 121 -46 -28 200
1656B00l9l14j12j13M18R3j01L67l07k21k0p5L30q0r3J32j84j3O4M7J53J54k04
$$ 200 161 -153 -265 -378 40 133 32 399 92 -129 -149 -224 106 26 -67 65 -119 -132 -68 -21 132 286 82
1679H2m25K19M3J07j82K73Mk44JN7l5J61j6n2j21k92R5L05o6kk2j4m7K1J80j16
$$ 82 -343 -124 -81 26 -156 117 121 -123 -122 -65 -100 61 45 -7 -128 -420 -325 -20 -86 -88 -110 -124 -171 -150 30 -86
1705h6J94k06O6j94k38J19K58p5K6J77p1j19J2J29J1J32l0m00O5pL15K15m47J33
$$ -86 108 -98 -32 -226 -464 -345 -87 -162 -136 41 -30 -149 -137 -8 3 135 105 -295 -230 -237 78 293 -154 -21
1729b1M5j07Q0J67l3K2r7j7n0J05r4P6K01q9n6j29l8m9K73K80m35M0j13Jl11O57
$$ -21 24 -83 -3 164 131 153 56 39 -11 94 0 76 277 188 132 3 -35 -84 189 469 34 74 -39 -38 -349 308
1755C08k29P1J6J7k60J89k4q2L24k73p3L51l66O2L34n0P3l34j75N2M63k48k61
$$ 308 79 150 166 183 -77 112 88 6 330 57 -16 335 -31 31 365 315 388 54 -121 -69 394 146 -115
1778a15O6q8P9R1K6J15K4k90J56J63j12N2q7p7p6J13o5P9P1m4j68L52m53O7Pk8
$$ -115 -49 -137 -58 33 59 174 198 -92 64 227 115 167 80 3 -73 40 -25 54 125 81 -87 265 -188 -121 -114 -142
1804a42M4K89k13J1o5k42K67q5J93J7k05J7q0J6K94j72r7m07L23q8K08j34J97
$$ -142 -98 191 -22 -11 -76 -318 -51 -136 57 74 -131 -114 -194 -178 116 -56 -153 -560 -237 -325 -117 -251 -54
1827e4R3r3J23m23K64j1J83l29K78j63K98j10n8K10j90K26m92N1j44N87m88J42
$$ -54 39 -54 69 -354 -90 -101 82 -247 31 -132 166 56 -2 208 18 244 -248 -197 -341 246 -242 -100
1849a00m1R6j24J33J56K9o4l25K95J5j70J6j0J50l4J05j77Q3r4R1j12J62M4j12
$$ -100 -141 -45 -169 -36 120 149 85 -240 55 70 -100 -84 -94 56 22 127 -50 33 -61 30 -82 80 124 12
1873A2j76J62j56L36J03m43RL97o5j01J41Rk61P3k5q4J98j11l0J17q8n4J30J16
$$ 12 -164 -2 -158 178 281 -162 -153 244 179 78 219 228 -33 40 15 -69 129 18 -12 105 17 -37 93 209
1897B09P0q5ol20K59j17o0L35q9J9j10k58J73Q2j29J50J6O7j31j29O2R2j31o4
$$ 209 279 194 188 -132 127 10 -50 285 196 215 105 -153 20 102 -27 123 139 206 75 -54 8 100 -31 -95
1921i5k4l9K06l5J22k51%P1p2m4j5J93k28qJ94k47P8RK97k72K72j44n2J34M1k01
$$ -95 -119 -158 48 13 135 -116 -116 -45 -117 -161 -176 17 -211 -219 -25 -272 -194 -185 112 -160 112 -32 -84 50 91 -110
1947a10Q3j24j20k29O75l65P7J60k72J67l2j79L6K43j0j44J91M8j64l1m8J08K2
$$ -110 -27 -151 -271 -500 175 -190 -113 47 -225 -58 -90 -269 -233 10 0 -144 47 95 -69 -100 -148 -40 -18
1970a8J73n32L07K17k90K09n2o3j07K90K9k75P8O6L6R0k90J53mJ25q6J40j8m70
$$ -18 155 -377 -70 147 -143 66 14 -49 -156 134 163 -112 -34 32 68 158 -132 21 17 142 56 196 178 -292
1994b92J99J17M4K0j0L9l06Q3J44Jj70M89k47J37K31l34J22l29p7K27j47J05p2
$$ -292 -93 24 68 88 78 117 -189 -106 38 39 -131 358 111 248 479 145 267 -62 -139 88 -59 46 -26
2017b6n3NN0J6J57l76J46L8P8Q5Q1m16J73M8L10j30p4j93NR9j29J79j41K35n4
$$ -26 -79 -74 -24 -8 149 -227 -81 -43 35 120 201 -215 -42 6 316 186 112 -81 -76 23 -106 73 -68 167 113
2042A13J46k13j80R0K25l66J14L4J25j54M3O0p7R0j66Q9L6J39j4l02J69pJ09n10
$$ 113 259 46 -134 -44 181 -185 -71 -37 88 -66 -23 37 -40 50 -116 -27 9 148 134 -168 1 -6 103 -407
2066d07K95M7K15k26K24l06r1l8M79k32J44k02O6j01M31n13K91R6k52K90j26k41
$$ -407 -112 -65 150 -76 148 -158 -249 -287 192 -40 104 -98 -32 -133 298 -215 76 172 -80 210 84 -157
2088a57k3M5M1J07n70N37J78rk54K03ml5k22p5K35j50K27l8J98l12N0m1R3K48
$$ -157 -180 -135 -94 13 -557 -20 158 149 -105 98 94 59 -163 -238 -3 -153 74 36 234 -78 -28 -69 24 272
2112B72l1j21k9j56K79l04J49k5JK1j37j09J63Q2M0L88m26Qo9J24r6K0l08K25
$$ 272 241 120 91 -65 214 -90 59 34 35 56 -81 -190 -27 55 95 483 57 65 -4 120 24 44 -264 -39
2136c9Qn0O1k7J47Q7p4k4j70K09l6j06L51m28J72m4J06N1n9J53k50j92K14J9j6
$$ -39 -31 -81 -20 -47 100 187 113 89 -81 128 92 -14 337 -91 81 37 143 194 135 288 38 -154 60 79 63
2161F3j43K9om8K99k19K67k56J2K04p7j95J87k45L58j02k55L0R5j14J20J84m20
$$ 63 -80 -51 -57 -105 194 -25 242 -14 -2 202 125 -70 117 -128 230 128 -127 -97 -2 -116 4 188 -232
2184b32J00K13l18K83o5K84k81J11j37M6ok28L11k92o1K02J6N6n6J20l95O0K55
$$ -232 -132 81 -237 46 -19 265 -16 95 -42 4 -2 -230 81 -211 -272 -70 -54 2 -54 66 -329 -269 -14
2207a4L5l11J65n9J09%L33m47j3L88j96k39M01j53j09L8k0j46Q9j7J30J31k54
$$ -14 21 -290 -125 -184 -75 -75 258 -189 -202 186 -10 -249 152 -1 -110 -72 -92 -238 -149 -166 -36 95 -159
2230a59p5J3L54j02q4r9K84j93j45L20J19j31k53Rk02J74R6J20J4k64P0p4n2K12
$$ -159 -234 -221 133 31 -53 -152 132 -61 -206 114 233 102 -151 -142 -344 -170 -74 46 60 -204 -134 -208 -260 -48
2254d8K85l20k06L22Rk26K78K12k25j93l8K33o4M2M5Pj18k42J24n8L80j22j58
$$ -48 237 -83 -289 33 42 -184 94 306 81 -112 -150 83 19 61 106 113 -5 -247 -123 -181 199 77 -81
2277h1oj37L35r0J07l2K36l24P6J09j91J17R1l6N5j20j10J90L0j55j8k43K74J5
$$ -81 -87 -224 111 21 128 96 332 8 84 193 2 119 210 174 229 109 -1 189 219 64 46 -197 77 92
2301I2k31k1L77k45K76k07j66l8mM58j54m0n2o8k5m4K15p1k0R9l73L04j00L9J4
$$ 92 -139 -160 217 -28 248 41 -125 -163 -167 291 137 97 45 -23 -48 -92 123 52 32 131 -242 62 -38 1 15
2326A5J7jj11j05K61r7o8jJ11r9J41k31K07Nj30K43j91L30k73k31L53j73Q7j18
$$ 15 32 31 -80 -185 76 -21 -89 -90 21 -78 63 -168 39 44 -86 157 -34 296 23 -208 145 -28 59 -59
2350e9K0K28k76K29j82l2R9k0j08j3K47k10R0J9L4n9k69j02L45O4R0k08L20m65
$$ -59 -39 189 -87 142 -40 -72 27 7 -101 -114 133 -77 13 32 66 7 -262 -364 -19 45 135 -73 247 -218
2374b18L10k30L92j66k56K52Q7j69R3p2J00l89J53Q0NK36j60l3k3o1J11lj24L70
$$ -218 92 -138 254 88 -168 84 171 2 95 23 123 -266 -113 -33 -28 208 48 15 -8 -69 42 39 -85 285
2398B85k75K7l19L8K15L09k47J84j73K07Nl75K17j14N6Q7r6J45k86l3K30j1j76
$$ 285 10 37 -282 -244 -29 280 33 217 44 251 256 -119 98 -16 40 127 31 176 -110 -143 87 76 -100
2421a00m9M3J7OL8K36k86K94k61K11p9N4Q2j66k97K14L6O3l1P1o1J56j72R2K3
$$ -100 -149 -106 -89 -83 -45 191 -95 199 -62 149 70 124 206 40 -257 -43 -7 56 25 96 35 191 19 111 134
2446A34k75L37j68k33L25j38J09r1P5k71OO4J90l8l22K31k7j16J8K86J02Rk5j1
$$ 134 -141 196 28 -205 120 -18 91 0 75 -196 -190 -126 64 26 -296 -65 -92 -208 -190 96 198 207 182 171
2470A71k83J64n7P1j95J52n8l5O1k9m6p2j10L92k04J69PJ27r9k15J31k36J16M2
$$ 171 -112 52 -5 66 -129 23 -35 -70 -9 -38 -84 -156 -266 126 -78 91 98 225 126 -89 42 -194 -78 -36
2494c6O0k6k56Q9K13j54J82j33Pj56l7J45K0m8m5L53k86K21L4p8QJ17k92J56O6
$$ -36 24 -2 -258 -169 44 -110 72 -61 -54 -210 -247 -102 -82 -130 -175 178 -108 113 147 69 77 194 -98 58 124
2519A24Rj87N6K7m1J32l69K61r3J30k03R5K74j79J3K72m41K58r3N7o3K13m08K72
$$ 124 133 -54 2 29 -12 120 -249 12 -81 49 -154 -59 215 36 49 321 -120 138 45 102 39 252 -156 116
2543A16R4O1k01J24j34M3k61n8J34l1L28j14k46J2L31r5J3J30j66p8l9l1Q0o3
$$ 116 210 271 70 194 60 103 -158 -216 -82 -113 215 101 -145 -133 198 103 116 246 80 2 -37 -68 12 -51
2567e1p3J16O2j3q7j19K52n3K0p0r6J3J1J11R1j43M3n0P9Q2rj92j19K97o3R8j59
$$ -51 -124 -8 54 41 -46 -165 87 34 54 -16 -112 -99 -88 23 114 -29 14 -36 43 125 116 -76 -195 102 39 137 -22
2594b2n5J79j54j3mR7k26J61j42J15NJ16j03k71K4L40K44l13j46PJ44L9KJ18P5
$$ -22 -77 102 -52 -65 -69 28 -198 -37 -179 -64 -59 57 -46 -317 -293 47 291 -22 -168 -161 -17 22 24 142 217
2619B17j99k5q3L0M7k10K36o2k2O1P3m1q7K18l7%j71Rk71K04J56j26j8R5N6j64
$$ 217 18 -7 -90 -60 -13 -223 13 -49 -71 -10 63 22 -65 153 116 116 -55 -46 -317 -113 43 -83 -101 -6 50 -114
2645a14L8k5K03Jj78j38K79j94K1J16m8J80j65J28J26k99K51l12j15L08R4k71
$$ -114 -76 -101 102 103 -75 -213 66 -128 -107 9 -39 141 -24 104 230 -69 182 -130 -245 63 157 -114
2667a14k3J13j58K81K23m05j65J2K21k27K51J56k55j7R3k58M16j07k65K23j81
$$ -114 -137 -24 -182 99 322 -83 -248 -236 -15 -242 9 165 -90 -107 -14 -272 144 37 -228 -5 -186
2688a86K33k23J14L2N9l40N98j66j95J84l20K63N9Q0m2k1n1j78Q8J9j02J6j67
$$ -186 47 -176 -62 -30 29 -311 287 121 -74 110 -210 53 112 192 150 129 78 -100 -12 7 -95 -79 -246
2711b46L18j16K3K03k53R8NP4j48L2j65J14K57r6j16L0K5K8j71L69q7j58J40j36
$$ -246 72 -44 -21 182 -71 27 32 106 -42 -10 -175 -61 196 100 -16 14 39 67 -104 265 178 20 160 24
2735B4q5k19J38J45R3m3j25P8j24O2j31L64j05o1K3K3m22M13l12J61J52l4L7j28
$$ 24 -61 -280 -142 3 96 53 -72 6 -118 -56 -187 177 72 11 34 57 -365 48 -264 -103 49 15 52 -76
2759g6J6J42q9R0k76K61j64o0j25K93q7J22j82q1Q1K83q9k0k21L9K47j30l2m2
$$ -76 -60 82 -7 83 -193 68 -96 -156 -281 12 -75 47 -135 -216 -135 148 59 39 -182 -143 104 -26 -58 -100
2783a00j23J42L8k32M18k57J63m8P5j13J28N5k07K01k4j20J89l58K69p4J07n3
$$ -100 -223 -81 -43 -275 143 -114 49 1 76 -37 91 146 -61 140 116 -4 185 -173 96 22 129 76
2805G6k07O6K27j06M1j30k40P2K81J24k32k03J01Q7J14l51Q8K22pJ75o2n24N55
$$ 76 -131 -65 162 56 97 -33 -273 -201 80 204 -28 -231 -130 -43 71 -280 -192 30 23 198 136 -388 167
2828A67q3j67L23j66Qj49k1k4M0J26j11L19l98L3P7o6O8P9j2m67L68K19j7j31
$$ 167 84 -83 240 74 82 -67 -88 -112 -72 54 -57 262 -136 -103 -26 -92 -24 55 43 -424 -56 163 146 15
2852A5M7j2n3rj45J22J83j58J22j42L4j47R7Q5m2L3j11J21k48L44o2p0j13K50
$$ 15 62 50 -3 -12 -157 -35 148 -10 112 -30 4 -143 -46 39 -3 30 -81 40 -208 136 74 4 -109 141
2876A41k10P1q0R8Q7k72J95j25Q7m0O1K5k3j57J74J9j0l2L3k84K31l5K06l5j59
$$ 141 -69 2 -78 20 107 -165 30 -95 -8 -48 13 38 15 -142 32 51 41 9 42 -242 -11 -46 160 125 -34
2901c4j09O0P4k8K09j32J21j54J38k43J92k02P9N2L0j21K6Q8j74L3J65k24j00
$$ -34 -143 -83 -9 -37 172 40 161 7 145 -98 94 -108 -29 23 53 -68 -42 46 -128 -95 70 -154 -254
2924b54K52Nl6K5j93J20K19j6j63j48K98K86m11k2R8j75n2J52j9Pj23L59o8k55
$$ -254 -2 3 -33 -8 -201 -81 138 122 -41 -189 109 395 -16 -38 60 -115 -167 -15 -34 -27 -150 209 141 -114
2948a14K58l34M52j28r1n0M3Q4n1q5n8r9J53l9J97Q6j98p9J28j01k6k13K61pm0
$$ -114 144 -190 262 134 43 -7 36 120 69 -16 -74 -173 -20 -59 138 224 26 -53 75 -26 -52 -265 -4 -11 -51
2973e1j45N5K07P0j20p0J13J70r2j25K4L9O5l82L88k51K9P8J93j66j29J05k06
$$ -51 -196 -141 66 136 16 -54 59 229 137 12 36 75 140 -242 146 -105 -76 2 195 29 -100 5 -201
2996b01K58j35K76j76o9J43r4K8R7j12o1j20M46l83P9K3J86q8m4j10J18M8j19
$$ -201 57 -78 198 22 -47 96 2 30 127 15 -46 -166 280 -103 -24 -1 185 97 53 -57 61 109 -10
3019a0J19k2j4k91K00j5J05l01L13k71M30o7k19Q1j70J13m7J57m33K88P1p1l8
$$ -10 109 87 73 -218 -18 -33 72 -229 84 -187 243 176 -43 38 -132 -19 -66 91 -342 -54 17 -54 -92
3042i2L9j9L9Q7j48M6N8k97L43R0k77J57j3K02k21q0J00O0j40O9j17M5L0JR3l37
$$ -92 -53 -72 -33 54 -94 -48 10 -287 56 146 -131 26 13 215 -6 -86 14 74 -66 3 -114 -69 -39 -38 55 -282
3068b82N23k42p6J03o6K9j2k09K34j34O9P6N9k23K62K4l08L61m12K97n6Q0k71
$$ -282 241 -1 -77 26 -40 -11 -23 -232 2 -132 -63 13 72 -151 111 135 -173 188 -224 73 17 97 -174
3091a74K34k2K00j42j42K14k35J59j89p4J61K83n72O34m17M0qk5J41J03j20L7
$$ -174 60 38 238 96 -46 168 -67 92 -97 -171 -10 273 -299 335 -82 -42 -50 -75 66 169 49 86
3113H6l8m9O4j51J60M2j41Q2L2K4j84L33k15o3K77j51n5J53j9k19k25R9K35Kj32
$$ 86 48 -1 63 -88 72 114 -27 55 87 111 -73 260 45 -18 259 108 53 206 187 -32 -257 -158 77 79 -53
3138e3m1J46q3j26J72J23m3J47j62j23M3O5J42j39n0L51m15N5J1j65L12k97n4
$$ -53 -94 52 -31 -157 15 138 95 242 80 -43 0 65 207 68 18 369 -46 9 20 -145 167 -130 -184
3161a84R5J94j0k21n7J93k28J65K3j53J27K21j94K83j34r2r3J33o3o1j13J65N6
$$ -184 -89 105 95 -126 -183 10 -218 -53 -30 -183 -56 165 -29 254 120 28 -65 68 5 -56 -169 -4 52
3184E2j02L1J6J47p6P0r6q2J37j19j04j49K47k70J55K45l17J72L2j57J01K07l1
$$ 52 -50 -19 -3 144 68 138 42 -40 97 -22 -126 -275 -28 -298 -143 102 -215 -43 -11 -168 -67 140 109
3207A09qj41o3N7K57l7Kj01l4r9J15J35k57K17k24k7P0R4r2J35p7j57K19P6k75
$$ 109 101 -40 -103 -46 211 174 176 75 41 -58 57 192 -65 152 -72 -99 -29 65 -27 108 31 -126 93 169 -106
3232a06J12J28J3M4k05J3P2J62k37J22k59K7J59K68k09k47L46q5j68J62j28K19
$$ -106 6 134 147 191 -14 -1 71 233 -4 118 -141 -114 45 313 104 -143 203 118 -50 112 -16 203
3254B03k27M1N7O2j71r2K73Lj55K24l18K04l4Q9k87J23N5J0p3j06L01l89J48M3
$$ 203 -24 17 74 136 -35 -127 146 149 -6 218 -100 104 70 159 -128 -5 50 60 -13 -119 182 -207 -59 -16
3278a6R2nJ05k38j84J88J79o9j42P3K7J30j6jk64K96k43K67l19J85J58j51j6K5
$$ -16 76 71 176 -62 -246 -58 121 52 -90 -17 10 140 124 123 -141 155 -88 179 -140 45 203 52 36 61
3302F1Lp3j86J12L63o2k22l5jO1j5j41L7R1J31o4l6o8q3k3L80k36K71l32Q2k11
$$ 61 64 -9 -195 -83 280 218 -4 -39 -40 21 6 -135 -98 -7 124 60 24 -44 -127 -150 230 -6 265 -67 15 -196
3328a96J38j08l4L03l36L53J00m05J49j52L07m3j5n5K58j24j96K38r6k26NR3j81
$$ -196 -58 -166 -200 103 -233 120 220 -185 -36 -188 119 76 61 6 264 140 -56 182 86 -140 -135 -42 -223
3351b23K90R4l0r3k0J51n5J02k90j29K07R5k86L69j37J11j49j2j04N6N8k6j38
$$ -223 67 161 131 38 18 169 114 216 -74 -203 4 99 -187 182 45 156 7 -5 -109 -53 5 -21 -159
3374a59J10J48j64J50k94K44J70r8O4r2r6J60j42L5R9J64k13k51K11Jq9k65L86
$$ -159 -49 99 -65 85 -209 35 205 107 171 79 -17 143 1 36 135 299 86 -165 46 47 -42 -307 79
3397G9L7k45K5J12M34o55K94j94L14j59N8o2J28j17L9K0n3K11n28L3K00k5K37
$$ 79 116 -129 -104 8 442 -213 81 -113 201 42 100 38 166 49 88 108 55 266 -262 -229 -29 -54 183
3420A83m7Kk11L8M2nJ07j37P3k9j78o5K14l3K12j43r1n6QK10k19k6K61l64K26
$$ 183 136 138 -73 -35 7 2 109 -28 45 16 -162 -227 -13 -46 166 23 -68 -124 -116 94 -125 -151 110 -254 -28
3445b8K68l69N6q2J45J22m45M26kM8j63l1j52L7P8J30k5N9j20j2J7J48k9k65J13
$$ -28 240 -129 -73 -155 -10 112 -333 93 91 139 -24 -55 -207 -170 -92 38 13 72 -48 -60 -43 105 76 -189 -76
3470g6k39M25j03n7J22l3r9J16l43o8L26q9R2m1n2Q4J30p7j51K41r9mo8J11p7
$$ -76 -315 110 7 -50 72 39 -60 56 -287 -355 -29 -118 -26 -67 -119 -35 95 18 -133 108 9 5 -63 48 -29
3495b9J57m3j87n1j29L64k96K0K47j73J94Q2m7J47l78K10k6j31K35k32J89k05
$$ -29 128 85 -102 -153 -282 82 -214 -194 53 -120 74 156 109 256 -122 88 62 -69 166 -66 123 -82
3517h2j08J18j82K81R9m4l31L15j10L40k19p4J37k44L8J79j74l1K47j42j41k6
$$ -82 -190 -72 -254 27 126 82 -249 66 -44 296 77 3 140 -104 -66 113 -61 -92 155 13 -128 -154
3539a54r4M09m3N0J01m00K82l28J37J10n2j16j46K69j52L05o1k87Q1J40L8k59
$$ -154 -248 161 118 168 269 -131 151 -177 -40 70 18 -98 -244 25 -127 178 117 -170 -89 51 89 -170
3561a70L25l62Q1L3J63L22k76l92M55k21J05j32L43r1j89L7k54L36m2j15k41N59
$$ -170 155 -207 -126 -93 70 392 116 -276 179 -42 63 -69 274 183 -6 31 -223 113 71 -44 -285 274
3583B74k93N1J05j21j12J67j44J2r4J52JQk38K67q2j45L3J13J57j21J64j60O7
$$ 274 -19 32 137 16 -96 71 -73 -61 -155 -3 -2 6 -232 35 -47 -192 -159 -46 111 -10 154 -6 61
3606F1J56k28j41K98j25n7j15J59O4k63L58k9l02J96P3j56R9L0j32J08k01Q3J14
$$ 61 217 -11 -152 146 21 -36 -151 8 72 -191 167 138 -164 32 105 -51 48 78 -54 54 -147 -64 50
3629E0J00r3k12J01J23J8j64l19M36j18O6j02p3L93j58J89l52K47j02j55K33j95
$$ 50 150 57 -155 -54 69 87 -77 -396 40 -78 -12 -114 -187 206 48 237 -115 132 30 -125 108 -87
3651h7j02k6M1K90l06L17j04j19N0J03r4P0l24K65J51k74N8K08j53m0l8K6J04
$$ -87 -189 -215 -174 116 -190 127 23 -96 -46 57 -37 33 -291 -26 125 -149 -91 117 -36 -76 -114 -88 16
3674A6m7l3K43Q4j74k07j08N53l37N0L8q4j75M17j27k07P7l4j87L83j68N5MK41
$$ 16 -31 -64 179 263 89 -118 -226 327 -10 40 78 -6 -181 236 109 -98 -21 -55 -242 141 -27 28 32 273
3698B73k76j7K11l14j7J85m6j30O4j07J29K16J06j93j16k00l9P8K10K4J5q8j22
$$ 273 -3 -20 191 -123 -140 45 -1 -131 -67 -174 -45 171 277 84 -32 -232 -271 -193 17 41 56 -32 -154
3721a54o1J65N6j15J15k64n8L42nn4j0l8MK25j62r5J12K9r5J80j24M0j38J24P5
$$ -154 -215 -50 6 -109 6 -258 -316 26 21 -33 -43 -81 -77 148 -14 -109 3 32 -63 117 -7 33 -105 19 94
3746I4k43M4p5Q6oJ36j64l7J72q3J14J63l62J77j36J21j80L1O3L7Q0R3l1j75q6
$$ 94 -149 -105 -180 -94 -100 36 -128 -165 7 -76 38 201 -161 16 -120 1 -179 -148 -85 -48 32 125 94 -81 -167
3771a67J19jQ5k9N0J06k71J24N6k69L02j18K17j65P6n1j42j96L09m6K71j64o2
$$ -167 -48 -49 36 7 57 163 -108 16 72 -197 105 -13 204 39 115 64 -78 -274 35 -11 260 96 34
3794C4k2K89l30K3l9j87Q8K99K5k95m2k5K33j49K32k5k35J04J15j55n4K54j17
$$ 34 12 301 -29 -6 -45 -232 -144 155 180 -115 -157 -182 51 -98 134 109 -126 -22 93 -62 -116 138 21
3817B1j14J02Q0m25L65J39m59L83j3j07L8J34o5n8J57j2n27N13k67j09L85j55
$$ 21 -93 9 89 -336 29 168 -291 92 79 -28 10 144 79 21 178 166 -361 152 -115 -224 161 6
3839FN9K54k40k14J60M1j34J37n2n6m7j25K18J84M7j26l33P6J48OJ48q2k48J86
$$ 6 65 319 79 -135 25 66 -68 69 17 -39 -86 -211 7 191 238 112 -221 -145 3 9 157 75 -173 13
3863A3j74L61k41J31j48K21j18k02j75K56J18J47j58J53o0k38K03j93K74j62o6
$$ 13 -161 200 -41 90 -58 163 45 -157 -332 -76 42 189 31 184 124 -114 89 -104 170 8 -58
3884e8l3J25O2J36l68J11o8q1L21k10j56J96K6j99J19K08j19Q1l2M3l68K25j3
$$ -58 -91 34 96 232 -136 -25 -93 -174 147 -63 -219 -23 3 -196 -77 131 12 93 61 104 -264 -39 -52
3907e2Q7q0M5O4j21j0R8J50l27J84M7j67J39p9R0J10j06q1n6q8K01k2JJ66k12
$$ -52 35 -45 0 64 -57 -67 31 181 -146 38 85 -82 57 -22 68 178 72 -9 -65 -153 48 26 27 193 -19
3932a9K33j31L0l73L72j12K7m4J31k49L10o6q9P6o5j70J16J49j83l3J57L2k08
$$ -19 214 83 113 -260 112 0 27 -17 114 -135 175 109 20 96 31 -139 -23 126 -57 -90 67 99 -109
3955a09L32j49k32l6J7R2K14l24J63K6l26L49j33j3J63j0p8j69K12m1NK9J30m6
$$ -109 223 74 -158 -194 -177 -85 129 -195 -32 -6 -332 17 -116 -129 34 24 -54 -223 -11 -52 -47 -18 112 66
3979F6j76O3J37o3J10j86K42k66J81n7L6Q3k34L69k21r1L05l11l3R1j43j76J74
$$ 66 -110 -47 90 27 137 -49 193 -73 108 51 87 170 -64 305 84 -7 298 -13 -46 45 -98 -274 -100
4002a00P8n7j40J87K58j84J44l79M8M7L14k89K04j94M43l81k84L78k83K76qJk81
$$ -100 -22 -79 -219 -32 226 42 186 -193 -145 -98 216 -73 131 -63 380 -1 -285 93 -190 86 78 79 -202
4025b02J81j67L38q4j32J34R8l94K25k7J54j91K80l24J67k02k50L23o0J06j41
$$ -202 -21 -188 150 66 -66 68 166 -228 -3 -30 124 -67 213 -111 56 -146 -396 -73 -133 -27 -168
4046a68J50j41L45r3k17J3j38J13K30r1j27j3j03K33J37m7j83j8K28J48m29R4
$$ -168 -18 -159 186 93 -124 -111 -249 -136 94 3 -124 -137 -240 -7 130 83 -100 -118 110 258 -171 -77
4068g7j83J97j6K8j73k2M58j17q0Mk0l6J96l71M29q9j26pK18k35K54j44K1l7j60
$$ -77 -260 -63 -79 -51 -224 -246 212 95 15 19 -1 -37 159 -212 217 128 2 -5 213 -22 232 88 109 72 -88
4093h8r2L50j08L0l9l07R9L35j94L8%Qj25J60j73J82qj02K09l55Q9N2l7R3j0j1
$$ -88 -180 170 62 92 53 -254 -155 180 -14 24 24 32 -93 67 -106 76 68 -34 175 -180 -91 -39 -76 17 7 -4
4119dL7RN1k5k02j61J78J35m4k6j83J89k88L54k5O0j19PN4J33k13J32k30lk14
$$ -4 33 42 93 68 -134 -295 -117 18 -26 -52 -235 -46 -334 20 -5 55 -64 -57 -3 130 -83 49 -181 -184 -398
4144c98K00J16R1j02L77k00m6L59o62M18l02r3K24j47L70l21L30l12K65r1j01
$$ -398 -198 -82 9 -93 284 84 38 397 -265 153 -149 -242 -18 -165 205 -116 214 -98 167 76 -25
4165b5r7P4M0N2j68J73J78q3k0k65K71l19P4K46k14j94L56J11mk48o2J40m5OJ16
$$ -25 -122 -48 -8 44 -124 49 227 144 124 -141 130 -189 -115 131 -83 -277 79 190 186 -62 -124 16 -29 -23 93
4190I3m6O9r4k30L06Jk07P4j00Q9M4J32j87O3J07j93K56j3k81J77l58N04N5L5
$$ 93 47 116 22 -208 98 99 -108 -34 -134 -45 -1 131 -56 7 114 -79 177 164 -117 60 -298 206 261 296
4214B96m59M21k10J13l07J87kj8q8J45J92l23J36m3k1P4L8l06K84j81J56j62K31
$$ 296 -163 258 48 161 -146 41 39 21 -67 78 270 -53 83 40 19 93 131 -175 109 -72 84 -78 153
4237A53n6j83j38P2K61OJ08m07J36m4m5J62l9O1r7R1j36l08L08J93l8j95K40j37
$$ 153 97 -86 -224 -152 109 115 223 -184 -48 -92 -137 25 -14 47 -50 41 -95 -403 -95 98 60 -135 105 -32
4261c2J36k17m3J75P9j13P1k16J9lK16O5q7J36k21K03j05j58Q3j60j32M17l98
$$ -32 104 -113 -156 19 98 -15 56 -160 -141 -144 72 137 50 186 -35 168 63 -95 -12 -172 -304 113 -285
4284b85J99P8m4r8M6l3J82J98j90j25K3m1O5j39K87k3j32J29k08K75j91J5JJ6
$$ -285 -86 -8 -52 -150 -104 -137 45 243 53 -72 -49 -90 -25 -164 123 100 -32 97 -111 164 -27 -12 -11 5
4308EP5L74m23j01o1K43r8j0j35J92r8K36j96Q5l29K65j24J78j52J65k2j67NJ39
$$ 5 80 454 31 -70 -131 112 14 4 -131 61 -37 199 3 88 -241 24 -100 78 -74 91 69 -98 -93 46
4332D6J62j90K61l11J87k07L6K2j20J26P8j78J02J05k95J89o9m9K87k16R0m4o
$$ 46 208 18 279 -32 155 -52 -16 6 -114 12 90 -88 14 119 -176 13 -56 -105 182 -34 56 12 6
4355Fj1O9O8j41rk97K84n2O1On0N6K70l50K34j00p6J07oJ56l40J43K2j08q8J83
$$ 6 -5 64 132 -9 -18 -315 -31 -83 -22 -16 -66 -10 260 -90 144 44 -32 75 69 225 -115 28 50 -58 -146 37
4381C7n7l6L1o7K17j32L79l82k37L21j01K6k05L06j39j1M3j15K22j52J35q8m5
$$ 37 -20 -56 -25 -92 125 -7 372 -10 -247 74 -27 -1 -206 100 -39 -50 -7 -122 100 -52 83 -5 -50
4404e0J26K7k67R0J61j92j70N89k36j09l6k36M43l12L5R0o1L9N1J64r9q3l8J11
$$ -50 76 103 -164 -74 87 -105 -275 314 78 -31 -67 -303 140 -172 -137 -47 -108 -69 -18 146 47 -36 -74 37
4428C7j4P5j60K31q2k46p0J94P1pJ56k75K73j18k47L66O4k14j23r5R4M9N0M8j50
$$ 37 23 98 -62 169 87 -159 -229 -35 36 29 185 -90 183 65 -182 184 248 34 -89 -184 -90 -41 9 57 -93
4453i3J04J20j71L89k78j50N6K57m43L22m1kj54J74ojm8j43J84k28J42n8L15k93
$$ -93 11 131 -40 349 71 -79 -23 234 -209 113 72 70 -84 90 84 83 35 -108 76 -152 -10 -68 247 -46
4477d6p8R1j76l5L17kL56j086P26N63m88j5m36k29J391o45l5l59J89K59j26j61
$$ -46 -124 -33 -209 -244 73 71 427 -659 67 630 142 127 -309 -538 853 208 173 -186 3 262 136 -25
4499b5j80M16k43K03k12k00K07L4j57K32k96J25P2j88J36R2q1N7PL1j40L92k71
$$ -25 -205 211 -32 171 -41 -241 -34 0 -157 75 -221 -96 -24 -212 -76 16 -65 -8 -1 30 -110 282 11
4522A1Q5j3n6J44j87PP8j49n0K82j76j01K43k27l1J81q8o1K47j87j55L28m5o7
$$ 11 96 83 27 171 -16 -9 69 -80 -130 152 -24 -125 118 -109 -140 41 -47 -108 139 -48 -203 125 80 13
4546A3j56K35K05l51L6n3J07J32J71j81k40J28k14J70j41J82K9l45L49l52L53
$$ 13 -143 92 297 -54 -18 -71 36 168 339 158 -82 46 -168 2 -139 43 72 -273 76 -276 77
4567G7L6j9k88K60j5j36K22j17k05L21p2j29K03j11N1R2P7n1k26P6J57pj66pK5
$$ 77 113 94 -194 66 51 -85 137 20 -185 136 64 -65 138 27 78 170 247 196 -30 46 203 196 30 23 48
4592D8j70J7M3k13K1O06l97J94k18q5P4K55Lk6J2L5j6kj13j42O5J09j68j6J15
$$ 48 -122 -105 -62 -275 -254 352 -45 149 -69 -154 -80 175 178 152 164 199 183 181 68 -74 -9 100 -68 -84 31
4617C1j42J67K8q0J02k27O0K79l12o8O7K38m1j31n7m9oJ24p2K24j3m95L50O7j23
$$ 31 -111 56 84 4 106 -121 -61 218 -94 -162 -95 143 102 -29 -86 -135 -141 -17 -89 135 122 -373 -23 44 -79
4642g9J54n6j81P9p6K25J8L3q8j40Q6k8L59j69m05K76p2N8p9J34l7j97K5J38O8
$$ -79 75 19 -162 -83 -159 66 84 117 29 -111 -25 -53 306 137 -268 8 -64 -6 -85 49 12 -185 -160 -22 46
4667D6n7j21k4L40k71R2k9J05p4N5K09k94j05N5J89k14K21j4P4m6q4n2l2j5Q5
$$ 46 -11 -132 -156 184 -87 5 -24 81 7 62 271 -23 -128 -73 116 -98 123 109 183 137 53 1 -31 -46 39
4692C9p9j0M7R2j66L37j37k65K48j02J15k76k4J63KJ52j66J63j55k62L55j75J78
$$ 39 -40 -50 -3 89 -77 260 123 -142 106 4 119 -157 -181 -18 -16 136 -30 133 -22 -284 71 -104 74
4715G4j37k16J45M81j88k00J07R3j22k15J76J06k50r9N39p2j41j69rj56L41j69
$$ 74 -63 -279 -134 347 159 -41 66 159 37 -178 -2 104 -146 -245 294 222 81 -88 -97 -253 88 -81
4737h1P1J57r8J15j65o7L04m02L7n4L89r9k11P7Q5k44M08k13K26j27j47Q1j04
$$ -81 -10 147 49 164 -1 -68 236 -166 -129 -183 206 107 -104 -27 58 -186 222 9 235 108 -39 42 -62
4760f2J60Pk46p9J82J41q0O1M4n7j31Q6J37k35P0J8m8j27M5J21k11oK19p2J88
$$ -62 98 105 -141 -220 -38 103 23 84 128 71 -60 26 163 -72 -2 16 -32 -159 -114 7 -204 -210 9 -63 125
4785A25k88L24j58J42J12k57J86j26j66q1N1O8K02m60M87k76O6J79j49K04j37
$$ 125 -163 161 3 145 257 0 186 60 -106 -187 -136 -68 134 -326 161 -115 -49 130 -19 185 48
4806D8P5J07l54J11J53l5k02J29J18k18L2J19k30J45j26J29j00J79l20K70j69
$$ 48 123 230 -124 -13 140 105 -97 32 150 -68 -36 83 -147 -2 -128 1 -99 80 -240 30 -139
4827a39%J48O6j04J48k9k35J13K97k51Q4j84J2J27l36J04L32k05QM0P8j79K20
$$ -139 -139 9 75 -29 119 90 -145 -32 265 14 98 -86 -74 53 -283 -179 153 -52 -44 -4 74 -105 115
4850A15o7k69k6J10L2J33L1l5J23k08N6Q2J43m79J93J77J14l35K16l0k29M04m00
$$ 115 48 -221 -247 -137 -105 28 59 24 147 -61 -5 77 220 -259 -66 111 225 -110 106 76 -153 251 -149
4873a49L9R9R4k02J50J9m7j83m7J51J40M7k6l25K53n4k4J34j21J77j51N9J21j88
$$ -149 -110 -11 83 -119 31 50 3 -180 -227 -76 64 111 85 -240 13 -41 -65 69 -52 125 -26 33 154 -34
4897c4K54n14N65k42J77r6j80Q6n4o6o5L50k43k3J46l39J05J83k9r5k4P6j46L75
$$ -34 220 -294 271 29 206 110 -70 16 -38 -104 -169 181 -62 -85 61 -278 -173 10 -19 -114 -138 -62 -208 167
4921A67j76j3L4j81J1L01KJ30k07l00L00J43l1k91o8K63q6N4J63r8k99K13%O0
$$ 167 -9 -22 12 -169 -158 143 145 275 68 -232 68 211 180 -111 -179 84 -2 52 215 117 -182 31 31 91
4945I1j60Q0p2J19n3Q2J4j06r0K58n3J34l22R5Q6k54P5J34N0j07m0J84l6k08J7
$$ 91 -69 11 -61 58 5 87 101 -5 -95 163 110 244 -78 17 103 -151 -76 58 108 1 -39 145 109 -99 -82
4970h2j53K40p1m3J2j31J81j04j09L38j29RR9j58j33K31Ql7K8j93K23m2L5m7K5
$$ -82 -235 5 -66 -109 -97 -228 -47 -151 -260 78 -51 -42 57 -101 -234 -3 5 -32 -4 -197 26 -16 19 -28 -3
4995cj23O1J26K7j77P7Q0k26L73l73L31p5K8k81l6L99k55R4J04k19J06m7k71L56
$$ -3 -126 -65 61 88 -89 -12 68 -158 215 -158 173 98 126 -155 -191 208 -47 47 151 -68 38 -9 -280 76
5019G6R1o9L9j02K9L0O1k04mJ43O5j35m5J10Ko8r7K67k70m0m7p8K07Q7j89P7j0
$$ 76 167 98 137 35 64 94 155 -49 -53 90 155 20 -25 85 87 19 -78 189 -81 -121 -168 -246 -39 48 -141 -64 -74
5046g4M0J03M2k5Pr6j22J21p3j0QQ7j78L40L0k2j84P3l22L48N2j17k7l6K27k54
$$ -74 -34 69 111 86 93 -3 -125 -4 -77 -87 -79 8 -170 170 200 178 -6 67 -255 93 145 28 1 -35 192 -62
5072f2n9J10J5J2Q5k66J23j2J82k94O0M3k0K76k30j03R8K2k7N1JL8J5Q4j41P1
$$ -62 -121 -11 4 16 101 -165 -42 -54 128 -166 -106 -63 -83 193 -37 -140 -42 -20 -47 4 5 43 58 142 1 72
5098G2j25l7J1L7K09k37P9j21J58K8O8M2L8l94K5L9J22k29L17q7KJ11q2j45R3
$$ 72 -53 -90 -79 -42 167 -70 9 -112 46 74 142 184 222 -172 -147 -108 14 -215 102 15 17 128 46 -99 -6
5123fk8n7J65R3l53J38J10P4j4k59R7J60o1m1k15L04j94J98k19n8K5K70k94O4
$$ -6 -34 -91 74 167 -186 -48 62 136 122 -137 -40 120 59 18 -197 107 -87 111 -108 -166 -141 129 -165 -101
5147a01Q4J30M1m68L10L09l57J34j61l87O51J87j38r02Q43n59l13N59J14N80M25
$$ -101 -17 113 154 -314 -4 305 -52 82 -79 -466 185 372 234 -668 175 -384 -697 -138 -24 556 981
5168I81j103P4O79o44q36M79J68K44k41R9j71M19k81K08L5r7Q9j06L5j33L13k45
$$ 981 -122 -48 631 -13 -849 -370 -202 42 -199 -100 -271 148 -133 75 110 13 102 -4 31 -102 211 -34
5190c4N6j84l9L00j38K5K0J57r1n8k57J67K69k30m0J16N4j51K53k36K07m7k55
$$ -34 22 -162 -201 99 -39 -14 6 163 72 14 -243 -76 193 -37 -77 39 93 -58 195 -41 166 119 -136
5213a36o3J47k07K45J93k98J84j03j42L33j94J33m1k62J13P5j3N8j27m8J05j08
$$ -136 -199 -52 -259 -14 179 -119 65 -38 -180 153 -41 92 51 -211 -98 -23 -36 22 -105 -153 -48 -156
5235a56J26K22p4P9l91K35j42K60l68J00L03o5l31J31J78o7M4j55pJ73r0j94J96
$$ -156 -30 192 118 197 -194 41 -101 159 -209 -109 194 129 -202 -71 107 40 84 -71 -78 95 5 -189 7
5258GO6K14l29j68N1R3J84k72J66r7K44q7K0Jk5k31M5K41m8Q1k92M84o77L97o1
$$ 7 73 287 -42 -210 -159 -66 118 -154 12 -85 159 72 92 93 68 -163 -118 123 75 156 -136 348 -329 68 7
5283Gqj31J67lk39K20j21K30r3L7j08k12L84r1l56M87k38J33m2M2j79J95Q9j66
$$ 7 -1 -132 35 32 -207 13 -108 122 29 66 -42 -254 130 39 -317 170 -68 65 23 65 -114 81 170 4
5307Do6o7K9J06q5Q9J53j24k05J80R3o0m4J68j55j41J93q7o1J7R2K2J03l93K29
$$ 4 -62 -129 -100 6 -79 10 163 39 -166 14 107 47 3 171 16 -125 68 -19 -80 -63 29 51 154 -239 -10
5332a0j1J5p8r7M11l75J61M2k96L54j25N3l25L44l5J1J1K50k85R4L0n6J78j82
$$ -10 -21 -6 -84 -181 230 -145 16 58 -238 116 -9 44 -281 63 28 39 50 300 15 109 139 83 261 79
5356G9n4k18K92j59N3j6M8j38L06k54j01p1L59k22jK90k04J75k79o5K04K31j93
$$ 79 25 -193 99 -60 -7 -23 25 -113 193 -61 -162 -233 126 -96 -97 193 -11 164 -115 -180 24 255 62
5379F2j12l18L04P6j61J9J94j07m2o1NK27O0k68M06l26j14J53j13J65j49K01q1
$$ 62 -50 -368 -64 12 -149 -130 64 -43 -85 -146 -141 86 146 -122 284 -42 -156 -3 -116 49 -100 101 20
5402B0j02M17o57J66K8K60j76n6K28j40k75J36Q6k11qL61K6qj15J73j75K0j08
$$ 20 -82 335 -322 -156 -128 132 -44 -100 128 -12 -287 -151 -65 -276 -284 77 103 95 -20 153 -22 -2 -110
5425a10K3J09j80J40n3J79J32m69Q1K03K7j71l10K56K63j87K47l63L20m88L00
$$ -110 -87 22 -158 -18 -71 108 240 -229 -148 55 82 -89 -399 -143 120 -67 180 -183 137 -351 -51
5446e1K0K2k19J06L20k32k7R2kJ03k12J22K45j89O8l09P1J04J06j93Jj55K01r2
$$ -51 -31 -9 -228 -122 198 -34 -61 31 29 132 -80 42 287 98 166 -143 -72 32 138 -55 -54 -209 -8 -100
5470a00R4j7r6L15k46Q1mk83L63r2jM8j13P4m5o0K26j89M0K94m28J82o1R8J03
$$ -100 -6 -23 -119 196 -50 31 27 -256 107 15 14 62 -51 23 -22 -82 144 -45 -5 289 -139 43 -18 80 183
5495A83k35L8J01n8j04J6J06j12O4o4J53j0j0j04K44l21q5J04K6N7J92j09k0J83
$$ 183 -52 -14 87 29 -75 -59 47 -65 -1 -65 88 78 68 -36 208 -113 -198 -94 -68 -11 181 72 52 235
5519B35j74k57M0N2J4Q3k44R5J01o2K81J87m09j0o6k8L12k75J52J97K6j97j35
$$ 235 61 -196 -156 -104 -90 -7 -251 -156 -55 -117 164 351 -58 -68 -134 -162 150 -125 27 224 250 53 -82
5542h2J7M0J95j23n4O6j93R9K74k16k82K76J18j42L78o59K51r0J71l85J49J43
$$ -82 -65 -25 170 47 -7 59 -134 -35 239 23 -259 17 135 -7 371 -288 -37 -127 44 -341 -192 -49
5564d9j3K59Ll86M23k87K1J26k0K08j52j11J7K0j13j19J6K08j24K24j44J01l43
$$ -49 -62 197 200 -186 237 -50 -29 97 77 285 133 22 39 59 -54 -173 -157 51 -73 151 7 108 -235
5587b35M89j79J54q1q5j09o3O1J31j67L0J34j7n8L94n77M5J24J72l21L8P9p9%
$$ -235 254 75 229 148 63 -46 -109 -48 83 -84 -54 80 63 5 399 -178 -133 -9 163 -158 -120 -41 -120 -120
5611a20J26K00k12l70J09J11J26L6n8K74l22L9L72n21K92j1M5k13K35K0m12K46
$$ -120 6 206 -6 -376 -267 -156 -30 6 -52 222 -100 -61 311 -210 82 71 116 -97 138 158 -254 -8
5633hJ38N1K67m89j30j22J04J55j4N3j38J46M1j1j20LL3l4K50l50K88j3J7q9j6
$$ -8 130 181 448 -41 -171 -293 -189 -34 -48 5 -133 13 54 43 -77 -74 -41 -75 175 -175 113 100 117 28 12
5658A2J25K1o1j65P9J4j8K3j63J44l0O9j76P1K57k97Q3J31J7l84K51j49K03K5
$$ 12 137 158 97 -68 11 25 7 30 -133 11 -19 50 -126 -55 202 -95 -12 119 136 -248 3 -146 57 82
5682H2l5m6k0J5J57j51K33k07K31k06n0l78L28O5k16L50k14J47j67J21k07K76
$$ 82 47 1 -19 -4 153 2 235 28 259 53 3 -375 -47 18 -198 152 -62 85 -82 39 -168 108
5704A08j59O5J78j00L1o4j91O2K22P7j80k20K86o7j89jK02o5o7l1J26O2N4k17
$$ 108 -51 14 192 92 123 59 -132 -70 152 229 49 -171 115 48 -141 -142 60 -5 -72 -103 23 85 139 -78
5728g8M5l6j04L26k58k3k5J34j10l6K45n8N8j06j08K05k29M61n0l96K15n9j69
$$ -78 -33 -69 -173 153 -105 -128 -153 -19 -129 -165 80 22 80 -26 -134 71 -158 303 253 -143 72 13 -156
5751a56K75N7l09K75k4j59p6K37K5j90J59j96J57k89K18KM8j74j58K49Nj95M80
$$ -156 119 176 -133 142 118 -41 -117 120 145 -45 114 -82 75 -214 4 6 54 -120 -278 -29 -24 -219 261
5774B61m95J29L2j74J82J14J0O8Mk5j36J08k01N4Q5mn7N7j13j5J46m5j77K53J91
$$ 261 -234 -105 -73 -247 -65 49 59 127 131 106 -30 78 -123 -69 16 12 -45 12 -101 -116 30 -15 -192 61 252
5799B52k09J05j96L37k88N3j85n6J78k1q6o3K8K92l69Q5J1K27k3j48K55j07j19
$$ 252 43 148 -48 289 1 54 -131 -187 -9 -30 -116 -179 -151 141 -228 -143 -132 95 72 -76 179 72 -47
5822d7n6M06l46J01Kk17K19q7j37R9J12J03k26J69J72j19k13Q4K70k98p9Q8J13
$$ -47 -103 303 -43 58 60 -157 62 -25 -162 -63 49 152 -74 95 267 148 -65 19 289 -9 -88 0 113
5845A13k14K09k15K36L40k69k25r9K17p4n4m6K01p9j34j58J57L87o06J08J53j56
$$ 113 -101 108 -107 129 469 200 -25 -124 93 19 -35 -81 120 41 -93 -251 -94 293 -313 -205 -52 -208
5867b08K22J57k08PJ07o2K29j44k09O7q2J47O1j02r5L70k51j23j39L88o9j68Q3
$$ -208 14 171 -37 -30 77 15 244 100 -109 -42 -124 23 84 -18 -113 257 6 -117 -256 132 63 -105 -22
5890b2r8P2o9J93j77K61k71J30k68J86J67j69L33k63o9L7Q9Pj95J8J61J11k56
$$ -22 -120 -48 -117 76 -101 160 -111 19 -249 -63 104 -65 268 5 -64 -27 62 69 -126 -108 53 164 -92
5913i2LO1K17k05k91L79r0k4J84k44M9j53J79J21j54j19J29j05K09K9k84n6M10
$$ -92 -89 -28 189 -16 -307 72 -18 -42 142 -102 -53 -206 -27 94 -60 -179 -50 -155 54 83 -201 -257 153
5936A53j92K32m3K1m21L72J67l47k6J35j51J25J31j51K7l5j10Q8o2l1J10j13J27
$$ 153 -39 193 150 171 -250 122 289 -58 -84 51 -100 25 156 5 32 -3 -113 -25 -87 -118 -8 -121 6
5959Fq6J28q2J35M2l64L56j09j75L52j62K18m98L45Q7p7m10N17j54o2j20J22N5
$$ 6 -80 48 -34 101 143 -221 135 26 -149 203 41 259 -239 106 193 116 -294 223 69 7 -113 9 64
5982F4j07J11nn1j43J24J61k70J22Lm4J77J8k52K33o2j66J29R7j49p2MQ1k00J61
$$ 64 -43 68 63 12 -131 -7 154 -116 6 9 -35 142 160 -92 141 79 -87 42 139 -10 -82 -78 3 -197 -36
6007c6O8o7m8K80j48p8j53L05j02J0P5l23J93q7J46l56K86K1n2N0nJ4j24L3jR7
$$ -36 32 -35 -83 197 49 -29 -182 123 21 31 106 -217 -24 -111 35 -321 -35 -14 -66 -16 -21 -7 -131 -98 -99 -2
6033bm6J59Rr4j07K31k78nk6J24j61L44l1J00j83j67J31j61M70l31N9l3R4j25
$$ -2 -48 111 120 26 -81 150 -128 -133 -159 -35 -196 148 117 217 34 -133 -2 -163 307 -24 35 2 96 -29
6057b9j12NL02k22j84M06j78j7k11K11R7r0R4O0o1n6m4J46j39l8J31j18OJ47k01
$$ -29 -141 -136 166 -56 -240 166 -12 -29 -240 -29 68 -22 72 132 71 15 -29 117 -22 -60 71 -47 -41 106 -95
6082i5L07k43k63L94j26j01K69j64J76k55J84o0r6j7J58J38k05K09o1k10n2l7
$$ -95 212 -31 -294 100 -26 -127 142 -22 154 -101 83 23 -73 -90 68 206 1 210 149 -61 -113 -150
6104a50p2L23r2k71K80J39j62j58N6P2j19K97k97J3K62N9K2l42K84J0k68N9n4
$$ -150 -222 101 9 -262 18 157 -5 -163 -107 -35 -154 143 -154 -141 121 180 202 -140 144 154 -114 -55 -109
6127a09O3j54O1K06j25K9m8l4l1J47P0J25k58L4J49k05J72k73L6O3P7n5j5K3R0
$$ -109 -46 -200 -139 67 -58 -29 -77 -111 -142 5 75 200 -58 -24 125 -80 92 -181 -145 -82 -5 -60 -75 -52 38
6152C8J54l78M3J86p6J38j80J1k1L9j02M04l35R6k00O5K05j65J88k05LJ18n7J69
$$ 38 192 -186 -143 43 -33 105 -75 -64 -85 -46 -148 256 -79 17 -183 -118 87 -78 110 -95 -92 26 -31 138
6176A38k67P1j26J9J31j64K50M0J19j14j3lk23K42j42Q1k39K40j0R0P9j72k03
$$ 138 -129 -58 -184 -165 -34 -198 52 92 211 97 84 81 -142 100 -42 39 -200 40 30 120 199 27 -176
6199a76p2J06J3O8J67j00Lo9k3N0K12k93M20L5n39K66k27N4J28j40jJ35L2m9%
$$ -176 -248 -142 -129 -61 106 6 9 -60 -83 -33 179 -114 306 341 -198 68 -159 -105 23 -117 -118 17 49 0 0
6224@J06j33j41J59J09l71L14M5Q8n8N1k6j29j22QK54j62J64p7o8o5K01k13r8
$$ 0 106 -27 -168 -9 100 -271 43 88 176 118 169 143 14 -108 -100 154 -8 156 79 11 -54 147 -66 -164
6248a64J14j07L2J41n9J28k66K42M5M8n3L5j04L8L7j21J02k74K86j21j14j75K41
$$ -164 -50 -157 -125 16 -43 85 -181 61 106 154 101 136 32 70 107 -14 88 -186 100 -21 -135 -310 -69
6271f9jl56N02J29m97J97K50J95j31K06p38K6O19j63j012O61L60n00M14m69n14
$$ -69 -70 -426 76 205 -292 -95 155 350 219 425 -313 -287 332 169 -843 -182 178 -322 92 -377 -891
6292h91O51K38j46P5P4R0j7J35k73J09jR7M9j9k10J59L9r6j44m4kM9J66l83K02
$$ -891 -240 -2 -148 -73 1 91 74 209 -64 45 44 141 190 171 -39 120 159 63 -81 -125 -127 -78 88 -295 -93
6317i3R1k37K36P6oj66jj70K47L0j4J2Q2k1L8j22O0j66K22M3j7l07K26j18K4j35
$$ -93 -2 -239 -3 73 67 -99 -100 -270 -23 7 -7 5 87 66 104 -18 42 -124 98 141 124 -183 43 -75 -51 -186
6343a86K13P5j75J67k5Km9J46q0m7j54l7J57k27J55J53j5m23K62k1J71j5M5qq6
$$ -186 27 102 -73 94 69 71 22 168 88 41 -113 -150 7 -220 -65 88 73 -350 -88 -109 62 47 92 84 -2
6368bJ20q9J90j32k58K76J96m05K35j03O4m6k3Lk53J71p6J63q9J13l9l06J28K54
$$ -2 118 29 219 87 -171 105 301 -104 131 28 92 46 23 26 -227 -56 -132 31 -58 55 16 -290 -162 92
6392I2j84L38L9k90K51k90J62k14l3K83k06l4J88K2j52Q6j61J88k04K1P1j59J67
$$ 92 -92 246 285 -5 246 -44 118 -96 -129 154 -52 -86 102 124 -28 58 -103 85 -119 -98 -27 -186 -19
6415a9J46K90l29k30J13j36J1K16o5j03J82j72J75k57J64P2j74j09K37N2p6p6
$$ -19 127 417 88 -142 -29 -165 -154 62 -3 -106 76 -96 79 -178 -14 58 -116 -225 12 64 -12 -88
6437h8J42J4j27K53l79L07J79m79J31N4k40J98o9K50k31K58J42o2l22J88Lq6N0
$$ -88 54 68 -59 194 -185 122 301 -178 -47 7 -233 -35 -104 146 -85 173 315 253 -69 119 122 36 86
6460H6q2J89k06J43j42N6L4k61j71L13L40m21K34l07K82R7n7k99M5J43k03M61
$$ 86 4 193 -13 130 -12 44 78 -183 -354 -41 299 -122 112 -195 87 184 127 -172 -127 16 -187 274
6482B74k08k12J61k1l6K15k24OL4j87K46L4o6n0R1q1r1Q6j18L32j01k55J23j52
$$ 274 66 -146 15 -6 -42 173 -51 -45 -11 -198 48 82 16 -34 57 -24 -115 -29 -147 185 84 -171 -48 -200
6506b00J86k1n6K69j5n7j11J0j91K22j41J06q7J86j27K29k51J56j00j54J6N4Q8
$$ -200 -14 -35 -91 178 163 106 -5 5 -186 36 -105 1 -86 100 -27 202 -49 107 7 -147 -131 -77 11
6529A1J48k75K32m10L49j7r4J7L4p8J91j57l2j00L85p4m69L99N2M4m61L50l2j4
$$ 11 159 -116 116 -294 55 38 -56 -39 -5 -83 108 -49 -81 -181 204 130 -339 60 112 156 -305 45 13 -1
6553aK12J30l56o0J34j34K39l00j30M54l1j25k37K60l1l2l45M77j07o9L3J72j85
$$ -1 211 341 -15 -75 59 -75 164 -136 -266 188 157 32 -205 55 24 -8 -353 124 17 -52 -19 153 -32
6576c2j28L92J26l94J30o9k42K66K8m8k39L00m4R8k18J85j18j69o4L74j66J2N2
$$ -32 -160 232 358 -36 94 25 -217 49 77 29 -210 90 46 144 -74 111 -7 -176 -240 134 -32 -20 32
6599C2j57J09K5j21k30K83J14k35J65pP5j02J39J79l30K68k76Qj57K14M1J44O1
$$ 32 -125 -16 9 -112 -342 -59 55 -180 -15 -22 53 -49 90 269 -61 207 -69 -61 -218 -4 37 181 242
6622B42k68N8l2q1J12Q0l31K58K20k27J81k40R2l29N6L70m70L64j73Q3R0J6p1
$$ 242 -26 32 0 -81 31 111 -220 38 258 31 212 -28 64 -265 -209 161 -309 55 -118 -35 55 71 0
6645@R2j51o8Q0J86l54J53J76k26j04K23M33l43pJ04J8p7j67j16J9M4K13j96P6
$$ 0 92 -59 -127 -47 139 -215 -62 114 -112 -216 7 440 97 90 194 212 135 -32 -148 -129 -85 128 -68 8
6669HM6j3k01K7K93j7l00kM70j90j03j64P8O5l24K06J38j22J02j8k12L00j51J13
$$ 8 54 41 -160 -133 160 143 -157 -159 311 121 18 -146 -68 -3 -327 -121 17 -105 -3 -21 -233 67 -84 29
6693B9j49J20M86m92j31L3l4O6M1j81O5k60K10J36O8k4j25j17M71j61k08K10J99
$$ 29 -120 0 486 -6 -137 -104 -138 -72 -31 -212 -147 -407 -197 -61 7 -17 -142 -259 212 51 -157 53 252
6716B52k81o6j45J95J88m64M13m58M36N9n26J68K54Oj68K29L2J3j05N0J18k60
$$ 252 -29 -95 -240 -45 143 -321 92 -366 70 129 -397 -229 25 31 -137 92 124 137 32 82 200 -60
6738f0J88j66M0mj33K26j92M6m7P6j7R8m4j48K43o9K2M8j60O2J2O7k01N8k8R5
$$ -60 128 -38 2 -2 -135 91 -101 -55 -102 -26 -43 55 11 -137 106 37 59 107 -53 9 21 88 -113 -55 -83 12
6764A2pj05O2K56l96J52k05L93j06k99K98j43j2j58L1L23j28K8J09K22k21n0R0
$$ 12 5 -100 -38 218 -178 -26 -231 162 56 -243 55 -88 -100 -258 -227 96 -32 -4 105 327 106 56 146
6787A46k91O7L4P3m2K80l75J01l7k7Q6j6k10N10l47Q2j28j76J63J92j65J54k43
$$ 146 -145 -78 -44 29 -13 267 -108 -7 -44 -71 15 -1 -211 299 -48 34 -94 -270 -107 85 -80 74 -169
6810a69L9K17j66K52l65K17o3o7K17j09n3K26J8r7k34K85k2q5j79K59k51J79J15
$$ -169 -130 87 -79 173 -192 25 -38 -105 112 3 -50 176 194 97 -137 148 126 41 -138 121 -130 49 164
6833A64k51j53K06K72J09n80K23J57j22p5m4j61J47J8j01K67L1j96R4lQ0Rk15
$$ 164 -87 -240 -34 238 347 -233 -10 147 25 -50 -94 -255 -108 -90 -191 76 107 -89 5 2 82 91 -124
6856a24J25K52l95J82J3Nj66J93J82k46r8K33l7k93J79j1J27l0r8J83j83n3%P4
$$ -124 1 253 -142 40 53 58 -108 85 267 21 -77 156 119 -174 5 -6 121 91 -7 176 -7 -60 -60 14
6880A4n4j92J10K58k33K74j26J67k16m1k0l1k3Q7j80L02J27k78l4K3L39l88N5
$$ 14 -40 -232 -122 136 -97 177 51 218 2 -39 -59 -90 -113 -26 -206 96 223 -55 -89 -66 273 -115 -60
6903f0L9R7j02Q0l01J59M39m27NJ07J6R3j18j92J78l0k2J37k4P8k56J45l02nL42
$$ -60 -21 76 -26 54 -247 -88 351 -76 -71 36 52 145 27 -165 13 -17 -39 98 74 152 -104 41 -261 -266 76
6928G6O3j90J56l0j56K62j38l1k02L42j56j51k8L49k30jm2O5j34K65l6j46J09
$$ 76 139 -51 105 75 -81 181 43 12 -190 152 -4 -155 -183 166 -64 -65 -107 -42 -176 89 53 -93 16
6951A6J32k43L2j32Q1M6J43j06o9J14k03J50K7O0j98K61J44k63j53J03J18Q4l1
$$ 16 148 -95 -63 -195 -114 -68 75 -31 -100 14 -189 -39 -12 48 -150 111 255 -8 -161 -58 60 144 113
6974A13j04%Po0p1K59o1k25j3K98j61O7K35l53K9L39k86O2j95J83J6l8n3k11M08
$$ 113 9 9 16 -44 -115 144 83 -142 -155 143 -18 49 284 -69 -40 299 13 75 -120 63 79 41 -12 -223 185
6999A85k84m7M2O2m0R5K0Nj92R4K6l1l3K07j1n9m55O29j09k99R4r1K47J16k25
$$ 185 -99 -146 -104 -42 -82 13 33 38 -154 -60 -34 -65 -98 109 98 39 -416 213 104 -195 -101 -192 55 171 -54
7024e4j19K29jO2R3k12o1K12n16N86k98lr3J64R7L6Q4k02j64K22R8k62J87q0j0
$$ -54 -173 56 55 117 210 -2 -63 149 -367 219 -79 -82 -175 -11 86 122 206 4 -160 62 160 -102 85 5 -5
7049ek24L86O2k45j12K54n7l5Q0k05l7l47O66k9j19L0j24R0J7r0K90k43Q8o4L5
$$ -5 -229 157 219 -26 -138 116 59 24 104 -101 -138 -485 181 152 33 63 -61 29 46 -44 246 3 91 27 62
7074F2o1j12K13n7n0P6q5J78j04M2n7J7j95J8kp6K01R9j13L2R0j04K16k78lN5
$$ 62 1 -111 102 45 -5 71 -14 164 60 102 45 62 -133 -115 -117 -193 8 107 -6 26 116 12 228 -50 -53 2
7100Bp6J69j42K75l20r7O1O9o2LK06k25P2j8K12l6r2K3k02N4J41J57j63N7l5O9
$$ 2 -74 95 -47 228 -92 -189 -128 -59 -121 -118 88 -137 -65 -83 129 93 1 24 -178 -124 17 174 11 68 33 102
7126A02j20n9l1K83r0M4l59L66n4j60P4K3M8j06N2P7j37Pm5J88M9k47P9n7N4k6
$$ 102 -18 -77 -108 175 85 129 -230 136 82 -78 -4 19 67 -39 13 90 -47 -40 -85 103 152 -95 -16 -73 -19 -45
7152d5n3O6j01O0m9O7j30J23pr5J79k68K87j6k76K62j76K07k49O3J4R4J47m3r2
$$ -45 -98 -32 -133 -73 -122 -55 -185 -62 -69 -164 15 -253 34 18 -258 4 -172 35 -214 -151 -137 -43 104 61 -31
7177c1L0j0j81J25J4J58j04j40K67m4Pj42L04k14j51J32r1L47m45J94j96P5K31
$$ -31 -1 -11 -192 -67 -53 105 1 -139 128 84 91 -51 253 39 -112 20 -71 276 -169 25 -171 -96 135
7200A35k29N9J12k47N5J47j68Q9ML3K08j32k92K56J86m64K16p6J23O5M5j06R7
$$ 135 -94 -35 77 -170 -115 32 -136 -47 -43 -10 198 66 -226 30 216 -248 -32 -108 15 80 125 19 116
7223A16K6j31K3j23J81m0k34L97o9j02n2pk98K14R2L9q4pJ02j01M0Q8K07m7l50
$$ 116 142 11 34 -89 92 52 -182 215 146 44 -8 -15 -313 -99 -7 32 -52 -59 43 -58 -18 70 277 230 -120
7248a20J72j06N9j51j01K07J16k13N5J24Q7q2n2k06K0K66k74L9L6n9J40MNK5j7
$$ -120 52 -54 5 -146 -247 -40 76 -137 -82 42 129 47 -5 -211 -191 75 -199 -160 -124 -183 -43 -39 -34 -9 -26
7273b6J14k06K49l98J77n0K2j93K72r8J32O1j57j8j0q3N0J78n2J76l13K20k23
$$ -26 88 -118 131 -267 -90 -140 -118 -311 -39 -137 -5 56 -101 -119 -129 -212 -162 16 -36 140 -173 47 -176
7296a76K66j96lJ83O9L8k65J66L7l05J76J35j17o6J14q6K3n8O8k66K95P9m4q3
$$ -176 90 -106 -109 74 143 181 -84 82 119 -186 -10 125 8 -58 56 -30 -7 -65 3 -263 32 111 67 -16
7320a6J7R7j40J59j38j33l3L10m4RJ44l57P2j27J09j80J61J1J95o2Rp2J35j69
$$ -16 1 98 -42 117 -21 -154 -187 123 79 88 232 -125 -53 -180 -71 -251 -90 -79 116 54 63 -9 126 -43
7344d3J37k40r2J84p3K52k23K02l9m6j04L1r1K3L16m20L09k74K53l4j35N5j00
$$ -43 94 -146 -238 -54 -127 125 -98 104 65 19 -85 -54 -145 -122 194 -226 83 -191 62 28 -107 -52 -152
7367a52M7K62k91K18j72J51Q8k36J01j07J02j02J94m26L32k40L00j59K03k09L03
$$ -152 -105 157 -134 84 -88 63 151 -85 16 -91 11 -91 103 -323 9 -231 69 -90 113 -96 207
7388B07j98J10j51q9K31j21Q4j10R8j52N1N6J42k13q7r7M0K60o4j30MN1Q6jl2
$$ 207 9 119 -32 -121 110 -11 73 -37 61 -91 -40 16 158 -55 -142 -239 -199 61 -3 -133 -129 -78 8 7 -25
7413b5J59J05m9k16J60J63l16K07k79L27j75k38J11J84Q2k53l2M3j64p6J13K09
$$ -25 134 239 190 -26 134 297 -19 188 -91 236 61 -177 -66 118 200 -53 -85 -42 -206 -282 -169 40
7435D0K1j31L3j47O8j4J60j41J48j01O0R6k11j5K71O0o0K1k41%J99p4L3n5QP4
$$ 40 61 -70 -37 -184 -116 -130 30 -111 37 -64 -4 92 -119 -134 137 197 137 158 -83 -83 116 42 75 20 28 102
7461A02J60k10n2R9k28K56m6k88N28l07k1J7pj41J83p9Q5o8J7R7j61K17M9M2j80
$$ 102 262 52 0 99 -129 127 81 -207 321 14 -7 10 3 -138 45 -34 51 -17 0 97 -64 153 202 244 64
7486F4k0O9j66J59o5K7m6Kk25K66j44p3K34j99J93o2N7JPj64O4q5K27q1K25k24
$$ 64 44 113 -53 106 41 68 22 24 -201 65 -79 -152 82 -117 76 14 71 72 79 -85 -21 -106 121 40 265 41
7512D1k35J78l9K65j74J14r8M4k90L60k89J23M5p3k26L00O4M8M0j03J39k90MO4
$$ 41 -194 -16 -55 210 36 150 52 96 -194 166 -123 0 45 -28 -254 46 110 158 198 95 234 -56 -52 12
7536A2R3j86J23L5j67L4K0J1K16Q6k62q1JJ56l65M44k47j98R8K24j66R4J93j57
$$ 12 105 -81 42 77 -90 -56 -36 -25 191 277 15 -66 -65 91 -274 170 -77 -275 -177 47 -119 -25 168 11
7560A1J42j68J43j44L3J06j64j16K5J82o8J21Rq1k7P4m8j14n6K40N3m26M52j64
$$ 11 153 -15 128 -16 17 123 -41 -157 -132 50 -18 103 112 31 4 78 30 -84 -140 100 153 -273 179 15
7584A5J98k48j89J48R5k40K54r1j95K44j22J41rJ62l69J68J28M9P2l37L2nk1P6
$$ 15 213 -35 -224 -76 19 -221 33 -58 -253 -9 -131 10 1 163 -206 -38 90 139 211 -126 -94 -99 -120 -44
7608d4N5L1r1J91k22j6K4KR0L8j4R5j89J35J76j48j30p8K2J42m0J65k78J71L25
$$ -44 11 42 -49 142 -80 -96 -72 -70 20 58 44 139 -50 85 261 113 -17 -95 -73 69 29 194 -84 87 412
7633D12k68k63O8Kn5J87J9j97M4K00r7j73K63n3m3k5j31K67j65J0R3l02L81r5
$$ 412 144 -119 -51 -49 -104 83 102 -95 -51 149 52 -121 142 89 46 21 -110 157 -8 2 95 -207 174 79
7657G9j82l3J35k21O7L9J46N3n4k1O3P9j39j45J37l03M98k51j42J86j29K92q4
$$ 79 -103 -136 -1 -222 -155 -116 30 83 29 8 71 150 11 -134 3 -300 198 -53 -195 -9 -138 154 70
7680G0k1r5J30j06O9j82J12nJ71l36q3J08J22N1p5N2M0j02K63j43j32KP2k00N51
$$ 70 49 -46 84 -22 47 -135 -23 -28 143 -193 -276 -168 -46 5 -70 -18 22 -80 183 40 -92 -90 -18 -218 333
7705C33n37K58p9J26M5k42P2N7K5R5o2j51pl5J62m6j24J22K9j01J54j72k42K46
$$ 333 -204 54 -25 101 146 -96 -24 33 58 153 91 -60 -67 -102 60 14 -110 12 41 -60 94 -78 -320 -74
7729g4L39l59K78j69J96l08J99k6j31j26K64j1o6K08l04O4J36j13%K30J06n8k05
$$ -74 265 -94 184 15 211 -97 102 76 -55 -181 83 72 6 214 -90 -26 110 -3 -3 227 333 275 70
7752G0J15k65J92kj77m0kQ1L0k45K46j91q4L25J86n9J04l78M11m38J00j24J76
$$ 70 185 -80 112 110 -67 -107 -109 -28 2 -243 3 -188 -272 53 239 180 284 -94 317 -121 -21 -145 31
7775C1j01J47q6J81j17q9l0q8M9J02p3o0L7p6J03n2K24l22J59m6J4J34j07O8n1
$$ 31 -70 77 -9 172 55 -34 -64 -152 -103 -1 -74 -134 -97 -173 -70 -122 102 -220 -61 -107 -93 41 -66 2 -49
7800d9Q2j14o2K47r7j57J88k5J27j69P7K0k38N4K40n7k36J19m2K99j26j73k18
$$ -49 33 -81 -143 104 7 -150 38 13 140 -29 48 68 -170 -116 124 67 -169 -50 -92 207 81 -92 -310
7823c10K07J72L5mj55K53j11n7M6k5j80L96m47L4L29j88J21k09r8L56Q6k47J38
$$ -310 -103 69 104 100 -55 198 87 30 76 51 -129 267 -180 -146 183 -5 116 -93 -191 165 251 4 142
7846A42Mr7j93K85j70j04L45j46j73Q3J03j04L3J34j39j24K05j96N6J42n7l8k34
$$ 142 146 49 -144 141 -29 -133 212 66 -107 -24 79 -25 8 142 3 -121 84 -112 -56 86 29 -9 -243
7869b43J95p0K70j70k76L08K0l4j28J98j4q7K5J68n2j54P1j27J85q0O3j90K37
$$ -243 -48 -118 152 -18 -294 14 34 0 -128 70 56 -31 -6 162 110 -44 27 -100 85 5 68 -122 115
7892A15j94j62L60j06k14j55M04P1P6j91J26l85O8J7J60J07rj25m5K49J9j25k20
$$ 115 -79 -241 119 13 -201 -356 48 119 195 4 130 -255 -187 -170 -10 97 88 -37 -82 167 186 61 -159
7915a59J72n3p0KN3m9J46J13m9j42N1k79K06J48m6l2J32j28k51J91J15j54J84
$$ -159 13 -40 -110 -108 -55 -104 42 155 106 -36 15 -264 -58 90 44 12 144 16 -235 -44 71 -83 101
7938A01o3j64O9K5L0m4m0k1R7j12n0M5lK11p7q0R0j61K93p2j59J15j96J31K24
$$ 101 38 -126 -57 -32 -2 -46 -86 -107 -10 -122 -172 -127 -130 81 4 -76 14 -147 146 74 -85 30 -166 -35 189
7963A89k81Nl1J04K48k43J25j88K20j22k3J03j42M4R7j27qO8p3R7M7l60K55J61
$$ 189 -92 -87 -118 -14 234 -9 116 -72 148 26 3 106 -36 8 105 -22 -30 38 -35 62 109 -251 4 165
7987A65J11J10m06L5Q7k34l7L08j24j81K21j39Q2j47J76J8K55l07J52j70j10L03
$$ 165 276 386 -20 15 102 -132 -169 139 15 -166 55 -84 -2 -149 27 45 300 -7 145 -25 -135 168
8009A68k01J08Q8k11k6J23o6j62O9R1k14K15r0Q6J57j35r3J14J33K9k17k2mJ24
$$ 168 -33 75 163 -48 -74 49 -17 -179 -110 -19 -233 -18 -108 -22 135 0 -93 21 154 183 -34 -56 -60 64
8033F4J13P7j72J57n95M40L5j47M8j7N8L2k13K1J02j7J83k55J50o6n6J09j73J26
$$ 64 177 254 82 239 -356 84 119 -28 20 3 61 93 -120 -99 3 -14 169 -86 64 -2 -58 51 -122 4
8057DK04k66Q6N5l17R6J49p7J29m5o4j28J43Q7j90J47Oj10K08O2m2j28J04j80
$$ 4 208 -58 28 83 -234 -138 11 -66 63 18 -46 -174 -31 56 -134 13 19 -91 117 179 137 9 113 -67
8081f7P2J17j3p2P1J1J29j67q1r7J28RK13k07r2R0o2pj9J64j55M0o8l47N26m03
$$ -67 5 122 109 37 108 119 248 81 0 -97 31 40 253 46 -46 44 -18 -25 -44 120 -35 5 -63 -410 116 -287
8107b87J69Q4KL19m61J32q4M0J99j03Q7l7J60k33K06l38q7K32L5k1K5j3M2R3L7
$$ -287 -118 -34 -32 287 -174 -42 -126 -86 113 10 97 60 220 -13 193 -145 -232 0 35 14 39 26 68 161 198
8132A98p5m5r0J94k48L9Q9P3k56J75J42k90J45m3K57l66K35j22k2J08k8j3J26
$$ 198 123 78 -12 182 -66 -27 62 135 -121 54 196 -94 51 8 265 -101 134 12 -10 98 70 57 183
8155A83K6j33O1k22K12n2l76K80j66K51j0j64o7L42k06J09j22J0J27j47pm2k35
$$ 183 209 76 137 -85 127 75 -301 -21 -187 64 54 -110 -177 165 -41 68 -54 -44 83 -64 -71 -113 -348
8178c48L93k07N9J28m8p5J68j44j32K9L09r6N6
$$ -348 45 -162 -103 25 -23 -98 70 -74 -206 -177 132 36 92
8191I2
$$ Imaginary data points
##PAGE= N=2
##DATA TABLE= (X++(I..I)), XYDATA
0@%%%%%%%%%%%%%%qJ6j6J6j6K4l2L4m2N2o0P2q7R9j12J30j50J70j94K20k48K80
$$ 0 0 0 0 0 0 0 0 0 0 0 0 0 0 0 -8 8 -8 8 -8 16 -16 18 -24 28 -32 40 -47 52 -60 70 -80 90 -104 116 -132 148
36A48l15L55m00M48m97N52o14O82p55Q34r21J016j121J236j361J499j653J823
$$ 148 -167 188 -212 236 -261 291 -323 359 -396 438 -483 533 -588 648 -713 786 -867 956
54I56k011K221k459K728l035L395l819M328m951N734o757Q158j0219J3604k0591
$$ 956 -1055 1166 -1293 1435 -1600 1795 -2024 2304 -2647 3087 -3670 4488 -5731 7873 -12718
69a2718O5305n9476K5965L232n1906J33768o6649J45J0664q2130M8254L327p522
$$ -12718 52587 -6889 19076 22308 -29598 104170 37521 37666 48330 -33800 14454 17781 10259
82A0259N0446n6865N885j0610k3986L6946j5666P906R122k9271J2161j9572K168
$$ 10259 60705 3840 9725 -885 -24871 12075 -3591 4315 13437 -15834 -3673 -23245 -21077
95b1077Q747o775K1449j6092q817m427k1745K2757K23J3951M195l4514J0271k1844
$$ -21077 -12330 -19105 2344 -13748 -22565 -26992 -48737 -25980 -25757 -11806 -7611 -42125 -31854 -53698
109e3698O410L9377k6833K3893j5965m2639L8815k2761J5774M0585m4402J7399
$$ -53698 -47288 -7911 -34744 -10851 -26816 -69455 -30640 -53401 -37627 2958 -41444 -24045
121b4045j3975k9941M4062j2479J3235J8307l9177J2317r504o547L3508q333P810
$$ -24045 -38020 -67961 -23899 -36378 -23143 -4836 -44013 -31696 -41200 -47747 -14239 -22572 -14762
134a4762p91k3034Q577k207Q879J6080m338p92j0586l556L378O005J4557k266
$$ -14762 -15553 -38587 -30010 -32217 -23338 -7258 -11596 -12388 -22974 -26530 -23152 -17147 -2590 -4856
148d856J794p205j1580J0648j899J3592J1455j3705N775j4408n612K1650n894
$$ -4856 -3062 -10267 -21847 -11199 -13098 494 11949 -1756 4019 -10389 -16001 5649 -245
161b45J6710K965k3571J0156j2317L773K5541j0800R881o082k1086J5440n437
$$ -245 16465 19430 -4141 6015 -6302 -2529 23012 12212 22093 16011 -5075 10365 4928
174D928R021J7525j5937L847o916j1613J6956r20N490Q032j4034j300k264l631
$$ 4928 13949 31474 15537 19384 12468 855 17811 16891 22381 30413 16379 15079 12815 9184
188I184J1604M440K75r36q372o452K637N768M424O467o295r625m56o142Q294R818
$$ 9184 20788 25228 25503 24567 16195 9743 12380 18148 22572 29039 22744 13119 12663 6521 14815 24633
204B4633m335K695r951r836P339k688Q662O731j1613R85r316n055J1833k764O259
$$ 24633 20298 22993 13042 3206 10545 7857 16519 23250 11637 12622 3306 -1749 10084 7320 13579
219A3579J357j4391K487o675j015J3683m789K533j852j5319M667n85J122J2100
$$ 13579 14936 545 3032 -3643 -4658 9025 4236 6769 4917 -10402 -5735 -6320 -5198 6902
233F902o899m224k250j0065N694O088n9M730o388q228L58j584M405P662k381k812
$$ 6902 3 -4221 -6471 -16536 -10842 -4754 -4813 -83 -6471 -14699 -14341 -15925 -11520 -3858 -6239 -9051
249i051l113p343K576N174J109O280m022p225J34m258M963Q347j576J960n560
$$ -9051 -12164 -19507 -16931 -11757 -10648 -4368 -8390 -15615 -15481 -19739 -14776 -6429 -8005 -6045 -11605
264a1605p472M498l98O425O658o743J7m792m317R223J178L909L563r506m49p94
$$ -11605 -19077 -14579 -14977 -8552 -1894 -8637 -8620 -13412 -17729 -8506 -7328 -3419 144 -9362 -9811 -10605
280a0605j312J0407R04r10J496q696l7M284j37Q287L62n201k5m987P14P577R42
$$ -10605 -11917 -1510 -606 -1516 -20 -8716 -8753 -4469 -4606 3681 4043 -1158 -1183 -6170 -5456 2121 3063
297C063L369j158p530J65L31J873Q499r07k387j205o517K147M793J067N071k380
$$ 3063 6432 5274 -2256 -2091 -1760 113 8612 7705 5318 4113 -2404 -257 4536 5603 10674 8294
313H294n677M98l028K903O559r98J129k724o211K032P37L016N483l206k546k017
$$ 8294 2617 3115 87 2990 9549 8551 9680 6956 745 2777 3514 6530 12013 8807 6261 4244
329D244m385M056L614J296K427n118l733L68j614N500L888l126N21n518l234M658
$$ 4244 -141 3915 7529 8825 11252 6134 2401 2769 1155 6655 10543 7417 7938 2420 -814 3844
345C844m69M336K501o232p7l319k190P084k40J245J164p799l57O21n58O315R1
$$ 3844 3375 7711 10212 3980 3903 584 -1606 5478 5238 6483 7647 -152 -509 112 -446 5869 5960
362E960k588j037n302J08L364R60K895r71m759j591j231R06M471J137j737j185
$$ 5960 3372 2335 -2967 -2859 505 1465 4360 3389 -1370 -2961 -4192 -3286 1185 2322 585 -600
378f00m526n21K058J230L275m36m282m93l128R80M883o22K370k545n363J617j536
$$ -600 -5126 -5647 -3589 -2359 916 480 -3802 -4295 -7423 -6443 -1560 -2182 188 -2357 -7720 -6103 -7639
395g639K577N475l693J002k734n224M859k87K686M582o364q9j589k893O537N24
$$ -7639 -5062 413 -3280 -2278 -5012 -10236 -5377 -5664 -2978 1604 -4760 -4849 -6438 -9331 -2794 -2270
411b270O59J675n825n38N31K55N108O10j074j625k746l19K085K975J688L1k111
$$ -2270 -1611 64 -5761 -6299 -5768 -5513 -405 205 -869 -2494 -5240 -5559 -3474 -499 1189 1220 -891
428h91l243J042K53K942L620k394j88k676k854M334K15K972K230n416R14k408
$$ -891 -4134 -3092 -2839 103 3723 1329 1141 -1535 -4389 -55 160 3132 5362 -54 860 -1548
444a548j096O539j381K130J40o491K401j157J180N968l122N83j429n330M352p7
$$ -1548 -2644 3895 2514 4644 4784 -1707 694 -463 717 6685 3563 4146 2717 -2613 1739 1662
460A662J661L666m079n67j543k186L963J239Q36N46l514j287n94J276K473J612
$$ 1662 3323 6989 2910 2343 800 -1386 2577 3816 4652 5198 1684 397 -197 1079 3552 5164
476E164n18k668j328j321Q25L934n82J314j776m206J769j287K188M472l672R19
$$ 5164 4646 1978 650 -671 154 4088 3506 4820 3044 -1162 607 -680 1508 5980 2308 3227
492C227k564l623M407o11K237K104n043J200k701r52M927j376K407l94n201J851
$$ 3227 663 -2960 1447 836 3073 5177 134 1334 -1367 -2319 2608 1232 3639 3245 -1956 -105
508a05k096J247M387j862O10j953l641J873M34J930J904k011j086k320q75J783
$$ -105 -2201 -954 3433 1571 2181 228 -3413 -1540 -1106 824 2728 717 -369 -2689 -3564 -1781
524a781J886J370r93r77k908l56J876J46K631p7l480P54k904N86M004j448K377
$$ -1781 105 1475 482 -495 -3403 -3759 -1883 -1737 894 817 -2663 -1909 -4813 -4227 -223 -1671 706
541G06j541m518K269j698K182L372k472J217k755k593L355j203K941J538l807
$$ 706 -835 -5353 -3084 -4782 -2600 772 -1700 -483 -3238 -5831 -2476 -3679 -738 800 -3007
556c007J315k692o06L899q60K254m06l115O30j429J365L172p43O71j248k278K90
$$ -3007 -1692 -4384 -4990 -1091 -1951 303 -103 -3218 -2588 -4017 -2652 520 -223 448 -800 -3078 -2788
573b788P86J954J525l90j637j603L81j11K816J675j206J29k412j024K155J17K026
$$ -2788 -2002 -48 1477 1087 -550 -2153 -1772 -1883 933 2608 1402 1531 -881 -1905 250 367 2393
590B393J053k933L16j542J0L018l35J685p48l227J427j091J118K927j416L45j483
$$ 2393 3446 513 829 -713 -703 2315 1980 3665 2917 -310 1117 26 1144 4071 2655 3000 1517
607A517k034J304J72J860J546k048m02j618p84K265N03J362p8k302j123k6N75
$$ 1517 -517 787 959 2819 4365 2317 1915 297 -487 1778 2281 3643 3565 1263 140 114 689
624F89J719P93o17p55j631n38J076J171M14O61j749j337Q3m32J462J633r76J97
$$ 689 2408 3201 2584 1829 198 -340 736 1907 2321 2982 1233 -104 -21 -453 1009 2642 1666 1863
642A863j837j640J720k21J908J110k490m0j574m04K672l52R13k13k593K05m69
$$ 1863 26 -1614 106 -115 1793 2903 413 373 -1201 -1605 1067 715 1628 1415 -1178 -973 -1442
659a442N66K149l59k13j114j699O81K56J082J087o48j012j146p93R33J429N32
$$ -1442 -876 1273 914 701 -413 -2112 -1431 -1175 -93 994 346 -666 -1812 -2605 -1672 -243 289
676B89nj462j212l21L96J135J314l92j122p81j095P56J312m3R48j082j233J92
$$ 289 284 -1178 -2390 -2711 -2315 -1180 134 -258 -1380 -2161 -3256 -2500 -1188 -1231 -283 -1365 -2598 -2406
694b406n76J153J534r38N73j208j518J258j79J813Q72j661j4j024q38K373k09
$$ -2406 -2982 -1829 -295 -1233 -660 -1868 -3386 -2128 -2307 -494 378 -1283 -1297 -2321 -3159 -786 -995
711i95R97L81k024l79j54O84J833J93m36m48j354L60Q91M60J398l50j027j89o14
$$ -995 2 383 -1641 -2020 -2174 -1490 343 536 100 -348 -1702 -1342 -451 9 1407 1057 30 -159 -773
730g73N59J188P89n6n01j198k12L50R07J355j50o40n50j319P09J384K53J048r14
$$ -773 -214 974 1763 1707 1206 8 -204 146 1053 2408 2258 1618 1068 -251 458 1842 2095 3143 2229
749B229j696K71l86J025J565p59K37j054j168P31M16N43R02j213m03n20m41R78
$$ 2229 533 804 418 1443 3008 2249 2486 1432 264 995 1411 1954 2856 1643 1240 720 279 1257
767A257O66M2N10j644r17M33j67J239N75n01k38j354o96R06K51O84J90q30l94
$$ 1257 1923 1965 2475 831 -86 347 180 1419 1994 1493 1255 -99 -795 111 362 1046 1236 406 12
786A2q41J70J425M8l03k01j124k41J20M07J420n77l66n63q42l3J091K50N36m23
$$ 12 -829 -659 766 814 511 310 -814 -1055 -935 -528 892 315 -51 -614 -1456 -1489 -398 -148 388 -35
806c5j143j95j39J59J450J10m67o43j156N24N03J26J187n82r78k17n70P74Q82
$$ -35 -1178 -1373 -1512 -1353 97 207 -260 -903 -2059 -1535 -1032 -906 281 -301 -1279 -1496 -2066 -1292 -410
825d10j68N41q94q41K56k12R54O13j47m44r81m32Q41J89P61M80o95o74o61N41
$$ -410 -578 -37 -931 -1772 -1516 -1728 -774 -161 -308 -752 -1733 -2165 -1324 -1135 -374 106 -589 -1263 -1924 -1383
845a383R73M13K10n46q29j89P5N76P77L25q11k40k86l27J134M58J47P3q79l05
$$ -1383 -410 3 213 -333 -1162 -1351 -1276 -700 77 402 -409 -649 -935 -1262 -128 330 477 550 -329 -634
865f34K95l0J367l5m45P2j315K14J223o9J180n76j228M75p02O60R72pL68o06j030
$$ -634 -339 -369 998 963 518 590 -725 -511 712 643 1823 1247 19 494 -208 452 1424 1417 1785 1179 149
886A49K43J03O72R13l06n71m15l90L74M22N50K04n20n42n26J33O06L58M28n00
$$ 149 392 495 1167 2080 1774 1203 788 398 772 1194 1744 1948 1428 886 360 493 1099 1457 1885 1385
906A385n95p07J90Q36K66L38q07o18k72q6O39N12k22N99j323n68K66l27R82L34
$$ 1385 790 83 273 1109 1375 1713 906 288 16 -70 569 1081 859 1458 135 -433 -167 -494 488 822
926H22o44J84j045l88P37j99Q60L3r70r1n54J36J180K2R7o05q58J00n6P01N44
$$ 822 178 362 -683 -1071 -334 -533 327 360 -610 -701 -1255 -1119 61 83 180 -425 -1283 -1183 -1239 -538 6
947Fk24l26o42j12K53L60N55J03k61q48k38J32K52Q92r8l58k45j070N49N97K20
$$ 6 -218 -544 -1186 -1298 -1045 -685 -130 -27 -288 -1136 -1374 -1242 -990 -98 -196 -554 -799 -1869 -1320 -723 -503
968e03O89n09o64J42o20O63L75J41L07n15p62M58o18J377L83l78J41j237N2L34
$$ -503 186 -323 -987 -845 -1465 -802 -427 -286 21 -494 -1256 -798 -1416 -39 344 -34 107 -1130 -1078 -744
988g44N47Q73k54m59l86k46J33N57N33j31l08l46l34J16L76P70Kl16n84p6o9N81
$$ -744 -197 676 422 -37 -423 -669 -536 21 554 423 115 -231 -565 -449 -73 697 699 383 -201 -277 -346 235
1010B35O03j59L11o96m92J87J17J007j57K29l44j023N52J26K77O31l77j20m27
$$ 235 838 679 990 294 -198 -11 106 1113 956 1185 841 -182 370 496 773 1404 1027 907 480
1029D80n29P90L46K21K53q53j80k51O0Q50J71j22j54n96k80L21L13N89m03k25
$$ 480 -49 741 1087 1308 1561 708 528 277 337 1187 1358 1236 1082 486 206 527 840 1429 1026 801
1049H01l48j39J2JQ32k89k06j45q69N65R7J43L58l25l23l50m02M58M59O4K24r90
$$ 801 453 314 326 327 1159 870 664 519 -350 215 312 455 813 488 165 -185 -587 -129 330 394 618 -372
1071c72j78r4q7N75M33j34n43o62R1K45J48L39o7m00j19l41K95J75K71L11m48
$$ -372 -550 -644 -731 -156 277 143 -400 -1062 -971 -726 -578 -239 -306 -706 -825 -1166 -871 -696 -425 -114 -562
1092e62n37k21j9N44O48k4n27l92N5l79Q03KO32k44r10J21k62N30Q96j03j96k90
$$ -562 -1099 -1320 -1339 -795 -147 -171 -698 -1090 -1035 -1414 -611 -609 23 -221 -1131 -1010 -1272 -742 154 51 -145 -435
1114d35o80K55K64L88M90l41k70l74N1K93M80J15K58q21j24K8J87O21J94k49j73
$$ -435 -1115 -860 -596 -208 282 -59 -329 -703 -652 -359 121 236 494 -327 -451 -423 -236 385 579 330 157
1135A57l12j18J34M16M24j0l39l91j37rO56K93j4j34n80K6j05L54N10J5m49J25
$$ 157 -155 -273 -139 277 701 691 352 -39 -176 -185 471 764 750 616 36 62 -43 311 821 836 387 512
1157E12p05J22P19q4O36l22o72k64J99L91M28j2K8o02k99K14Q7N88J68m90k04
$$ 512 -193 -71 648 564 1200 878 206 -58 141 532 960 948 976 374 75 289 376 964 1132 642 438
1178D38k30m08O22K60K78k11m74j74pJ99K49L84l74o7k83k57M01J87K06L8n59
$$ 438 208 -200 422 682 960 749 275 101 94 293 542 926 552 485 202 -55 346 533 739 777 218
1199B18m31R8L7L30l4K62k45j95l69m6J60M22K0j06l44l46k6N24k08O61k85q85
$$ 218 -213 -115 -78 252 218 480 235 40 -329 -375 -215 207 227 121 -223 -569 -595 -71 -279 382 97 -788
1221g88L05j80L58J19L06j59k97n24P7K94J45L15j33l23k62pj25N12J78L61n70
$$ -788 -483 -663 -305 -186 120 -39 -336 -860 -783 -489 -344 -29 -162 -485 -747 -754 -879 -367 -189 172 -398
1242c98m40j82N23J68K92o2m08j29m35N70L1J54K96k41P7m31l1K07K52M40k9o01
$$ -398 -838 -1020 -497 -329 -37 -99 -507 -636 -1071 -501 -470 -316 -20 -261 -184 -615 -646 -439 -187 253 224 -377
1264c77r0J49O7N95L2m25n2p1k55K42P23l27K33k98k52l29K76M92L15L9m08m44
$$ -377 -467 -318 -251 344 376 -49 -101 -172 -427 -185 538 211 444 146 -106 -435 -159 333 648 687 279 -165
1286a65J03K21kN14J28o61j08J2J0L81k2L49N7o29m1o5J6O18k30J0l31n72M17
$$ -165 -62 159 157 671 799 138 30 42 52 433 411 760 817 188 147 82 98 716 486 496 165 -407 10
1309A0L81O23j60p59K70j23o21N0K73J54j07P4r6K73M65K6j20K83p41j78J81K02
$$ 10 391 1014 854 95 365 242 -379 -329 -56 98 -9 65 -31 242 707 733 613 896 155 -23 158 360
1331C60j85j49M75m35o62M45JQ04M50j368K15p4n11Q5J97R74n49n5m63k7m2J015
$$ 360 175 26 501 66 -596 -151 -150 654 1104 -264 -49 -123 -634 -549 -352 622 73 18 -445 -472 -514 501
1353E01J31m34o9J28o80J18K37K07R6m62l20j61P07l14J04L12l89r8J32M3K21
$$ 501 632 198 129 257 -423 -305 -68 139 235 -227 -547 -708 -1 -315 -211 101 -288 -386 -254 -211 10
1374A0j85K23J15n95N2O2j18J09M41j63j19K55l46k5j87M80p2L83k54q27j18Q92
$$ 10 -175 48 163 -432 -380 -318 -436 -327 114 -49 -168 87 -259 -284 -471 9 -63 320 66 -761 -879 13
1396A3P75k09o15m94j86Q48j95j79K68l79j17m43L26N20L35K56m28n45j02N33
$$ 13 788 579 -36 -530 -716 132 -63 -242 26 -353 -470 -913 -587 -67 268 524 96 -449 -551 -18
1416a8M15J52m82m25M37M4n31O43J66Nj44p65M90K7K02K10ql52PJ1j55J38K53
$$ -18 397 549 67 -358 79 123 -408 235 401 406 262 -503 -13 14 216 426 418 66 73 84 -71 67 320
1439C20M9J1k62j95j1J37M47j43j87m2r6J1m7J27K19R1j08k01m32M35nPJ28P9
$$ 320 369 380 118 -77 -88 49 496 353 166 124 28 39 -8 119 338 429 321 120 -312 123 118 125 253 332
1463C32l64k29K86K07J7J08N4k97m62L2M92J47l19M4j28j17O9n5N82Lk03j43k15
$$ 332 -32 -261 25 232 249 357 411 114 -348 -316 176 323 4 48 -80 -197 -128 -183 399 402 199 56 -159
1486a59J12L38k9O6j05p9m10K02J39j82L44Q1l71k50l0L02K68r8O8k42k04l6J0
$$ -159 -47 291 262 328 223 144 -266 -64 75 -107 237 318 -53 -303 -333 -31 237 139 207 -35 -239 -275 -265
1509b65J48M53m48k1J17n80N28j99K01J88q9l32j45K72j27L55m5j28q2l77L2M07
$$ -265 -117 336 -112 -133 -16 -596 -68 -267 -66 122 33 -299 -444 -172 -299 56 11 -117 -199 -576 -544 -137
1531a37K75j25j01j80J31k30j41O32k38R4K5l34J5J41J64K03j60p1j41l00L03
$$ -137 138 13 -88 -268 -137 -367 -508 124 -114 -20 5 -329 -314 -173 -9 194 34 -37 -178 -478 -175
1552a75N8J2M03l76j39j75L22K5J16pj72n1Q1J25o6M21j74o7k08J82l04J99K2
$$ -175 -117 -105 298 -78 -217 -392 -70 -45 71 64 -108 -159 -78 47 -19 402 228 161 -47 135 -169 30 52
1575E2M1J79l16mJ01J6R2L95l66r8k22L6J92J13J28j51r8j36J35L0P1k1K11l04
$$ 52 93 272 -44 -48 53 69 161 556 190 92 -130 -94 98 211 339 188 90 -46 89 119 190 169 380 76
1599G6K0J01N2m76L66M1J18l89p2J85j75L40jo9k49L7nJ02k05L47K2j20j21K56
$$ 76 96 197 249 -227 139 180 298 -91 -163 22 -153 187 186 117 -132 -95 -100 2 -203 144 166 46 -75 181
1623A81j26L13k43J31m33L35k03k70M62J12k79L2o0l56K09K76Pk44R8P5p1M1j22
$$ 181 55 368 125 256 -177 158 -45 -315 147 259 -20 12 -48 -404 -195 81 88 -156 -58 17 -54 -13 -135
1646a35K33qj51R3j19J78j36J18N3j33q3K02j65K45m0l11J78Q7k44j22Q3P5O6
$$ -135 98 90 -61 32 -87 91 -45 73 126 -7 -90 112 -53 192 152 -159 19 106 -138 -260 -177 -102 -36
1669c6J3l23L09l02J91K11k30M9M5k13m1K95j30J39N5j16j34K31J71j18j76K94
$$ -36 -23 -346 -37 -339 -148 63 -167 -118 -73 -286 -327 -32 -162 -23 32 -84 -218 13 184 66 -110 184
1691A84l58l9n1J17J40MJj45J80r8LlK15k86L10k32j66M11N0J39J6j68l59M10
$$ 184 -174 -213 -264 -147 -7 -3 -2 -147 33 -65 -62 -65 150 -136 174 -58 -224 187 237 376 392 224 -135 275
1715B75j27P9k52J15J26k19O7L39n91K61J66R3k56N9j2J12K35n41J72k61R4k8
$$ 275 148 227 -25 90 216 -3 64 403 -188 73 239 332 76 135 123 235 470 -71 101 -160 -66 -94
1737i4L9K78J16k15j27n9K39J39k68k60J53K80j98J13m7J15mp3k68K61l81L41
$$ -94 -55 223 339 124 -3 -62 177 316 48 -212 -59 221 23 136 89 204 200 127 -141 120 -261 80
1759H0j94K67o0k56k1L2J07j31M9N6K41k01j40J42O0j43K82k88N2P5k13K4K01
$$ 80 -114 153 93 -163 -184 -152 -45 -176 -127 -71 170 -31 -171 -29 31 -112 170 -118 -66 9 -204 -180 21
1782B1j21J86j45k85K80j26M36l81k9J34j0r5L9j0L3m7n4qK75l13K20P7p1k36
$$ 21 -100 86 -59 -344 -64 -190 246 -135 -164 -30 -40 -135 -96 -106 -73 -120 -174 -182 93 -220 0 77 6 -230
1806b30L7L8j81M57Q3m80J88j18J2K81j88J90l53K79j24Q3q6J36Q5j16R8l09M22
$$ -230 -193 -155 -336 121 204 -276 -88 -206 -194 87 -101 89 -264 15 -109 -26 -112 24 109 -7 91 -218 204
1829B04j77k2J78Q2k47l02K51m5L08M5l45N9J50j96L2k5P7J83L1j38p9J29k96
$$ 204 27 5 183 265 18 -284 -33 -78 230 275 -70 -11 139 -57 -25 -50 27 210 241 103 24 153 -143
1852a43M82j9j31j42K1RM6K33l21m0j6K34j65j45K65j32K15r0j7k44m1K72l6K19
$$ -143 339 320 189 47 68 77 123 356 35 -5 -21 213 48 -97 168 36 251 161 144 -100 -141 131 95 314
1876C14k21k42J7n8R1L70M0l73J48j69J80k65K69o3m0kp7N5K4J86l02j1J53p3
$$ 314 93 -149 -132 -190 -99 271 311 -62 86 -83 97 -168 101 38 -2 -4 -81 -26 -2 184 -118 -129 24 -49
1900d9j75L49J3j04j41j02O6l4J08j50K29o1K7j6M8p7Po4J54l19J25j30Q2L09
$$ -49 -224 125 138 34 -107 -209 -143 -177 -69 -219 10 -51 -24 -40 8 -69 -62 -126 28 -291 -166 -296 -214 95
1924I5j25O3L2k37J23r3R0j01K15l9j55K16j73K07j49J00j17j20L28o0k66J00
$$ 95 -30 33 65 -172 -49 -142 -52 -153 62 23 -132 84 -89 118 -31 69 -48 -168 160 100 -166 -66
1946f6J97J2j08j79JK8J80J1K6p2j20K01l23K20O6J09l33J52nJ12j53J10j97R8
$$ -66 131 143 35 -144 -143 -115 65 76 102 30 -90 111 -212 8 74 183 -150 2 -3 109 -44 66 -131 -33
1970c3r1m2N6K02m2J38q5j83J60k42L75r7L1m3oj14O3r7N5j30M2M7J46J16Nk13
$$ -33 -124 -166 -110 92 50 188 103 -80 80 -162 213 116 147 104 98 -16 47 -50 5 -125 -83 -36 110 226 231 18
1996A8j55K33Nl03K50Q3Pj15Mj37J18q6J66j70Q1R8j9J7o0j07M7J20j73K53m48
$$ 18 -137 96 101 -202 48 131 138 23 27 -110 8 -78 88 -82 -1 97 78 95 35 -72 -25 95 -78 175 -273
2021b73M49l92M10k0j82j7r6J66j06q0JK1J14N7l26j4K46r5K06j48l0K01K9o4
$$ -273 176 -216 194 174 -8 -25 -121 45 -61 -141 -140 -119 -5 52 -274 -288 -42 -137 69 -79 -109 92 121 57
2045E7J9K00k79Q3k88K31q8K26k64M2k48K26j06O5J86j72J15l04N9K63J06k70
$$ 57 76 276 -3 80 -208 23 -65 161 -103 -61 -309 -83 -189 -124 62 -110 5 -299 -240 23 129 -141
2067a41o1J85Q4o3l03J69J31K71j80q2k32J9J39J44K46m46j3J25j67K21K92l25
$$ -141 -202 -17 67 4 -299 -130 1 272 92 10 -222 -203 -64 80 326 -120 -133 -8 -175 46 338 13
2089A3J26L0j87nJ29k6O0m0n5q3j59L28K33l68R4J12j35l7l59L33N7J09k03J47
$$ 13 139 169 -18 -23 106 80 140 100 45 -38 -197 131 364 -4 90 202 67 30 -329 4 61 170 -33 114
2113A14j6j21m9L80p2j91P6j9o1j02J38lM4k82K43j22j34K29R9j56K9n4Q4N9K00
$$ 114 98 -23 -72 308 236 45 121 102 41 -61 77 74 118 -164 79 -43 -177 52 151 -5 24 -30 54 113 313
2138C13j0j98k77J84q0Q2k51M16j74Q2k57J66q5P7J27K9L3k56O0j27R9O8p9J4
$$ 313 303 105 -172 12 -68 14 -237 179 5 87 -170 -4 -89 -12 115 144 177 -79 -19 -146 -47 21 -58 -44
2162d4K59k61r5J52QQj22J46O6K0l29L23k58j11L35r3j26L5L5J71Jp2o6j12k3
$$ -44 215 -46 -141 11 19 27 -95 51 117 137 -192 131 -127 -238 97 4 -122 -87 -52 119 120 48 -18 -130 -153
2187a53K84k09J07J11k99KJ4jJ68R1m20K68j84K42k30J28J5J23j71p8J07K12n91
$$ -153 131 -78 29 140 -159 -157 -143 -144 24 115 -305 -37 -221 21 -209 -81 -66 57 -114 -192 -85 127 -464
2210d64O64r4j58j24j17K32K32k99J34k1K3M0j18j9K32l10J26O0K0L0j04%J99
$$ -464 200 106 -52 -176 -293 -61 171 -128 6 -15 8 48 -70 -89 143 -167 -41 19 39 69 -35 -35 164
2233A64j14J1l7p1K6N5R8K1l2k41J52J3J99p3K14k97o6m8k0K25j05J38j63k72
$$ 164 50 61 24 -47 -21 34 132 153 121 -120 32 45 244 171 385 88 22 -26 -46 179 74 212 49 -223
2257b23M38J01k55o2K36l59K23j6j69J66o3J54j37L04m50R9O9j75QJ50R3j21M9
$$ -223 215 316 61 -1 235 -124 99 83 -86 80 17 171 34 338 -112 -13 56 -119 -111 39 132 11 60
2280F0R2j50RJ01n46O22m31K09J42Lj31j01L8L37k28J43j9l2k12K75j99k8K9P0
$$ 60 152 2 11 112 -434 188 -243 -34 108 111 -20 -121 -83 254 26 169 150 118 -94 181 -18 -46 -17 53
2304E3j6k20K41j44Q9J28j91P2%Q9l22K71R2k05k4K4O4m9K1N1O5NM0l52pM16j57
$$ 53 37 -183 58 -86 3 131 -60 12 12 101 -221 50 142 -63 -87 -63 1 -48 -27 24 89 94 134 -218 -225 191 34
2331C4k44K18jj42j17J71J65j45J97j44j1K9j95J72j40L11k07K27l60k9K17q5
$$ 34 -210 8 7 -135 -252 -81 84 -61 136 -8 -19 10 -185 -13 -153 158 -49 178 -182 -211 6 -79
2353g9l0J5j76K99P3j59m8J20J69q4r0j79J85m5m1Q0P7l41L91J00j88J01k90R5
$$ -79 -109 -94 -270 29 102 -57 -105 15 184 100 10 -169 16 -29 -70 10 87 -254 137 237 49 150 -140 -45
2377d5P0k39K89J72j96o5m2K83j87J37k63J98L2l02L20k09n9K60j70N1J14k04
$$ -45 25 -214 75 247 51 -14 -56 227 40 177 -86 112 144 -158 162 -47 -106 154 -16 35 149 -55
2399e5K18k82P9R8p5j04r4J59m4K37q5m6j29J69o3j48J24o8K14J07O0k96m4L7
$$ -55 163 -119 -40 58 -17 -121 -215 -56 -100 137 52 6 -123 46 -17 -165 -41 -109 105 212 272 -24 -68 -31
2423c1j98L48j59O5r5N4O1r8L4Q8k49K57k47m0K24J19k96k6K19J21q6r3J39l50
$$ -31 -229 119 -40 25 -70 -16 45 -53 -19 69 -180 77 -170 -210 14 133 -163 -189 30 151 65 -28 111 -239
2447b39l7K36N9k45Q0J07Q1K42n49K65l04L98p9k61K85k10J42K12l05Q1J24p5
$$ -239 -276 -40 19 -226 -146 -39 42 284 -265 0 -304 94 15 -246 39 -171 -29 183 -122 -41 83 8
2469HO8k5l20M46j81J92j36j67M2P3k25N1K14J9o8K57k46L2J32j09j14k6K97k17
$$ 8 76 51 -269 177 -4 188 52 -115 -73 0 -225 -174 40 59 -9 248 2 34 166 57 -57 -83 214 -3
2493cP2o0RJ00o6l5M3k1J81j11j37J05k20o1J32J2K03l15O3Ro5Q7J6R4L6j33P
$$ -3 69 9 18 118 52 17 60 39 220 109 -28 77 -143 -204 -72 -60 143 -172 -109 -100 -165 -78 -62 32 68 -65 -58
2520e8K32j30J21o8Pj79o2R9J39L3n1j25P2J01k23o8L78k25J3qn0O6K5l46L96
$$ -58 174 44 165 97 104 -75 -137 -38 101 134 83 -42 30 131 -92 -160 218 -7 6 -2 -52 14 39 -307 89
2545H9j65M1j69J93q0j54L04J41j94R5R5l86K18K3M4j73r8r3L00n9J15o2m5J05
$$ 89 -76 -35 -204 -11 -91 -245 59 200 6 101 196 -190 28 51 95 -78 -176 -269 31 -28 87 25 -20 85
2569H5l1J08k01mN3k26K40Mj26J13K6j15N8k19K80j09j08j05J63j1k34J81k1M5
$$ 85 54 162 -39 -43 10 -216 24 28 -98 15 41 -74 -16 -235 45 -64 -172 -277 -114 -125 -359 -178 -199 -154
2593a54m1J05J10K61j99l09Q8K01oj13j06j8M8P2j41J90q9R9j52Q5j32pJ1K74
$$ -154 -195 -90 20 281 82 -227 -139 62 56 -57 -163 -181 -133 -61 -202 -12 -101 -2 -154 -69 -201 -208 -197 77
2617G7r8Q2K29l67m1R8J58k1k77L30l15J38l9J11J10j07j11j55J92J63R6k41J35
$$ 77 -21 61 290 -77 -118 -20 138 117 -160 170 -145 -7 -46 65 175 68 -43 -198 -6 157 253 12 147
2640A47m43O7L83o6J6j14j26J61l1q2p4K50Q9k65K06k4l82K41p4K38K0j27M4M5
$$ 147 -296 -229 154 88 104 -10 -136 25 -6 -88 -162 88 177 -88 118 94 -288 -47 -121 117 137 10 54 99
2664I9k56J17J78k21j3r3j17M31j64N3j00J3Q7P7k15L04r2j16r3L3L31l16o9L96
$$ 99 -157 -40 138 -83 -96 -189 -306 125 -39 14 -86 -73 14 91 -124 180 88 -28 -121 -88 243 -73 -142 254
2688B54l14N6L3L5mj69L79k46l21L93j34Q3Q1k81N5K28j5Q2k36J12o%r2k05K07
$$ 254 -60 -4 29 64 60 -109 270 24 -297 96 -38 45 126 -155 -100 128 113 195 -41 71 65 65 -27 -232 -25
2713b5o0J91J52k26k00J97j07K0j66J56J40l30J04J53JJ5k09R9K05J09l05m1J32
$$ -25 -85 106 258 32 -168 29 -78 -58 -224 -68 72 -258 -154 -1 0 15 -194 -95 110 219 -86 -127 5
2736Ek64L63j40l36K97j9mL6J32P0M1k22n5rQM31l32j02o3K72l18L33K21l29k2
$$ 5 -259 104 -36 -372 -75 -94 -98 -62 70 140 181 -41 -96 -105 -97 334 2 -100 -163 109 -209 124 345 16 -6
2761fl8K04j2k59jJ26J8j18J49j23J61j36O1r3J87k7j55J17j81K91j36j36J46
$$ -6 -44 160 148 -111 -112 14 32 -86 63 -60 101 -35 26 -67 120 93 -62 55 -126 165 29 -107 39
2784C9p7Q5l52J23K13K0j77K36n7R1o6ll52L47q7j9J5J63k16K71j63m2j34M26
$$ 39 -38 47 -305 -182 31 51 -126 110 53 144 78 75 -277 70 -17 -36 -21 142 -74 197 34 -8 -142 284
2808B84l84M2M6R0K9j62M8J41l4m9j89K87l06M0O6k9J51j54K06k60K56m1j37J49
$$ 284 -100 -58 -12 78 107 -55 -7 134 100 51 -138 149 -157 -117 -51 -80 71 -83 123 -137 119 78 -59 90
2832I0N4j16Kj94j2J72K77k61l36J66K82j09j17N2L4K7l45L78N1k80J94K30l36
$$ 90 144 28 30 -164 -176 -4 273 12 -324 -158 124 15 -102 -50 -16 11 -334 44 95 -185 9 239 -97
2855i7rk84L53M3o0J91j58j43R1J16J67k42NJ39j86j89L29r0O7K1L3m40K44j92
$$ -97 -106 -390 -37 6 -54 137 -21 -164 -73 43 210 -32 -27 112 -74 -263 66 -24 43 64 97 -343 -99 -291
2879b91J78J42o9nJ66j23M5J00j26k45J55J9J4O6j95J97J22k30k01L49Nq6l5L28
$$ -291 -113 29 -40 -45 121 -2 43 143 17 -228 -73 -54 -40 26 -169 28 150 -80 -281 68 73 -13 -48 280
2903B80n64J75K31j65J49k3J3j1j03l0K1k7M4K9N5m8lj93O9K24N4j97k5m4j03
$$ 280 -284 -109 122 -43 106 83 96 85 -18 -48 -27 -54 -10 19 74 26 23 -170 -101 123 177 -20 -45 -89 -192
2928a92J6K81q3q4J77k13QoJ49p2j49J34K3oR3k78J76O5k6k69mL18K11k98J32
$$ -192 -176 105 22 -62 115 -98 -90 -96 53 -19 -168 -34 -11 -17 76 -202 -26 39 13 -256 -260 58 269 -29 103
2953A03j42j05J53p0j66M38l23P0K38k40KO5K23k15o7K3j72J67L3Mo3k3j2J51
$$ 103 -39 -144 9 -61 -227 211 -112 -42 196 -44 -42 23 246 31 -36 -13 -185 -18 15 19 -44 -67 -79 72
2977G2l1O3Q4k51M5o3M6J29k0j68K39o7P4o7j67J46k03L12j19j85l2J27M4K79
$$ 72 41 104 188 -63 -18 -81 -35 94 74 -94 145 78 152 85 -82 64 -139 173 54 -131 -163 -36 8 287
3001B87j60l3o4o6K70j11j64J16j16k1j8m0K39j84M5J56l44J72nO9j36J75J7p5
$$ 287 127 94 30 -36 234 123 -41 75 -41 -62 -80 -120 119 -65 -20 136 -208 -36 -41 28 -108 67 84 9
3025IJ1lK13j86l4k07K93j62K29k1k5j40j58j9O7n5K6%r0K21p6J17P5O7l7P8j84
$$ 9 20 17 230 44 10 -197 96 -66 163 142 117 -23 -181 -200 -133 -188 -162 -162 -252 -31 -107 10 85 152 115 193 9
3052IK4P2j5l55J51K08k39K97j7j32K48r0k70p4K47q4J39k08J95j55J32k1k38
$$ 9 33 105 90 -265 -114 94 -145 152 135 3 251 161 -109 -183 64 -20 119 -89 106 -49 83 62 -176
3075a76J9k7J01Q2j33j27N36k97L2P0j98M23n54M22j36k4J09j40r9L8J52q8J35
$$ -176 -157 -184 -83 -1 -134 -261 275 -22 10 80 -118 305 -249 173 37 13 122 -18 -117 -79 73 -15 120
3098A20J9j28k8j13J74j16J58k88K63k10R8J52j60k3k65M11qJ16k63J04o3l2L34
$$ 120 139 11 -17 -130 44 -72 86 -202 61 -149 -51 101 -59 -82 -347 64 56 172 -91 13 -50 -82 252
3121B52l46J96k16K63q4k5j70N2R0L1k21K2NK12j75K73j09N4J22l11J98k18k41
$$ 252 -94 102 -114 149 65 40 -130 -78 12 43 -178 -156 -151 61 -114 159 50 104 226 -85 113 -105 -346
3144c46M19q0j13J47J6l0k44J86k88M57k83L27l96O3j5L78k26j0%K41k23q8r0
$$ -346 73 -7 -120 27 43 13 -231 -45 -333 124 -159 168 -228 -165 -180 198 -28 -38 -38 203 -20 -108 -198
3167a98K53l9R0Lj98K71m08M18k64Q0K49k31m2J25J2j81n9L62l12J66j01Q3n7
$$ -198 55 16 106 109 -89 182 -226 192 -72 8 257 26 -16 109 121 -60 -119 243 -69 97 -4 79 22
3190B2P6J49o9l53L67k75j4J13j99L12k64Kj13J54J18R7l4l0K14o9k81J26n9L7
$$ 22 98 247 178 -175 192 -83 -97 16 -183 129 -135 -133 -246 -92 26 123 89 59 273 204 -77 49 -10 27
3214B7J15j03J88n9k15N0r3m6L65k74J36L1J46m23R9P2J89j93k6J7n2q7J89J72
$$ 27 142 39 227 168 -47 3 -90 -136 229 -45 91 122 268 -155 -56 16 205 12 -14 3 -49 -136 53 225
3238B25k92M5J32j17K12l1k14j38K42J60j48j86K48j61J05j93J1j5J40J1J85k35
$$ 225 -67 -22 110 -7 205 174 -40 -178 64 224 76 -110 138 -23 82 -111 -100 -115 25 36 221 -14
3260a4M6k6K30k02m1J39L0lk50O1j18J84l05K98j30K92k19n2j34K37l8J25l39
$$ -14 32 6 236 34 -7 132 162 159 -91 -30 -148 36 -269 29 -101 191 -28 -80 -214 23 -15 110 -229
3283b29K35J35k76k04M85j11j76J42J96l51J01j35M53l53J05K47l24Q9jk11K15
$$ -229 6 141 -135 -339 146 35 -141 1 197 -154 -53 -188 265 -88 17 264 -60 29 28 -183 32
3304C2j44R5j44K63j73J8K75l22J23J57j18M6P5j21Q3n9q1r0K44j05K7J9m1l6
$$ 32 -112 -17 -161 102 -71 -53 222 -100 23 180 62 108 183 62 145 86 5 -85 159 54 81 100 59 23
3328B3j6l37K83J64p0p9J23r2j5p9j49L20j65lLK24j80m0p1J8L70j57l8J22l6
$$ 23 7 -330 -47 117 47 -32 91 -1 -16 -95 -244 76 -89 -92 -89 135 -45 -85 -156 -138 232 75 37 159 123
3353A23K15k41j04j04L48l89j7J90J04mk02j48J53m6J47j28N8K45r9j01j03L73
$$ 123 338 97 -7 -111 237 -152 -169 21 125 121 -81 -229 -76 -122 25 -103 -45 200 101 0 -103 270
3375B70k33O4l67N65l36J08k2k35K67k5j69K50lj8k26L37m0o8m6l4q0k7L77n44
$$ 270 37 101 -266 299 -37 71 49 -186 81 56 -113 137 134 116 -110 227 187 119 73 39 -41 -68 309 -235
3399b35K45O1K88l05j11K22j56p5J24M9l42K27j21O3j0J94l19J41J15j52J60k32
$$ -235 10 71 359 54 -57 165 9 -66 58 107 -235 -8 -129 -66 -76 118 -201 -60 55 -97 63 -169
3421a69K76j05n6j04K10J7l15K19N7j22j39L64o9l27K89P8j4M3q2o3J6J78n42
$$ -169 107 2 -54 -158 52 69 -246 -27 30 -92 -231 133 64 -263 26 104 90 133 51 -12 4 182 -360
3444c60K17K03k08M16k29J44M1j45j99q6J38R3L9R8j58N5j40J5J13Jj43J09lN
$$ -360 -143 60 -148 268 39 183 224 79 -120 -206 -68 25 64 162 4 59 -81 -66 47 48 -95 14 11 16
3468A6R2m3k46J55o0R1K62k99J35n9p6L3j15o6J38j23L71J5k09M4k43M81n62K05
$$ 16 108 65 -181 -26 -86 5 267 -32 103 44 -32 1 -114 -180 -42 -165 206 221 12 56 -187 294 -268 -63
3492f3j38L81k63J23N1j34m0k50L57n7K26j81l7p6N54l80j04J78k12J74n1O8m1
$$ -63 -201 180 -83 40 91 -43 -83 -333 24 -33 193 12 -25 -101 453 73 -31 147 -65 109 58 126 85
3515H5j83N3M3J32k20J0M3L7J56j98L66k87r6J7KR4j64K09k14J82j37K3m5j5j32
$$ 85 -98 -45 -2 130 -90 -80 -37 0 156 -42 324 37 -59 -42 -40 54 -110 99 -115 67 -70 -47 -92 -107 -239
3540b39j0L27J93j53l47N04l55J40n8J39k16K61m66O2J16J16o9k09L63n6J28j73
$$ -239 -249 78 271 118 -229 275 -80 60 2 141 -75 186 -280 -218 -102 14 -55 -264 99 43 171 -2
3562bj2j41RK04j27j34m1L72j28J70k06o9JK41k55N2J10J3j05J15j36L1k2J88
$$ -2 -14 -155 -146 58 -69 -203 -244 128 0 170 -36 -105 -104 137 -118 -66 44 57 -48 67 -69 -38 -60 128
3586A28k27k0K36q0K66l91J72N3j66lk12L90k00J15J40j03j01j2J83p7q9j61L00
$$ 128 -99 -119 117 37 303 -88 84 137 -29 -32 -244 146 -54 61 201 98 -3 -15 168 91 2 -159 141
3609A41n5J0r2P6j03J60j75J31P7j9j88o7P0J87j0k01K17l2k77J54R1k07J13k29
$$ 141 86 96 4 80 -23 137 -38 93 170 151 -37 -104 -34 153 143 -58 159 127 -150 4 95 -112 1 -228
3633b28K17n1n9K69j84p4K24L1l0j43N5j1j18L16k71R6j2O3r0Rn4k9K41l07J45
$$ -228 -11 -62 -121 148 -36 -110 114 145 115 -28 27 16 -102 214 -57 39 27 90 0 9 -45 -74 167 -140 5
3658Ek58J05J4K42O3j94j47K35r8j31J80pj01J07JJ27Q8l65K36j49l1J04j23J30
$$ 5 -253 -148 -134 108 171 -23 -170 65 -33 -164 16 9 -92 15 16 143 231 -134 102 -47 -78 26 -97 33
3682C3J80m54J75q6j0K05k5P1j84l2R5K14m2l5k71J48J5K50k89j7J61L8l75K11
$$ 33 213 -241 -66 -152 -162 43 18 89 -95 -127 -32 182 140 105 -166 -18 -3 247 -42 -59 102 140 -235 -24
3706b4K13l1j53J22r6j54K33k92J29J8J96k20q7J62L53k65q6L3K62k99j91L6K96
$$ -24 189 158 5 127 31 -123 110 -182 -53 -35 161 -59 -146 16 369 104 18 51 313 14 -177 -141 155
3729A55k34J0K95l07jKn2P6K17k77K09J20k39M1L01m53Q7J35l04n6N21l74pJ35
$$ 155 -79 -69 226 -81 -82 -80 -132 -56 161 -116 93 213 -26 15 316 -137 -50 85 -219 -275 246 -128 -135 0
3753@j55J51j16J38k25M50j63L2m2j83J5L27j15j18j37k9j58N58k67K26j75R9
$$ 0 -155 -4 -120 18 -207 243 80 112 70 -113 -98 229 114 -4 -141 -170 -328 230 -37 189 14 113
3775A13r9M4j31K05l7l2k43K11J0q5J23k20L87p9k77J23L4M0N4k58L0J55o9j06
$$ 113 14 58 -73 132 95 63 -180 31 41 -44 79 -141 246 167 -110 13 47 87 141 -117 -87 68 -1 -107
3799a07L19j29l51L74q5j12L74j08j66J01Q3l00K54o4K23p9o3p9M0Q6l46q9K15
$$ -107 212 83 -268 106 21 -91 283 175 9 110 193 -107 147 83 306 227 164 85 125 211 -135 -224 -9
3822ij9Q6J3m4l08M26j48j53R9j9J66k69Q9O2R9NJ28j10j66J20r0QLJ87L4j19
$$ -9 -28 58 71 27 -281 145 -3 -156 -57 -76 90 -179 -90 -28 71 76 204 94 -72 48 -42 -34 -31 156 190 71
3848G1J28m6k86L40j45J86L0j62j6k32r0Q3K01J89k41j10l0k9J24k6J32j80J63
$$ 71 199 153 -133 207 62 248 278 116 100 -132 -222 -139 62 251 10 -100 -130 -159 -35 -61 71 -109 54
3871E4j89M4L02k87o3K30J33m26L35k00R7J12j91J88pj81N1J62j80N7J8Q0n1k41
$$ 54 -135 -91 211 -76 -139 91 224 -202 133 -67 30 142 -49 139 132 -49 2 164 -16 41 59 139 88 -153
3895a53P5J96j24K5j48L67q7j42J36k45J06J59j78Q9J62n6O5pj91k6L9J42k23
$$ -153 -78 118 -6 19 -129 238 151 9 145 -100 6 165 -13 76 238 182 247 240 49 23 62 204 -19
3918a9L84n14M5o0Q5J52j64J58p9N1L6n4l9K15k59r0J56J19n1j76J88k82K67k46
$$ -19 365 -149 -104 -164 -79 73 -91 67 -12 39 75 21 -18 197 -62 -152 4 123 72 -104 84 -198 69 -177
3942a77L53k7l49M39l80j38M19j03J68LO1k52l1K01j53l68L36K0M1n1j09J00J69
$$ -177 176 149 -200 239 -141 -279 140 37 205 208 269 17 -14 187 34 -334 2 22 63 12 -97 3 172
3965A72R4l56R1Pk34L43r7O9l64L21k9r2L27j49j40P1j90L2L29K70m91j5pK19
$$ 172 266 -90 1 8 -226 117 20 89 -275 46 17 -75 252 103 -37 34 -156 -124 205 475 -16 -31 -38 181
3989A81l9r3J74l82J93k27lJ75J8k0%m7m1K76l57P6L2j02Q5N0K82j6k99J17n3
$$ 181 142 49 223 -159 34 -193 -196 -21 -3 -23 -23 -70 -111 165 -192 -116 -84 -186 -101 -51 231 215 -84 33 -20
4014b0l0j6p7K59j84J93n8k9l5l04K33mJ99j24j96K79j00J07N4Q2k31k40K38M
$$ -20 -50 -66 -143 116 -68 125 67 38 3 -301 -68 -72 127 3 -193 86 -14 93 147 229 -2 -242 -4 0
4038@J72k50P7M1j04J10j14N7K80l99j4m3K63J73k17j00j7J97m9j35j50J73L5
$$ 0 172 -78 -1 40 -64 46 -68 -11 269 -130 -144 -187 76 249 32 -68 -85 112 63 -72 -222 -49 -14
4061a4j51L34L2r2m45M42j40K79n6k70j28K20J19k53N1J23j78J37J38P5k14N0
$$ -14 -165 169 201 109 -336 106 -34 245 189 -81 -209 11 130 -123 -72 51 -127 10 148 223 9 59
4083E9J5j9l5j90J71P8j81L81m80K69p7P5n7j82K56j8j6j27R9K17l75J7K01j94
$$ 59 74 55 20 -170 1 79 -102 279 -201 68 -9 66 9 -173 83 65 49 -78 21 238 -137 -120 81 -113
4107a13K0R9j13p9n9K96R2j07Q2q3k36K47qj30J88k01J13k01J9L89o2j02j27J55
$$ -113 -93 6 -107 -186 -245 51 143 36 118 35 -201 46 38 -92 96 -105 8 -193 -174 215 153 51 -76 79
4131G9p8k8j11J18lJ16L2k85L47j65M8k63L41k63m0L91n21L85j8k16j30K07J13
$$ 79 1 -27 -138 -20 -23 93 125 -160 187 22 70 -193 148 -115 -155 236 -285 100 82 -134 -264 -57 56
$$ [...]
8191B
##END NTUPLES=NMR FID
##END=
