##TITLE=1H_SR48_K
 CDCl3, 8 sc, 
 9.04.2021
##JCAMPDX= 6.0         $$ Bruker NMR JCAMP-DX V2.0
##DATA TYPE= NMR FID
##DATA CLASS= NTUPLES
##ORIGIN= UXNMR, Bruker Analytische Messtechnik GmbH
##OWNER= root
$$ XWIN-NMR		Version 3.5
$$ Fri Apr  9 12:04:27 2021 Russian Standard Time (UT+4h)  she@DPX200
##.OBSERVE FREQUENCY= 200.131506
##.OBSERVE NUCLEUS= ^1H
##.DELAY= (6, 6)
##.ACQUISITION MODE= SIMULTANEOUS
##.ACQUISITION SCHEME= undefined
##.AVERAGES= 8
##.DIGITISER RES= 18
##SPECTROMETER/DATA SYSTEM= spect
##.PULSE SEQUENCE= zg30
##.SOLVENT NAME= CDCl3
##.SHIFT REFERENCE= (INTERNAL, CDCl3, 0, 15.7039)
##AUDIT TRAIL= $$ (NUMBER, WHEN, WHO, WHERE, WHAT)
$$ ##TITLE= Audit trail, XWIN-NMR		Version 3.5
$$ ##JCAMPDX= 5.01
$$ ##ORIGIN= Bruker BioSpin GmbH
$$ ##OWNER= she
$$ F:/spectra/data/she/nmr/H-F/1/audita.txt
$$ ##AUDIT TRAIL=  $$ (NUMBER, WHEN, WHO, WHERE, WHAT)
(   1,<2021-04-09 12:03:16.89 +0400>,<she>,<DPX200>,
      <created by zg, POWCHK disabled, PULCHK disabled
       configuration hash MD5:
       00 E9 B6 7A A2 85 ED C7 34 08 36 98 17 FE 4E 26
       data hash MD5: 16K
       9D 82 98 9F 10 7D 0B 7E 9E FC C7 D8 D7 50 29 E6>)
$$ ##END=
$$ 
$$ hash MD5
$$ 12 BC 4B 3C E1 93 93 14 98 6D F4 83 85 1D 7F B6
##$RELAX= 
##$RELAX= 
##$RELAX= 
##$RELAX= 
##$RELAX= 
##$RELAX= 
$$ Bruker specific parameters
$$ --------------------------
##$DU= <F:/spectra>
##$EXPNO= 1
##$NAME= <H-F>
##$PROCNO= 1
##$TYPE= <nmr>
##$USER= <she>
##$AMP= (0..31)
100 100 100 100 100 100 100 100 100 100 100 100 100 100 100 100 100 100 
100 100 100 100 100 100 100 100 100 100 100 100 100 100 
##$AQSEQ= 0
##$AQ_mod= 1
##$AUNM= <au_zg>
##$AUTOPOS= <>
##$BF1= 200.13
##$BF2= 200.13
##$BF3= 200.13
##$BF4= 200.13
##$BF5= 200.13
##$BF6= 200.13
##$BF7= 200.13
##$BF8= 200.13
##$BYTORDA= 1
##$CFDGTYP= 0
##$CFRGTYP= 5
##$CHEMSTR= <none>
##$CNST= (0..31)
1 1 145 1 1 1 1 1 1 1 1 1 1 1 1 1 1 1 1 1 1 1 1 1 1 1 1 1 1 1 1 1 
##$CPDPRG= <>
##$CPDPRG1= <>
##$CPDPRG2= <>
##$CPDPRG3= <>
##$CPDPRG4= <mlev>
##$CPDPRG5= <mlev>
##$CPDPRG6= <mlev>
##$CPDPRG7= <mlev>
##$CPDPRG8= <mlev>
##$CPDPRGB= <>
##$CPDPRGT= <>
##$D= (0..31)
0 1.2 0 0 0 0 0 0 0 0.06 0 0.03 0 0 0 0 0.0002 0 0 0 0 0 0 0 0 0 0 0 0 
0 0 0 
##$DATE= 1617955396
##$DBL= (0..7)
120 120 120 120 120 120 120 120 
##$DBP= (0..7)
150 150 150 150 150 150 150 150 
##$DBP07= 0
##$DBPNAM0= <>
##$DBPNAM1= <>
##$DBPNAM2= <>
##$DBPNAM3= <>
##$DBPNAM4= <>
##$DBPNAM5= <>
##$DBPNAM6= <>
##$DBPNAM7= <>
##$DBPOAL= (0..7)
0.5 0.5 0.5 0.5 0.5 0.5 0.5 0.5 
##$DBPOFFS= (0..7)
0 0 0 0 0 0 0 0 
##$DE= 6
##$DECBNUC= <off>
##$DECIM= 32
##$DECNUC= <off>
##$DECSTAT= 4
##$DIGMOD= 1
##$DIGTYP= 9
##$DL= (0..7)
0 120 120 120 120 120 120 120 
##$DP= (0..7)
150 150 150 150 150 150 150 150 
##$DP07= 0
##$DPNAME0= <>
##$DPNAME1= <>
##$DPNAME2= <>
##$DPNAME3= <>
##$DPNAME4= <>
##$DPNAME5= <>
##$DPNAME6= <>
##$DPNAME7= <>
##$DPOAL= (0..7)
0.5 0.5 0.5 0.5 0.5 0.5 0.5 0.5 
##$DPOFFS= (0..7)
0 0 0 0 0 0 0 0 
##$DQDMODE= 0
##$DR= 18
##$DS= 0
##$DSLIST= <SSSSSSSSSSSSSSS>
$$ [...]
##$SUBNAM2= <"">
##$SUBNAM3= <"">
##$SUBNAM4= <"">
##$SUBNAM5= <"">
##$SUBNAM6= <"">
##$SUBNAM7= <"">
##$SUBNAM8= <"">
##$SUBNAM9= <"">
##$SW= 16.9725357007746
##$SWIBOX= (0..15)
0 0 2 0 0 0 0 0 0 0 0 0 0 0 0 0 
##$SW_h= 3396.73913043478
##$TD= 16384
##$TD0= 1
##$TE= 0
##$TE2= 300
##$TE3= 300
##$TEG= 300
##$TL= (0..7)
0 120 120 120 120 120 120 120 
##$TP= (0..7)
150 150 150 150 150 150 150 150 
##$TP07= 0
##$TPNAME0= <>
##$TPNAME1= <>
##$TPNAME2= <>
##$TPNAME3= <>
##$TPNAME4= <>
##$TPNAME5= <>
##$TPNAME6= <>
##$TPNAME7= <>
##$TPOAL= (0..7)
0.5 0.5 0.5 0.5 0.5 0.5 0.5 0.5 
##$TPOFFS= (0..7)
0 0 0 0 0 0 0 0 
##$TUNHIN= 0
##$TUNHOUT= 0
##$TUNXOUT= 0
##$USERA1= <user>
##$USERA2= <user>
##$USERA3= <user>
##$USERA4= <user>
##$USERA5= <user>
##$V9= 5
##$VALIST= <valist>
##$VCLIST= <CCCCCCCCCCCCCCC>
##$VD= 0
##$VDLIST= <DDDDDDDDDDDDDDD>
##$VPLIST= <PPPPPPPPPPPPPPP>
##$VTLIST= <TTTTTTTTTTTTTTT>
##$WBST= 1024
##$WBSW= 4
##$XGAIN= (0..3)
0 0 0 0 
##$XL= 0
##$YL= 0
##$YMAX_a= 65213
##$YMIN_a= -38529
##$ZGOPTNS= <>
##$ZL1= 120
##$ZL2= 120
##$ZL3= 120
##$ZL4= 120
##$ABSF1= 10
##$ABSF2= 0
##$ABSG= 5
##$ABSL= 3
##$ALPHA= 0
##$AQORDER= 0
##$ASSFAC= 0
##$ASSFACI= 0
##$ASSFACX= 0
##$ASSWID= 0
##$AUNMP= <proc_1d>
##$AZFE= 0.1
##$AZFW= 0.1
##$BCFW= 1
##$BC_mod= 2
##$BYTORDP= 1
##$COROFFS= 0
##$CY= 11.3945322036743
##$DATMOD= 1
##$DC= 2
##$DFILT= <>
##$DTYPP= 0
##$F1P= 15.9154993809931
##$F2P= -4.1035820241983
##$FCOR= 0.5
##$FTSIZE= 0
##$FT_mod= 4
##$GAMMA= 1
##$GB= 0.15
##$INTBC= 1
##$INTSCL= 1
##$ISEN= 128
##$LB= 0.24
##$LEV0= 0
##$LPBIN= 0
##$MAXI= 10000
##$MC2= 0
##$MEAN= 0
##$ME_mod= 0
##$MI= 1.114404
##$NCOEF= 0
##$NC_proc= 0
##$NLEV= 6
##$NOISF1= 3.799351
##$NOISF2= 2.8
##$NSP= 1
##$NTH_PI= 0
##$NZP= 0
##$OFFSET= 15.70392
##$PC= 1
##$PHC0= -11116.72
##$PHC1= 8.60092
##$PH_mod= 1
##$PKNL= yes
##$PPARMOD= 0
##$PSCAL= 0
##$PSIGN= 0
##$REVERSE= no
##$SF= 200.130013532006
##$SI= 16384
##$SIGF1= 3
##$SIGF2= 2
##$SINO= 400
##$SIOLD= 16384
##$SREGLST= <1H.CDCl3>
##$SSB= 0
##$STSI= 0
##$STSR= 0
##$SW_p= 3612.71676300578
##$SYMM= 0
##$S_DEV= 0
##$TDeff= 0
##$TDoff= 0
##$TI= <>
##$TILT= no
##$TM1= 0
##$TM2= 0
##$TOPLEV= 0
##$USERP1= <user>
##$USERP2= <user>
##$USERP3= <user>
##$USERP4= <user>
##$USERP5= <user>
##$WDW= 1
##$XDIM= 8192
##$YMAX_p= 0
##$YMIN_p= 0
$$ End of Bruker specific parameters
$$ ---------------------------------
##NTUPLES= NMR FID
##VAR_NAME=  TIME,          FID/REAL,        FID/IMAG
##SYMBOL=    X,             R,               I
##VAR_TYPE=  INDEPENDENT,   DEPENDENT,       DEPENDENT
##VAR_FORM=  AFFN,          ASDF,            ASDF
##VAR_DIM=   8192,          8192,            8192
##UNITS=     SECONDS,       ARBITRARY UNITS, ARBITRARY UNITS
##FACTOR=    0.0002944,     1,               1
##FIRST=     0,             0,               0
##LAST=      2.4114304,     0,               0
##MIN=       0,             -38529,          0
##MAX=       2.4114304,     65213,           0
$$ Real data points
##PAGE= N=1
##DATA TABLE= (X++(R..R)), XYDATA
0 0 0 0 0 0 0 0 0 0 0 0 0 0 0 0 0 0 -8 8 -8 8 -8 8 -16 16 -16 23 -24 24 -32 37 -40 48 -55 61 -68 77 -87 96
38 96 -105 119 -132 145 -161 180 -199 218 -240 266 -292 322 -356 390 -431 476 -527 585 -648 722
58 722 -810 915 -1040 1196 -1393 1654 -2013 2542 -3399 5010 -9070 40729 65213 7250 44747
73 44747 -6522 5939 38068 20845 56039 39821 15191 31117 4956 32346 38856 28481
85 28481 47870 21768 21593 28115 13118 37758 30583 29925 33360 14218 23430 15402 18484 35188
99 35188 20203 27771 16639 3091 16665 9927 24083 25267 9605 13614 -4949 1836 12579
112 12579 5409 23150 5059 -3948 3060 -16756 3931 7999 -1822 12678 -11482 -12772 -5532
125 -5532 -17904 3851 -614 -7770 -647 -20869 -14757 -10956 -14820 893 -8883 -11329 -12762 -24405
139 -24405 -13956 -13243 -8820 -4249 -16013 -14834 -21395 -19942 -8941 -12496 -5547 -11745 -20550 -15272
153 -15272 -21700 -11466 -5381 -11410 -5386 -18038 -19045 -11819 -16158 -2208 -5091 -11059 -6481 -19034
167 -19034 -12225 -6239 -8964 2619 -6081 -9725 -6647 -15066 -3465 -979 -2408 4116 -6886 -6882 -4566
182 -4566 -7330 3755 2968 2035 2614 -5488 -2460 -786 2278 8846 4901 4028 680 -1986 3278 4866
198 4866 10070 10002 4894 5286 542 3941 8916 8729 13243 7990 4760 6161 2570 10179 12144 10251
214 10251 12774 5009 4531 7645 5856 13718 12290 8708 9777 2898 5353 8788 7949 13486 9433
229 9433 5452 5666 1600 5990 9062 8119 9264 4193 1457 1866 1698 5440 6679 5459 3025 -513
245 -513 -1534 -466 2072 3759 2334 233 -3062 -4192 -2809 -1569 1358 328 -2251 -3940 -7658
260 -7658 -5195 -3343 -2558 -386 -4031 -6238 -6786 -8725 -4151 -2605 -3691 -2694 -7359 -8713 -6989 -6962
276 -6962 -3120 -2480 -4692 -5076 -8460 -8283 -5092 -4311 -1864 -2659 -5687 -6275 -7131 -5315 -2278 -1304 -1578
293 -1578 -2841 -5460 -5412 -3804 -1746 808 53 -1351 -2991 -3953 -2682 172 1237 1928 451 -2015
309 -2015 -1891 -1300 777 3303 2430 1605 562 -1624 -560 1598 2879 4161 1982 1165 794 -165 1432
326 1432 2947 3470 3138 1481 286 911 611 3013 4625 3076 1865 831 -573 1888 2636 3336 4290
343 4290 1382 191 537 172 2935 3566 2786 2277 -258 -458 1107 1007 3478 2837 1003 678 -1063
360 -1063 -149 1836 1962 3070 1644 -506 -145 -816 1029 2041 2057 1710 -328 -938 -840 192 1668 1766
378 1766 1165 -415 -1437 -807 -963 1196 1209 199 232 -2172 -1685 -337 -521 1557 108 -1357 -604 -3212
396 -3212 -911 -34 -328 1198 -1290 -2486 -1702 -2759 -324 432 -905 283 -2644 -2443 -1333 -2045 670
413 670 -206 -1247 -1310 -3045 -1823 -805 -509 590 -1122 -1276 -1763 -2157 -485 -613 462 390 -1578 -1005
431 -1005 -2032 -734 972 19 1570 -640 -1359 -255 -1462 1290 1650 45 1621 -1306 -520 1177
447 1177 -243 2757 1359 287 1469 -1306 830 1426 661 3148 306 167 775 -787 1903 1603
463 1603 1220 2098 -718 281 374 33 2056 1095 957 730 -1229 277 -45 725 1688 49 474 -999
481 -999 -1085 368 -424 1430 451 -1175 147 -2165 -705 683 -726 1193 -1206 -1395 -307 -2380 524
498 524 -97 -1165 764 -2486 -1151 -780 -1858 1229 -728 -1014 117 -2592 -96 -393 -541 998 -940
515 -940 -435 -360 -1311 539 -323 491 890 -778 -248 -787 -117 1348 233 1400 -68 -592 245 -257 1220
534 1220 1418 537 1331 -456 441 1078 -62 2308 747 574 1164 -1048 909 1258 625 2278 -359
551 -359 309 827 -970 1820 450 635 1599 -732 400 260 -699 1678 268 702 600 -1227 328
568 328 -231 -10 1294 -621 435 -272 -1195 323 -438 751 583 -840 -40 -1250 -478 294 -459 672
586 672 -687 -1052 -320 -972 366 175 -219 476 -1052 -868 -287 -941 642 -254 -505 91 -1716 22
604 22 -392 -656 686 -626 -258 -444 -1233 326 -304 104 340 -1146 -399 -900 -718 445 -324 -122 -358
623 -358 -1097 -291 -857 -54 217 -565 -98 -1186 -717 -278 -599 366 -201 -537 -5 -1106 -309 -18 -586 890
643 890 -316 -337 -383 -977 266 -195 -121 370 -825 -28 -205 -397 703 -53 262 564 -521 108 318 404
663 404 1174 138 605 528 -102 787 505 1147 881 519 576 327 473 1018 1012 1068 932 500 677 418 1006 1091
685 1091 850 1053 517 463 719 583 1241 857 768 975 32 623 361 521 1033 321 477 291 -268 444 360
706 360 125 620 -102 154 -273 -538 400 14 -57 -82 -920 -543 -604 -523 -98 -520 -411 -712 -1036 -510 -641 -556
728 -556 -467 -937 -1003 -1150 -1069 -925 -398 -422 -945 -992 -839 -855 -666 -602 -378 -424 -1046 -903 -997 -701 -174 -525 -334
751 -334 -185 -806 -344 -395 -258 -78 -314 -164 -394 -621 -298 -70 -99 24 38 -190 -391 -177 278 416 199
772 199 381 -237 -183 -217 -37 252 664 267 150 157 -7 270 275 297 503 -101 48 82 491 440 484 493 441 4 -52
797 -52 566 493 690 629 285 377 291 127 379 451 592 285 233 175 453 519 697 616 273 392 183 218 507 341
821 341 819 359 156 337 215 220 836 446 605 310 109 188 114 166 198 283 159 156 6 268 435 192 357
844 357 -178 -43 -442 53 39 28 -34 -75 -409 -403 -182 3 41 -305 -188 -391 -352 -529 -357 -245 -433 -405 -669
867 -669 -707 -523 -425 -504 -467 -642 -518 -661 -655 -405 -749 -313 -369 -919 -612 -729 -558 -332 -568 -442 -431 -581 -425
890 -425 -649 -387 214 -291 -448 -344 -462 -194 -165 -120 109 -175 4 -292 120 -46 106 441 199 -79 47
911 47 -34 110 502 427 536 258 168 366 164 748 465 560 705 310 260 376 340 623 444 524 358 157 539
934 539 484 650 681 203 495 51 255 702 322 454 330 94 409 384 377 367 314 457 -1 -75 274 11 451
957 451 117 -103 154 -216 127 -89 -183 -24 -44 -52 140 -130 -123 132 187 80 -183 -113 -87 -153 300 3 135 -199
981 -199 -126 8 -422 108 172 -227 -47 -260 -400 30 12 -22 41 -290 -4 -252 -255 130 -48 -49 -263 -531 -158
1004 -158 -367 -379 -129 -116 88 -497 -234 -530 -536 122 -136 54 -272 -448 -155 -289 -161 88 -83 -237 -352
1025 -352 -257 -150 -131 58 -218 -517 -165 -270 -239 -66 -190 182 -120 12 -8 68 141 468 -83 105 -275 64
1047 64 30 -261 437 498 -124 164 71 105 216 204 465 204 304 418 33 479 287 487 504 151 92 471 342
1070 342 330 492 445 305 132 179 69 181 621 304 373 113 -52 422 426 424 438 244 252 54 53 177 189 -84 26
1095 26 42 -68 -268 1 114 80 -63 -257 -388 -76 -37 262 -84 -196 -167 -620 -352 97 -360 -281 -42 -83
1117 -83 -140 -633 -18 -166 -159 -179 -295 -362 -104 -70 52 67 -217 -344 -310 -321 -34 -72 271 -9 -157 -255 -255 -143 -349
1142 -349 -58 95 -263 -28 -117 -131 93 -281 65 -23 -85 -371 -71 31 -10 71 -66 -143 -129 -87 -225 39 0
1165 0 -23 -91 -291 77 -16 127 212 275 31 12 -314 -49 61 38 381 -95 40 -38 39 34 217 310 -5 -144 -27
1190 -27 189 199 283 174 -141 -145 -113 175 186 200 124 177 39 38 -118 87 393 66 172 290 -30 167 37 126
1214 126 104 285 108 225 -68 127 224 69 246 44 204 2 324 395 175 34 86 -159 -133 7 95 90 152
1237 152 -1 -111 -261 -228 -5 28 35 19 -332 -126 -230 29 106 -175 -190 -59 -270 -218 188 75 -75 -97 -100 -94
1261 -94 -405 -266 105 -14 -14 -140 -88 -217 -127 -7 -136 -106 -80 -198 -89 -93 141 132 -113 -89 -68 8 -32 92 168
1286 168 249 136 -235 -127 81 175 69 28 126 128 -91 -207 3 54 -123 -13 186 -78 102 -80 -3 52 -113
1309 -113 57 -260 45 -5 284 207 -173 -5 -107 143 20 180 -20 58 4 -133 -136 -30 -21 150 231 -111 27
1332 27 -139 -11 -252 -79 266 -24 -14 -127 7 -112 70 103 139 99 23 -102 100 105 181 25 7 -222 53
1355 53 -38 163 -93 -11 109 -241 69 337 169 376 -55 -260 -172 -28 149 -117 218 123 130 218 70 209 201
1378 201 22 -52 79 -151 78 -339 200 7 212 -10 -30 13 90 78 4 114 -17 31 -122 36 -379 195
1400 195 38 102 45 -247 -87 -304 30 242 -237 15 -110 -172 -2 77 191 151 36 66 -136 -24 98 15
1422 15 -147 60 -24 -100 -106 -139 193 -53 34 -63 12 -8 119 64 285 -80 -110 25 18 64 -77 -39 84 -101 121
1447 121 157 274 16 217 136 -226 30 -21 118 124 82 -250 -55 -71 -135 -194 -158 -143 138 -90 103 -56 -126 -147
1471 -147 -78 77 -100 -18 -82 -32 -184 -28 -40 -163 -234 -190 92 -73 79 58 -182 -257 -318 122 217 87 -48 197
1495 197 32 -220 -151 -165 -74 96 -105 -114 89 -44 108 76 29 -179 96 -88 32 -108 58 -79 144 147 29
1518 29 194 238 74 199 -89 138 259 70 66 -28 -99 127 162 229 88 -63 285 199 207 253 335 87 -56 53
1542 53 197 36 329 204 100 3 22 -207 -96 -44 3 15 -188 -22 -150 27 -117 -126 11 110 -34 -37 -178 -83
1566 -83 -113 8 -22 71 98 8 -66 -435 -4 70 99 180 161 113 -171 -41 110 -149 -109 -60 252 -180 -16 -14 -148
1591 -148 247 33 -97 -93 46 -101 -234 58 -202 -5 13 133 -60 -24 -153 -135 118 -91 29 -115 204 130
1613 130 135 -212 -72 50 154 12 -21 29 -191 17 -62 -168 -204 5 228 -57 -49 19 -254 -75 -134 -58 109 -7
1637 -7 52 61 166 75 109 -126 175 147 -119 -45 7 -83 228 216 -41 63 -147 -9 -65 113 195 75 237 -98 -100
1662 -100 183 245 -41 177 -59 -16 -72 52 -190 -78 118 289 -69 70 30 -162 5 1 59 -123 -61 -215 122
1685 122 191 -28 -225 180 -39 -369 32 175 -90 15 3 -101 -5 37 14 -113 -184 400 -218 -109 -40 -13 83
1708 83 12 -81 85 -139 -33 -260 119 -164 -109 64 -52 44 -40 31 147 -83 -62 -314 -54 116 -70 -10 167
1731 167 26 53 31 -163 14 -7 93 285 -35 46 73 -81 -41 -42 82 53 23 -6 -208 158 84 70 94 -48 96
1756 96 -132 193 217 -43 -46 -22 -77 129 40 50 236 -5 -52 219 252 128 30 186 -78 144 -37 -170 -148 -165
1780 -165 -5 -120 -65 300 -93 230 125 -99 -36 -159 -19 -54 -169 -157 176 -246 99 -15 33 126 81 128 39
1803 39 -286 -55 149 -75 132 -133 140 -103 -224 -19 -158 93 -82 -206 -72 178 -108 163 -43 -69 21
1824 21 -99 178 163 150 18 130 -408 -123 32 -128 -100 274 120 70 -359 -75 76 46 -96 -43 -261 27
1846 27 -71 -22 30 -142 231 201 99 312 11 -175 -50 -141 124 27 122 -78 -143 88 -236 6 -148 145 -260
1869 -260 -26 -106 174 52 -22 130 -9 -174 203 27 271 40 -224 -135 -25 24 -108 13 -77 27 -27 -172
1891 -172 20 -58 18 116 73 -153 -103 142 -100 -51 37 -69 -109 45 118 -108 28 44 -198 9 250 128 331
1914 331 214 -149 -139 -102 -71 -33 126 16 39 130 143 54 21 -64 -102 105 -106 10 76 -79 69 -163 12 84
1938 84 17 -422 -3 -145 215 103 -233 -1 37 111 -56 36 -145 -26 81 -183 108 -31 -146 68 14 -151
1960 -151 -42 -328 93 119 -33 132 -225 251 67 83 -81 -19 182 218 -45 93 -6 20 109 126 54 -9 77 115
1984 115 -256 -9 -79 4 -1 -6 46 58 -114 -264 -221 32 -330 -90 -163 81 43 -184 -138 39 -167 -9 -118 -173
2008 -173 210 -193 177 24 -400 714 218 213 15 85 6 337 41 -290 -284 249 249 -1054 -306 -5 -52 316
2030 316 -20 261 27 -175 -85 5 468 394 -27 96 -47 -495 7 -114 208 -183 247 295 -309 89 262
2051 262 306 317 76 157 -319 -16 -46 409 -80 80 -901 -560 -146 -283 -381 30 -668 272 -358 92 170 -343
2073 -343 724 366 24 599 294 -322 -314 -240 -30 385 198 -190 -745 696 -651 -314 -130 -85 258 123
2093 123 226 59 -143 -85 -231 -517 225 201 -281 -61 -142 291 89 -377 -115 104 -123 329 109 -19 36
2114 36 147 215 50 -186 -15 380 218 33 18 13 -133 -184 29 -49 -46 -25 182 23 -82 25 1 -21 -32 -149
2138 -149 -134 242 -194 -16 -70 -211 218 237 99 11 35 -15 183 -57 11 159 186 28 94 180 -48 -139 -408 -177
2162 -177 -33 -26 25 -104 -118 184 -83 -101 -100 -277 -73 69 -78 -90 -79 223 -158 -13 -78 99 -129 -60 -194 -96
2186 -96 116 37 -14 -78 -70 -155 -120 62 226 -96 -9 -49 91 -120 -26 -70 -164 -8 -193 -159 -159 -65 -160 147 -39 -42 -176
2213 -176 98 -133 -56 3 -95 -56 144 31 60 -1 -15 -179 -7 81 -156 -113 89 -224 -93 2 -343 50 -245
2236 -245 -123 -176 208 -17 292 258 -84 -49 138 -4 115 240 47 62 94 35 -14 37 128 47 197 178 -64 146
2260 146 -15 -229 93 -3 2 222 74 -231 -174 5 185 101 157 70 46 -146 -26 -15 -23 65 -98 195 -40 36
2284 36 43 -3 -160 -156 196 85 -2 18 198 22 -342 -30 -117 195 -86 73 -11 -198 -86 -162 -7 -84 -5 -252
2308 -252 -38 -84 133 -3 11 110 -170 -85 238 -36 -38 -245 84 39 -21 245 114 70 -56 -105 113 -107 89
2331 89 253 -4 8 129 163 36 -59 283 57 127 10 -44 55 -94 -197 80 189 -36 -10 51 -103 22 -37
2354 -37 54 -16 11 11 -125 -39 -149 300 109 24 169 -220 108 77 -276 -204 112 179 147 -3 104 207 -128 -115
2378 -115 -57 45 12 9 -102 113 142 -298 -41 79 -8 -59 107 -76 -25 -205 -116 -91 265 197 -14 -128 67 -110
2402 -110 1 -37 28 -120 -157 -45 42 114 -4 -66 -132 -26 31 0 -205 -51 -126 7 216 -74 -60 -112 -104 6 -225
2427 -225 -52 89 87 -58 45 33 -23 -173 -19 8 -127 -153 -44 139 -320 -16 -175 -156 -164 10 230 102 53
2450 53 -222 59 -169 112 -120 -137 309 36 119 -65 155 119 81 46 223 -191 -220 137 -27 70 -199 136 70
2473 70 -10 133 113 181 85 169 102 -237 -147 -93 163 -29 26 -167 216 53 42 -90 -285 -74 -248 203 125 156
2497 156 39 -102 -33 149 103 -95 128 61 -31 110 -235 49 119 -91 115 -21 -63 -133 214 -50 89 -10 -243
2520 -243 383 303 0 -226 16 108 -77 -93 -5 -35 26 198 15 22 -144 -122 50 -107 -62 147 99 -1 -57 80
2544 80 128 -34 115 39 -58 -310 -66 -117 -16 -70 80 4 -81 -39 -123 39 11 -197 -54 -254 74 99 5 -170
2568 -170 -139 -230 73 45 -166 45 81 -55 -177 66 -67 77 99 27 -181 0 150 -191 -84 9 -144 240
2590 240 49 65 -69 -206 188 -9 -1 188 -66 -174 347 94 109 -44 -175 347 119 144 -88 -95 102 86 -246
2613 -246 -207 -66 -116 64 -153 -23 150 15 13 81 136 94 -124 95 -21 164 51 135 21 -122 84 -165 -246
2636 -246 261 -17 43 -149 -4 94 -63 80 -213 -13 -39 -64 -53 -231 128 -57 -69 -232 -240 41 219 -121 -96
2659 -96 83 78 -101 75 1 -304 122 113 43 -86 45 -28 94 -62 -41 -138 -16 90 156 -100 -153 -294 -71 -88
2683 -88 455 -89 107 175 61 57 -74 108 78 122 -215 -63 -45 -107 -129 111 -1 29 2 -181 73 -223 33 165
2707 165 -23 -217 -3 -156 40 75 57 -17 67 -9 -176 36 148 -39 87 224 -25 -50 76 -88 -227 -4
2729 -4 -106 132 -17 -167 -240 40 46 61 -137 -47 -4 149 -185 -73 34 13 247 -233 5 -116 107 -57 -125
2752 -125 19 56 -46 -16 279 -54 19 145 109 87 19 -4 152 -49 178 146 64 -90 41 220 -193 -140 59
2775 59 -83 114 195 140 -165 -107 -44 -186 103 199 20 -170 -76 -43 -26 15 -100 -141 -5 111 310 39 82 -51
2799 -51 -86 77 -96 65 167 20 -247 197 25 -78 146 -205 60 95 -103 63 133 24 89 43 -172 235
2821 235 60 -99 -107 -1 26 42 141 -52 192 55 -92 41 122 100 -60 151 208 -10 -82 -133 73 -8 8 -10
2845 -10 -2 -4 147 -10 -88 -155 17 75 192 -70 -149 43 116 72 26 -249 10 -132 -59 127 -259 323 144 1
2869 1 89 -109 -162 -7 -5 25 -185 74 -23 128 57 -11 115 -116 91 -8 -68 -34 -25 -156 210 -142 -119 237 343
2894 343 335 83 -23 144 -100 -36 -114 -113 -102 -7 38 -115 94 -7 -16 122 39 5 19 166 322 -164 -145 142 144 -93
2920 -93 -150 -170 159 246 109 -310 -257 126 -67 72 42 -143 -133 52 -212 99 4 183 -72 -51 -62 207 51
2943 51 220 190 -125 23 -32 -8 28 43 195 -81 202 41 34 142 -50 292 42 243 64 -152 -213 25 97
2966 97 -85 134 -286 -68 -46 -11 -2 -74 -49 -149 -271 279 115 -162 -2 -70 -57 -133 -111 47 10 -129 -21 -164
2990 -164 -5 -244 -16 -119 118 -88 -54 -109 -163 87 -162 -214 -262 -142 -4 -23 97 99 35 -176 212 -79 -2
3013 -2 172 226 4 55 106 -42 34 161 -148 0 -37 3 -211 148 114 -111 -34 -94 -122 112 221 -290 10 -210
3037 -210 -33 268 -29 -109 16 -81 73 -195 38 -69 30 -19 -184 361 -159 -114 -46 -71 89 17 -143 -14 -113
3060 -113 -235 66 -148 -3 304 143 28 -145 17 -88 242 -178 62 101 -84 22 335 -49 -209 -111 -253
3081 -253 -208 34 129 -614 -381 -130 366 280 239 -295 53 83 -115 -142 26 -343 -95 118 47 -80 -176 -206 149
3104 149 -30 -68 13 48 -115 -215 -37 46 245 -32 -62 -110 73 -49 -444 240 78 12 -174 -190 -53 -198 -22
3127 -22 72 -104 -99 -131 -169 112 106 -160 -91 -59 196 -46 -121 -187 108 -68 35 264 254 50 -123 121 134 86 -141
3152 -141 -186 47 -114 -83 105 51 49 -37 -67 5 -208 -37 -139 9 -33 -11 -24 -167 64 -79 67 173 -141 -49
3176 -49 -29 -105 -8 30 25 87 112 -200 -184 -95 -91 14 96 34 45 224 105 -153 -81 -184 3 -15 -27 104 -76 84
3202 84 -148 -124 182 -169 -97 -31 64 -40 -181 72 60 70 -119 24 70 -59 -158 256 7 69 182 -153 154
3225 154 140 22 33 78 120 -357 -38 44 103 -213 128 38 -105 -63 -137 260 42 76 81 110 -65 20 -27 98 56
3250 56 -36 14 138 24 -119 -136 95 -192 76 231 -69 -56 -372 60 -86 -215 29 -142 -232 388 -84 405
3272 405 -362 -464 -73 194 125 221 270 -237 52 -345 36 -264 165 -204 184 32 -228 -88 205 -123 77
3293 77 7 -57 -19 67 -72 46 71 -228 155 -77 -311 25 -160 -141 -52 95 -109 -184 -37 -264 35 -96 26
3316 26 -128 26 76 41 -32 65 83 -44 -101 166 64 -264 -79 -34 241 -22 65 -30 161 -33 35 24 -236 119
3340 119 216 188 24 274 105 -122 134 -271 32 8 -159 -49 -18 72 -83 131 8 190 -84 41 -222 -29
3362 -29 -244 -34 178 190 -84 -93 4 -165 -233 -111 -17 62 -56 49 -190 2 224 -101 43 -229 -34 -69 -142
3385 -142 291 -61 134 -83 9 -126 -173 -52 66 -190 -120 -246 88 -14 -140 93 -227 175 -355 34 124
3406 124 127 -45 4 164 151 68 -123 -93 -136 -66 208 181 143 -138 -121 -193 -126 -42 74 63 16 30 -164 -103 -64 45
3432 45 -58 -74 -42 -133 -195 -131 42 -65 -179 -94 -80 -138 -91 51 166 -167 -81 124 -204 -212 -69 35 -26 -222 72
3457 72 16 -247 -28 -70 -55 100 27 -85 -142 -13 -69 51 11 -10 151 -71 111 -10 -87 21 74 71 -119 44
3481 44 -101 178 61 71 243 10 77 -152 183 -120 7 120 -239 -19 170 -12 -40 117 -133 23 144
3502 144 110 48 -159 327 -37 235 -118 68 -173 29 -6 151 -166 -2 74 -22 -104 -126 -172 260 -22 123 -170
3525 -170 10 62 292 -27 65 -16 64 233 -119 -57 -4 53 60 3 -62 36 -83 -216 341 -54 -146 -84 -24 40 -55 181
3551 181 -164 -252 -231 63 139 -117 183 5 -89 17 -106 -211 118 121 -35 144 -369 -46 197 107 -292 0
3573 0 -88 -146 -186 131 -248 -151 72 -17 -122 -205 -293 -170 31 224 -61 4 95 -104 -15 -134 148 -172 -113 1
3597 1 97 78 10 -99 -22 -98 85 177 13 231 -50 13 -35 212 144 -102 125 -300 -25 -288 -135 15 -19 10
3621 10 -37 -115 -155 105 89 3 19 175 -177 -1 13 12 -9 19 116 -104 -181 -208 41 -20 43 15 123 291 164 130
3647 130 4 -78 -19 -60 -146 -129 280 32 -240 83 -150 165 243 59 -78 -186 -62 -54 -168 205 -4 -1 -77 -42
3671 -42 233 -199 18 125 -6 41 -12 -27 -88 52 64 -73 -47 139 -147 196 262 -171 -235 -55 -212 -53 94
3694 94 38 37 218 -67 -252 172 51 -143 -107 -78 134 -3 -61 -249 -91 -54 187 -124 48 -90 184 -39 58
3717 58 -7 -246 -47 -209 -35 114 11 133 -104 7 18 -145 -11 -14 -5 -323 -236 -96 321 -214 156 -226 77
3740 77 -20 -110 158 6 91 -238 11 5 102 39 33 -70 -82 -57 -91 165 -157 94 -194 114 -123 -287 -23 -64 -69
3765 -69 54 154 -255 57 51 29 -246 -107 89 179 -18 85 154 -249 287 98 -414 -235 -15 86 -130 -80
3787 -80 144 -136 -58 1 55 -214 244 82 130 -7 -64 -9 -255 42 52 -81 -22 -12 -162 -86 -91 157 -156 -75 35
3812 35 45 147 -40 -117 -156 -78 -220 155 54 -148 -1 75 -64 -57 -182 209 155 -19 -7 10 -60 45 -29 88
3836 88 123 200 47 75 78 148 -185 -139 86 38 49 55 414 144 127 118 -6 -73 -129 -87 -78 -45 98 -25 -116 -63 -31 51
3864 51 -146 -200 -170 -101 114 25 2 132 12 -126 -72 258 19 60 -15 -60 -147 51 230 -276 86 100 -100 6
3888 6 -123 -96 119 94 69 28 49 90 -163 1 -122 -221 232 64 138 -204 -202 4 75 93 -56 -60 56 155 54 -59
3914 -59 88 174 72 -33 230 285 -32 150 35 -39 18 -11 -230 20 0 8 -125 116 11 145 98 148 -39 200
3938 200 -214 160 -8 -163 -34 -72 -115 -13 53 12 86 117 -50 89 -168 25 184 -107 35 -366 127 32
3960 32 142 -46 142 -114 21 41 -327 -146 141 -169 -26 116 -103 42 -73 172 135 -51 60 62 -307 -27
3982 -27 55 -33 -127 84 -230 -88 65 18 -143 69 96 92 111 -54 -104 37 -196 -40 -149 -98 -34 -10 34 -211 -86
4007 -86 -59 146 -73 85 93 84 31 31 82 -14 57 -40 137 288 148 141 100 -97 239 -83 -20 34 -33 36 -51 10 -22 204
4035 204 -190 41 -161 -207 128 -188 99 -142 -405 -131 89 194 -103 -35 -406 64 156 -112 236 -100 -203
4056 -203 189 5 33 81 -58 -14 -131 232 31 2 -60 251 140 -34 -170 -120 51 294 -90 -85 165 -60 -22
4079 -22 -65 65 158 286 -220 6 -89 -53 -66 -173 222 71 -99 124 -1 -139 -235 72 -133 -85 154 -71 -2
4102 -2 -348 148 97 231 -341 130 150 -82 -17 -109 -17 -223 -95 -86 -20 225 -109 -28 -36 137 141 -43 -40 33 -94 -17
4128 -17 456 -135 206 434 -69 -81 121 27 281 23 -338 269 -21 -522 -315 63 164 -105 268 467 -327
4149 -327 -8 68 313 -287 -11 -419 -186 93 -595 217 -402 -156 326 -414 -336 199 -45 -707 -586 -47 169
4170 169 107 83 366 -412 32 -171 23 -1004 -608 702 309 47 -6 348 -553 -825 -215 -974 260 -15
4190 -15 119 -147 155 101 -209 88 69 93 673 11 594 88 117 -42 -180 583 -590 93 -466 219 111
4211 111 272 -552 -101 -350 -16 257 -180 148 24 275 135 91 36 -76 153 91 -94 -112 -96 -61 -7 -89 -109
4234 -109 8 -2 132 -33 -69 182 -78 127 58 -157 143 140 -101 149 213 95 127 158 73 -231 72 -161 190
4257 190 -157 -101 -104 -64 11 29 87 -54 -18 -46 52 -105 -109 166 -100 -93 -132 -52 13 69 3 -175 -42 78 147 -74 -18
4284 -18 87 251 136 -68 64 -104 -122 47 -102 2 -7 136 14 47 -122 -25 98 -122 -145 62 -82 179
4306 179 -109 -59 -287 -120 -43 -271 -42 211 -85 151 228 -120 70 -132 -69 45 78 -19 52 -149 -91 -252 146
4329 146 132 -127 -240 -33 120 -172 -79 168 10 -184 176 136 -19 173 6 280 36 94 61 127 -199 -20
4351 -20 67 -40 -145 -199 -69 -63 98 -245 -301 76 33 -128 78 -35 27 -123 -114 86 -147 93 -172 -176 -48 -136
4375 -136 -218 17 35 51 -263 -120 -77 -244 120 -86 -112 71 25 -147 67 267 79 -210 0 77 -39 -87 -26
4398 -26 83 105 -38 -126 -31 -124 182 124 8 -110 126 -90 95 114 -143 90 21 178 -12 -53 77 -72 -16
4421 -16 -6 27 207 51 157 63 -96 87 -171 -80 -38 121 115 13 25 -24 156 53 -8 132 25 76 -101 127
4445 127 266 62 90 -76 182 101 19 -66 -148 49 68 -165 -74 219 147 15 62 26 165 111 -340 100 -47 1
4469 1 73 -44 -84 257 60 -8 -351 107 -194 47 204 -201 -36 -52 135 -82 96 128 -181 90 -139 -79 90
4492 90 -176 94 -222 -123 41 77 -112 -6 92 66 -129 83 15 -324 53 -263 29 71 1 57 -63 172 -5
4515 -5 54 -1 -1 -183 -87 -113 -194 151 -229 20 120 162 30 -52 167 121 -80 -25 70 -140 -156 -34 96 25 82 40
4541 40 -68 -53 20 -20 -137 -36 168 -38 -9 164 -23 -109 51 69 -147 198 171 -118 -79 -145 32 -152 158
4564 158 -152 -49 1 -240 -61 231 98 85 -163 -147 281 163 166 -94 -12 -47 -120 25 13 126 -78 -333 33
4587 33 142 -79 15 -28 64 -116 -59 -136 66 214 -39 209 -211 -85 -132 -124 34 47 -166 -152 -66 -12 -55 10 -11
4612 -11 151 77 -157 -115 -3 -152 5 -175 1 -134 -58 96 57 -148 10 -216 -101 189 -69 57 22 -95
4634 -95 51 7 29 -5 208 -111 -27 69 -99 195 331 123 102 7 -54 196 129 -175 -64 19 116 -43 -112 -74 -54
4659 -54 -118 -145 -231 64 -94 -39 88 50 -127 -96 -140 10 50 264 121 -8 -62 -122 -150 -169 59 113 -77 3 -357
4684 -357 0 -129 202 56 -14 -106 92 -102 -270 -207 88 451 228 -168 376 108 364 -707 442 121
4704 121 -110 875 -119 -115 -195 -116 2 208 34 150 185 10 -211 -122 -28 -25 14 181 157 -75 162 -111 46 21
4728 21 -27 143 63 48 260 166 44 231 -182 -1 266 -47 -9 69 4 34 111 85 -185 -201 69 -65 138 -141
4752 -141 95 -140 12 -7 -117 -172 -67 -246 -102 55 277 64 21 -74 -209 61 -68 25 219 -128 -96 -71
4774 -71 243 158 3 -58 -96 -102 33 -136 43 -48 28 -2 49 -215 -110 242 -184 109 189 13 64 46 -1 183 -109
4799 -109 -147 -138 12 47 -140 122 227 -391 269 132 -73 -57 -168 -214 230 -41 43 -73 80 64 294 100 134
4822 134 0 81 9 3 -117 100 -13 253 33 1 -28 -108 -78 -159 119 24 -104 -68 133 245 42 113 51 150 -163
4847 -163 -331 -170 81 19 -62 232 -116 346 97 145 51 105 -13 -413 186 -151 38 -174 -122 -73 11 39 -198
4870 -198 69 -101 21 -20 42 20 351 52 181 7 53 -97 52 -157 -35 -172 252 -859 -783 -289 -660
4891 -660 -223 -390 -115 -21 21 -22 54 -36 84 139 78 21 -46 19 118 117 -63 -67 256 -49 -252 24 258 -79 69
4916 69 -84 79 -1 14 14 246 11 -110 103 62 66 111 -194 -165 137 127 -146 102 -13 104 -83 146 -99 -54
4940 -54 -97 181 -227 -199 -66 -45 -156 -275 -58 -70 30 -222 224 158 204 -114 85 -171 46 231 77 164 -143
4963 -143 -90 26 -166 -2 -196 -42 157 0 -22 -39 -137 106 83 93 109 31 -152 94 -88 95 180 -61 -36
4986 -36 110 -39 11 156 28 72 62 104 -302 -196 137 -25 48 -91 -56 79 57 105 -152 -67 74 -230 -65
5009 -65 -19 -79 -172 27 114 -158 -35 -143 45 -94 -43 10 -28 -158 -128 -238 24 61 -80 -9 -23 27 138 22
5033 22 -213 105 -159 60 58 8 -18 -68 125 49 26 71 -41 46 -11 -237 18 62 2 238 137 -144 64 -17 128
5058 128 19 -217 -42 91 90 -316 -286 -11 -291 67 7 -134 49 -112 29 -97 35 -30 -110 -83 30 -67 -80
5081 -80 -120 114 33 -19 23 -87 -74 161 6 63 -41 81 -50 -258 16 -55 -128 17 4 -127 -121 -152 -118 -113 -174 -131
5107 -131 49 131 -90 160 -189 -74 -171 48 37 54 116 -48 31 -91 -15 -228 -117 6 -27 -53 -11 3 -28 -173
5131 -173 -122 -304 -12 91 -60 -35 13 -11 -80 135 98 95 -240 -105 -222 76 -36 -102 -27 -123 -34 -129 -106 -110 -147 -340
5157 -340 87 -78 23 47 -143 186 60 -3 101 -147 -91 -55 -124 -201 297 237 82 329 69 92 78 267 13
5180 13 -15 -166 152 26 -87 -55 -203 29 -127 -21 -48 12 112 -152 -35 -158 -50 242 219 -109 -238 -62
5202 -62 173 -69 66 -79 167 0 22 67 -153 104 -120 -69 -83 -5 -230 -43 137 73 7 55 -17 -64 165 181
5226 181 62 -3 240 64 -165 -51 101 -6 50 113 234 116 -35 86 54 -32 -120 20 323 -95 16 49
5248 49 -159 -50 -55 -70 184 -93 165 -237 -5 106 -442 -49 172 73 58 127 7 -169 -60 70 89 127 9
5271 9 186 -49 -37 68 -70 -141 -265 130 -163 99 -7 -15 1 41 149 26 77 101 131 32 167 46 69 -73
5295 -73 78 -71 79 -168 -231 -107 184 -96 -9 350 96 -17 -12 188 161 117 123 28 -98 -68 -31 -258 -46 19
5319 19 -50 121 231 382 39 -75 -94 184 95 226 76 54 0 82 -148 -216 71 -82 75 -160 70 31 95
5342 95 2 12 -116 131 330 141 -109 -14 74 -51 3 157 111 -95 242 206 -296 -30 -140 70 277 -97 53
5365 53 50 123 -207 117 235 -99 -35 164 -178 -226 -172 -248 40 153 41 -109 83 273 -23 82 42 -194 -42
5388 -42 -76 95 45 35 -281 125 -196 332 68 2 -9 24 -99 211 92 -6 -89 136 182 -6 135 -194 -17
5411 -17 6 -157 -5 -121 -35 158 99 -27 -69 213 16 -82 130 210 148 76 -7 -382 233 614 -114 -156 307 477
5435 477 -499 93 -180 184 -134 -15 77 -74 -114 -22 160 -108 -145 -69 69 -117 -107 106 -4 8 49 129 239
5458 239 163 35 -180 -88 104 -153 -190 26 -63 -16 -5 95 -109 92 109 52 -61 35 -51 -95 -11 -31 3 -274 -123
5483 -123 -100 -11 -162 173 -22 85 -84 235 244 13 -97 -17 -117 -108 142 -349 -148 -422 -361 -96 -112 157 -354
5506 -354 -357 281 -116 113 -77 22 -28 -1 308 536 88 -317 131 173 -459 419 -506 -380 169 437 149 -263
5528 -263 228 188 -73 12 -48 -106 -597 -508 -1166 -1040 111 -73 319 81 17 193 -102 -404 232 10 288 49
5550 49 129 189 -107 -51 66 75 -262 -50 -68 -74 10 47 -24 -58 263 -299 234 58 80 61 32 239 -165 148 -26
5575 -26 242 116 -125 -76 185 -124 85 -10 -211 22 -19 -99 -24 3 18 -13 -53 -83 -35 -38 10 -75 -61 69 -110 -29
5601 -29 134 -32 80 153 94 151 -165 94 -263 147 25 -70 -159 -53 -41 -134 128 13 71 131 -186 91 -30
5624 -30 62 -80 181 122 121 -247 -103 -36 -53 -93 149 -37 47 -63 108 93 -130 14 -32 75 -78 -51 -241 20
5648 20 -19 -18 -35 155 16 -86 22 312 63 69 97 172 117 -210 -142 -88 -285 -8 -44 -81 -199 60 56 155 7 -5
5674 -5 2 195 -2 183 170 -11 -44 95 254 62 -184 62 -18 -174 6 -9 1 63 -6 -131 176 57 -32 -130
5698 -130 1 -1 45 -134 -4 55 272 36 131 -145 21 147 -132 232 -92 151 -4 7 185 2 -19 -137
5720 -137 -24 -105 -115 46 -97 -102 -93 -129 -169 -162 88 -56 22 -148 39 -153 -220 28 152 436 -167 -25 -79 29
5744 29 -212 131 268 -113 79 174 34 -34 -54 -28 -67 33 -233 -168 108 243 -164 -98 134 -64 -163 112 195
5767 195 -63 133 -140 -24 -70 -48 -28 161 -31 -135 -233 -29 -255 -119 -61 22 -156 -10 228 -51 99 211
5789 211 196 -25 -146 -59 24 -114 -19 92 3 44 -41 -152 -29 -19 -84 119 -99 -69 -14 24 14 11 -10 58 13 -103
5815 -103 -59 -97 30 -138 -73 -63 -99 86 -447 -81 43 -23 -18 118 11 -96 165 226 156 -299 114 -74 223
5838 223 -125 17 82 6 -230 171 57 -132 20 120 228 -28 68 -93 366 20 188 117 -52 -48 -18 135
5860 135 71 4 -77 -263 163 -43 -127 -19 -112 -154 -188 -102 -26 -37 67 123 100 -373 -165 111 313 18 179 21
5884 21 -57 -57 67 -19 -96 43 4 180 45 84 -118 -35 367 2 -72 -49 -121 123 45 57 -50 148 39 19 -138
5909 -138 65 82 -105 -58 78 157 -26 -122 -27 -149 137 -136 9 -40 17 103 -208 -66 -290 48 147 -164 -7
5932 -7 -60 -193 105 -54 -103 130 -6 -181 269 118 204 -116 40 -293 58 -204 -41 -247 -64 0 43 -66
5954 -66 -274 104 -206 -116 -12 -58 172 201 55 46 -17 -64 -47 384 -32 -7 110 -145 104 -60 196 15 -78 -243
5978 -243 167 -60 -158 42 115 -292 -33 -126 -22 66 -140 88 43 102 56 142 108 114 48 70 63 -51 -195 -150 -90 -29
6004 -29 -46 36 -24 -27 -93 135 99 -30 -261 90 -116 -119 -49 192 -194 -87 2 -79 -90 161 -14 -131 91 111 105 186
6030 186 -74 99 -63 57 -30 51 141 34 -64 -129 25 -222 -16 -154 36 -29 142 -329 121 -30 -141 -8
6052 -8 2 53 -10 -97 38 203 241 -219 -158 -29 197 -67 57 85 172 74 7 269 -31 -77 100 280 -100 -309
6076 -309 63 -220 -170 175 262 108 -58 92 280 53 -31 74 136 -84 -228 -108 -128 -55 -34 -98 105 52 -66
6099 -66 130 -153 103 250 0 192 -164 176 30 57 -74 107 -241 78 121 -227 311 257 215 8 -67 -88
6121 -88 -108 143 -155 -16 -53 -4 -86 15 88 -69 127 -109 -13 67 80 -96 3 44 -103 -253 19 -345 3 -436
6145 -436 67 197 -65 209 98 108 -210 -57 128 37 -39 -62 89 49 -251 -61 -25 40 -276 -112 -104 -110 133 34
6169 34 -132 -145 82 125 79 -92 59 99 -35 -114 -92 77 190 -128 102 -84 -109 24 69 276 -19 189 195 89
6193 89 -344 -15 -2 233 -3 -207 265 -6 56 53 285 130 -63 -159 -219 -240 -60 82 -142 103 -100 266 -80
6216 -80 -44 -2 -13 55 -79 75 -193 -1 -48 -198 103 -122 46 171 -202 289 105 89 -109 -63 -53 56 142
6239 142 -22 -205 -383 -113 3 70 -3 195 1 216 37 -180 -97 71 169 115 15 -95 -46 -58 78 56 -151
6262 -151 125 85 -128 42 -184 -10 -96 -90 130 18 -50 -224 17 150 -202 450 73 158 -83 -55 5 -21 28
6285 28 63 2 -224 56 -61 -134 137 -130 10 -121 -118 276 150 -132 -67 206 -72 -18 266 65 -40 -128 -31
6308 -31 -33 51 -134 258 -568 530 256 -277 267 469 361 36 81 200 234 -118 49 143 -20 81 27 -176
6330 -176 277 142 -209 -53 188 191 148 34 138 -32 127 59 -117 -150 12 -22 -16 25 206 -94 130 284 108
6353 108 99 210 178 10 -130 30 13 22 11 -73 -134 -129 175 -212 15 -139 -203 137 -9 8 0 -219 -33 69 -17
6378 -17 195 34 -139 172 255 90 16 132 42 65 -38 -10 82 218 0 -349 27 -160 32 -200 70 -29 -73
6401 -73 -114 -46 -17 13 90 -105 200 -3 41 -153 -167 -125 -31 -55 -129 18 -137 -152 -8 -100 51 -183 14 -67 13
6426 13 19 -259 -116 176 72 -206 247 -30 21 73 -39 -123 195 -65 -90 -6 425 21 -148 13 74 163 88 111
6450 111 54 -177 -9 366 128 10 70 -295 90 -7 -17 -183 231 -71 -46 -204 -207 -73 -22 -249 -92 -161 12
6473 12 -62 -68 52 85 -60 67 43 2 175 -308 0 160 115 -251 70 110 64 -61 135 77 -143 74 -4 81
6497 81 35 130 -186 -167 251 -334 -170 -162 -40 136 -18 -167 -60 184 -11 89 -117 -45 30 -12 38 -161 -137 -178
6521 -178 -122 26 28 -20 -34 233 -103 -40 -109 116 67 30 -13 -98 -77 -154 223 151 43 224 59 282 -264 -7 -273
6546 -273 262 -116 -136 -656 270 18 77 88 3 7 -3 47 -190 75 -71 290 -234 -34 192 90 -33 110 -113
6569 -113 5 81 92 -224 -38 -86 -137 39 147 -124 -128 70 166 21 27 104 -85 -14 -90 49 -189 -95 5 -66 45
6594 45 32 -60 -140 153 -54 -140 -64 111 2 -62 153 -127 -60 59 -206 -97 -71 -67 -95 -120 -113 -245 -38 219 -184
6619 -184 -203 44 143 -131 -74 -148 219 246 -170 -136 112 -191 286 65 74 -118 245 143 -73 50 160 6 -97
6642 -97 123 -99 -118 3 -173 -139 50 -142 -70 189 48 275 -7 -65 130 -114 -8 -178 -55 -58 29 -22 -54
6665 -54 -201 86 224 45 0 45 -20 141 -77 21 2 -54 -73 229 38 -23 -274 -176 72 -88 200 81 -172
6688 -172 -12 -71 -82 -315 -38 -152 79 -24 97 59 121 -49 59 -54 221 103 -111 -47 134 -53 224 -27
6710 -27 -79 46 -63 143 -57 49 17 481 -277 -311 126 -71 89 143 -30 58 278 -225 276 -160 -185 29
6732 29 141 143 48 -199 -80 124 14 -158 -23 -100 -132 97 -229 40 -34 185 -78 72 -26 170 -97 239 174
6755 174 -330 40 45 -128 -175 21 -107 278 -285 172 -322 -341 -268 243 -16 8 78 -131 -17 -49 -51 -19 79 197
6779 197 32 131 -239 -24 -153 375 -135 126 -107 -40 147 -8 117 139 -178 34 11 -98 -39 -182 218 -140
6801 -140 -153 -57 -230 -83 -93 48 18 22 1 -315 103 165 95 -56 -115 58 -23 99 -86 138 37 36 193 -131
6825 -131 71 -75 -126 -208 76 -207 -73 -293 -167 -20 75 -141 52 -34 -137 158 83 -266 -62 -246 -145 15
6847 15 -121 -208 -90 -88 46 -120 88 58 2 234 -36 270 61 54 -216 131 -26 -54 -44 -223 220 -30 36 50
6871 50 -115 -8 -111 129 55 165 -84 -144 87 146 5 117 209 -26 -160 -95 44 65 102 168 211 172 102 158
6895 158 -331 -17 82 -50 29 -97 -2 -44 -122 -163 -23 -49 250 65 50 226 -100 68 -21 86 30 -109 2
6918 2 37 73 83 -253 104 29 -120 -215 -155 -3 -51 -96 -222 5 73 -141 81 100 -151 -118 -23 -299 171 112 -22
6943 -22 131 -94 49 152 85 -53 206 156 65 11 -2 -150 106 124 -27 56 -17 21 124 49 70 315 -231 -39
6967 -39 98 -199 202 -51 -14 -52 -160 -404 -199 73 202 9 -4 -172 -178 -233 -214 -38 45 -169 -211 73 10 -48
6991 -48 61 -7 -9 -184 -157 92 136 -7 150 162 57 -29 160 -82 -27 -17 -60 170 -147 -258 -237 63 -36 -117 14
7016 14 11 -85 -222 54 -102 -2 -4 8 -8 -100 -91 93 -69 -167 33 -102 67 48 232 39 2 -108 169 274 -137
7041 -137 35 -148 -49 86 -28 -90 85 -87 -15 -56 -238 239 211 -105 126 61 -10 -33 -274 -108 15 146 32
7064 32 176 -2 7 108 -194 34 -246 49 -89 110 257 -148 -140 98 86 5 124 1 -273 179 -103 194
7086 194 143 22 -68 -88 16 238 -70 -140 -197 -66 -26 -15 -190 -255 69 -60 118 103 -8 -2 286 -262 15 -186
7110 -186 -110 -2 91 23 -66 -274 185 94 -147 -294 -100 6 -280 80 46 -159 -530 167 -39 14 -175 137
7132 137 -209 -146 308 0 57 -101 -187 181 -375 347 59 -116 -47 -162 28 -165 -282 -125 -142 -49 330 -318
7154 -318 8 -179 -238 323 -43 325 2 116 -81 -355 48 41 364 450 -122 -150 -28 -62 5 -86 146 -146 150
7177 150 414 -141 -27 -100 169 -591 -23 -565 -395 220 -88 -95 210 109 68 -281 -10 347 32 -28 110 -224
7199 -224 140 -120 430 -29 6 115 -228 -200 64 139 -26 43 -38 -38 20 -273 14 -352 -70 14 -90 -194 -116
7222 -116 43 -213 156 -26 150 112 28 135 143 253 -218 335 34 17 128 303 159 -239 225 205 -574 302
7244 302 -20 -141 -83 -3 -65 237 -2 136 250 -320 -312 307 141 41 166 -263 -255 -171 -146 183 -55 526 -71
7267 -71 -453 88 332 -372 -319 235 273 731 180 278 590 -147 -114 -346 532 343 511 376 -272 -339 769 -22
7289 -22 -553 540 -370 -650 101 811 25 194 -17 -174 237 -110 178 -123 -81 -27 261 -269 104 84 84 63
7311 63 356 -61 141 -230 115 -154 22 -36 -98 92 -139 -3 15 46 -33 -65 57 156 174 47 95 27 -96 13
7335 13 -45 20 28 -275 -133 -209 115 -224 179 103 124 34 -235 24 49 -36 154 92 -352 13 13 147 115 33 -91
7360 -91 8 -74 -102 -57 144 -170 -169 -53 -69 75 -11 61 60 -93 185 -274 -130 331 307 -2 -97 121 100 241 57
7385 57 247 -127 -118 82 -31 -172 116 -77 5 22 98 -153 105 -34 -38 101 -44 -315 -84 -9 12 171 206 -24
7409 -24 215 42 109 -160 -17 -176 60 -9 -114 171 -46 203 36 -24 94 -12 133 -163 31 186 38
7430 38 -88 -29 -61 -139 -42 -82 -102 -109 98 -21 -13 -160 77 -183 106 -12 37 -62 -138 -289 76 125 147 -230 -48
7455 -48 -67 82 -47 -176 -216 -57 -43 97 -66 -130 -63 -295 36 -1 -22 -60 -22 -220 -58 171 25 219 48
7478 48 6 132 197 182 -37 -266 22 -24 245 58 -17 -31 -53 -156 -18 22 183 -216 18 62 -195 -5 152
7501 152 -116 -54 -99 115 220 89 -375 -21 102 72 297 -32 259 -187 40 -334 -27 -7 -113 53 76 244
7523 244 46 -103 92 -26 -104 4 11 14 -137 44 -197 -75 -70 1 -121 72 -91 -169 -137 -8 -246 104 11 76
7547 76 -112 -60 -126 -84 7 184 -34 74 184 -91 136 234 -32 127 -163 -28 85 -86 87 20 65 -77 -21
7570 -21 100 -134 -34 77 304 10 102 77 248 238 41 -11 -34 -116 -241 -66 -47 -223 30 -178 8 83 -124
7593 -124 199 -15 -215 -397 -34 -216 124 22 -124 74 208 61 19 168 260 51 144 215 -108 111 -25
7614 -25 -242 37 -197 71 66 -22 -220 -71 -34 181 189 34 -253 367 -180 48 -139 -28 16 -114 14 -196 7
7637 7 27 14 185 61 -35 101 15 94 23 123 -216 152 -26 -323 52 201 -86 -56 -80 49 -148 86 -42
7660 -42 85 -109 3 134 80 -2 50 151 -138 160 47 -143 77 -31 96 67 122 6 -47 119 128 92 -122
7683 -122 -29 73 -49 -24 122 -127 12 -280 -44 -60 24 76 73 221 18 -8 -108 -74 64 55 105 -117 -13 -195
7707 -195 -8 -14 87 150 55 208 150 238 -160 -125 133 96 290 -56 102 34 -280 272 35 38 -169 25 157 -117
7731 -117 88 144 37 159 -225 -80 -89 -214 -113 84 -108 125 73 -135 -113 17 -121 -73 112 -92 -119 57
7753 57 245 -224 -18 139 164 -313 -196 -150 -20 -81 101 102 50 -168 -229 275 47 -115 -132 156 317 -167 -121
7776 -121 144 109 -274 -14 -62 78 151 -344 -74 -291 -102 -198 -102 218 -45 -13 -123 -116 -26 14 320 -65 -87 59
7800 59 -112 -239 99 -151 307 -281 -36 -128 -14 3 276 -285 -98 197 -70 -73 -50 -5 108 127 -56 -23 19
7823 19 50 -58 -24 87 -14 41 10 -10 50 -174 -8 100 71 82 37 11 52 -27 -13 -336 102 -101 135 -12 -164
7848 -164 -70 61 23 -43 -30 -97 -20 164 59 -77 -88 -165 -83 153 213 152 -227 -61 174 -363 -113 16 198 -9
7872 -9 54 143 15 28 46 66 79 -32 30 57 -3 -217 171 49 -107 44 51 -114 147 -159 95 -78 -147 46 168
7897 168 -80 132 -88 2 -151 107 200 -19 -196 -8 -238 -47 -47 38 -167 164 156 -49 -32 29 299 36 -36
7920 -36 -34 -12 -57 49 6 154 63 -65 -33 -33 -153 -124 -216 -39 22 -84 -66 -131 -196 -30 198 90 39 -207 -242 -161
7946 -161 -26 47 44 38 12 -61 -66 -54 278 43 -4 -223 298 -142 -99 90 80 222 40 -72 176 -121 -15 9 91
7971 91 -166 -26 -22 338 186 76 73 -195 -90 -73 -184 -85 26 -153 45 192 -289 -44 -84 -18 39 48 -55 106
7995 106 201 -134 26 -150 101 -116 72 20 88 -168 176 -15 -150 31 -32 -92 17 -29 57 -296 45 186
8017 186 -25 -4 112 168 199 143 -166 -35 44 -52 -13 55 -44 160 93 128 -164 37 205 -170 -4 -114 76 32
8041 32 -272 -91 108 -13 72 -203 -232 -199 -198 124 -56 81 130 189 152 -98 -113 10 -57 -66 -63 54 313 -24 8
8066 8 169 35 -177 -6 -223 -93 97 -25 -6 -17 -27 -11 202 92 38 133 130 35 -225 -121 113 49 -117 -185
8090 -185 40 199 35 5 -115 181 -263 -67 105 290 147 19 -90 23 -128 -239 -3 -139 -104 -138 46
8111 46 -172 -56 55 -248 -58 -30 -74 -32 -57 71 4 135 194 269 286 56 -109 49 148 246 167 -68 91 -84
8135 -84 10 72 -177 -63 -199 -243 119 -150 -46 8 57 118 29 11 -57 117 -35 214 22 -35 13 -123 -10 -150
8159 -150 0 153 165 -153 -93 -131 -77 10 1 300 71 98 -170 40 -50 66 29 -136 43 3 -121 128 131 -91
8183 -91 285 -160 -17 96 -54 48 -44 -25
8191b5
$$ Imaginary data points
##PAGE= N=2
##DATA TABLE= (X++(I..I)), XYDATA
0 0 0 0 0 0 0 0 0 0 0 0 0 0 0 0 0 0 -8 8 -8 8 -8 8 -16 16 -16 24 -24 32 -32 40 -48 52 -58 67 -76 86 -96 109
38 109 -122 135 -151 168 -188 208 -230 254 -279 308 -340 373 -413 454 -501 553 -611 675 -747
57 -747 831 -927 1039 -1172 1335 -1535 1793 -2134 2615 -3352 4637 -7624 35373 2458 9622
72 9622 13859 -10578 51536 21569 29562 26704 -14848 6842 1794 6555 30905 790 12469
85 12469 -2525 -16566 4456 -8815 3752 8137 -11859 -2374 -19302 -15006 -7936 -15261 2005
98 2005 -12405 -19283 -15279 -32156 -14374 -12200 -13499 -6385 -28600 -25156 -27592 -28047 -6314 -17991
112 -17991 -12586 -19075 -38529 -20100 -28034 -18870 -1810 -23631 -14581 -24353 -35226 -12393 -21136
125 -21136 -10118 -4399 -24020 -13610 -23744 -23124 -6094 -13409 -3429 -7664 -19345 -11526 -18615 -9138
139 -9138 -631 -5132 -401 -11194 -12246 -7821 -8626 5036 1351 -219 -589 -11734 -2305 -631 2602
154 2602 12366 1032 2338 -1305 -5954 8394 5500 10847 12754 -1150 5258 982 2466 16036
168 16036 8669 13476 9866 -508 8186 4538 10569 18391 9178 12939 6536 2089 11517 8695 15269
183 15269 16445 8108 9959 4195 6528 12827 11833 15761 10752 5982 6219 4272 10380 12429 11821 11453
199 11453 3908 4479 4117 5546 12108 8837 8454 4550 -1149 3249 2618 5938 9598 2712 3179 -1149
215 -1149 -4133 2981 1539 4445 4129 -3750 -2131 -5242 -4767 1998 -841 348 -1768 -8625 -5999 -6880
231 -6880 -3837 -223 -3817 -4577 -7898 -10532 -7069 -5845 -3532 -3107 -6936 -8991 -10758 -9737 -6504 -4566
247 -4566 -3766 -6620 -8922 -10595 -9842 -6297 -5065 -3371 -4820 -8586 -8682 -9194 -6554 -2224 -3348 -2989 -5431
264 -5431 -8342 -5931 -5363 -2004 842 -2477 -2488 -4502 -6020 -1211 -591 1608 2169 -1726 -2161 -2560 -1822
281 -1822 3031 3317 3230 2104 -986 -287 981 2460 5508 5154 3283 1838 36 1385 3880 5356
297 5356 6024 4902 1621 1366 1917 3429 5995 5917 4598 3047 486 1454 3569 4300 6266 4368 2115
314 2115 1396 1005 2308 4267 3699 4534 1959 175 548 1588 3079 4278 3043 1445 165 -796 -12
331 -12 1750 1649 2009 235 -1583 -895 -1239 1138 2339 1191 456 -1197 -2545 -590 -644 1189 2117 -615
349 -615 -1025 -2265 -2407 413 306 832 595 -2387 -2053 -1967 -1277 1139 139 -258 -1152 -3266 -2169 -1299
367 -1299 -447 636 -379 -1615 -2394 -2777 -1434 -543 288 -165 -1533 -2300 -2924 -1340 -893 142 345 -1856
385 -1856 -1857 -2784 -2715 -38 -784 249 -637 -2844 -1431 -2139 -1146 1182 -521 45 -1355 -2929 -710 -1052
403 -1052 103 1623 -1158 -639 -1438 -2001 862 -32 1327 1257 -1234 -364 -1163 -137 1962 945 1766
420 1766 313 -757 109 -51 1396 1989 1179 1464 -523 74 573 1243 3027 1186 1295 640 -1012 1544
438 1544 938 2056 2783 -70 1070 251 -843 2594 741 1694 1912 -1168 893 -277 -163 2549 40
455 40 1365 118 -1886 710 -589 328 1849 -960 324 -1277 -1665 434 -847 823 50 -1262
471 -1262 -631 -2018 -762 100 -503 517 -1310 -1478 -1215 -1733 617 -518 -114 -150 -2343 -532 -1064 -907
489 -907 1164 -794 143 -515 -2571 334 -815 345 1349 -1198 681 -993 -1289 1356 -421 1371
505 1371 1111 -1034 739 -1005 306 1971 40 1756 254 -562 916 -123 1380 1681 624 1519
521 1519 -373 -234 889 617 1817 805 677 659 -870 905 458 1172 1665 -386 646 -423 -661
538 -661 1515 0 1293 710 -1047 521 -938 166 1339 -640 1065 -489 -1632 405 -1409 142
554 142 733 -1236 381 -1203 -1517 680 -1146 773 -1 -1474 125 -1889 -361 238 -734 648 -1097
571 -1097 -1149 -675 -1540 111 -159 -465 280 -1570 -527 -507 -786 760 -549 -72 -481 -1343 233 -551 -54
590 -54 939 -810 28 -670 -761 700 -530 816 439 -1056 115 -886 70 494 -531 794 -156 -1026
608 -1026 279 -723 393 633 -151 530 -773 -386 399 -369 855 404 -130 79 -469 -2 416 408 1062
627 1062 -211 51 -237 -506 634 313 818 354 -408 749 19 491 1172 422 1309 186 -212 760 206
646 206 795 1145 390 869 -26 243 1081 227 1628 842 173 693 15 792 1069 419 969 428 349 573
666 573 32 1079 791 493 857 102 -173 497 251 778 732 173 113 -539 -35 -176 212 400 -242 15 -371
687 -371 -432 2 -469 149 -334 -784 -339 -1112 -831 -31 -669 -2 -530 -1417 -872 -1090 -669 -468 -765 -723 -1150
708 -1150 -1457 -637 -1159 -449 -530 -896 -760 -1104 -954 -486 -734 -498 -629 -845 -814 -931 -383 -320 -466 -469 -638 -463
730 -463 -641 -254 25 -161 101 -528 -399 -251 -115 416 433 193 512 -177 140 317 260 505 513 -61 650 149
752 149 382 674 315 783 495 138 502 222 792 1036 504 606 460 512 196 508 769 657 755 379 251
773 251 -12 449 899 531 655 452 194 414 429 506 783 161 325 -3 -94 236 442 351 635 78 229 207
795 207 -78 449 165 506 164 21 -336 -74 99 363 153 55 87 -389 -70 132 -23 139 147 -322 -97 -230
817 -230 66 167 -32 -175 -300 -617 -194 -29 -217 -11 -267 -376 -150 -578 -508 -113 -198 -177 -749 -577 -385
838 -385 -714 -400 -729 -511 -226 -712 -496 -459 -574 -196 -460 -494 -494 -847 -391 -415 -271 -118 -361 -692 -638 -721 -540
861 -540 -81 -235 -421 -431 -412 -414 10 -125 172 111 -138 -292 20 -534 101 415 -178 106 156 -45 333 -118
883 -118 387 600 75 358 5 397 683 546 521 561 399 363 201 879 640 526 1060 696 398 467 417 739
905 739 699 359 520 544 630 446 741 563 488 655 101 104 559 287 572 278 124 427 37 237 206 -166 501
928 501 -148 -140 -3 -257 257 10 -262 60 -326 -322 13 -292 145 4 -281 87 -858 -432 -200 -78 248 -247
950 -247 -411 -215 -632 -271 -148 -203 -68 -541 -240 -419 -260 25 -174 -266 -307 -364 -249 -206 -193 -213 -260 -223 -817
973 -817 -309 -69 -580 -186 -182 -456 -69 -498 -226 1 -56 124 -233 -516 -411 -492 255 -69 -183 28 -418 -239
995 -239 -223 -165 311 -196 -119 -158 -458 58 73 125 284 -153 -134 -222 -334 163 -69 90 297 -201 235 -170 348
1018 348 397 95 358 179 -86 212 307 373 451 96 464 297 248 207 244 414 422 355 382 -5 429 337 556 439
1042 439 178 320 320 118 437 283 342 285 49 171 300 247 438 243 83 224 -39 75 141 338 281 405
1064 405 -85 186 -12 -152 55 81 -56 -118 -256 -231 -101 59 -234 132 -340 -270 -148 -347 -160 118 -268
1085 -268 -263 -507 -184 -285 -221 30 -296 -205 -512 -446 -248 -249 -73 -153 -348 -226 -309 -537 -85 -366 -23 -42 -269
1108 -269 -221 -69 -227 -146 -192 -31 -275 -444 -345 -273 145 108 -160 208 -95 -63 -426 -4 -4 -91 157 -186 -273 -168
1132 -168 -45 -238 231 224 -117 250 149 318 118 250 11 186 69 -37 128 341 102 211 -41 -219 30
1153 30 191 318 386 241 123 -165 -95 193 112 185 201 -68 207 -309 94 212 142 41 247 -182 36 -11 40
1176 40 101 310 152 -109 198 52 155 263 265 118 161 -265 172 112 61 407 42 -52 -43 92 252 258 100 102 -101
1201 -101 -79 -220 13 454 111 407 -8 -192 -124 -37 -7 197 -144 4 -149 -90 -61 -91 59 133 -136 -195 -202 30
1225 30 -80 -238 -90 -330 -241 -20 -170 18 21 67 -150 -301 -106 -140 -91 -121 -65 -36 -159 -212 -504 -355 -75 54
1249 54 -146 -26 61 14 159 133 104 1 -14 -141 -24 -302 28 247 -41 -96 -181 2 73 110 190 324 2 -132
1273 -132 -70 -24 94 103 391 199 13 -125 355 58 113 424 108 -232 -123 -51 73 81 197 225 -35 58 -26 92
1297 92 -6 -38 -1 -133 -261 -54 -43 206 141 -58 -415 -13 -162 58 32 -257 85 97 45 -184 70 8 168
1320 168 113 -48 -112 -301 67 53 125 0 -272 9 -103 71 49 14 -35 -91 -32 114 -175 1 -8 -27 146 308
1344 308 -137 -40 -54 -79 136 -105 142 -16 180 277 83 171 91 -104 -241 291 221 114 36 237 -49 -248 68
1367 68 36 -18 61 86 34 -273 142 -117 -22 30 -184 -59 -198 -84 -76 30 148 88 -171 22 146 -60 9 -34
1391 -34 46 -141 -213 -204 -29 180 6 -36 -232 -302 -25 -183 -96 148 278 -20 -149 -233 -276 -232 212 150 -168 -213
1415 -213 -72 -398 8 -182 -116 -83 -131 -184 -125 50 149 93 155 -244 -140 -164 -134 199 294 220 -32 75 83 123 52
1440 52 521 77 -82 -29 -249 -162 108 -303 -14 -38 42 -141 129 -184 155 -80 112 -336 -182 -111 -59 59
1462 59 -113 -174 -16 -354 -46 -57 -37 133 -71 -45 -1 131 -12 -16 -18 157 -17 98 73 -113 -222 92 0 -3 -84
1487 -84 222 -73 -237 195 414 81 -45 -149 113 160 139 -76 -8 346 56 -21 27 143 108 -191 203 -2
1509 -2 263 58 -75 118 89 198 -49 132 33 17 -112 -19 144 -84 31 104 122 174 -43 141 48 -146 -125 140
1533 140 201 -108 110 141 -119 3 110 42 171 109 -122 -177 37 15 -95 1 93 156 -2 -52 -31 -47 -129 -33 -28
1558 -28 -213 38 -174 -26 -9 29 -148 86 -131 243 -110 42 45 14 160 -127 -103 212 179 66 -191 -31 82
1581 82 -274 -120 -114 -297 40 7 -25 -57 -54 -140 43 124 177 -45 16 308 -78 155 -181 -74 -77 69 -67 92 77
1606 77 176 65 137 234 -77 364 130 3 149 -44 -179 41 -144 335 56 84 21 132 -47 14 86 111 -97
1629 -97 -80 7 -27 61 -45 82 -25 -141 118 -180 70 -98 109 92 -15 128 -105 -13 -116 -99 -24 135 -67
1652 -67 -121 -10 102 54 -31 3 35 -97 -57 -127 -159 99 -67 -177 -152 -177 105 -207 148 19 48 163 -423 313
1676 313 -44 76 169 -44 -29 -63 14 -294 99 -180 113 -107 -186 28 131 -268 284 44 -297 64 -17 -86
1698 -86 -12 83 -31 -102 -22 368 182 24 -231 134 -137 41 -12 -125 75 -50 -132 -170 47 58 123 60 46 -37
1722 -37 305 -31 28 174 -88 -142 -22 -53 2 17 44 256 -190 18 -52 -8 30 2 93 -189 -93 6 -123 177 102
1747 102 182 -34 259 -12 77 226 -158 55 -73 -13 -276 -12 -115 27 -152 148 -143 -29 1 162 -16
1768 -16 -40 -139 -106 -66 -153 -30 -9 -38 46 -76 -22 -125 -84 82 -41 136 -70 -146 -162 -74 -133 216 -17 231 123
1793 123 155 202 9 -271 26 -188 98 -92 174 -217 -91 -32 -129 -80 38 156 50 -20 -44 79 66 206 -44
1816 -44 -275 -284 -283 -74 -16 -31 -4 -158 31 138 116 -143 -99 152 -194 -126 -86 76 133 25 -320 84 -55 -79 -8
1841 -8 18 150 -150 -158 -7 184 -144 -108 -62 -121 -211 -138 140 79 179 174 34 -177 37 -242 -70 54 -112 -38 33
1866 33 100 258 189 164 -68 41 -108 -141 68 101 349 -77 6 -10 133 11 81 64 -8 -119 52 88 -96 114
1890 114 65 -76 87 -62 113 51 85 253 47 57 -158 -54 -2 -80 29 -113 9 -88 6 -58 -89 4 -35 15
1914 15 248 -69 -243 11 266 -133 176 182 198 -32 -46 -158 -221 -88 -306 89 25 -13 -4 -171 4 11 -115 -389
1938 -389 -193 -19 117 202 -107 -17 -159 2 -40 -339 142 -116 -4 221 -279 100 -135 83 282 -72 -82
1959 -82 -78 115 30 12 83 23 21 70 -69 59 79 55 -19 8 89 -274 -61 -199 339 -205 244 199 26 41 180 26
1985 26 41 137 -7 268 -51 -63 -30 -166 7 -198 14 105 62 231 -223 65 -108 21 -37 203 -468 76 -207
2008 -207 -164 -142 588 393 -5 230 227 279 450 -189 -462 -29 849 180 253 231 -417 344 316 -196 -427 -731 266
2031 266 116 105 410 -145 -122 468 89 -467 -123 462 137 344 193 166 603 66 383 -44 62 -79 264
2052 264 -180 -277 -88 -43 -328 16 -87 -113 -7 -170 -343 428 143 -256 -750 -1415 -793 -117 48 -358 -561
2073 -561 -275 -277 -57 -56 222 -15 679 -368 -324 -232 -507 -164 -185 380 -649 588 -117 170 50 -334 -65
2094 -65 -142 -352 171 -351 -317 -57 -198 513 233 -378 -61 144 554 92 -220 25 28 -152 45 -234 229 -104
2116 -104 -33 -208 45 -12 -24 82 91 -10 -94 -86 -47 6 129 101 -122 75 -5 -138 51 166 78 -115 -121 -41 -29 179
2142 179 130 -46 -8 133 15 214 96 71 61 -153 -81 -6 -13 -207 14 -225 92 48 335 -36 120 118 46 55 -6
2167 -6 -73 -66 -111 -173 -33 44 17 14 -9 -4 99 -74 58 106 381 -108 73 -50 50 12 59 -71 -47 -140 -209 21 85
2194 85 -8 -50 -142 -71 -75 -98 -83 45 -204 -96 -105 -85 -9 158 -58 9 139 140 -55 -32 89 -10 -218 -157 11 -54 -117
2221 -117 -121 114 47 -108 -215 -39 -6 117 26 -159 86 177 -102 -33 -72 -182 -59 -222 140 125 -149 55 52 -58
2245 -58 185 -141 -192 -191 26 64 -132 43 154 -16 -60 -303 -155 149 12 121 -89 88 226 -62 88 -54
2267 -54 -147 -75 -111 -107 -221 -194 -16 15 -46 291 -25 208 42 113 98 42 -106 -18 -70 -93 -112 -189 -72 -36 353 100
2293 100 -66 25 58 117 226 104 68 54 2 -175 -83 -86 -103 -8 13 -163 -117 -56 119 -27 97 48 -67 82 36
2318 36 72 132 -267 138 -236 -142 -14 61 -62 126 -111 132 -115 -193 -115 15 210 -160 129 193 -164 -68 194
2341 194 77 -219 -275 -7 -75 25 85 115 35 6 140 -229 -19 11 -393 -53 -106 -196 -222 -217 44 282 -50 -5
2365 -5 -70 -16 -274 43 65 -113 -18 86 85 164 -185 -56 -152 127 -9 -75 -90 169 -23 -69 -47 -365 9 175 119
2390 119 -15 35 49 -118 -112 -56 -141 -100 196 -54 -168 101 55 -181 57 -142 -45 -118 -5 57 -17 72 243 -21
2414 -21 -277 166 246 122 -63 -129 17 -262 80 69 -64 -28 -149 34 132 -86 154 -183 84 124 70 -65 12
2437 12 -45 39 83 -201 29 105 -269 77 95 38 -70 -235 98 67 72 153 58 107 89 214 -11 -117 -28 329 -94
2462 -94 -12 -23 -17 19 74 87 67 -73 280 90 -78 -85 65 84 -211 -33 -219 96 -43 270 56 157 -10 -44
2486 -44 252 40 61 88 0 57 43 -18 -169 -2 -128 -146 -121 211 162 -286 7 63 64 -49 118 59 191 20 -134
2511 -134 192 100 -113 -95 -62 -142 -32 66 -41 -126 47 32 67 -99 293 85 62 -200 141 18 78 -54 -161
2534 -161 -31 18 -100 111 66 165 -5 -28 86 14 -19 215 -118 -51 214 -60 -106 -11 -226 -48 164 -169 67
2557 67 41 89 -19 362 -91 33 109 -225 -108 -268 -8 110 65 -70 2 -140 30 117 62 213 -22 30 67
2580 67 85 -189 -67 -296 131 15 101 1 -26 -128 70 55 120 -274 -181 199 118 -120 -7 146 -33 264 20
2603 20 -78 -112 160 205 93 23 35 -96 73 138 12 -69 -6 12 56 76 298 74 43 23 244 -32 -12 65 36 -105
2629 -105 -90 137 90 65 -28 42 157 168 300 12 -27 -156 -9 271 74 116 256 -135 -63 176 243 -67 -41 38
2653 38 -18 59 136 173 -100 1 191 -137 -54 188 62 222 -107 102 -13 13 -26 -5 98 -57 -3 -2 -104 -124
2677 -124 -33 -171 -44 78 -239 -24 6 -282 -70 -310 -55 -140 -254 95 67 -325 34 53 -55 53 30 -174
2699 -174 -33 62 -121 -70 -21 -72 -106 343 286 71 -7 -106 -5 -4 153 -103 324 -61 -182 25 113 223 189 -81
2723 -81 -325 -90 32 90 4 -17 -176 -181 -154 -23 -116 82 -13 -16 28 54 27 186 -153 -240 -157 -106 -76 -246 -6 40
2749 40 175 64 -90 -20 92 -77 -50 10 -141 144 50 -67 -34 91 49 -17 -85 160 -8 -319 41 79 -190
2772 -190 65 -50 -88 -51 67 -19 109 25 82 -92 193 204 189 25 236 51 -74 55 -165 20 -80 104
2794 104 199 53 266 -51 106 -30 56 -148 -35 95 6 -59 -112 3 -86 47 292 65 127 -199 -34 -188
2816 -188 23 96 -247 381 56 -154 193 293 27 14 -97 -86 155 96 -215 -47 77 -95 26 -190 -83
2837 -83 -43 174 6 -138 115 -53 -43 -97 -1 -38 65 337 -65 122 -36 108 -203 -69 -154 2 230 -35
2859 -35 -85 -97 69 67 -76 -120 -18 -111 -11 -68 -240 55 -40 -101 -101 -14 -255 109 127 22 196 184 215 -155 20
2884 20 43 -15 -51 -291 -226 -148 118 59 -99 -55 342 256 -47 -107 170 132 -106 36 -95 134 21 191 -49 98
2908 98 61 86 -4 -9 223 82 -4 49 99 14 198 87 77 -35 155 -48 -14 95 235 246 -6 -101 223 24 -134
2933 -134 -205 -116 -73 106 13 163 -157 94 -218 -28 -234 108 92 -357 -1 36 -123 -50 -96 -113 -39 81 -65
2956 -65 -66 43 -102 -5 63 77 117 -233 -251 11 14 21 -63 -185 162 177 -49 50 137 60 -55 -135 156 43 -222 47
2982 47 -86 -225 40 25 -205 -287 146 61 -69 103 129 -192 8 197 -209 -128 -109 5 5 78 -139 122 -264
3005 -264 108 6 -483 -43 44 -17 113 68 26 94 -34 7 118 -161 136 -3 45 88 99 -90 -88 34 -121 13
3029 13 -89 6 -86 193 158 -67 246 -39 -47 132 145 62 -200 -67 77 -21 -229 -193 -26 210 257 375 -143 81
3053 81 -240 183 -16 211 -281 237 -215 82 306 -78 558 -360 303 27 10 26 -90 80 509 247 307
3074 307 -208 -88 -42 -178 350 -44 -105 321 259 158 -638 126 680 -4 -9 225 -116 -101 -361 69 57 9 -118
3097 -118 785 44 252 -201 160 -107 -20 -6 -19 88 162 44 63 -196 102 76 -49 -33 21 177 180 187 49 -122
3121 -122 -31 83 5 4 184 -80 177 29 -203 -170 -122 -152 124 -30 -158 -21 -27 -317 -33 -135 164 -68 -22
3144 -22 -30 -174 112 -190 134 -122 -39 6 52 -155 247 -13 -89 3 -222 -55 257 60 -77 173 71 -44 156
3167 156 5 196 240 -392 41 -59 12 -87 -103 -60 -144 120 23 -170 -241 -74 -281 -10 -34 44 -191 196 -274
3190 -274 246 -69 -78 190 -142 33 -105 -216 41 -57 -140 -58 -97 -57 -59 -131 -272 -119 -15 -108 242 210 -99 -150
3214 -150 -177 84 -5 -94 -38 -88 -93 122 49 -134 10 -78 -164 -96 -78 344 354 -88 -158 -228 49 -230 -103 -204 66
3239 66 -134 -28 -152 -235 -65 48 230 38 8 260 -33 -50 -97 292 -150 -140 -77 -124 229 -152 147 -190 -168
3262 -168 -101 -45 -165 -447 -113 480 -263 -101 350 101 150 63 -541 -468 -207 72 41 65 585 280 465 -296
3284 -296 86 151 -163 22 -47 147 23 -40 -10 -193 -35 -126 -56 -39 -92 103 -269 50 69 -166 -15 200 208 199
3308 199 0 67 -31 85 -19 51 -276 -20 -164 92 -45 146 -82 35 85 -72 179 91 -6 -127 84 -31
3330 -31 -275 -55 -59 34 -220 -11 95 -396 18 122 85 46 -80 144 17 -187 -5 -221 264 -111 418 -69
3352 -69 -38 -185 37 56 76 155 -49 -221 192 73 -22 -79 -132 195 -60 338 -158 187 274 197 -138 -165 165 -10
3376 -10 -21 90 69 -30 -29 19 106 3 -31 235 -62 65 -1 71 113 -8 -97 -8 -56 180 -101 245 -217 100 -43
3401 -43 85 -596 -214 -113 20 48 -127 -66 -76 48 -27 126 15 110 118 49 -94 125 -15 64 -26 113 7 -52
3425 -52 235 -253 -244 -266 -54 -171 270 -320 -24 4 -152 167 100 37 -200 -34 -113 -139 -4 -115 -49 245 -38
3448 -38 55 -20 -105 -51 -18 39 34 38 -256 -20 -131 35 57 -217 32 -102 192 150 219 -46 -39 -35 182 124 -139 142
3474 142 -12 -72 4 126 52 -178 63 -84 162 -23 -89 -141 102 105 -31 -148 21 321 -107 6 -13 377 -211
3497 -211 218 -174 -180 31 -29 78 -80 66 23 50 91 -87 143 21 -1 54 -229 40 77 100 -52 39 206 157
3521 157 68 -80 120 -200 -157 81 -22 -181 166 -24 78 -56 -272 228 72 -149 -56 73 81 -20 52 -191
3543 -191 172 -133 98 -53 -264 73 248 249 -71 -59 -20 -258 -29 -18 -90 -148 121 -75 -36 -63 55 49 -98 5
3567 5 -118 -107 -38 3 -76 -105 -148 -206 -168 -92 142 -65 7 -11 -117 -215 36 -92 -48 111 76 5 -8 -77 -183 86
3593 86 -5 -32 191 -2 -7 136 11 -55 425 -30 -30 136 -17 -30 -188 -60 -110 184 159 8 -118 -10 -133 -96
3617 -96 -39 10 6 11 -59 37 -12 103 -127 -184 205 -180 -35 66 103 -71 58 114 36 -185 -232 -314 -15 -37 -200 -53
3643 -53 -144 -184 -136 9 -165 102 169 258 74 -58 -85 107 44 72 -54 26 240 -204 131 25 92 -199 -128 2
3667 2 112 -74 36 65 -21 103 -88 -143 35 -76 -13 -115 -52 -77 -43 70 -95 -31 -201 -45 -44 -239 112 -122
3691 -122 310 234 -369 -266 -166 -104 -67 -87 -144 -2 79 -34 96 23 -5 71 -85 -121 -110 187 49 -109 -175 392
3715 392 -107 68 -66 -3 224 46 -78 -87 -94 242 70 -174 106 6 51 -117 -6 -22 206 97 256 -89
3737 -89 -111 -119 -50 -74 -39 61 -50 -141 63 54 188 -163 -186 -161 103 79 18 133 32 194 324 22 -85 197 -133
3762 -133 -23 7 -85 92 -260 -193 -73 -129 243 2 -102 -344 -36 74 -220 -119 -197 -59 -17 108 18 -257
3784 -257 -214 -179 -221 173 -8 -39 56 -153 -85 -85 -120 -77 221 -145 -32 -102 -83 -42 176 -18 -29 -87 -26 -58 -218 -128
3810 -128 -158 51 58 11 59 -39 -122 -215 104 -351 207 163 32 -87 -12 82 -63 113 -160 -19 130 -57 -85 -15
3834 -15 -23 -99 -11 2 -132 149 100 -124 -3 208 -30 12 -16 -74 -76 -323 15 103 -182 -101 121 379 297 -259 -157
3859 -157 -46 -73 -60 5 -49 -136 -436 -72 -222 37 134 -208 17 -166 -17 -65 -42 -27 319 70 -65 -94 -113 -82
3883 -82 81 67 18 3 -214 -52 36 77 129 57 -90 -148 6 98 -181 42 41 61 -14 115 -93 55 -218 40 -37
3908 -37 -199 237 3 -166 -107 165 -71 -5 -135 95 -143 229 133 75 -45 23 4 -11 83 -163 47 -207 23
3931 23 184 95 -131 -76 235 49 120 -112 158 80 112 -19 23 -149 -136 167 -195 67 120 55 201 127 38 -217
3955 -217 -23 -125 -101 2 13 -315 85 41 11 11 -76 -16 -197 -117 -161 -110 15 -167 -145 -37 75 -84 -30 89
3979 89 -44 26 181 -37 19 -102 -67 281 -86 64 47 -81 -185 -15 -25 60 -50 -110 -31 -10 -36 227 66 -23
4003 -23 -35 115 62 -77 -131 77 177 226 -210 -29 -162 14 131 72 -15 -43 55 -27 -321 111 133 8 67 -5
4027 -5 202 -26 45 112 -66 86 -2 172 203 66 -24 92 81 294 -191 -107 75 -173 254 110 -384 25 26 -222
4051 -222 -12 84 -112 -34 20 43 -294 145 141 -27 237 -43 -155 103 3 21 97 -100 -38 219 112 -26 44
4074 44 55 20 -38 -1 24 -71 125 103 -256 -260 37 40 -155 17 -31 40 148 -340 27 -129 134 108 68 4 -245 23
4100 23 157 -157 240 31 252 106 157 183 117 70 -39 -68 -359 171 19 -160 -86 -116 89 60 139 -62 188
4123 188 111 -21 -24 126 280 -66 289 -259 1 194 -6 67 127 -88 -249 -56 143 263 -251 0 24 359
4145 359 -405 -498 266 432 147 -17 -14 278 199 229 -12 -83 -624 28 524 504 85 43 189 -13 -291 -39 274
4168 274 221 373 -61 225 506 -607 101 155 -653 554 230 795 436 -325 12 554 344 295 -102 -56 -300
4189 -300 -94 328 115 -779 -4 781 -429 -475 -281 -682 7 89 558 -154 -525 95 333 219 -148 -32
4209 -32 252 4 -201 31 170 180 -21 -9 91 55 -152 222 -91 71 263 25 -13 -69 -206 -33 -45 -86 -19
4232 -19 -69 217 -175 132 -52 -189 56 -204 128 -206 -2 -5 -364 -226 -160 2 14 -15 -50 -78 84 215 233
4255 233 -72 -238 -15 91 -1 16 -18 -75 16 -10 90 -88 -80 11 -36 31 -74 -125 1 -108 119 90 -280 -39
4279 -39 105 203 -92 -84 -78 181 -86 -282 66 110 10 -189 -117 63 65 102 -127 43 -111 74 6 -16 74 191 30
4304 30 160 17 87 -161 84 18 27 84 -200 118 84 -160 113 417 -353 -7 277 104 -139 -128 -78 -81 -17 -18 80
4329 80 -152 -101 141 -76 149 -125 -100 148 150 -116 220 22 21 -28 59 18 -30 118 85 149 -59 195 58 113 4
4354 4 112 34 -35 112 267 22 -15 69 -184 33 36 -86 266 163 75 -1 235 -160 -81 -48 277 -61 102 196
4378 196 -59 -6 210 -18 -103 -86 212 245 55 88 -121 184 21 -106 -174 -24 -166 46 -84 -91 -128 68 113
4401 113 37 -27 -148 -46 -166 -134 108 -8 163 -73 1 31 -21 -46 -75 -291 -9 -71 -195 -151 37 135 77 -110
4425 -110 108 -264 80 125 -93 -158 -158 -34 83 -140 61 276 56 -188 90 -29 62 4 33 -156 -70 79 -82
4448 -82 -12 -165 15 9 179 69 -10 -32 -152 -244 -169 41 -89 -16 52 122 144 -253 -73 -87 61 -99 26 -147
4472 -147 69 -71 -64 34 11 -30 -45 -76 80 40 42 188 25 76 2 38 -195 82 -147 -50 88 103 141 -56 87
4497 87 -183 -32 -83 47 211 -25 -73 198 119 -3 75 -180 109 -147 -196 -85 41 -20 -130 -189 -80 -210 -176
4520 -176 -32 -46 -49 76 -104 132 -24 -14 60 -101 -54 -40 81 -3 -221 62 -43 124 -157 -128 141 -230 -108
4543 -108 -27 -27 -88 166 -109 179 -85 126 -188 -39 208 -70 17 66 -31 -124 -122 37 44 80 19 -110 -167 28 -37
4568 -37 39 -3 18 -315 -191 15 95 -227 133 118 116 148 -188 -25 39 107 -60 -118 29 104 -74 24 -36 -65 -94 49
4594 49 -155 108 -92 -69 -171 -202 14 75 -164 269 -46 85 -29 98 13 85 -98 -98 94 106 -128 -102 46
4617 46 242 219 -62 191 227 74 66 -27 -20 184 17 132 -50 -115 -131 -93 -175 -130 -13 24 -151 -181 62 56 73 24
4643 24 204 231 -41 -84 50 -8 -29 210 48 -126 -78 -36 4 133 -196 -123 -105 316 -146 -116 -144 -480 -279 2
4667 2 -41 90 42 189 55 95 210 123 139 -3 151 -53 50 -114 -78 -30 -27 -461 35 10 153 92 32 86 -171
4692 -171 80 100 146 285 462 -61 -23 235 -92 295 -159 43 137 -353 801 -207 231 -192 21 60 -239
4713 -239 -1 31 -62 54 41 -285 232 5 -157 101 -118 165 -65 44 -29 283 -114 -118 -243 -70 43 -34
4735 -34 -62 52 44 -31 -134 140 -55 -179 -162 -148 -27 29 5 159 9 -126 -66 51 -59 286 363 26 -23 77
4759 77 -233 114 70 9 -157 89 -57 110 9 -120 102 -64 70 16 -67 -43 207 -41 23 -8 67 -49 167
4782 167 29 174 6 -73 213 39 279 -31 179 90 243 62 -34 -63 -21 50 24 -28 -183 41 -119 88 -52
4805 -52 -245 157 94 180 -183 66 -149 145 -105 32 149 118 217 -43 69 102 187 98 6 -10 226 55 123 -116
4829 -116 -152 9 21 -60 44 50 -216 58 6 -58 -134 301 -81 100 -101 -116 40 53 34 -53 -123 -126 26 27 -47 41
4855 41 24 -7 -47 -260 177 -62 1 -93 -6 53 -143 -12 40 -30 157 168 72 145 36 -191 123 20 116 18 33
4880 33 -168 167 -115 125 -111 -44 -282 58 1140 197 352 -149 323 -16 -126 -19 91 9 169 52 113
4901 113 173 -160 58 242 13 -55 -22 -63 312 -186 -136 36 98 82 102 -10 -43 -5 -26 -39 -177 -312 54 193
4925 193 -282 167 -140 3 9 -59 65 165 -150 -352 156 -27 -164 -10 -143 -53 -216 40 -117 16 -47 142
4947 142 25 -128 -99 0 -140 -204 110 -28 -188 90 -57 -10 -24 -166 -318 4 49 -23 -97 -243 175 9 -107
4970 -107 -211 -43 97 -95 75 -193 -123 -270 126 107 -75 -129 141 -116 -186 80 -34 118 55 -12 -179 76
4992 76 -117 64 -109 117 94 148 69 -163 -56 42 7 151 153 -49 -92 54 -105 33 84 -199 -161 127 77 3
5016 3 -183 50 113 -179 193 -265 45 107 172 117 104 211 -74 147 -62 -32 -110 -60 -71 50 73 83 -144 84
5040 84 -69 76 -79 87 165 -163 -19 -126 -191 6 71 91 -166 209 -90 -108 -282 -99 -25 -138 -155 -106 58
5063 58 -325 110 3 -205 83 40 63 86 6 -34 -50 -122 214 -72 -158 -188 -185 136 -45 16 187 106 38 20 -110
5088 -110 -111 136 -13 -87 -42 282 244 -200 97 -108 71 229 -6 257 -101 115 71 -30 92 -63 -45 -171
5110 -171 -70 -156 -8 29 -214 68 -101 44 158 145 -235 -366 147 137 33 -153 147 45 -51 -66 264 58
5132 58 -180 193 226 203 43 77 44 -47 101 17 -115 109 -105 -261 -168 -218 -105 39 68 143 -204 -87 -107 104
5156 104 293 -274 -201 160 190 -16 168 24 88 34 186 -75 156 68 61 95 223 -90 -45 128 42 -18 -121 128
5180 128 -204 15 -213 -99 104 355 91 -144 -288 88 15 -49 2 -175 -75 -105 -75 249 -112 150 19 211
5202 211 13 -66 158 -91 -5 42 -18 36 78 161 -37 101 5 11 238 67 -213 39 -78 20 27 200 127 162 46
5227 46 7 -153 24 62 17 185 7 101 27 178 93 -25 -174 -40 -59 40 54 -20 225 96 -114 100 159 164 130
5252 130 63 -38 -7 -73 -194 170 75 -163 -172 178 -175 -47 -91 -22 57 157 147 -39 -149 5 -31 -23 -43 11 120
5277 120 111 53 137 259 -95 193 279 15 47 253 418 37 -175 133 -25 -156 62 -45 78 90 27 -76 276
5300 276 -145 -51 173 -68 178 -18 -175 6 -26 141 -18 -98 80 7 6 -184 -157 73 52 1 -28 -147 198
5323 198 192 20 -41 -182 284 -11 -4 -78 46 -98 -71 -36 -267 95 -16 -134 115 -78 63 -141 35 -81 -52
5346 -52 -30 68 -113 181 -27 -268 -64 -17 -374 75 199 -173 96 -72 43 274 -40 139 -68 -40 -54 -204
5368 -204 -4 15 -51 -92 169 220 310 123 -151 -194 34 -59 183 -87 48 247 -313 -25 -28 18 -161 -105 101 -53
5392 -53 -172 155 285 -67 187 292 249 9 41 96 -65 20 -70 99 138 -31 -110 6 201 -107 188 -124 -1
5415 -1 -262 178 149 31 -180 61 82 -87 -54 132 61 386 109 -46 69 -327 318 -534 70 105 -53 -199
5437 -199 -304 -9 -128 -184 -41 -85 159 13 -117 -73 60 87 13 175 67 47 -115 -209 -45 21 129 38 27
5460 27 -112 -10 52 168 13 -117 89 138 46 -190 320 60 -187 -1 -218 64 200 76 -45 56 39 -68
5482 -68 -110 191 95 17 -94 21 -64 -21 291 53 84 -12 -36 -32 -77 -45 -147 -336 22 67 390 -233 -64 -9 -423
5507 -423 -49 -77 113 -449 70 -175 -138 455 -149 65 259 407 -245 566 -253 39 -320 -29 272 -81 -199
5528 -199 -863 187 -392 274 155 353 -307 -760 305 236 93 64 -88 -243 17 -345 101 -33 80 112
5548 112 16 154 269 39 -14 -131 -16 50 138 155 96 14 -28 107 -67 234 123 -119 173 141 16 -157 168
5571 168 -104 -17 52 -32 -114 -124 -80 122 280 -54 151 133 5 -93 43 66 -161 70 -221 -307 -83 9 129 96
5595 96 -86 -349 67 11 58 11 59 -8 24 56 -109 -88 31 -85 135 11 -59 -98 134 -115 -149 20 -54 37 -251
5620 -251 116 91 -68 36 107 -189 38 204 38 126 -61 -148 -99 23 -24 36 -82 121 175 -176 411 71 62
5643 62 55 -185 97 1 30 88 116 -52 296 -75 97 -133 -19 238 234 54 142 41 -301 -194 126 3 -181
5666 -181 2 147 17 41 56 23 -126 -40 66 -1 -43 -55 62 -109 -63 -274 6 158 -12 63 283 73 -228
5689 -228 23 76 93 54 -57 51 84 130 -69 129 19 135 -176 11 152 191 79 -16 127 59 118 122 61 -132
5713 -132 47 -82 -179 56 -37 12 126 174 -85 135 78 101 -56 -16 -73 246 -65 -265 -136 254 -315 149 47
5736 47 94 -16 -113 -38 -299 248 166 161 28 224 24 107 23 -121 236 -294 115 157 -4 170 -189 25 83 51
5760 51 115 243 -24 -16 103 345 -53 -239 -128 21 69 -80 105 -161 12 151 -101 85 -125 -2 61 -237
5782 -237 90 -12 -141 -30 -268 -24 115 54 91 122 231 51 -126 173 -59 214 -45 24 121 -20 -86 -166
5804 -166 112 -148 136 74 -40 -227 -73 -16 249 -151 147 149 -184 49 -2 29 -79 167 -132 15 223 -24
5826 -24 10 196 209 107 -91 270 0 95 -35 -6 69 57 46 -70 14 10 -79 163 12 140 -72 -333 174 32
5850 32 50 43 90 78 51 -33 -188 84 4 -63 201 51 -16 126 76 104 2 85 141 186 164 -99 -36 59 -293 -96
5876 -96 -164 29 190 -44 295 -255 54 67 217 -99 -176 201 85 -239 137 -62 -149 117 48 -39 26 173 -193
5899 -193 62 -45 -101 337 2 104 -70 -128 -10 29 67 -38 57 -141 -222 -174 145 -179 84 -58 24 132 -28
5922 -28 20 -43 -152 -247 -114 -56 158 -60 147 24 -2 -129 238 70 148 -119 3 37 211 152 32 -428 170
5945 170 112 165 78 -89 68 69 233 -102 136 70 -86 -128 322 38 89 -72 41 186 72 59 137 189 -108 129
5969 129 72 259 -281 8 25 -189 92 206 -50 70 194 135 162 -100 -189 -121 -63 67 -206 74 -101 84
5991 84 119 -76 -181 325 -100 200 77 -21 -63 -55 36 52 -151 -302 -56 -36 31 -137 -208 -60 -164 -157 -36 55 -49
6016 -49 -22 58 74 -181 -72 -28 130 49 58 84 14 -142 -144 70 -18 343 -69 9 -1 -6 -135 189 -161 24 95 141
6042 141 -263 44 -242 50 169 -160 -53 -104 60 -128 54 -15 -14 -53 55 -6 35 93 -48 -3 225 -294 -72
6065 -72 267 71 69 70 -276 17 -132 193 33 68 -56 -25 -102 56 243 -147 262 -213 213 7 -72 -72 88 -187
6089 -187 158 165 112 278 7 -131 15 -132 6 -147 93 -23 -42 60 -105 190 -58 85 135 162 -80 -3
6111 -3 128 -73 40 208 -293 73 131 -108 41 12 193 411 -46 -84 4 45 31 -42 73 -101 25 -160 58
6134 58 -84 -16 -60 -146 49 122 8 132 150 342 -6 -79 277 -187 41 -5 -50 -264 -26 -46 110 48 153 -254
6158 -254 -143 155 -27 2 -114 -107 182 158 -214 113 -209 -35 -107 219 -175 74 -238 163 57 144 0 -70
6180 -70 111 37 -15 55 -218 -203 -199 -22 148 52 -6 4 -14 212 186 13 179 203 358 -97 -212 -94 183 -46
6204 -46 -182 -75 9 21 -214 200 91 -244 -175 -127 -55 -179 -25 18 33 251 -169 -115 75 165 161 55 -10 34 199
6229 199 93 -149 36 77 122 -5 -196 79 48 -179 29 -12 -58 -78 -213 5 -75 161 -131 158 30 149
6251 149 -238 -194 266 50 -8 51 -111 6 93 59 -66 -177 241 -48 162 -47 -175 173 -16 -306 52 -77
6273 -77 191 -114 -39 180 -146 46 -101 70 -62 18 260 78 -46 -49 -43 -235 -130 116 -66 61 -67 66
6295 66 -143 39 268 73 43 43 107 -59 -190 13 45 -61 182 184 -48 -179 6 -284 328 194 106 -232 -133
6318 -133 -126 -126 -68 195 57 -64 22 -115 -185 61 168 -45 170 103 -32 -101 -3 -134 159 269 108 144 114 -122
6342 -122 -90 -101 57 179 -4 -33 -201 103 -116 -145 -46 -44 225 81 -83 184 -94 -5 -239 -122 -21 -53 -83
6365 -83 12 134 21 159 170 -73 -48 -1 -31 -99 -153 -136 -34 -86 -244 138 101 -101 -146 -20 -107 -169 71 -97 -26
6390 -26 -129 -26 215 268 -32 -28 -21 99 -145 -185 -128 61 -28 -37 -215 81 -74 135 59 53 -132 203 283 -275 -50
6415 -50 -208 -10 -56 238 -114 22 -22 -284 -24 245 64 20 -123 -170 143 26 0 155 -89 280 93 192
6437 192 68 70 200 -146 63 123 -70 -135 -28 156 -53 58 242 -98 62 137 42 -185 -55 123 82 -190
6459 -190 -87 -172 -129 200 -58 -39 -110 -213 -42 -106 188 85 130 -36 -249 -22 -175 -207 40 -44 -78 5 -133
6482 -133 56 -150 -72 7 -67 -189 384 -150 -161 -37 48 -174 21 -122 271 -214 -236 -128 -71 -74 83 210 64
6505 64 114 105 164 -85 -57 -99 -188 189 -47 104 153 9 84 -190 -86 107 57 79 -74 83 83 258 182 -67 232
6530 232 91 -42 44 147 314 -101 -181 155 25 11 489 48 -154 756 65 -118 -270 -188 -195 -520 -307 -587
6552 -587 143 200 -114 -231 243 202 4 -12 -8 253 -35 5 -171 72 0 -102 -157 43 -164 -166 -221 134 -17 163
6576 163 -46 -57 -120 46 176 26 -95 10 -125 -287 -112 -45 -289 -218 107 224 70 76 -187 -218 150 91 295
6599 295 -162 -24 -30 42 -79 125 249 87 -47 -29 94 -51 49 -107 -191 173 62 -155 172 15 -135 311
6621 311 -43 -206 132 -240 -47 56 -40 -194 -28 280 164 -89 -100 3 254 221 309 -58 -144 -180 0 -128
6643 -128 -6 16 267 -10 4 -125 44 111 -31 -69 -145 217 74 0 217 -50 307 -130 -8 157 -143 97
6665 97 157 -71 103 -63 216 4 -88 97 -48 113 -32 245 -54 -184 -110 -155 132 -67 125 -29 20 -85
6687 -85 74 12 -251 -20 -1 35 -45 -196 241 148 165 -39 -78 72 -5 101 107 -17 -122 179 -16 81 104 115 -46
6712 -46 -158 -204 -75 112 -245 24 -18 20 40 39 -120 69 -216 258 292 -102 -182 -43 -151 28 108 -56 45
6735 45 -125 340 91 -21 68 106 -312 -230 -134 -258 -82 -124 148 -173 54 113 84 -81 -190 78 20 -105 81
6758 81 -56 178 246 -66 172 -9 246 25 -21 -166 -29 -136 56 -46 -46 136 167 -137 -158 195 65 31 -27
6781 -27 253 111 -20 -29 93 -65 -57 -71 -348 129 -121 -49 -203 257 167 -9 160 -15 -72 143 -96 93 -65
6804 -65 -206 105 -96 -26 -3 -236 -90 63 165 -58 -17 161 131 -126 81 259 -24 -76 -187 90 31 2 28
6827 28 164 28 18 150 39 -173 -93 66 122 238 -129 168 -14 -33 184 -89 -145 307 75 97 56 56 -82
6850 -82 93 81 -35 -33 103 -67 -18 65 -61 -57 15 -86 78 -58 -16 207 92 117 -18 61 162 -124 -80 -75 94
6875 94 8 56 16 -70 76 -119 -159 -19 -66 37 391 -300 -64 -25 -83 122 91 -133 -246 58 -9 -21 20 -75 57
6900 57 240 49 -113 -95 -183 53 -82 12 112 -76 -135 41 82 189 -213 208 143 -185 126 -16 -36 -195 -84
6923 -84 201 22 -71 -28 -4 79 79 47 168 14 -55 83 12 -246 -192 -34 -217 275 -269 70 202 -63 79 200
6947 200 34 -156 -161 -67 -56 -56 -168 167 298 149 -81 176 183 -179 47 -53 -23 -170 117 29 -222 98 -58
6970 -58 -20 83 30 98 95 18 -288 -96 95 -33 -6 213 61 -25 33 -55 189 169 -105 -119 69 -83 -23 25 -72
6995 -72 59 35 -76 12 -80 85 -258 197 -259 104 81 130 60 6 2 77 -100 -6 12 -82 110 31 -96 71 -224
7020 -224 26 97 141 330 -45 113 20 101 -65 -130 106 73 206 105 -97 -20 -34 77 70 -175 -103 195 -262 155
7044 155 -163 -202 244 -90 114 162 -12 119 50 362 110 -86 -267 -136 -131 -27 148 199 -39 -214 -38 77
7066 77 347 88 -5 23 157 -107 -86 -21 106 -39 -142 9 231 299 9 -1 305 -101 -341 -220 32 -1 102
7089 102 -71 -23 320 -120 -9 -107 74 192 33 81 -137 -74 59 80 115 -122 107 -91 45 -200 -47 -73
7111 -73 13 -100 -7 115 131 -141 -4 64 162 18 -192 58 297 119 -163 -160 165 -305 7 -47 -276 187 70
7134 70 61 0 -219 26 -229 -220 401 195 -93 -138 111 0 136 -207 44 587 -296 68 -324 -236 148 -63 -207
7157 -207 248 -101 -441 -227 -227 -293 100 -171 -60 -242 160 -12 -141 -388 -18 -17 -37 83 -610 82 390 48
7179 48 -196 53 -205 -248 205 -587 383 10 301 128 -261 -382 60 204 22 281 -274 -2 291 -301 -232
7200 -232 106 25 -96 27 60 -214 183 -30 18 -212 -441 -199 388 170 -125 15 18 188 -126 402 306 -200
7222 -200 -156 271 -64 141 99 30 -322 -136 346 -390 135 -123 -130 -672 22 346 158 -95 62 -214 -342 5
7244 5 -417 -111 -135 114 157 54 -153 -318 -291 95 -164 26 -238 -168 -250 32 352 15 -180 -72 140 -139
7266 -139 -201 -18 102 274 75 253 382 -284 204 -231 223 69 203 35 49 -253 -3 168 -204 66 -12
7287 -12 177 -133 5 298 261 116 -59 598 524 -113 -129 320 -77 -44 -18 -292 199 110 64 238 -137 -7 125
7310 125 80 -160 233 51 -59 91 24 55 -25 -78 -83 -32 -114 -30 -75 49 9 -77 78 -36 317 -44 60 52 266
7335 266 182 -96 2 25 219 -55 -78 -16 1 124 -37 39 63 19 -14 -96 -278 -42 -163 -74 246 -18 47 181
7359 181 129 118 -138 10 -176 -55 36 -149 -86 -208 -165 23 -149 -99 67 -160 -22 -99 147 -333 300 -33
7381 -33 -6 -335 14 -75 180 -308 74 -232 70 138 65 -5 106 -71 2 179 -54 157 44 -21 218 119 193
7404 193 -298 18 -134 -44 179 92 71 265 128 -48 159 186 96 -99 -2 106 -184 25 26 3 -166 46 129
7427 129 146 -108 -61 -154 165 305 97 72 267 -92 -127 -92 -9 283 14 -63 126 179 -95 46 -217 99 -34
7450 -34 -157 22 -162 22 -238 -64 -232 147 308 -77 -41 6 -113 212 198 -37 131 14 63 -86 194 -30
7472 -30 66 -85 -36 53 10 85 53 27 -138 27 -286 -101 182 -95 -7 -102 69 -119 -15 -126 173 -95 197
7495 197 40 312 47 -93 -106 92 132 30 0 -22 -165 79 44 114 -60 -10 34 78 147 20 173 -89 -17 98
7519 98 -204 31 128 21 252 -83 -63 376 -231 -168 -119 100 119 13 -96 28 -174 -87 150 -210 86 4 23
7542 23 -41 -213 125 -151 -369 -86 55 50 24 -263 185 113 -10 193 185 163 -26 30 19 -56 -15 -14 -105 -20 -91 -64
7568 -64 151 112 -38 128 72 189 35 9 37 -22 -94 87 -133 45 141 39 300 10 -235 -23 -198 -108 -67
7591 -67 157 -47 -35 0 -31 164 25 148 60 -142 -41 -62 83 142 -138 145 5 533 0 118 -92 -27 137
7614 137 97 129 -246 69 46 -64 224 321 161 -43 -33 -70 121 82 -18 20 -43 81 27 -186 36 107 36 -48
7638 -48 -191 53 -39 -145 76 186 -32 144 136 27 101 -124 -158 -75 11 -131 -95 33 65 28 3 -94 236 -147
7662 -147 -163 -75 -4 38 -40 133 318 375 129 71 -179 8 250 25 -149 -211 22 15 109 -40 -3 -20 -100 -107 17
7687 17 -71 -81 178 55 52 -246 -116 79 -25 112 273 77 -138 129 264 128 72 141 30 10 0 74 -76
7710 -76 -136 96 -20 139 16 -39 -40 -31 138 240 -43 -210 -56 -137 77 -58 -22 -176 260 -33 74 -67 -157
7733 -157 -150 105 75 85 60 -45 48 -226 46 50 328 -1 -75 -209 145 129 -39 76 -5 -81 228 91 -141 -118
7757 -118 -99 118 -153 -105 32 -84 -99 142 259 -68 -173 -104 -92 219 214 8 -139 -29 34 3 -13 -116 -27 76
7781 76 -116 -27 -78 81 31 -201 136 11 107 81 -147 -31 42 230 -11 174 -68 143 127 -349 36 -237 1
7804 1 -187 158 292 86 -9 78 -231 -197 44 205 105 -24 -122 -62 -88 15 258 -176 -57 45 164 -53 92
7827 92 -69 47 -186 -129 -209 -93 -331 99 0 199 -28 -60 -220 -92 101 -124 -111 -165 -41 218 237 -88 -67
7850 -67 37 49 -172 153 -233 72 -204 -2 -174 13 9 80 -209 106 -152 35 347 -110 32 137 -64 -126
7872 -126 172 71 -59 226 96 -196 5 -42 -16 -317 -86 50 -7 198 168 305 -105 246 -53 -7 163 55
7894 55 13 -180 162 7 -14 -143 105 -61 -64 -266 -223 8 44 -47 -113 84 100 15 34 -72 225 256 -243 -55
7918 -55 44 193 -187 198 -64 3 -71 -74 76 -67 206 121 -143 289 -27 7 24 70 -75 -67 57 61 171 -92 51
7943 51 15 -176 -139 190 85 -121 -127 3 -114 -59 -225 -1 56 104 143 -169 -33 -12 191 -58 102 -38 -57 -140
7967 -140 75 11 111 110 181 147 -73 -50 109 -32 138 -54 -217 11 -82 23 142 117 30 -129 -78 -108 -112 33
7991 33 -83 -53 69 -131 59 -15 -19 -135 267 -41 173 -11 -144 120 -46 53 75 -49 -215 -230 39 -64 177
8014 177 75 -12 1 13 105 -189 40 -119 98 218 36 48 117 98 228 51 84 145 54 -113 82 -161 147
8037 147 83 110 302 -69 -29 132 109 -8 -27 21 290 139 83 -121 -34 -26 -116 61 85 -54 -74 273 85 231
8061 231 -65 191 -15 -39 171 166 -105 17 112 37 138 -16 -83 399 -52 100 49 50 18 17 -298 -145 -100 -79 -123
8086 -123 104 283 -176 286 130 223 218 113 -166 -78 -94 -21 70 169 -115 94 178 83 -281 -98 107 -112 -30 9
8110 9 235 -71 -112 168 -29 -12 106 -14 -87 -176 -67 30 -14 -70 -112 -102 101 121 11 16 -34 208 -172 -112 -177 -91
8136 -91 29 70 76 -145 54 129 -147 44 113 -144 147 -178 96 124 8 12 41 -124 -89 140 -77 -23 -129 123
8160 123 92 11 141 -104 -77 -83 34 -128 37 -139 -41 72 54 -44 54 -45 -152 -202 154 191 -65 48 99 -150
8184 -150 -88 20 -27 19 -19 132 178
8191A78
##END NTUPLES=NMR FID
##END=
