##TITLE=1H_SR47_k_vak
 CDCl3,8 sc, 
 25.10.2021
##JCAMPDX= 6.0         $$ Bruker NMR JCAMP-DX V2.0
##DATA TYPE= NMR FID
##DATA CLASS= NTUPLES
##ORIGIN= UXNMR, Bruker Analytische Messtechnik GmbH
##OWNER= root
$$ XWIN-NMR		Version 3.5
$$ Mon Oct 25 11:39:51 2021 Russian Standard Time (UT+4h)  she@DPX200
##.OBSERVE FREQUENCY= 200.1313468511
##.OBSERVE NUCLEUS= ^1H
##.DELAY= (6, 6)
##.ACQUISITION MODE= SIMULTANEOUS
##.ACQUISITION SCHEME= undefined
##.AVERAGES= 8
##.DIGITISER RES= 18
##SPECTROMETER/DATA SYSTEM= spect
##.PULSE SEQUENCE= zg30
##.SOLVENT NAME= Acetone
##.SHIFT REFERENCE= (INTERNAL, Acetone, 0, 15.7039)
##AUDIT TRAIL= $$ (NUMBER, WHEN, WHO, WHERE, WHAT)
$$ ##TITLE= Audit trail, XWIN-NMR		Version 3.5
$$ ##JCAMPDX= 5.01
$$ ##ORIGIN= Bruker BioSpin GmbH
$$ ##OWNER= she
$$ F:/spectra/data/she/nmr/H-F/1/audita.txt
$$ ##AUDIT TRAIL=  $$ (NUMBER, WHEN, WHO, WHERE, WHAT)
(   1,<2021-10-25 11:38:07.46 +0400>,<she>,<DPX200>,
      <created by zg, POWCHK disabled, PULCHK disabled
       configuration hash MD5:
       00 E9 B6 7A A2 85 ED C7 34 08 36 98 17 FE 4E 26
       data hash MD5: 16K
       C3 09 22 83 3D 59 56 33 33 BB 15 AD 91 2A AB AF>)
$$ ##END=
$$ 
$$ hash MD5
$$ 4D F8 DF B9 B0 28 7A 81 F8 22 CF 48 C5 B8 A2 17
##$RELAX= 
##$RELAX= 
##$RELAX= 
##$RELAX= 
##$RELAX= 
##$RELAX= 
$$ Bruker specific parameters
$$ --------------------------
##$DU= <F:/spectra>
##$EXPNO= 1
##$NAME= <H-F>
##$PROCNO= 1
##$TYPE= <nmr>
##$USER= <she>
##$AMP= (0..31)
100 100 100 100 100 100 100 100 100 100 100 100 100 100 100 100 100 100 
100 100 100 100 100 100 100 100 100 100 100 100 100 100 
##$AQSEQ= 0
##$AQ_mod= 1
##$AUNM= <au_zg>
##$AUTOPOS= <>
##$BF1= 200.13
##$BF2= 200.13
##$BF3= 200.13
##$BF4= 200.13
##$BF5= 200.13
##$BF6= 200.13
##$BF7= 200.13
##$BF8= 200.13
##$BYTORDA= 1
##$CFDGTYP= 0
##$CFRGTYP= 5
##$CHEMSTR= <none>
##$CNST= (0..31)
1 1 145 1 1 1 1 1 1 1 1 1 1 1 1 1 1 1 1 1 1 1 1 1 1 1 1 1 1 1 1 1 
##$CPDPRG= <>
##$CPDPRG1= <>
##$CPDPRG2= <>
##$CPDPRG3= <>
##$CPDPRG4= <mlev>
##$CPDPRG5= <mlev>
##$CPDPRG6= <mlev>
##$CPDPRG7= <mlev>
##$CPDPRG8= <mlev>
##$CPDPRGB= <>
##$CPDPRGT= <>
##$D= (0..31)
0 1.2 0 0 0 0 0 0 0 0.06 0 0.03 0 0 0 0 0.0002 0 0 0 0 0 0 0 0 0 0 0 0 
0 0 0 
##$DATE= 1635147486
##$DBL= (0..7)
120 120 120 120 120 120 120 120 
##$DBP= (0..7)
150 150 150 150 150 150 150 150 
##$DBP07= 0
##$DBPNAM0= <>
##$DBPNAM1= <>
##$DBPNAM2= <>
##$DBPNAM3= <>
##$DBPNAM4= <>
##$DBPNAM5= <>
##$DBPNAM6= <>
##$DBPNAM7= <>
##$DBPOAL= (0..7)
0.5 0.5 0.5 0.5 0.5 0.5 0.5 0.5 
##$DBPOFFS= (0..7)
0 0 0 0 0 0 0 0 
##$DE= 6
##$DECBNUC= <off>
##$DECIM= 32
##$DECNUC= <off>
##$DECSTAT= 4
##$DIGMOD= 1
##$DIGTYP= 9
##$DL= (0..7)
0 120 120 120 120 120 120 120 
##$DP= (0..7)
150 150 150 150 150 150 150 150 
##$DP07= 0
##$DPNAME0= <>
##$DPNAME1= <>
##$DPNAME2= <>
##$DPNAME3= <>
##$DPNAME4= <>
##$DPNAME5= <>
##$DPNAME6= <>
##$DPNAME7= <>
##$DPOAL= (0..7)
0.5 0.5 0.5 0.5 0.5 0.5 0.5 0.5 
##$DPOFFS= (0..7)
0 0 0 0 0 0 0 0 
##$DQDMODE= 0
##$DR= 18
##$DS= 0
$$ [...]
##$SUBNAM2= <"">
##$SUBNAM3= <"">
##$SUBNAM4= <"">
##$SUBNAM5= <"">
##$SUBNAM6= <"">
##$SUBNAM7= <"">
##$SUBNAM8= <"">
##$SUBNAM9= <"">
##$SW= 18.0517286264689
##$SWIBOX= (0..15)
0 0 2 0 0 0 0 0 0 0 0 0 0 0 0 0 
##$SW_h= 3612.71676300578
##$TD= 16384
##$TD0= 1
##$TE= 0
##$TE2= 300
##$TE3= 300
##$TEG= 300
##$TL= (0..7)
0 120 120 120 120 120 120 120 
##$TP= (0..7)
150 150 150 150 150 150 150 150 
##$TP07= 0
##$TPNAME0= <>
##$TPNAME1= <>
##$TPNAME2= <>
##$TPNAME3= <>
##$TPNAME4= <>
##$TPNAME5= <>
##$TPNAME6= <>
##$TPNAME7= <>
##$TPOAL= (0..7)
0.5 0.5 0.5 0.5 0.5 0.5 0.5 0.5 
##$TPOFFS= (0..7)
0 0 0 0 0 0 0 0 
##$TUNHIN= 0
##$TUNHOUT= 0
##$TUNXOUT= 0
##$USERA1= <user>
##$USERA2= <user>
##$USERA3= <user>
##$USERA4= <user>
##$USERA5= <user>
##$V9= 5
##$VALIST= <valist>
##$VCLIST= <CCCCCCCCCCCCCCC>
##$VD= 0
##$VDLIST= <DDDDDDDDDDDDDDD>
##$VPLIST= <PPPPPPPPPPPPPPP>
##$VTLIST= <TTTTTTTTTTTTTTT>
##$WBST= 1024
##$WBSW= 4
##$XGAIN= (0..3)
0 0 0 0 
##$XL= 0
##$YL= 0
##$YMAX_a= 193072
##$YMIN_a= -202053
##$ZGOPTNS= <>
##$ZL1= 120
##$ZL2= 120
##$ZL3= 120
##$ZL4= 120
##$ABSF1= 10
##$ABSF2= 0
##$ABSG= 5
##$ABSL= 3
##$ALPHA= 0
##$AQORDER= 0
##$ASSFAC= 0
##$ASSFACI= 0
##$ASSFACX= 0
##$ASSWID= 0
##$AUNMP= <proc_1d>
##$AZFE= 0.1
##$AZFW= 0.1
##$BCFW= 1
##$BC_mod= 2
##$BYTORDP= 1
##$COROFFS= 0
##$CY= 11.3945322036743
##$DATMOD= 1
##$DC= 2
##$DFILT= <>
##$DTYPP= 0
##$F1P= 2.36226072786647
##$F2P= -0.459571619588291
##$FCOR= 0.5
##$FTSIZE= 0
##$FT_mod= 4
##$GAMMA= 1
##$GB= 0.15
##$INTBC= 1
##$INTSCL= 1
##$ISEN= 128
##$LB= 0.24
##$LEV0= 0
##$LPBIN= 0
##$MAXI= 10000
##$MC2= 0
##$MEAN= 0
##$ME_mod= 0
##$MI= 1.114404
##$NCOEF= 0
##$NC_proc= 0
##$NLEV= 6
##$NOISF1= 3.799351
##$NOISF2= 2.8
##$NSP= 1
##$NTH_PI= 0
##$NZP= 0
##$OFFSET= 15.70392
##$PC= 1
##$PHC0= -15151.68
##$PHC1= 9.80083
##$PH_mod= 1
##$PKNL= yes
##$PPARMOD= 0
##$PSCAL= 0
##$PSIGN= 0
##$REVERSE= no
##$SF= 200.130013532006
##$SI= 16384
##$SIGF1= 3
##$SIGF2= 2
##$SINO= 400
##$SIOLD= 16384
##$SREGLST= <1H.CDCl3>
##$SSB= 0
##$STSI= 0
##$STSR= 0
##$SW_p= 3612.71676300578
##$SYMM= 0
##$S_DEV= 0
##$TDeff= 0
##$TDoff= 0
##$TI= <>
##$TILT= no
##$TM1= 0
##$TM2= 0
##$TOPLEV= 0
##$USERP1= <user>
##$USERP2= <user>
##$USERP3= <user>
##$USERP4= <user>
##$USERP5= <user>
##$WDW= 1
##$XDIM= 8192
##$YMAX_p= 0
##$YMIN_p= 0
$$ End of Bruker specific parameters
$$ ---------------------------------
##NTUPLES= NMR FID
##VAR_NAME=  TIME,          FID/REAL,        FID/IMAG
##SYMBOL=    X,             R,               I
##VAR_TYPE=  INDEPENDENT,   DEPENDENT,       DEPENDENT
##VAR_FORM=  AFFN,          ASDF,            ASDF
##VAR_DIM=   8192,          8192,            8192
##UNITS=     SECONDS,       ARBITRARY UNITS, ARBITRARY UNITS
##FACTOR=    0.0002768,     1,               1
##FIRST=     0,             0,               0
##LAST=      2.2672688,     0,               0
##MIN=       0,             -202053,         0
##MAX=       2.2672688,     193072,          0
$$ Real data points
##PAGE= N=1
##DATA TABLE= (X++(R..R)), XYDATA
$$ [...]
$$ plain form
1705 -224 -20 90 -266 -18 366 -295 54 426 200 -12 313 -74 -82 416 297 -395 -30 -11 -316 72 -57
1726 -57 -251 -206 111 -186 -41 152 -404 3 -54 -283 -83 318 59 -159 283 -136 -155 233 64 -117 132
1747 132 249 -190 135 13 -243 301 252 -269 -177 463 -232 176 147 -322 -155 45 23 -352 48 -27 -306 218
1769 218 171 -363 180 306 -121 -67 40 -139 216 386 -314 243 420 167 57 53 -170 -191 75 -128 -202 42
1791 42 -75 -492 2 161 -70 -78 166 -119 37 100 -253 133 348 -236 -167 146 157 86 91 -40 -238 99 7
1814 7 -11 89 169 -260 52 77 -313 -119 -274 -38 -168 -59 19 -42 -46 -65 -13 108 -78 -295 244 -113 250 20
1838 20 97 -39 181 219 25 132 382 -136 306 -21 109 -182 229 -171 -84 -26 -384 132 -219 -98 -312 94
1860 94 -31 -51 -209 163 -63 11 232 -133 -242 -96 14 68 202 308 92 65 -78 38 242 -41 -283 448
$$ packed form
1705b24K04J10l56K48L84o61L49L72k26k12L25l87qM98j19o92L65J9l05L88j29
1726e7j94M5L17k97J45J93n56M07n7k29K00M01k59k18M42m19j9L88j69j81K49
1747A32J17m39L25j22k56N44m9n21R2O40o95M08k9m69J67K00k2l75M00p5k79N24
1769B18m7n34N43J26m27N4J07j79L55J70p00N57J77k53j10mk23k1K66k03p4K44
1791D2j17m17M94J59k31qK44k85J56O3l53L86K15n84O9L13J1p1Nj31j98L37r2
1814Gj8J00Q0m29L12K5l90J94j55K36j30J09P8o1mj9N2J21j86k17N39l57L63k30
1838B0P7j36K20L8j94J07K50n18M42l27J30k91M11m00Q7N8l58N16l51J21k14M06
1860I4j25k0j58L72k26P4K21l65j09J46J10N4J34J06k16k7j43J16K04k83k42P31
$$ plain form
1882 448 -32 -220 151 33 -287 -54 419 -317 -36 146 -298 102 12 -62 -68 61 43 -125 48 80 -52 87
1904 87 284 30 -238 114 -85 176 -108 146 -49 67 -211 -136 15 -197 -157 153 -86 53 248 129 -7
1925 -7 67 123 -63 90 84 184 40 -50 14 120 36 58 -142 -211 -108 253 70 -21 34 140 -6 -84 -266 188 -293
1950 -293 -124 167 -161 -162 -189 1 102 -122 -23 -8 52 -135 -32 -39 235 215 332 135 275 125 132 244 7 -34
1974 -34 37 263 -167 -135 -266 -135 -165 -286 -53 77 -44 -291 -24 -125 -308 96 -25 -371 87 283 66
1995 66 165 159 86 -17 15 -9 103 2 9 -137 -77 177 -134 -7 68 23 148 -42 -221 73 -70 116 -208 -30
2019 -30 -46 62 -165 -133 253 30 101 -127 -104 6 12 26 340 -13 -58 15 -68 -19 -23 -107 -116 224 37 -72 -21 122
2045 122 -114 98 -188 -117 -156 23 79 -68 83 204 -306 178 167 -71 88 -6 129 -33 -115 166 -242 -59
$$ packed form
1882D48m80j88L71j18l20K33M73p36K81J82m44M00r0p4oJ29j8j68J73L2j32J39
1904H7J97k54k68L52j99K61k84K54j95J16k78P5J51k12M0L10k39J39J95j19j36
1925gP4N6j86J53oJ00j44r0O4J06q4K2k00o9J03L61j83r1N5J06j46p8j82M54m81
1950b93J69K91l28jk7J90J01k24R9J5O0j87J03pK74k0J17j97J40j50PJ12k37m1
1974c4P1K26m30L2j31J31l0j21K33J30j21k47K67j01j83M04j21l46M58J96k17
1995F6R9op3j03L2k4J12j01Pj46O0K54l11J27P5m5J25j90j79K94j43J86l24J78
2019c0j6J08k27L2L86k23P1k28K3J10OJ4L14l53m5P3q3M9mq4rL40j87j09N1J43
2045A22k36K12k86P1l9J79N6j47J51J21n10M84j1k38J59r4J35j62q2K81m08J83
$$ plain form
2067 -59 -46 -175 93 -90 189 281 -113 -136 -36 -105 29 73 85 -159 -169 92 -141 102 -31 113 -126 -138 282
2090 282 320 -82 197 268 97 309 26 56 123 88 38 35 65 -44 -106 -26 -249 -65 -146 -162 30 15 -53 -182 -47
2115 -47 -67 186 45 185 184 38 -44 46 135 -117 -68 1 109 -14 195 -229 63 141 183 -138 -5 -114 -91 -273
2139 -273 -206 -139 -52 -238 27 123 -162 251 -132 181 -25 -272 67 176 156 -26 -68 -89 -34 289 -59 42 -81
2162 -81 103 -73 7 -77 -92 -29 8 23 -150 -77 2 14 -47 72 -200 -191 -116 -63 159 -205 41 -7 34 280 97 -142
2188 -142 294 -52 -125 76 -56 137 86 123 -273 -96 24 -477 -149 -3 -33 -37 26 56 -153 -217 266 -129 156
2211 156 377 -125 29 23 49 186 329 -45 -104 56 187 238 61 129 2 -92 -31 -122 -126 51 0 61 -126 -258
2235 -258 26 -15 -118 40 9 -182 198 -42 -124 -58 -60 131 15 272 -46 -149 79 134 44 384 445 72 14
$$ packed form
2067e9J3j29K68j83K79R2l94k3J00o9J34M4J2k44j0K61k33K43j33J44k39j2M20
2090B82L8m02K79P1j71K12k83L0O7l5n0lL0j09o2Q0k23J84q1j6J92j5o8j29J35
2115d7k0K53j41J40jj46q2R0Q9k52M9O9J08j23K09m24K92P8M2l21J33j09K3j82
2139b73O7O7Q7j86K65R6k85M13l83L13k06k47L39J09k0j82m2k1N5L23l48J01j23
2162h1J84j76Q0q4j5O3L7J5j73P3P9J2o1J19k72RP5N3K22l64K46m8M1K46j83k39
2188a42M36l46p3K01j32J93n1L7l96J77J20n01L28J46l0mO3L0k09o4M83l95K85
2211A56K21n02J54oK6J37J43l74n9J60J31N1j77O8j27r4O1r1mJ77n1O1j87j32
2235b58K84m1j03J58l1j91L80k40q2O6kJ91j16K57l18j03K28N5r0L40O1l73n8
$$ plain form
2258 14 -252 -75 113 -52 -317 -68 33 215 -90 -120 -149 121 -1 -158 -61 124 76 14 82 -185 -140 -183 60
2281 60 198 -7 -84 46 236 206 -113 22 -151 135 -233 169 -383 -100 96 -53 119 248 -166 -209 -19
2302 -19 13 -31 -59 131 -244 -176 19 -289 104 92 61 -43 167 190 -216 92 -64 -194 71 106 -209 118 11
2325 11 14 -189 -80 79 191 -111 -204 -128 -144 -10 -11 53 -35 -105 98 -62 98 233 114 154 188 -87 -135 46 13
2350 13 -52 40 -239 -79 -48 46 -215 -85 47 -15 -124 -74 -85 -84 -394 -199 -153 -47 136 -114 -49 -159 -109 120
2374 120 -97 10 -1 -85 218 218 29 -2 153 63 142 -78 48 25 85 -191 -286 59 -40 186 -59 -79 -49 -155
2398 -155 -102 112 -35 -226 132 -24 211 129 89 136 143 74 133 -149 195 128 -289 69 66 -59 -23 -151 -122 33
2422 33 -146 -74 -5 -135 -206 -204 -6 -100 9 4 36 -5 229 -20 -19 -75 34 137 23 -71 270 106 -126 -14 177
$$ packed form
2258A4k66J77J88j65k65K49J01J82l05l0k9K70j22j57R7J85m8o2O8k67M5m3K43
2281F0J38k05p7J30J90l0l19J35j73K86l68M02n52K83J96j49J72J29m14m3J90
2302a9L2m4k8J90l75O8J95l08L93j2l1j04K10K3m06L08j56j30K65L5l15L27j07
2325A1Lk03J09J59J12l02r3P6j6J34jO4q8p0K03j60J60J35j19M0L4k75m8J81l3
2350A3o5R2k79J60L1R4k61J30J32o2j09N0j1Jl10J95M6J06J83k50O5j10N0K29
2374A20k17J07j1q4L03%j89l1J55r0P9k20J26k3O0k76r5L45r9K26k45k0L0j06
2398a55N3K14j47j91L58j56K35q2m0M7Po9N9k82L44o7m17L58lj25L6j28K9J55
2422C3j79P2O9j30p1KJ98r4J09nL2m1K34k49Jn6J09J03j14r4L41j64k32J12J91
$$ plain form
2447 177 -74 245 -148 -167 128 97 -97 37 7 -164 33 -45 -28 3 -5 -162 -99 -9 318 272 107 -62 246 148
2471 148 26 -207 -104 112 413 -77 3 223 -72 -48 -109 144 -52 182 -117 -35 193 -114 -90 -33 107 -95
2493 -95 -136 4 107 30 78 -178 117 134 -30 156 207 -98 -5 170 -114 163 125 -75 -53 175 -124 -134 145
2516 145 -104 -159 76 111 91 -136 -188 -216 -21 -6 122 -54 57 -115 55 -139 -245 276 -33 -9 155 -41
2538 -41 -214 -128 229 -17 -101 -2 -59 10 -70 -90 -218 30 116 -115 -255 -142 -21 -109 -231 90 134 10 2 30 -11
2563 -11 -77 207 53 11 -70 225 330 180 -24 16 202 -112 -179 66 146 -214 107 84 -232 1 -6 -75 24 158
2587 158 -69 -38 252 -225 157 -121 -18 -27 -60 157 -178 23 -170 274 255 -35 11 -117 -68 -113 13 -73 -47
2610 -47 -168 78 -27 2 -31 -143 -113 36 -71 -24 1 214 -154 52 -262 -165 61 178 58 -32 173 -27 182
$$ packed form
2447A77k51L19l93j9K95l1j94J34l0j71J97p8J7L1qj57O3R0L27m6j65j69L08r8
2471A48j22k33J03K16L01m90Q0K20k95K4o1K53j96K34k99Q2K28l07K4N7J40k02
2493i5m1J40J03p7M8k56K95J7j64J86N1l05R3J75k84K77l8k00K2K28k99j0K79
2516A45k49n5K35L5k0k27n2k8J95J5J28j76J11j72J70j94j06N21l09K4J64j96
2538d1j73Q6L57k46q4R9n7O9q0k0j28K48Q6k31j40J13J21q8j22L21M4j24qK8m1
2563a1o6K84j54m2q1K95J05j50k04M0J86l14o7K45Q0l60L21k3l16K33po9R9J34
2587A58k27L1K90m77L82k78J03rl3K17l35K01j93M44j9k90M6j28M9m5J26q6K6
2610d7j21K46j05K9l3j12L0J49j07M7K5K13l68K06l14R7K26J17j20r0K05k00K09
$$ plain form
2633 182 105 -18 -10 -10 -202 43 132 -64 171 -152 24 -163 203 30 10 -64 -175 46 -26 155 -170 -152 -215 123
2657 123 213 -71 64 -75 -115 250 -44 268 331 -114 -35 85 50 32 -171 -143 -86 -75 112 -244 37 13 72 -277
2681 -277 -173 63 70 172 -15 -111 -168 156 258 161 278 47 112 -58 -85 -167 55 27 8 65 -72 -117 -6 -42
2705 -42 -26 29 -16 -54 -72 -113 -50 64 -164 -148 -32 46 140 69 108 -103 -55 198 -184 134 176 -24 103 183 188 -1
2731 -1 -56 -152 -62 16 -266 174 139 107 -72 139 184 -97 -70 69 -160 29 -103 130 42 64 68 -26 189 96 196
2756 196 -97 34 -77 -217 -106 223 177 -122 -63 26 129 -74 -95 10 0 -98 -117 40 -238 -3 -197 -117 81
2779 81 -150 -58 134 27 -8 8 40 144 64 -54 117 -54 -107 152 113 25 21 -65 210 -326 -44 36 88 10 -166
2804 -166 -7 92 189 -150 68 13 -61 -23 79 -60 76 -48 -168 134 -245 158 108 -164 187 -174 24 7
$$ packed form
2633A82p7j23Q%j92K45Q9j96K35l23J76j87L66j73k0p4j11K21p2J81l25J8o3L38
2657A23R0k84J35j39m0L65k94L12O3m45P9J20l5j8k03K8N7J1J87l56K81k4N9l49
2681b77J04K36PJ02j87r6n7L24J02r7J17k31O5j70k7q2K22k8j9N7j37m5J11l6
2705d2J6N5m5l8j8m1O3J14k28J6J16P8R4p1L9k11M8K53l82L18M2k00J27Q0Nj89
2731an5r6R0P8k82M40l5l2j79K11M5k81K7J39k29J89j32K33q8K2Mr4K15r3J00
2756A96k93J31j11j40J11L29m6k99N9Q9J03k03k1J05j0r8j9J57k78K35j94Q0J98
2779H1k31R2J92j07l5J6L2J04q0j18J71j71n3K59l9q8mq6K75n36K82Q0N2p8j76
2804a66J59R9R7l39K18n5p4L8J02j39J36j24j20L02l79M03n0k72L51l61J98j7
$$ plain form
2826 7 328 76 94 -221 -88 6 -119 -144 147 169 121 -170 -88 20 -137 -77 23 2 -226 78 102 17 7 -114
2850 -114 159 35 16 -45 -219 125 59 189 109 -56 -23 -137 -164 -145 -175 95 -92 19 88 274 50 40 245
2873 245 -29 -189 48 146 44 -66 170 -19 -144 89 32 37 119 116 76 -115 61 75 -235 -94 -86 151 -7 -4
2897 -4 -63 13 7 153 2 -2 -108 55 13 -43 133 -124 -17 -2 -39 -5 98 5 10 -111 290 178 -36 -260 42
2922 42 232 -25 -100 -5 -177 185 60 -49 78 -260 -26 78 -103 -37 -274 85 95 34 43 14 -98 90 -267
2945 -267 -100 25 143 182 214 -62 91 -150 64 5 -34 14 168 146 49 -32 -67 20 109 -43 83 66 -74 -24
2969 -24 258 -219 52 132 -17 14 23 44 69 -127 36 199 -67 -68 159 327 -128 -11 126 -9 52 -34 -83 56
2993 56 -23 233 -115 154 39 42 -176 -26 -53 118 6 42 -109 -34 -78 -71 -61 -65 38 -181 -63 -244 177 43
$$ packed form
2826GL21k52J8l15J33R4j25k5K91K2m8k91Q2J08j57O0J00k1k28L04K4q5j0j21
2850a14K73j24j9o1j74L44o6J30q0j65L3j14k7J9l0K70j87J11O9J86k24j0K05
2873B45k74j60K37R8j02j10K36j89j25K33n7NQ2lm0j91J76J4l10J41QK37j58L
2897dn9P6oJ46j51mj06J63m2n6J76k57J07J5l7L4J03r3Nj21M01j12k14k24L02
2922D2J90k57p5R5j72L62j25j09J27l38K34J04j81O6k37L59J0o1Rk9j12J88l57
2945b67J67J25J18L9L2k76J53k41K14n9l9M8J54k2r7q1l5Q7Q9j52J26j7j40N0
2969b4K82m77K71Q0j49L1RK1K5j96J63J63k66jK27J68m55J17J37j35O1q6m9J39
2993E6p9K56l48K69j15Lk18J50k7J71j12L6j51P5m4PJ0mJ03k19J18j81M21j34
$$ plain form
3017 43 244 80 183 268 134 1 205 120 82 64 -260 -54 -169 -18 -13 67 42 -9 -421 -16 -222 -136 68 -124
3041 -124 12 26 20 -77 52 90 -9 -16 -88 -146 74 -90 6 -21 -256 -83 -276 75 -39 -45 43 32 75 63 106 136 -74
3068 -74 15 22 -29 58 -146 -117 122 53 -40 -95 -44 67 82 165 119 12 -160 61 -99 113 -250 -7 -54 -167 22
3093 22 -59 -87 47 -232 -119 128 -187 188 4 62 9 423 -106 -2 -4 111 36 108 47 -86 -32 -165 134 -276
3117 -276 -2 -258 -214 -141 -260 -60 -34 -133 -5 -99 80 112 130 14 -15 -194 -293 -61 -6 97 -8 183 339
3140 339 -37 -33 -55 161 262 -106 -138 147 -162 -46 136 -99 166 -54 15 156 207 75 -202 59 -26 -3 124
3163 124 -3 234 6 269 220 139 86 40 -27 52 95 8 164 -31 -44 -6 115 -109 -137 -2 -299 -4 -110 -146
3187 -146 -33 35 -65 -45 -101 -69 -13 138 -59 -144 -67 78 22 -176 -72 22 -50 22 229 -2 -268 9 64 -207
$$ packed form
3017D3K01j64J03Q5j34j33K04q5l8j8l24K06j15J51NQ0k5n1m12M05k06Q6K04j92
3041a24J36J4or7J29L8r9pp2n8K20j64R6k7k35J73j93L51j14oQ8j1M3j2M3L0k10
3068g4Q9Pn1Q7k04K9K39o9r3n5N1J11J5Q3m6j07j72K21j60K12l63K43m7j13J89
3093B2q1k8J34k79J13K47l15L75j84N8n3M14n29J04kJ15p5P2o1j33N4j33K99m10
3117b76K74k56M4P3j19K00K6r9J28r4J79L2J8j16k9j79r9K32N5J03j05J91J56
3140C39l76Mk2K16J01l68l2K85l09J16J82k35K65k20O9J41N1j32k77K61q5K3J27
3163A24j27K37k28K63m9q1n3m6o7P9M3q7J56j95j3L8J21k24k8J35k97K95j06l6
3187a46J13O8j00K0n6L2N6J51j97q5P7J45n6j98J04R4p2P2K07k31k66K77N5k71
$$ plain form
3211 -207 -8 36 259 161 15 -306 337 115 -56 49 -45 104 15 21 149 39 -132 131 -13 83 76 2 9 420
3235 420 -138 -79 176 -13 129 29 -41 -129 242 -38 -126 -76 -130 100 74 -291 72 -82 -189 -28 -48 -147 133
3258 133 243 30 50 260 2 80 67 -57 116 126 146 102 37 57 -7 -75 -7 -134 191 5 -173 -144 -122 -138 9
3283 9 220 -2 -39 138 115 137 -389 32 -201 -123 262 104 -66 110 167 201 -21 59 87 292 -293 139 -7
3306 -7 -87 -122 101 21 -194 -42 -160 -29 73 -112 105 119 -104 37 -26 -8 72 87 -86 22 -68 171 29 -38
3330 -38 -76 -42 7 -48 264 -217 -149 -44 89 -22 -138 126 -117 -90 -66 -63 -252 196 272 -70 17 30 0 163 69
3355 69 -216 -133 -46 -96 -33 -8 211 27 85 -116 -130 -5 -175 -24 -143 233 39 -258 180 -17 248 -94 66
3378 66 -21 -24 37 141 -261 268 -161 -149 139 43 338 108 -63 -105 205 44 84 -37 139 30 -284 -35 -167
$$ packed form
3211b07J99M4K23r8j46l21O43k22j71J05r4J49q9OJ28j10j71K63j44R6pp4PM11
3235D20n58N9K55j89J42j00p0q8L71k80q8N0n4K30k6l65L63j54j07J61k0r9K80
3258A33J10k13K0K10k58P8j3j24J73J0K0m4o5K0o4o8O8j27L25j86j78K9K2j6J47
3283IK11k22l7J77k3K2n26M21k33P8L85j58j70J76N7L4k22Q0K8K05n85M32j46
3306gq0l5K23q0k15J52j18J31J02j85K17J4k23J41o3J8Q0J5j73J08r0K39j42o7
3330c8l8L4M9n5L12m81O8J05J33j11j16K64k43K7K4Lj89M48P6l42Q7J3l0J63r4
3355F9k85Q3Q7n0O3K5K19j84N8k01j4J25j70J51j19L76j94k97M38j97K65l42J60
3378F6q7lO1J04m02N29m29J2K88r6K95k30j71m2L10j61M0j21J76j09l14K49j32
$$ plain form
3401 -167 -106 -164 -1 142 13 119 -46 -48 121 -85 -133 -31 -77 6 13 29 46 39 -66 142 -23 64 151 -219 103
3426 103 -10 148 19 30 -116 152 -42 96 2 92 72 51 -36 78 371 -171 -275 366 29 296 -54 -2
3448 -2 224 12 155 191 195 128 -9 131 172 -134 -146 70 155 9 -28 95 55 98 159 16 -87 -73 -12 -65 413
3473 413 8 -3 18 127 -14 -207 -231 -129 47 273 -72 -154 148 -40 -56 -220 -110 49 106 113 11 -287 -131
3496 -131 -171 224 8 94 140 15 61 112 -177 70 73 -153 110 156 79 86 47 224 -54 236 206 103 -10 -149
3520 -149 257 30 -72 221 -175 -26 -93 162 -58 -1 -194 -232 229 -169 234 108 -89 -91 -95 -2 100 -75 -155
3543 -155 -58 -63 -60 11 58 -127 -76 53 64 -58 154 -3 -18 -143 51 -10 -25 73 -47 -140 -42 39 348 208 169 -324
3569 -324 -239 29 -27 40 -179 92 217 -50 327 267 40 163 11 -235 -35 -156 -99 200 84 103 22 -185
$$ packed form
3401a67O1n8J63J43j29J06j65kJ69k06m8J02m6Q3PJ6J7pj05K08j65Q7Q7l70L22
3426A03j13J58j29J1j46K68j94J38r4R0k0k1q7J14K93n42j04O41l37K67l50N2
3448bK26k12J43L6Mo7j37J40M1l06j2K16Q5j46l7J23m0M3O1j43j03J4O1n3M78
3473D13m05j1K1J09j41j93k4J02J76K26l45q2L02j88j6j64J10J59N7Pj02k98J56
3496a31m0L95k16Q6M6j25M6N1k89K47Lk26K63M6p7Pl9J77k78K90l0j03j13j39
3520a49M06k27j02K93l96J49o7K55k20N7j93l8M61l98M03j26j97kmR3J02j75q0
3543a55R7nLP1M7j85N1J29J1j22K12j57j5j25J94o1j5R8j20r3R8Q1L09j40l9m93
3569c24Q5K68n6O7k19K71J25k67L77o0k27J23j52k46K00j21N7K99j16J9q1k07
$$ plain form
3591 -185 -3 96 45 -172 -188 -79 -204 140 -52 -84 -13 -92 69 -210 81 -58 -55 329 22 3 179 -169 -96
3614 -96 100 64 -29 152 46 -8 -255 36 26 42 61 27 18 41 81 64 53 -112 30 259 -76 116 82 221 -132
3639 -132 -32 204 310 -63 92 -18 3 196 10 232 -27 -30 -132 -168 -169 -183 19 219 150 -219 -27 -163 334
3662 334 54 83 -72 220 -44 80 -49 -3 -111 70 -120 -110 43 -175 18 180 28 54 65 -102 12 57
3684 57 -100 -230 74 166 63 -210 33 -81 6 20 201 -182 -116 -22 -108 -78 78 -189 -140 121 -100 -154 -106 -67
3708 -67 -16 -92 32 -79 -93 37 -220 93 55 -45 95 -74 50 -137 -45 120 167 59 -2 -67 21 -90 63
3731 63 43 153 -219 -64 -20 16 -74 27 -7 -202 218 149 181 -239 60 -392 -94 74 -98 -94 50 234 39
3754 39 83 137 -13 189 -224 -13 -156 -132 -93 22 204 -107 -190 -8 16 -257 -226 119 -35 -245 192 -105 -21
$$ packed form
3591a85J82R9n1k17j6J09j25L44j92l2P1p9J61k79K91j39LL84l07j9J76l48P3
3614i6J96l6r3J81j06n4k47K91j0J6J9l4rK3M0j7j1j65J42K29l35J92l4J39l53
3639a32J00K36J06l73J55j10K1J93j86K22k59lj02l6jj4K02K00o9l69J92j36M97
3662C34k80K9j55K92k64J24j29M6j08J81j90J0J53k18J93J62j52K6J1j67J14M5
3684E7j57j30L04R2j03k73K43j14Q7J4J81l83O6R4q6L0J56k67M9K61k21n4M8L9
3708f7N1p6J24j11j4J30k57L13l8j00J40j69J24j87R2J65M7j08o1o5Q8j11J53
3731F3k0J10l72J55M4L6r0J01l4j95M20o9L2m20K99m52K98J68j72MJ44J84j95
3754C9M4N4j50K02m13K11j43K4L9J15J82l11q3J82K4k73L1L45j54k10M37k97Q4
$$ plain form
3777 -21 -88 7 -46 436 141 -100 111 41 -10 132 -95 135 -108 -88 -283 -96 -82 70 28 13 126 128 95 64 111
3802 111 -71 -113 48 -11 92 -69 -182 -132 42 -129 219 -339 -107 -42 149 -50 0 137 37 -21 31 -214
3824 -214 -128 159 134 133 109 28 45 -94 -46 50 42 159 -85 45 -118 -231 -244 -195 -85 -14 9 82 -170 -161 28 -160
3850 -160 130 -237 -194 15 -53 -103 0 130 119 -175 328 -152 -22 472 3 -144 -26 106 182 194 -47 82
3872 82 149 -29 59 -136 19 -176 -133 -49 -39 -154 -155 53 47 -13 256 97 33 -197 -76 236 113 127 -117 0
3896 0 64 4 268 -92 87 -1 -79 -15 -25 -18 83 143 -89 14 121 -4 -170 31 196 -79 56 26 223 -241
3920 -241 135 2 127 185 242 206 248 -19 220 169 83 -18 -109 -213 63 -202 -143 -39 -230 -6 -122 344 -106
3943 -106 30 -9 215 -296 -41 -210 99 79 178 180 -99 211 127 -21 116 -211 173 62 -189 -36 75 10
$$ packed form
3777b1o7R5n3M82k95k41K11p0n1J42k27K30k43K0j95J87J4J52m2j5J13Kl3l1M7
3802A11j82m2J61n9J03j61j13N0J74j71L48n58K32O5J91j99N0J37j00n8N2k45
3824b14Q6K87k5jk4q1J7j39M8R6qJ17k44J30j63j13j3M9J10P1K3P3k52RJ89j88
3850a60K90l67M3K09o8n0J03J30j1k94N03m80J30M94m69j47J18J32P6J2k41J29
3872H2O7j78Q8j95J55j95M3Q4J0j15jK08oo0K69j59o4k30J21L12j23J4k44J17
3896@O4o0K64l60J79q8p8O4j0PJ01O0k32J03J07j25j66K01J65k75J35l0J97m64
3920b41L76j33J25N8N7l6M2k67K39n1q6j01r1j04K76k65N9J04j91K24j16M66m50
3943a06J36l9K24n11K55j69L09k0R9Kk79L10q4j48J37l27L84j11k51J53J11o5
$$ plain form
3965 10 -53 40 151 -27 -127 75 -30 120 177 50 -63 -137 -21 -76 -205 17 292 280 -114 26 198 -48
3987 -48 -97 -19 -16 45 -9 -170 84 79 120 -68 -77 114 -215 271 -16 -137 86 -57 96 -115 -166 -163 113 80 83 -139
4013 -139 -14 23 52 -30 -278 -25 191 18 163 179 -301 34 78 -158 -205 74 102 -188 -16 12 -49 -100 381
4036 381 -70 -46 165 -38 121 -24 -97 -63 316 -65 -113 46 25 -1 -53 16 116 -200 -190 -153 -61 -30 -85 76
4060 76 19 -181 157 -22 -61 102 -67 -166 -90 -41 69 91 -257 26 298 -40 -303 -130 67 111 64 46 -255
4083 -255 -138 -100 -13 -139 218 -188 90 43 123 160 -5 252 -56 18 -166 -150 -59 -1 -117 125 33 10 40 30
4107 30 -3 -63 105 148 -54 -56 -115 56 235 83 -89 -21 -136 7 19 115 18 -207 -3 98 -130 -12 31 155
4131 155 -113 353 -287 -138 -70 -34 -33 -29 17 -73 78 -47 -35 21 268 23 -86 73 -105 229 118 112 43 -33 -35
$$ packed form
3965A0o3R3J11j78j00K02j05J50N7j27j13p4J16n5j29K22K75j2l94J40J72k46
3987d8m9P8LO1n4j61K54nM1j88rJ91l29M86k87j21K23j43J53k11n1LK76l3Lk22
4013a39J25L7K9q2k48K53K16j73J45J6m80L35M4k36m7K79K8k90J72K8o1n1M81
4036C81m51K4K11k03J59j45p3L4L79l81m8J59k1k6n2O9J00l16J0L7R2L1n5J61
4060G6n7k00L38j79l9J63j69r9P6M9J10K2l48K83K72l38k63J73J97M4m7j8l01
4083b55J17L8Q7j26L57m06K78m7Q0L7j65K57l08P4j84J6R1N8j16K42r2k3L0j0
4107C0l3o0J68M3k02kn9J71J79j52j72O8j15J43J2R6r7k25K04J01k28J18M3J24
4131A55k68M66o40J49O8L6JMM6r0J51j25J2N6K47k45j09J59j78L34j11oo9p6k
$$ plain form
4156 -35 -48 -138 24 -80 -251 -9 -84 -14 209 26 -26 -238 -216 -47 119 147 -91 126 -51 -89 40 155 182
4179 182 -218 91 102 178 2 117 0 72 -14 -85 -159 -50 188 87 -44 48 -209 68 -80 -116 -35 -58 -20 36
4203 36 -219 -199 -24 69 144 224 262 152 -24 228 -41 -121 44 -297 26 75 232 123 106 -88 32 16 43 136
4227 136 170 -30 82 92 81 74 62 154 -49 150 -79 126 -87 -23 -64 -269 56 1 -216 -126 138 -11 -280 -78
4251 -78 239 -151 172 15 118 41 51 113 102 -212 -18 28 -86 -99 -109 10 -27 -241 1 74 -33 53 17 114
4275 114 47 26 -114 56 20 -19 185 190 -73 18 154 46 -235 -313 -129 152 -15 143 -123 232 260 62 132
4298 132 61 -69 -207 56 -9 -288 83 55 20 -126 -76 127 51 -211 155 -118 128 237 17 -105 -18 141
4320 141 58 -8 20 349 -9 -57 -19 1 -120 -67 -72 264 -96 181 72 -21 246 134 35 177 154 -25 -5 -26 26
$$ packed form
4156c5j3r0J62j04j71K42p5P0K23j83n2k12K2J69J66K8k38K17j77l8J29J15K7
4179A82m00L09J1P6j76J15j17P2q6p1p4J09K38j01j31R2k57K77j48l6Q1k3L8N6
4203C6k55K0J75R3P5Q0L8j10j76K52k69q0J65l41L23M9J57j09j7j94J20j6K7R3
4227A36L4k00J12J0j1pj2R2k03J99k29K05k13O4m1k05L25n5k17R0K64j49k69K02
4251g8L17l90L23j57J03p7J0O2j1l14J94M6j14j3j0J19l7k14K42P3j07Q6l6R7
4275A14o7k1j40J70l6l9K04Nk63R1J36j08k81p8J84K81j67J58k66L55K8j98P0
4298A32p1j30j38K63o5k79L71k8l5j46N0K03p6k62L66k73K46J09k20j22Q7J59
4320A41q3o6K8L29l58m8L8K0j21N3nL36l60K77j09r3K67j12r9J42k3j79K0k1N2
$$ plain form
4345 26 -79 -51 -28 -187 -164 -132 -31 -72 -343 -80 -42 -123 -40 103 54 70 104 -125 -100 206 35 -24 174 -294 -279
4370 -279 50 93 22 -230 -64 115 -149 57 83 -27 -65 -193 -24 295 3 68 -119 -40 -123 -148 150 -145 -95
4393 -95 -93 -19 217 -19 111 2 -37 119 129 -72 160 -434 63 -47 69 -100 -377 -14 -36 -30 136 82 -20
4416 -20 -74 -141 96 -61 80 -14 -231 38 150 -43 -98 -322 -169 20 19 10 -80 137 -111 -40 -103 208 139 -299
4440 -299 243 -146 192 19 -94 -73 24 -7 60 120 165 -132 -37 -195 114 -110 8 -59 20 147 140 182 413 -303
4464 -303 78 28 1 32 -84 373 76 25 69 -11 138 76 -79 143 -71 -186 -52 -115 1 -202 -83 -18 -342
4487 -342 116 -17 161 -274 -207 38 40 -12 -127 -107 -59 112 -15 -47 -96 45 -108 -6 103 -1 138 -143 -203
4510 -203 212 -60 -239 -135 108 10 -41 212 -199 109 120 54 166 138 -208 119 97 -93 6 -184 187 19
$$ packed form
4345B6j05K8K3j59K3L2J01m1k71K63L8q1Q3J43m9J6L4k29K5L06j71n9J98m68J5
4370b79L29M3p1k52J66J79k64K06K6j10l8j28J69L19k92O5j87P9q3k5K98k95N0
4393i5KP4K36k36J30j09l9J56J0k01K32n94M97j10J16j69k77L63k2OJ66n4j02
4416b0n4o7K37j57J41r4k17K69J12j93n5k24J53J89jrr0K17k48P1o3L11o9m38
4440b99N42l89L38j73j13K1R7l1O7O0M5k97R5j58L09k24J18o7P9J27pM2K31p16
4464c03L81n0k7L1j16M57k97n1M4q0J49o2j55K22k14j15J34o3J16k03J19O5l24
4487c42M58j33J78m35O7K45Kn2j15K0M8J71j27l2m9J41j53J02J09j04J39k81o0
4510b03M15k72j79J04K43r8n1K53m11L08J1o6J12k8l46L27k2j90R9j90L71j68
$$ plain form
4532 19 234 -14 -30 -100 -195 43 263 13 -194 162 -196 -7 54 111 28 23 46 -134 -67 128 132 50 -65 31 79
4557 79 103 -43 -86 -37 125 -130 8 -92 213 303 -178 31 40 53 47 -267 -104 -152 207 -119 -220 27 88 121
4581 121 130 -40 -72 -192 -6 170 110 37 10 -14 95 -62 -192 43 -247 68 -109 24 117 -49 -163 -95 210
4604 210 -17 158 -209 215 109 32 170 294 167 15 -101 65 127 -14 110 19 82 37 -25 101 -31 133
4626 133 26 66 173 -15 -76 -40 216 -11 306 -65 10 -37 -32 108 65 -144 89 19 -144 -17 23 -66 68 -141
4650 -141 -15 -25 190 -56 -49 -179 -193 14 -79 -115 -354 8 -289 137 -77 -19 29 -120 65 65 -49 -54 -49 -154 -67
4675 -67 -49 6 69 -85 -171 -112 98 -184 -50 41 7 34 -159 200 209 118 -129 -108 105 78 150 211 16 -80 -224 202
4701 202 239 -142 -69 176 207 -114 -65 -160 -30 45 7 148 -133 224 128 -129 -185 111 -129 84 116 39 -173 -70
$$ packed form
4532A9K15k48j6p0r5K38K20k50k07L56l58J89O1N7q3nK3j80O7J95Mq2j15R6M8
4557G9K4j46m3M9J62k55J38j00L05R0m81K09RJ3ol14J63m8L59l26j01K47O1L3
4581A21Rj70l2j20J86J76o0p3k7k4J09j57j30K35k90L15j77J33R3j66j14O8L05
4604B10k27J75l67M24j06p7J38J24j27j52j16J66O2j41J24r1O3m5o2J26j32J64
4626A33j07M0J07j88o1L6K56k27L17l71P5m7NJ40m3k09K33p0j63J27M0q9J34k09
4650a41J26j0K15k46Pj30j4K07r3l6k39L62k97M26k14N8M8j49J85%j14nNj05Q7
4675f7J8N5O3j54q6N9K10k82J34R1l4K7j93L59Rr1k47K1K13k7P2O1j95r6j44M26
4701B02L7l81P3K45L1l21M9r5J30P5l8J41k81L57r6k57n6K96k40K13L2p7k12J03
$$ plain form
4725 -70 133 5 -43 -40 -70 -127 -142 29 139 -339 188 -85 -97 47 -140 -74 -84 -69 -155 -27 90 22 -71 39 88
4750 88 36 -124 76 -34 -27 -187 -124 -72 -151 86 -214 -79 28 -266 -98 60 -274 -62 111 -147 90 7 84
4773 84 -64 -194 -169 26 28 110 -113 -48 135 140 292 22 -161 268 8 18 213 -238 8 -10 -10 169 188 308
4797 308 39 -85 -154 -94 121 -374 81 38 -34 -159 14 70 -7 -109 -33 141 165 85 170 -297 46 66 191 -5
4821 -5 -148 -37 -120 35 134 228 -56 -67 -89 31 -77 57 -27 122 -4 64 51 -144 72 108 -141 192 -45 110
4845 110 19 147 43 -37 -242 75 -74 12 91 -65 41 21 -79 -191 -31 -7 -176 125 -79 -20 27 119 25
4868 25 105 26 197 147 -24 -37 321 223 53 -269 121 -204 40 182 -68 212 11 203 -7 -54 -215 -95
4890 -95 -83 -9 -36 -174 -110 83 125 -77 156 -191 -74 75 53 205 152 -20 142 35 36 246 -117 341 -114
$$ packed form
4725g0K03j28m8Ll0n7j5J71J10m78N27k73j2J44j87O6j0J5q6J28J17o8r3J10M9
4750H8n2j60K00j10Pj60O3N2p9K37l00J35J07k94J68J58l34K12J73k58K37q3P7
4773H4j48j30K5J95KQ2k23O5J83NJ52k70j83M29k60J0J95m51K46j8%J79J9J20
4797C08k69j24o9O0K15m95M55m3p2j25J73N6p7j02P6J74K4q0Q5m67L43K0J25j96
4821ej43J11q3J55R9R4k84j1k2J20j08J34q4J49j26O8j3j95K16L6k49L33k37J55
4845A10r1J28j04q0k05L17j49Q6P9j56J06k0j00j12J60K4j69L01k04N9M7R2r4
4868B5Q0p9J71n0j71j3L58r8j70l22L90l25K44J42k50K80k01J92k10m7j61J20
4890i5J2P4k7j38O4J93M2k02K33l47J17J49k2J52n3j72J62j07JK10l63M58m55
$$ plain form
4913 -114 9 -41 224 86 98 151 35 108 -66 3 -11 -54 -167 76 -124 47 -136 -81 111 19 -182 -30 38
4936 38 -127 18 -304 -53 -68 -54 125 198 -77 -97 -130 -18 -28 1 1 -20 -75 -101 -82 -10 -164 5 -304 223 -324
4961 -324 -26 84 -199 258 226 -110 132 2 -23 -19 0 -150 -126 174 14 -89 -31 -67 -137 -147 -80 -207 -241 -4
4985 -4 -66 73 -191 -145 68 17 -82 10 358 136 -231 11 91 -123 -108 -76 49 15 -219 -202 -12 478 -92 -301
5009 -301 177 -171 -85 48 158 -31 94 -240 -207 -197 -162 6 8 65 242 -162 6 -45 177 87 80 -69 -73 -26 -31
5034 -31 -68 -57 -46 -82 -250 125 180 -134 -41 115 -31 -123 -142 109 -161 269 -17 -30 -4 -47 -34 -3 128 -95 -50
5059 -50 -184 -137 73 -44 158 274 28 -23 -146 10 22 108 -5 -116 52 -163 3 -76 5 -61 -63 33 -25 91
5083 91 82 -106 -171 67 34 33 71 212 -13 -213 60 149 -45 86 343 -35 15 -13 214 -288 -229 195 162 43
$$ packed form
4913a14J23n0K65j38J2N3j16P3j74O9j4m3j13K43k00J71j83N5J92r2k01J52O8
4936C8j65J45l22K51j5J4J79P3k75k0l3J12j0K9%k1n5k6J9P2j54J69l09N27n47
4961c24K98J10k83M57l2l36K42j30k5MJ9j50K4L00j60j03N8l6p0j0O7j27l4K37
4985do2J39k64M6K13n1r9R2L48k22l67K42Q0k14J5L2J25l4k34J7J90M90n70k09
5009c01M78l48Q6J33J10j89J25l34L3J0L5J68KN7J77m04J68n1K22r0pj49mM7n
5034c1l7J1J1l6j68L75N5l14R3J56j46r2j9K51k70M30k86j3K6m3J3L1J31k23M5
5059e0j34M7K10j17K02J16k46n1j23J56J2Q6j13j11J68k15J66p9Q1o6kR6n8J16
5083I1rj88o5K38l3jL8J41k25k00K73Q9j94J31K57l78N0k8K27n02N9M24l3j19
$$ plain form
5107 43 -10 204 212 -16 -211 -226 129 -131 -15 158 39 -71 -132 -257 86 -30 84 79 -126 137 -63 63 130
5130 130 -184 -43 -84 -65 -182 -180 85 -491 -102 -45 49 142 -131 170 15 -101 -25 -68 123 83 232 34 -19 -145
5154 -145 -12 -48 -8 68 71 -198 -194 -123 287 -96 -77 -9 -96 219 46 0 -56 61 -120 -5 -90 -167 102 10 -123
5179 -123 70 -66 -29 60 193 201 197 -137 -9 -404 37 -17 -214 107 -102 112 -5 17 -76 103 64 -82 29
5202 29 8 54 -112 50 -62 8 -209 353 59 -73 -36 -99 -126 198 -87 -76 16 -45 -25 93 -18 132 -12 171
5226 171 136 164 55 238 129 -65 425 308 -171 136 -73 73 -151 -42 -264 -145 -58 -65 120 -180 -73 -178
5248 -178 265 149 212 60 284 -113 -39 -116 288 8 -63 -47 -166 -132 216 -137 23 152 89 -66 -26 -177 -6
5271 -6 -321 65 -220 46 59 33 9 75 124 -178 -137 184 -28 -1 -82 12 -89 -19 -102 140 55 -55 -184 54 -72
$$ packed form
5107D3n3K14Qk28j95j5L55k60J16J73j19j10o1j25L43j16J14nk05K63k00J26O7
5130A30l14J41m1J9j17KK65n76L89N7R4R3k73L01j55j16P6m3J91m0J49j98n3j26
5154a45J33l6M0P6Lk69MP1M10l83J9O8q7L15j73m6n6J17j81J15q5p7K69r2j33
5179a23J93j36L7Q9J33Qml34J28l95M41n4j97L21k09K14j17K2r3J79l9j46J11
5202B9k1M6j66J62j12P0k17N62k94j32L7o3k7L24k85J1R2o1K0J18j11J50j44J83
5226A71l5K8j09J83j09j94M90j17m79L07k09J46k24J09k22J19Q7pJ85l00J07j05
5248a78M43j16O3j52K24l97P4p7M04k80p1J6j19L4L48l53J60J29o3j55M0j51J71
5271fl15L86k85K66J3k6k4O6M9l02M1L21k12K7q1R4j01P0q3K42q5j10j29K38j26
$$ plain form
5296 -72 128 88 -103 -237 -165 110 287 260 -21 -23 242 -155 -70 -85 -45 127 -16 77 -110 194 354 239 -124
5319 -124 -144 -103 -77 -284 90 -237 39 102 -40 10 -232 -238 -207 -420 -193 -13 314 29 77 -71 35 -212 -96
5342 -96 120 -293 33 -12 196 214 101 -16 -25 -152 -26 -27 36 -6 316 89 -26 22 -103 47 -172 -24 -81 -130
5366 -130 -140 7 -99 -116 -87 249 -207 -148 83 21 150 138 -106 12 74 -129 -153 -53 -69 -8 -40 -124 240 -134
5390 -134 -178 24 -18 -48 26 206 -21 19 70 -94 128 -2 166 133 82 -131 97 113 -206 106 185 74 -11 130
5414 130 -50 216 -193 -158 33 -63 273 12 117 91 -139 -118 -62 -45 268 -20 -104 -85 -110 -69 14 -332 83 408
5438 408 89 197 -143 -33 30 -51 232 242 71 89 -111 216 180 12 190 31 40 -200 12 12 4 26 -178 56
5462 56 -68 -18 -58 214 163 31 228 -54 36 -70 116 8 136 159 430 85 95 62 149 -116 -10 45 5 79
$$ packed form
5296g2K00m0j91j34P2K75J77k7k81kK65l97Q5j5M0J72j43R3j87L04J60j15l63
5319a24k0M1K6k07L74l27K76O3j42N0k42oL1k13K27J80L27k85M8j48J06k47J16
5342i6K16m13L26m5K08J8j13j17rj27J26jO3m2L22k27j15M8j25J50k19J48n7m9
5366a30j0J47j06j7K9L36m56N9K31o2J29j2k44J18O2k03k4J00j6O1l2q4L64l74
5390a34m4K02m2l0P4J80k27M0N1j64K22j30J68l3n1k13K28J6l19L12P9j11q5J41
5414A30j80K66m09L5J91r6L36k61J05k6k30K1N6J7L13k88q4J9k5M1Q3l46M15L25
5438D08l19J08l40J10O3q1K83J0j71J8k00L27l6j68J78j59Rk40K12%qK2k04K34
5462E6j24N0m0K72n1j32J97k82R0j06J86j08J28K3K71l45J0l3Q7k65J06N5m0P4
$$ plain form
5486 79 7 109 -317 -109 15 -89 -41 19 -250 -117 -120 85 149 -53 -314 20 37 10 -37 175 -416 15 -28 -75
5510 -75 -41 -68 -17 62 34 105 -5 -204 -13 -158 59 97 -166 120 -30 -50 -89 -31 8 164 -232 -151 -123 -63 -4
5535 -4 138 -174 17 -173 -64 266 6 -73 -13 122 3 -9 7 29 14 -196 -173 -27 169 112 -5 -177 -72
5558 -72 73 -103 171 154 19 169 -93 -82 6 138 -50 -127 104 -210 18 -20 -24 238 13 -129 163 45 -115
5581 -115 39 -178 -260 -51 46 -104 36 -147 15 109 -156 -65 21 65 -178 282 0 123 172 6 53 -24 -17 60
5605 60 97 -132 -189 -49 -61 -62 -44 11 91 67 -93 133 167 -49 -189 203 62 -83 -48 -109 43 60 145 20 -6
5630 -6 129 -3 -47 -151 -112 -52 -35 5 67 -12 13 41 -121 -10 61 179 -245 -44 129 113 13 103 54 47 -17 143
5656 143 99 -19 209 -35 -182 75 201 -28 36 -76 -32 323 -207 -120 -145 -31 154 -88 87 -26 162 38
$$ packed form
5486G9p2J02m26K08J24j04M8O0k69J33lK05O4k02k61L34J7k7m7K12n91M31m3m7
5510g5L4k7N1P9k8P1j10j99J91j45K17L8k63K86j50k0l9N8L9J56l96Q1K8O0N9
5535dJ42l12J91j90J09L30k60p9O0J35j19j2J6K2j5k10K3J46J96n7j17j72J05
5558g2J45j76K74j7j35J50k62J1Q8J32j88p7K31l14K28l8mK62k25j42K92j18j60
5581a15J54k17q2K09R7j50J40j83J62R4k65R1Q6M4k43M60k82J23M9j66M7p7PP7
5605F0L7k29n7J40j2jJ8N5Q0k4j60K26L4k16j40L92j41j45L5o1J52J7Q5j25k6
5630fJ35j32m4j04L9O0J7M0O2p9K5K8j62J11P1J18m24K01J73j6j00R0m9po4J60
5656A43m4j18K28k44j47K57J26k29O4j12M4L55n30Q7k5J14J85k42J75j13J88j24
$$ plain form
5678 38 190 -49 -253 -31 -102 -30 -118 228 196 221 -27 16 85 28 -72 172 -155 11 16 -205 0 -158 72 112
5702 112 77 61 -200 77 -107 -64 56 -51 -35 -177 -28 151 -82 185 63 -103 13 214 -114 -240 -103
5723 -103 0 -70 -56 249 37 -109 210 28 40 90 -186 108 7 -46 64 -268 -194 -164 80 179 -83 -143 -297
5746 -297 121 4 -220 -223 -19 129 103 -51 -73 157 18 24 -43 50 3 76 43 -37 -154 126 -105 139 -52 55
5770 55 74 167 -4 -151 -76 29 -25 -47 44 -167 -233 49 -109 67 121 -317 -334 104 19 75 173 -176 19 90 224
5795 224 -18 -7 55 -187 2 21 180 -118 92 51 263 -206 134 -21 18 -11 -298 79 27 -204 10 -20 369
5818 369 19 67 -94 91 213 -68 116 -107 -47 -165 -141 -195 45 86 -122 1 -301 133 -241 34 -78 1
5840 1 -3 54 -175 -2 -35 34 162 -61 -60 47 34 -97 58 -96 40 -122 153 71 -201 268 -131 -214 -41 7
$$ packed form
5678C8J52k39k04K22p1P2q8L46l2K5k48M3O9n7j00K44l27J66Nk21K05j58K30M0
5702A12l5j6k61K77j84M3J20j07J6j42J49J79k33K67j22j66J16K01l28j26J37
5723a03J03p0J4L05k12j46L19j82J2N0k76K94j01n3J10l32P4L0K44R9k62o0j54
5746b97M18j17k24lK04J48k6j54k2K30j39Oo7R3m7P3l3q0j17K80k31K44j91J07
5770E5J9R3j71j47P5J05n4k2R1k11o6K82j58J76N4m38j7M38q5N6R8l49J95P1J34
5795B24k42J1O2k42J89J9J59k98K10m1K12m69L40j55L9k9k87L77n2k31K14l0L89
5818C69l50M8j61J85J22k81J84k23O0j18K4n4K40M1k08J23l02M34l74K75j12P9
5840AmN7k29J73l3O9J28k23JJ07j3j31J55j54J36j62K75q2k72M69l99q3J73M8
$$ plain form
5864 7 -41 34 -135 -150 -6 -165 -127 -44 -30 -152 160 25 -112 -169 -31 123 65 -49 -104 133 -28 -28 165 223 -134
5889 -134 -81 -180 -20 19 -40 -9 -195 -259 134 113 79 74 126 -102 48 -60 19 -41 -116 -101 -49 -42 188 -239 16 -16
5915 -16 51 129 6 -30 -325 269 178 -11 23 7 30 197 -82 -43 -257 -18 -182 186 -150 -108 5 144 71 -155
5939 -155 30 -218 -124 97 -14 81 -275 -265 -70 155 -201 -38 -233 -85 -28 190 -42 14 -237 159 -206 -121
5961 -121 216 -52 -3 49 193 -204 251 14 9 -58 -103 3 20 -102 -64 -23 30 -142 0 -35 73 65 212 -131
5985 -131 11 171 81 18 44 -138 -51 -282 -1 -297 -76 95 -39 116 -2 -50 70 172 -3 -146 74 34
6007 34 32 176 -105 141 -34 -28 -18 -81 -83 8 3 3 -44 -56 22 75 174 66 -93 115 -90 84 -97 -129 -155 -5 -66
6034 -66 3 68 122 -68 95 31 -33 -63 167 -87 -36 204 319 -1 -106 35 -29 -75 135 -164 2 -6 -160 177
$$ packed form
5864Gm8P5j69j5J44j59L8Q3J4j22L12j35j37n7J38J54n8j14n5K37j61%J93N8l57
5889a34N3r9J60L9n9L1j86o4L93k1l4nN2k28J50j08P9o0p5J5N2PK30m27K55l2
5915a6O7P8j23l6k95N94r1j89L4j6K3J67k79L9k14K39j64L68l36M2J13J39p3k26
5939a55J85k48R4K21j11R5l56J0J95K25l56J63j95J48N7K18k32N6k51L96l65Q5
5961a21L37k68M9N2J44l97M55k37no7m5J06J7j22L8M1N3j72J42l5J08qJ47l43
5985a31J42J60r0o3K6j82Q7k31K81k96K21J71j34J55j18m8J20J02j75j43K20m0
6007C4kJ44k81K46j75OJ0o3kR1n%m7j2P8N3R9j08j59K08k05J74j81l2k6J50o1
6034f6O9O5N4j90J63o4o4l0K30k54N1K40J15l20j05J41o4m6K10k99J66qj54L37
$$ plain form
6058 177 -45 83 -212 -44 -91 -93 -36 74 -51 113 -113 1 59 -1 25 135 49 4 -198 75 43 37 31 210 -283
6083 -283 -177 27 -28 160 -59 -80 -109 -38 76 324 -183 -81 114 106 -137 187 201 74 -43 70 -133 23
6105 23 241 123 -141 -140 -126 -82 135 -182 -49 49 1 139 1 141 20 -135 -52 -93 -203 -47 -122 19 -91
6128 -91 72 -177 199 101 25 85 21 118 101 9 2 -116 -190 -271 -47 -42 -1 -63 76 183 139 39 -38 -68 -94 -21 148
6155 148 -2 38 -208 382 223 -196 25 44 7 130 65 30 92 -26 43 144 275 104 -63 -87 -45 35 248
6178 248 234 104 14 -85 -11 144 111 48 50 99 -337 -36 -75 -111 -147 -212 -137 -64 152 -54 212 -287 222 -3 -117
6203 -117 -146 -122 -161 -300 -21 0 -220 168 101 4 -28 152 66 -152 90 -189 92 -146 114 32 29 -179 -111 -13
6227 -13 281 70 129 -99 -146 -258 45 1 2 78 -11 -14 96 7 -1 63 -212 151 -242 30 26 -7 -238 2 -73 310
$$ packed form
6058A77k22J28k95J68m7kN7J10j25J64k26J14N8o0K6J10q6m5k02K73l2ooJ79m93
6083b83J06K04n5J88k19k1k9P1J14K48n07J02J95qk43L24J4j27j17J13k03J56
6105B3K18j18k64JJ4M4K17l17J33R8m8J38j38J40j21j55Q3m1j10J56p5J41j10
6128i1J63k49L76r8p6O0o4R7j7r2pj18p4q1K24NM1o2J39J07m4j00p7l0k6P3J69
6155A48j50M0k46N90j59m19K21J9l7J23o5l5O2j18O9J01J31j71j67k4M2Q0K13
6178B48j4j30r0r9P4J55l3o3KM9m36L01l9l6l6o5P5P3K16k06K66m99N09k25j14
6203a17k9K4l9j39K79K1k20L88o7r7l2J80q6k18K42k79K81k38K60q2lk08O8R8
6227a3K94k11N9k28m7j12L03m4JP6q9lJ10q9qO4k75L63l93K72ml3k31K40p5L83
$$ plain form
6253 310 61 70 -106 -46 86 -184 8 106 84 -133 146 99 0 147 63 102 -126 179 315 -131 -27 119 89
6276 89 -158 262 28 18 -236 -28 -46 79 146 72 -183 -43 -78 -71 204 -142 -42 -77 15 -80 -122 51 -114 38
6300 38 -24 -261 -92 -39 122 28 23 191 -56 -150 -116 89 108 7 111 134 201 -69 70 93 -340 41 73 -37
6324 -37 -57 -41 59 28 31 -126 -204 -99 -180 -190 -130 -47 -111 -27 189 54 -39 -19 157 48 17 9 66 33 337 -97 196
6351 196 -20 -16 24 -20 -28 -19 -37 -242 -35 -14 -53 -180 -28 -160 -86 -240 -24 11 43 71 32 248 47 20 85 36
6377 36 -1 -88 117 -38 -113 -51 -92 -129 -49 121 -287 89 -78 -190 -52 -168 -198 20 -86 264 -138 160 -98
6400 -98 143 136 62 6 -162 99 -5 -7 150 -59 -65 95 -98 61 -68 -24 41 -74 0 29 34 105 79 -245 -113 -210
6426 -210 244 -1 -237 -67 39 503 251 63 -226 152 43 -12 -257 -152 142 -23 140 -130 -130 109 81
$$ packed form
6253C10k49Rj76O0J32k70J92R8k2k17K79m7r9J47q4L9k28L05J36m46J04J46l0
6276H9k47M20k34j0k54K08j8J25O7p4k55J40l5PK75l46J00l5R2r5m2J73j65J52
6300C8o2k37J69N3J61r4nJ68k47r4L4K05J9j01J04K3O7k70J39K3m33L81L2j10
6324c7k0J6J00l1Lj57p8J05q1j0O0Q3o4Q4K16j35r3K0J76j09l1qN7l3L04m34K93
6351A96k16MM0m4qRj8k05K07K1l9j27J52j32P4j54K16L5L2K8l9K16k01k7O5m9
6377C6l7q7K05j55p5O2m1l7Q0J70m08L76j67j12J38j16l0K18j06L50m02K98k58
6400i8K41pp4n6j68K61j04kJ57k09oJ60j93J59j29M4O5j15P4K9NP1k6l24J32r7
6426b10M54k45k36J70J06M64k52j88k89L78j09n5k45J05K94j65J63k70%K39k8
$$ plain form
6447 81 -208 -91 4 -63 -174 -76 57 -156 -6 -101 -66 75 -112 -53 -43 200 -40 167 -129 37 -14 -54 -33 -65
6471 -65 41 62 -37 -297 191 49 137 -51 -134 -165 -20 163 -59 -41 -107 42 92 115 -13 -79 -34 -17 -73 -64 -50 -54
6497 -54 -231 180 -72 -55 -178 26 -68 -120 -26 19 -67 85 -195 91 166 166 199 95 -117 29 79 -215 125 69
6521 69 -140 -234 63 -22 126 -43 85 38 -56 166 16 182 45 111 26 -14 73 225 92 10 254 133 -127
6544 -127 136 66 41 -378 27 52 23 -59 -6 -108 148 -63 -2 85 61 112 190 24 -203 163 17 111 -100 -67
6568 -67 -161 -230 -120 -27 133 132 26 72 17 -174 -285 -192 -154 -273 190 -75 187 42 140 -11 111 -56 -81 -79 66
6593 66 47 -21 -87 154 -115 131 -84 -240 28 96 -220 -51 127 39 177 134 -69 -26 -33 -57 63 -190 3 97
6617 97 29 -91 -45 -192 243 -154 -132 -54 75 -18 133 -51 36 14 -117 4 -60 208 111 88 -107 -62 -91 60
$$ packed form
6447H1k89J17R5o7j11R8J33k13J50r5L5J41j87N9J0K43k40K07k96J66n1m0K1l2
6471f5J06K1r9k60M88j42Q8j88q3l1J45J83k22J8o6J49N0K3j28o6M5J7n6RJ4m
6497e4j77M11k52J7j23K04r4n2R4M5q6J52k80K86P5%L3j04k12J46N0k94L40n6
6521F9k09r4K97q5J48j69J28m7r4K22j50J66j37O6q5m0Q7J52j33q2K44j21k60
6544a27K63p0k5m19M05K5k9q2N3j02K56k11O1Q7k4N1P8j66k27L66j46R4k11L3
6568f7r4o9J10R3J60jj06M6n5j91j11R3L8j19M63k65K62j45R8j51J22j67k5KJ45
6593F6j9o8o6K41k69K46k15j56K68O8l16J69J78q8J38m3k03M3pk4J20k53J93R4
6617I7o8j20M6j47M35l97K2P8J29r3J51j84Q7k2j31J21o4K68r7k3j95M5k9J51
$$ plain form
6641 60 -6 46 91 227 79 68 -127 -97 -147 142 42 -40 235 27 -131 -93 77 24 26 335 -194 -117 -21 -67 76
6666 76 -271 258 -196 192 15 133 91 73 11 -89 -50 71 -31 -35 -93 -8 -11 -87 197 -67 -158 125 87 34 0
6691 0 89 -69 100 -170 -68 40 -104 26 58 83 -99 -5 255 -22 108 104 -118 -304 68 3 -99 75 92
6714 92 19 63 -30 -64 -164 97 -51 58 -57 147 -104 -20 60 -165 139 170 58 63 -33 -29 100 162 -64 425 87
6739 87 140 -94 487 13 -277 126 59 245 -104 10 81 95 -4 98 -56 -34 32 -139 -168 0 -50 47 97 -46
6763 -46 -5 20 -136 272 150 285 -101 -83 -125 80 -69 -203 123 109 34 216 35 -119 -22 29 -107 -114 -17 -67
6787 -67 84 -56 129 179 -186 211 -56 -49 -80 -116 69 227 -74 42 -124 -256 -85 -184 -75 -80 -278 -195 132
6810 132 5 -48 33 -68 160 55 -105 -272 177 101 -74 -10 114 25 71 32 132 -41 24 -99 3 77 -104
$$ packed form
6641F0o6N2M5J36j48j1j95L0n0K89j00q2K75k08j58L8J70n3KL09n29P7R6m6J43
6666G6l47N29m54L88j77J18m2j8o2j00L9J21j02mn8Q5lp6K84k64r1K83l8n3l4
6691@Q9j58J69k70J02J08j44J30L2K5j82R4K60k77J30mk22j86L72o5j02J74J7
6714I2p3M4r3l4j00K61j48J09j15K04k51Q4Q0k25L04L1j12Nr6MJ29O2k26M89l38
6739H7N3k34N81m74k90M03o7J86l49J14P1J4r9J02j54K2O6j71k9J68n0R7N0j43
6763d6M1K5j56M08j22J35l86J8m2K05j49j34L26j4p5J82j81j54R7N1j36pR7n0
6787f7J51j40J85N0l65L97k67Pl1l6J85J58l01J16j66j32J71r9J09nj98Q3L27
6810A32j27n3Q1j01K28j05j60j67M49p6j75O4J24q9M6l9J00j73O5j23J02P4j81
$$ plain form
6833 -104 150 -214 -127 -68 -319 -163 46 41 30 -70 201 178 -143 92 -59 57 87 109 -313 -157 190 73 -213
6856 -213 -148 60 -303 -69 110 -145 -89 -4 100 24 112 137 48 -228 -48 107 -175 44 -42 56 35 -61 -33 -226
6880 -226 196 -26 41 -59 -44 76 -8 199 21 29 43 -165 -101 91 110 -53 -109 33 64 -106 156 -63 -10 -29
6904 -29 17 85 6 31 -16 132 221 209 44 -62 -227 -151 190 -57 -196 282 -235 27 -142 -17 127 127 77 106
6928 106 90 -15 82 6 64 -135 15 -82 115 -28 -125 -117 -16 45 -77 -74 55 82 -177 -85 42 7 0 96 -62 -116
6954 -116 25 -9 0 -168 -65 42 -50 224 -140 -44 46 112 63 177 -70 223 -267 228 -57 -11 -39 229 17
6977 17 -136 121 -43 -76 16 -14 -194 77 67 247 19 114 199 31 -22 115 -114 -115 184 -132 48 249 -178
7000 -178 -3 19 -5 -93 100 -33 -54 -28 82 25 44 76 -48 0 -39 -146 37 20 114 -45 -69 -51 131 -2 312
$$ packed form
6833a04K54l64Q7N9k51J56K09nj1j00K71k3l21K35j51J16L0K2m22J56L47j17k86
6856b13O5K08l63K34J79k55N6Q5J04p6Q8K5q9k76J80J55k82K19q6R8k1r6K8j93
6880b26M22k22O7j00J5J20q4K07j78QJ4k08O4J92J9j63n6J42L1j70K62k19N3j9
6904b9M6O8p9K5m7J48Q9j2j65j06j65P6L41k47j39M78n17K62j69J25J44%n0K9
6928A06j6j05R7p6N8j99J50r7J97j43r7QJ01O1j22LJ29K7k59R2J27l5pR6j58n4
6954a16J41l4Rj68J03J07r2K74l64R6R0O6m9J14k47K93m90M95k85M6k8K68k12
6977A7j53K57j64l3R2l0j80K71j0J80k28R5Q5j68n3J37k29jK99l16J80K01m27
7000a78J75K2k4q8J93j33k1K6J10n7J9L2j24M8l9j07J83j7R4j59k4J8J82j33L14
$$ plain form
7025 312 83 157 -224 27 47 89 280 38 194 -36 45 -77 -153 84 -1 -279 -9 52 126 90 -49 61 -79
7048 -79 -53 -215 162 186 174 -94 -182 236 -9 144 19 79 -61 28 -158 94 -220 -1 -32 75 -134 52 -13
7071 -13 -73 70 -33 287 134 -201 -81 0 191 -210 18 -48 -22 258 62 -49 -93 72 15 162 -185 -20
7093 -20 -42 -121 285 61 -122 156 191 43 -50 -23 76 116 112 29 -68 135 142 -102 -381 74 231 -28 -17 -211 -73
7118 -73 -93 -57 229 -176 -124 -202 138 -62 182 -43 -81 -37 169 -9 -1 -11 -66 -80 68 -209 33 -138 38 -41
7142 -41 -66 -72 197 2 239 -122 147 53 -314 253 -121 16 93 -107 -264 90 -84 21 -118 -198 -203 71 -23
7165 -23 6 52 84 169 -88 5 190 -278 70 -1 80 81 -92 26 224 234 -58 -169 -74 -17 -184 149 -170 62
7189 62 272 44 128 94 168 106 -260 -138 10 -103 176 212 122 146 -103 -295 -9 48 -103 -60 -204 -75 -113 -2
$$ packed form
7025C12k29P4l81K51K0M2J91k42J56k30Q1j22p6K37q5k78K70O1P4l6j39J10j40
7048g9K6j62L77K4j2k68q8M18k45J53j25O0j40Q9j86K52l14K19l1J07k09J86o5
7071a3o0J43j03L20j53l35J20Q1J91m01K28o6K6K80j96j11m4J65n7J47l47J65
7093b0k2p9M06k24j83K78L5j48r3K7R9M0mq3r7K03Pk44k79M55J57k59J1j94J38
7118g3k0L6K86m05N2p8L40k00K44k25l8M4K06j78Qj0n5j4J48k77K42j71J76p9
7142d1k5oK69j95K37l61K69r4l67N67l74J37P7k00j57L54j74J05j39q0nK74r4
7165b3K9M6L2Q5k57R3J85m68L48p1Q1Jj73J18J98J0k92j11R5N7j67L33l19K32
7189F2K10k28Q4l4P4o2l66J22J48j13K79L6r0K4k49j92K86N7j51M3j44J29l8J11
$$ plain form
7213 -2 235 5 -126 58 -188 -58 112 134 -26 -104 -96 -183 -85 -61 -235 9 74 -191 -188 -57 41 -119 -57 -80 49
7238 49 -158 137 92 -80 -35 -73 85 67 -17 -145 170 -47 46 -72 357 24 243 -40 -153 -85 -86 30 -126
7261 -126 -20 -127 93 -12 -128 80 103 238 -162 6 79 -53 -80 -127 137 67 -95 -187 159 124 139 -72 111
7284 111 140 -67 -13 -123 93 67 -157 39 -118 6 98 -90 -1 -178 -37 -188 45 -106 -145 -32 11 -2 -212
7307 -212 28 58 -44 102 123 -209 -280 -87 -118 176 -104 -112 -185 -44 65 326 30 -147 -17 -44 -114 -144 -229 -107
7331 -107 -9 -44 -122 99 -49 -120 -83 41 -23 -6 139 -121 357 118 168 -37 19 70 27 5 -46 -184 275 -122
7355 -122 -25 64 -6 -171 -126 190 65 105 229 -12 -128 71 20 -29 4 33 10 59 -118 20 66 -164 118 -314
7379 -314 102 -9 -168 62 230 47 -171 187 -79 133 -109 -77 -200 95 26 -104 114 32 -13 -47 37 139
$$ packed form
7213bK37k30j31J84k46J30J70K2j60p8Qq7R8K4j74K44O5k65LJ31R8j60O2k3J29
7238D9k07K95m5j72M5l8J58j8q4j28L15k17R3j18M29l33K19k83j13O8jJ16j56
7261a26J06j07K20j05j16K08K3J35m00J68P3j32k7m7K64p0j62r2L46l5J5k11J83
7284A11K9k07N4j10K16k6k24J96j57J24R2j88Q9j77J41j51K33j51l9J13M3j3k10
7307b12K40L0j02J46K1l32p1J93l1K94k80qp3J41J09K61k96j77J30k7p0l0q5J22
7331a07R8l5p8K21j48p1L7J24o4J7J45k60M78k39N0k05N6N1m3k2n1j38M59l97
7355a22R7Q9p0j65M5L16j25M0J24k41j16J99n1m9L3K9k3M9j77J38M6k30K82m32
7379c14M16j11j59K30J68j83k18L58k66K12k42L2j23K95o9j30K18q2m5l4Q4J02
$$ plain form
7401 139 -186 79 -120 -135 -250 -47 -46 -104 187 47 104 133 -40 -222 -109 -25 -35 99 -25 13 -143 -223 -314 -162
7425 -162 -118 68 -25 -228 78 -135 382 -110 -27 219 -70 -34 3 -118 -36 140 -114 142 47 272 84 146 164
7448 164 3 11 10 -79 187 47 21 -58 -65 -7 -157 18 119 -115 -53 -154 -97 -309 -92 73 144 83 -285 10 -87
7473 -87 13 36 73 -24 -86 143 -183 58 374 -83 15 -152 -10 182 -25 59 40 43 17 -94 14 -81 -228 145
7497 145 162 -10 177 -220 7 -51 3 140 -161 98 120 110 -27 -184 -21 93 -102 -26 162 -196 -66 16
7519 16 99 64 148 48 220 -96 -27 27 -21 86 -112 83 12 199 -385 42 41 82 -101 -162 130 -96 -170 72
7543 72 142 173 103 115 4 248 -22 78 -343 28 283 -212 90 -30 149 -63 -230 34 153 36 87 -40
7565 -40 54 86 -260 30 135 41 -82 -149 -10 40 -14 -86 -131 -103 6 22 -232 -13 -101 64 170 53 -59 258
$$ packed form
7401A39l25K65j99j5j15K03Jn8K91j40N7K9j73j82J13Q4j0J34j24L8j56q0r1J52
7425a62M4J86r3k03L06k13N17m92Q3K46k89L6L7j21Q2J76k54K56r5K25j88O2J8
7448A64j61Qjq9K66j40k6p9pN8j50J75J01k34O2j01N7k12K17J65P1o1l68K95r7
7473h7J00K3L7r7o2K29l26K41L16m57R8j67J42J92k07Q4j9Lk6j11J08r5j47L73
7497A45J7j72J87l97K27n8N4J37l01K59K2j0j37j57J63J14j95P6J88l58J30Q2
7519A6Q3l5Q4j00J72l16O9N4m8J07j98J95p1J87n84M27jM1j83o1K92k26p4K42
7543G2P0L1p0J2j11K44k70J00m21L71K55m95L02j20J79k12j67K64J19j17N1j27
7565d0R4L2l46K90J05r4j23o7J39N0n4p2m5K8J09J6k54K19q8J65J06j17j12L17
$$ plain form
7589 258 -36 203 58 -123 -7 -26 -22 102 42 84 -14 -3 -155 -105 119 -135 -46 103 -85 45 -33 21 -126 -166
7613 -166 -10 -96 -164 -100 147 -55 34 -104 -194 -14 167 -28 112 169 117 109 -81 -126 -118 92 -127 214 198 19
7637 19 -7 117 28 -49 119 94 9 -177 -124 -259 -23 -50 92 -119 -97 122 158 -125 -194 -103 61 6 19 69 -61
7662 -61 -38 25 -44 -35 -177 -3 79 -13 65 54 -17 -92 -34 -50 -178 -86 -160 -70 -166 45 -109 -272 0 -143 -110 49
7688 49 118 -175 -48 -90 239 -14 361 205 14 86 80 22 80 243 -59 23 45 166 -27 -48 -70 -89 69 -112
7712 -112 -212 -267 236 46 -46 231 -145 31 -175 -149 -83 27 -178 -166 -249 -54 -30 -60 -63 -57 3 10 144 -89 104
7737 104 231 -62 -39 -126 120 117 -110 30 104 -29 148 57 48 -213 189 137 71 148 -87 151 238 -73 204 -183
7761 -183 -210 128 266 -194 -62 50 -59 -115 -135 79 -60 248 -149 -10 -62 -214 28 -140 82 19 -49 59
$$ packed form
7589B58k94K39j45j81J16j9MJ24o0M2r8J1j52N0K24k54Q9J49j88J30p8N4j47m0
7613a66J56q6o8O4K47k02Q9j38r0J80J81j95J40N7n2qj90m5QK10k19L41j6j79
7637A9k6J24q9p7J68k5q5j86N3j35K36k7J42k11K2K19L6k83o9R1J64n5J3N0j30
7662f1K3O3o9Rj42J74Q2r2P8j1p1p5N8j6j28R2p4R0r6K11j54j63K72j43L3J59
7688D9O9k93J27m2L29k53L75j56j91P2on8N8J63l02Q2K2J21j93k1k2j9J58j81
7712a12j00n5N03j90r2K77l76J76k06K6O6J10k05J2q3J95K4l0lOO0PJ34k33J93
7737A04J27k93K3q7K46lk27J40P4j33J77r1rk61M02n2o6P7k35K38Q7l11K77l87
7761a83k7L38J38m60J32J12j09n6k0K14j39L08l97J39n2j52K42j68K22o3o8J08
$$ plain form
7783 59 -13 1 -144 -208 95 -22 -260 163 -40 -9 -235 95 13 -200 23 -112 -104 29 90 80 39 -61 36 90
7807 90 -166 35 43 -98 186 -62 30 -169 363 -85 -17 -56 -49 -110 149 76 -177 65 -104 -25 37 187 10 -71
7831 -71 -185 232 123 153 94 21 -32 123 222 -110 36 52 -138 217 70 -175 -172 163 62 110 141 295 -93 -130
7855 -130 -121 166 85 -56 185 49 44 -458 -241 99 -152 -92 -37 -148 -190 117 113 23 59 42 165 -113 68 -43
7879 -43 -24 8 123 -76 -125 171 -163 -8 217 -10 -27 31 -122 113 100 -85 -163 -69 76 -39 92 -224 20
7902 20 120 58 -101 -152 -152 -14 -21 52 104 120 16 190 -60 56 -223 13 44 -16 18 298 -83 76 -190 -11
7926 -11 -180 9 162 -130 -14 170 -36 -245 28 -68 -62 71 90 -55 35 -42 -51 270 81 259 -48 -69 40
7949 40 -81 202 124 -56 21 71 155 94 0 -192 -64 -122 -137 -118 241 14 34 -209 0 -149 78 30 -61 -26 -25
$$ packed form
7783E9p2J4j45o4L03j17k38M23k03L1k26L30q2k13K23j35QJ33O1j0m1j00R7N4
7807I0k56K01Qj41K84k48R2j99N32m48O8l9Po1K59p3k53K42j69P9O2J50j77q1
7831g1j14M17j09L0n9p3n3J55R9l32J46J6j90L55j47k45LL35j01M8L1J54l88l7
7855a30RK87q1j41K41j36nn02K17L40k51O0N5j11m2L07mr0L6j7J23k78J81j11
7879d3J9L2J15j99m9K96l34J55K25k27j7N8j53K35j3j85p8R4J45j15J31l16K44
7902B0J00o2j59n1%J38pP3N2J6j04J74k50J16k79K36L1o0L4K80l81J59k66J79
7926a1j69J89J53k92J16J84k06k09K73r6OJ33J9j45R0p7rL21j89J78l07k1J09
7949D0j21K83p8j80P7N0Q4o1r4j92J28n8j5J9L59k27K0k43K09j49K27m8r1L5J
$$ plain form
7974 -25 -63 81 80 -145 -51 225 -109 116 -188 126 7 15 171 -147 22 -127 -99 -226 -84 -173 9 -14 212
7997 212 104 69 216 -110 -33 158 -310 0 130 142 -34 171 -84 -111 -112 -82 -29 7 227 115 -25 156 45
8020 45 -200 180 117 -246 105 93 -75 83 67 28 -288 7 8 7 -48 141 -100 -153 82 -8 -11 125 37 214 97
8045 97 -265 114 -80 -42 119 314 132 -122 99 149 69 70 2 -65 153 31 329 105 37 150 279 78 -48
8068 -48 -156 -18 -122 -16 157 88 120 309 11 -115 -82 -23 -57 115 -88 -21 -28 -214 -293 183 179 9 -58 -142 -93
8093 -93 -291 -44 -215 342 -155 117 244 -41 36 -47 -285 -114 66 235 -24 56 -43 331 138 7 144 -220
8115 -220 197 63 -1 -140 -143 -28 -14 -114 -182 -311 -9 130 153 -47 -216 104 -131 -263 -37 36 157 19
8137 19 -256 145 -83 264 -14 -82 137 59 152 -97 -57 90 39 -33 96 -243 8 -171 85 -77 -144 -98 -138
$$ packed form
7974b5l8J44jk25R4K76l34K25l04L14j19QJ56l18J69j49K8j27J42q9J82k3K26
7997B12j08l5J47l26P7J91m68L10J30J2j76K05k55k7jL0N3L6K20j12j40J81j11
8020D5k45L80o3l63L51j2j68J58j6l9l16K95Jjn5J89k41n3K35r0lJ36q8J77j17
8045I7l62L79j94L8J61J95j82k54K21N0q0Jo8o7K18j22K98k24o8J13J29k01j26
8068d8j08J38j04J06J73o9L2J89k98j26L3N9l4J72k03O7pj86p9M76mj70o7q4M9
8093i3j98K47j71N57m97K72J27k85P7q3k38J71J80J69k59Q0r9L74j93j31J37l64
8115b20M17j34o4j39lJ15J4j00o8j29L02J39K3k00j69L20k35j32K26P3J21j38
8137A9k75M01k28L47k78o8K19p8R3k49M0J47n1p2J29l39K51j79K56j62o7M6m0
$$ plain form
8160 -138 -144 -2 -164 75 -266 -58 73 123 166 45 201 36 -1 95 -64 -104 -131 -138 91 -77 96 6 33 -152
8184 -152 188 -57 -24 -13 71 14 62
$$ packed form
8160a38oJ42j62K39l41K08J31N0M3j21J56j65l7R6j59m0k7pK29j68J73r0K7j85
8184a52L40k45L3J1Q4n7M8
8191F2
$$ Imaginary data points
##PAGE= N=2
##DATA TABLE= (X++(I..I)), XYDATA
$$ plain form
0 0 0 0 0 0 0 0 0 0 0 0 0 0 0 0 8 -8 8 -8 8 -16 16 -18 24 -25 32 -38 41 -48 56 -64 74 -85 96 -109 125 -141
36 -141 157 -174 197 -217 242 -270 298 -330 365 -405 445 -490 541 -596 657 -724 798 -879 971
55 971 -1077 1197 -1335 1495 -1687 1915 -2199 2558 -3031 3685 -4645 6200 -9120 16436 -72395
70 -72395 -51118 180514 5894 -182774 -5047 145756 22355 -72643 -106241 -28990 159811
81 159811 129189 -123444 -147708 14917 103345 109699 -10123 -160955 -43450 123552 33878
92 33878 -54404 -11807 -29446 -436 62250 -51129 -97641 81526 98279 -66658 -83416 -19316
104 -19316 28714 111589 41113 -132380 -75197 77447 62980 20612 -16934 -84367 -5369 94015
116 94015 -14490 -70891 40539 35754 -38609 -14329 -19532 -17482 74185 41103 -86065 -56791
$$ packed form
0@%%%%%%%%%%%%%%Qj6J6j6J6k4L2l4M2m9N7p0P9q9J04j20J38j59J81k05K34k66
36a41K98l31L71m14M59n12N68o28O95p70Q50r35J031j137J253j381J522j677J850
55I71k048K274k532K830l182L602m114M757n589O716q330J0845j5320K5556q8831
70g2395K1277K31632j74620j88668J77727J50803j23401r4998l3598P7251J88801
81A59811l0622k52633k4264J62625Q8428O354j19822j50832J17505J67002q9674
92C3878q8282M2597j7639K9010O2686j13379m6512J79167J6753j64937j6758O4100
104a9316M8030Q2875p0476j73493N7183J52644j4467m2368l7546o7433P8998R9384
116I4015j08505n6401J11430m785p4363K4280n203K050R1667l3082j27168K9274
$$ plain form
128 -56791 24857 35623 52086 -4189 -99841 -20471 82133 13677 -29553 4644 -19901 -6846
140 -6846 39155 -20953 -34214 57977 28900 -59033 -21839 16304 12064 44409 7224 -74876
152 -74876 -25118 49500 22895 1829 -13163 -47894 -86 46547 -12714 -25795 24435 -2153
164 -2153 -25625 9075 -6437 -8228 45293 7695 -58177 -8579 34707 11478 15958 -3486 -48102
177 -48102 -717 47856 1695 -16892 4737 -13904 -5499 21976 -9190 -14910 24276 -748
189 -748 -32951 179 10942 2219 18360 -7824 -41231 2763 32720 1991 -4119 -3907 -21069
202 -21069 6040 28038 -6893 -11150 13439 -3799 -9973 11392 -9 -3331 18030 -4936 -27424
215 -27424 5575 18643 -846 923 -8171 -22199 7101 22710 -6762 -11483 892 -7335 1162
$$ packed form
128e6791Q1648J0766J6463n6275r5652P9370J02604o8456m3230L4197k4545J3055
140f846M6001o0108j3261R2191k9077q7933L7194L8143m240L2345l7185q2100
152g4876M9758P4618k6605k1066j4992l4731M7808M6633n9261j3081N0230k6588
164b153k3472L4700j5512j791N3521l7598o5872M9598M3286k3229M480j9444m4616
177d8102M7385M8573m6161j8587K1629j8641Q405K7475l1166n720L9186k5024
189g48l2203L3130J0763q723J6141k6184l3407M3994K9957l0729o110K12j7162
202b1069K7109K1998l4931m257K4589j7238o174K1365j1401l322K1361k2966k2488
215b7424L2999J3068j9489J769r094j4028K9300J5609k9472m721J2375q227Q497
$$ plain form
228 1162 13274 -5702 -6825 11140 -2412 -11700 7510 7416 572 7003 -5879 -15091 10669 17155
242 17155 -4496 -5434 -2331 -7091 6336 12300 -7408 -8681 3086 -1901 -2136 4428 -3728 -3236 5149
257 5149 -5496 -9480 7942 7960 -4445 -1872 -2406 -4510 8442 10795 -4742 -6084 1215 1767 5761
272 5761 5442 -5342 -3948 4367 -203 -2666 3455 1226 -2878 -1911 -4411 -2509 6040 2328 -6445
287 -6445 -3882 -1535 -1590 5906 4824 -7077 -6327 3780 4457 1619 862 -1035 -474 1663 283 945
303 945 5153 1847 -3262 -2315 394 1910 3952 838 -5355 -4662 179 3153 2422 -2011 -5464 -2539
319 -2539 1011 939 844 381 -1786 -2689 308 1449 1772 2294 1038 -1951 -2503 1331 5722 4228 -2026
336 -2026 -4374 -386 3426 2565 162 -1279 -2063 -2639 -1044 1804 1667 -1844 -3902 -2120 -220 272
$$ packed form
228A162J2112j8976j123J7965j3552r288J9210r4o844O431j2882r212K5760O486
242A7155k1651r38L103m760J3427N964j9708j273J1767m987k35O564q156M92Q385
257E149j0645l984J7422J8j2405K573n34k104J2952K353j5537j342P299N52L994
272E761l19j0784J394Q315m570k463O121k229m104R67k500J902Q549l712q773
287f445K563K347n5P496j082j1901P50J0107O77k838p57j897N61K137j380O62
303I45M208l306n109R47K709J516K042l114o193O93M841K974p31m433l453K925
319b539L550p2r5m63k167r03K997J141L23N22j256k989n52L834M391j494o254
336b026k348L988L812q61k403j441p84n76J595K848j37l511k058J782J900M92
$$ plain form
352 272 1249 1386 -1306 -3696 -1762 3199 5066 730 -3012 -1780 1516 2601 2777 1799 -586 -1710
368 -1710 -928 1042 2744 1492 -1099 -2681 -2171 -502 1266 1559 -767 -3791 -3777 -661 2017 2126 -473
385 -473 -3432 -2698 635 2361 1907 754 -515 -1239 -105 1783 2865 2457 -153 -2125 -1459 1607 2814
402 2814 1295 -578 -2713 -2549 736 2080 103 -1343 -2806 -3181 -216 2061 173 -944 -313 -2177
418 -2177 -2123 2434 2783 -51 -445 -900 -1287 2159 3674 1273 -169 -808 -1255 1508 2863 217 -1185
435 -1185 -1004 -2074 -471 2214 -636 -1544 -189 -2708 -2512 2711 1612 -2331 -1225 -587 -1840 1829
451 1829 3113 -1076 -808 528 -1487 1553 4499 -291 -1426 1702 -1258 -666 3870 644 -2250 1000
467 1000 -1054 -3074 3037 2009 -3953 -1193 576 -2876 684 2734 -3054 -2395 1424 -1861 -235
$$ packed form
352B72R77J37k692k390J934M961J867m336l742J232L296J085J76r78k385j124
368a710P82J970J702j252k591j582N10J669J768K93k326l024J4L116K678J09k599
385d73k959P34L333J726m54j153j269p24J134J888J082m08k610j972O66L066J207
402B814j519j873k135J64L285J344j977j446j463l75K965K277j888j117O31j864
418b177N4M557L49k834l94m55l87L446J515k401j442o39m47K763J355k646j402
435a185J81j070J603K685k850r08J355k519J96N223j099l943J106O38j253L669
451A829J284m189K68J336k015L040K946m790j135L128k960N92M536l226k894L250
467A000k054k020O111j028n962K760J769l452L560K050n788O59L819l285J626
$$ plain form
482 -235 4282 -1020 -2840 2577 -4 -1459 4460 1688 -2847 1438 898 -1996 3435 3254 -3821 -948
498 -948 1928 -2818 566 3332 -3765 -2497 2341 -2943 -1739 4412 -1705 -4605 2935 -75 -3410
513 -3410 3959 2116 -4682 1681 3046 -2821 2404 4171 -4442 -565 4487 -2149 97 5032 -3258
528 -3258 -3504 4076 -732 -3094 4585 -526 -6134 1942 1193 -4076 2511 2001 -5826 -150 3000 -3195
544 -3195 994 4055 -4048 -1150 4598 -2305 -457 5606 -2303 -3209 5696 -77 -3514 5296 449
559 449 -6163 3332 2938 -4952 2157 3004 -6630 -422 4632 -4291 -1134 4456 -4626 -3620 5209 -1384
575 -1384 -3234 4996 -1017 -4897 4531 1760 -3688 4300 1959 -5500 2805 4349 -4048 1928 3901
590 3901 -5045 -310 5003 -3413 -1362 4469 -3779 -3432 5138 -1724 -4219 4432 -1541 -5651 4489
$$ packed form
482b35M517n302j820N417k581j455N919k772m535M285n40k894N431j81p075K873
498i48K876m746L384K766p097J268M838n284J204O151o117k900P540l010l335
513c410P369j843o798O363J365n867N225J767q613L877N052o636K246M935q290
528c258k46P580m808k362P679n111n608Q076p49n269O587n10p827N676L150o195
544c195M189L061q103K898N748o903J848O063p909r06Q905n773l437Q810m847
559D49o612R495l94p890P109Q47r634O208N054q923L157N590r082J006Q829o593
575a384j850Q230o013l880R428k771n448P988k341p459Q305J544q397N976J973
590C901q946M735N313q416K051N831q248L47Q570o862k495Q651n973m110J0140
$$ plain form
605 4489 1621 -5538 3059 2412 -6288 2347 5386 -4394 -31 5198 -4122 -1355 6313 -1566 -2419 4878
621 4878 -1891 -3697 4985 -84 -3857 3592 -249 -5423 3479 1542 -5807 2047 2709 -6454 702
636 702 5242 -4903 -1249 5040 -3444 -2566 6414 -521 -3496 4522 155 -3310 4312 1602 -3262
651 -3262 2660 735 -4035 3185 2363 -4699 1326 2559 -5832 99 4780 -4657 -1998 4836 -3657
666 -3657 -3564 5220 -973 -4442 3852 455 -3819 3517 2045 -3745 2309 2397 -3726 1969 3503 -3302
682 -3302 560 3474 -3305 -287 4401 -2470 -2584 3697 -1736 -3289 3776 -274 -4094 2198 -114
697 -114 -3644 2684 1006 -3829 1568 1929 -3673 1408 3436 -3214 137 3736 -2345 -582 4780 -1327
713 -1327 -2450 3813 44 -3007 3276 927 -3507 1533 779 -2944 1260 1097 -3350 189 1518 -2906
$$ packed form
605D489k868p159Q597o47q700Q635L039r780M363N229r320K767P668p879q53P297
621D878o769j806Q682n069l773P449l841n174Q902j937p349P854O62r163P156
636G02M540j0145L654O289q484Q78Q980o935k975Q018m367l465P622k710m864
651c262N922j925m770P220q22p062O025J233q391N931M681r437K659O834q493
666c657R3Q784o193l469Q294l397m274P336j472n790O054Q8o123N695J534o805
682c302L862K914o779L018M688o871j14O281n433j553P065m050l820O292k312
697a14l530O328j678m835N397L61n602N081K028o650L351L599o081J763N362o107
713a327j123O263l769l051O283k349m434N040p54l723M204j63m447L539J329m424
$$ plain form
729 -2906 133 2274 -2971 -1129 2486 -1838 -765 3223 -619 -1809 3016 435 -1949 2645 1319
744 1319 -2684 1412 1625 -1867 1101 1847 -2445 -200 1611 -1876 -239 1512 -1662 -1392 1518 -1370
760 -1370 -1358 1731 -813 -2289 1610 -1 -1737 1608 910 -1755 852 1517 -931 1150 1591 -1597
776 -1597 89 2061 -982 25 1796 -903 -1102 1290 -886 -1121 1217 -484 -2047 288 376 -1289
792 -1289 387 -72 -1599 -161 864 -919 307 873 -712 237 1239 -150 78 1249 -513 -319
808 -319 1327 123 -808 925 -10 -1103 550 141 -899 6 1 -1198 -99 133 -744 -366 -121 -688
826 -688 -412 549 -204 -275 798 -129 -79 994 541 126 667 336 -36 749 682 -32 306 28 -196 -54 -70
847 -70 -661 -401 -305 -732 -459 49 -390 -801 -352 -543 -504 145 -126 -159 157 21 -83 410 664 413 355 198
$$ packed form
729b906L039K141n245J842L615m324J073L988l842j190M825k581k384M594j326
744A319m003M096K13l492K968P46m292K245J811l487J637J751l174K70K910k888
760a370J2L089k544j476L899j611j736L345o98k665K607O65k448K081M41l188
776a597J686J972l043J007J771k699j99K392k176k35K338j701j563K335Q8j665
792a289J676m59j527J438J025j783J226N66j585R49J002j389K28J171j762J94
808c19J646j204r31J733r35j093J653m09j040R05nj199J099K32q77L78K45n67
826f88K76R61p53p1J073r27N0J073m53m15N41l31l72P85o7p14L38k78k24J42j6
847g0n91K60R6m27K73N08m39m11M49j91L9O49k71l3L16j36j04M93K54k51n8j57
$$ plain form
869 198 187 473 588 262 294 -37 165 105 57 -370 -213 -510 -314 -254 -110 -360 -256 -549 -620 113 -46 -198
891 -198 -18 111 -82 280 456 108 295 166 86 186 485 -9 314 384 -98 35 67 27 -332 -479 -200 -396
913 -396 -277 -219 -227 -218 -405 -415 -203 -463 -183 65 8 -193 110 299 11 303 286 -29 375 680 458 386 136
936 136 81 11 261 201 -256 48 44 -400 -109 -177 -93 -422 -256 -185 -375 -2 -76 -170 -256 -181 152 113 276 117 57
961 57 335 373 366 430 562 14 119 492 141 -218 122 -95 -150 105 -342 -278 -52 -130 -450 -146 -164 -296 -158
984 -158 -93 -467 -68 228 120 102 165 174 -140 349 215 308 501 233 9 401 123 -351 478 57 -481 95
1006 95 151 -717 -247 142 -679 -444 265 -373 -382 465 -223 -522 398 47 -303 419 498 -225 395 919 -304
1027 -304 209 359 -327 250 369 -185 24 241 -348 -227 526 -481 -732 55 -496 -774 257 -367 -707
$$ packed form
869A98j1K86J15l26L2l31K02o0m8m27J57k97J96O0J44k50J04k93p1P33j59j52
891a98J80J29j93L62J76l48J87j29q0J00K99m94L23P0m82J33L2m0l59j47K79j96
913c96J19N8qRj87j0K12k60K80K48n7k01L03J89k88K92j7l15M04L05k22p2k50
936A36n5p0K50o0m57L04mm44K91o8Q4l29J66P1j90L73p4r4q6P5L33l9J63j59o0
961E7K78L8pO4J32n48J05L73l51l59L40k17n5K55m47O4K26p8l20L04j8j32J38
984a58O5l74L99K96j08j8O3Rl14M89j34R3J93k68k24L92k78m74Q29m21n38N76
1006I5N6q68M70L89q21K35P09o38rQ47o88k99R20l51l50P22P9p23O20N24j223
1027c04N13J50o86N77J19n54K09K17n89J21P53j007k51P87n51k78J031o24l40
$$ plain form
1046 -707 260 -124 -845 346 342 -539 292 818 -309 293 1226 -194 -104 1039 -253 -195 1136 -207 -379
1065 -379 534 -54 -513 919 243 -941 -45 290 -1092 52 653 -925 -377 507 -609 -475 961 -598
1083 -598 -323 878 -116 -699 861 380 -432 720 43 -441 983 565 -857 438 692 -1051 139
1100 139 664 -1192 -627 600 -1080 -634 763 -550 -807 633 -257 -720 722 150 -942 814 663
1117 663 -752 787 1115 -659 253 1197 -730 271 1096 -609 -299 1039 -298 -743 898 -306 -819
1134 -819 674 -184 -906 370 -53 -1171 359 222 -1040 172 764 -794 142 1158 -709 82 1226
1151 1226 -583 -196 1406 -48 -483 1209 341 -952 821 230 -1115 685 272 -1124 419 610
1167 610 -1080 -239 870 -1082 -323 910 -485 -289 924 -363 -598 1078 -90 -647 899 252 -614
$$ packed form
1046g07R67l84p21J191mq81Q31N26j127O02R33j420R0J143j292N8J331j343j72
1065c79R13n88m59J432o76j184Q96L35j382J144O01j578N48Q84j116J34J436j559
1083e98K75J201r94n83J560m81q12J152o77m84J424m18j422J295K54j743J190
1100A39N25j856N65J227j680M46J397j313k57J440q90m63J442n72j092J756j51
1117F63j415J539L28j774R12R44j927J001Q25j705L10J338j337m45J641j204n13
1134h19J493q58p22J276m23j118J530j37j262J212N92j558R36J016j867P91J144
1151A226j809L87J602j454m35J692q68j293J773n91j345J800m13j396J543J91
1167F10j690Q41J109j952P59J233j395J96J213j287k35J676j168n57J546o47q66
$$ plain form
1184 -614 891 583 -632 503 535 -716 307 920 -549 -175 837 -952 -620 786 -731 -823 903
1201 903 -416 -968 725 -398 -957 540 338 -1043 247 739 -490 265 885 -444 204 922 -232
1218 -232 -77 1026 -204 -205 714 -297 -439 805 -152 -1128 906 131 -946 398 178 -1000 294 625
1236 625 -717 -314 689 -645 -220 729 -390 -319 949 214 -345 564 -163 -291 838 350 -514 377
1254 377 252 -687 373 393 -946 170 524 -761 -132 474 -746 -396 567 -452 -427 534 -128 -543 557
1273 557 203 -605 525 373 -688 452 549 -259 387 650 -351 -173 644 -587 -205 523 -199 -442 22
1292 22 -405 -666 112 -261 -768 249 -273 -732 338 126 -514 301 446 -396 74 424 -81 190 742 -55
1312 -55 260 540 -52 247 145 21 -59 212 17 -410 233 61 -426 151 71 -731 154 272 -422 -279 407
$$ packed form
1184f14J505l08j215J135L2j251J023O13j469L74J012j789L32J406j517r2J726
1201I03j319n52J693j123n59J497k02j381J290M92j229P55O20j329O48P18j154
1218b32J55J103j230jR19j011j42J244r57r76K034p75j077J344k20j178J294L31
1236F25j342M03J003j334M25R49j119P1J268p35n59R09p27j28J129m88q64Q91
1254C77j25r39J060K0j339J116L54j285O29O06j220L50R63j019K5R61o62m15J100
1273E57l54q08J130j52j061J140R7q08O46K63j001J78Q17j231L82P28p22k43M64
1292B2m27k61P78l73n07J017n22m59J070k12o40Q15J45q42M70L50n05K71N52p97
1312e5L15K80n92K99j02j24q0K71j95m27O43j72m87N77q0q02Q85J18o94J43O86
$$ plain form
1333 407 -499 -220 222 -39 231 351 228 -147 449 40 -215 400 266 -147 250 20 -136 99 80 -348
1353 -348 -27 -115 -486 -45 55 -248 -348 -16 -381 -166 5 22 -113 197 106 -68 212 413 164 154 214 68
1375 68 445 115 214 68 75 -159 -189 -21 -158 -185 88 -73 -171 2 -391 -196 63 -100 -132 -239 200 -232 1
1398 1 70 70 210 27 278 323 184 -1 178 57 289 178 310 -114 217 163 -133 62 -210 129 -79 -122 -253
1421 -253 -148 -372 119 -227 -9 83 -8 -92 -204 16 -10 309 86 176 -87 370 89 107 -36 321 -33 -28 97
1444 97 65 -178 91 105 -224 -230 -169 -114 -34 103 -339 -164 -1 -312 -56 -112 74 -57 -10 357 -267 244 222 52
1468 52 297 166 273 131 167 108 246 -100 -101 -223 129 -143 -126 6 -64 -255 -175 -106 -239 114 -228 -335 -78
1491 -78 198 -132 185 128 45 423 166 67 -30 47 61 177 235 256 -78 -254 -61 79 -40 242 8 -129 -159
$$ packed form
1333D07r06K79M42k61K70J20j23l75N96m09k55O15j34m13L97k30j56K35j9m28
1353c48L21q8l71M41J00l03j00L32l65K15J71J7j35L10r1j74K80K01k49j0O0j46
1375F8L77l30R9j46Pk34l0J68j37k7K73j61r8J73l93J95K59j63l2j07M39m32K33
1398AO9%J40j83K51M5j39j85J79j21K32j11J32m24L31n4k96J95k72L39k08m3j31
1421b53J05k24M91l46K18R2r1q4j12K20k6L19k23R0k63M57k81J8j43L57l54NJ25
1444I7l2k43K69J4l29oO1N5Q0J37m42J75J63l11K56n6J86j31M7L67o24N11k2j70
1468E2K45j31J07j42L6n9J38l46jj22L52k72J7J32p0j91Q0O9j33L53l42j07K57
1491g8K76l30L17n7q3L78k57r9r7P7J4J16N8K1l34j76J93J40j19K82k34j37l0
$$ plain form
1514 -159 -143 -43 -181 -20 -360 -76 -19 86 -221 130 177 132 8 1 -125 196 225 300 18 150 58 114 97 70
1538 70 -110 -40 4 136 -73 -253 -318 -41 -79 -122 71 -210 -46 223 -410 -320 181 -19 -44 48 367 -7 -45
1561 -45 221 -185 -55 -25 93 -135 404 120 -263 117 48 -258 -40 -322 -138 -250 102 -315 -83 -133 -461
1582 -461 -151 136 -106 -139 -39 0 205 262 -61 254 299 -94 59 314 291 -7 432 75 70 153 -71 -23 161
1605 161 149 -258 -27 276 -305 -144 71 -131 -173 -43 -171 -40 133 -216 -164 147 61 -55 427 319 -121
1626 -121 374 197 65 173 104 -405 204 362 -141 292 455 -184 -118 69 -361 -457 97 -221 -383 130 3
1647 3 -415 280 -149 -358 174 -56 -160 15 211 -71 50 265 -201 -188 293 -66 -196 488 63 -374 76
1668 76 -147 -395 65 -253 -639 -23 -25 -323 187 -11 -427 282 89 -137 155 197 47 63 604 -108 -169 351
$$ packed form
1514a59J6J00j38J61l40K84N7J05l07L51M7m5j24pj26L21K9P5k82J32r2N6j7k7
1538G0j80P0M4J32k09j80o5K77l8m3J93k81J64K69o33R0N01k00k5R2L19l74l8
1561d5K66m06J30L0J18k28N39k84l83L80o9l06K18k82J84j12L52m17K32n0l28
1582d61L10K87k42l3J00L9K05N7l23L15M5l93J53K55k3k98M39l57nQ3k24M8J84
1605A61j2m07K31L03n81J61K15k02m2J30j28J31J73l49N2L11q6j16M82j08m40
1626a21M95j77j32J08o9n09O09J58n03M33J63o39O6J87m30r6N54l18j62N13j27
1647Cm18O95m29k09N32k30j04J75J96k82J21K15m66J3M81l59j30O84m25m37M50
1668G6k23k48M60l18l86O16kk98N10j98m16P09j93k26K92M2j50J6N41p12o1N20
$$ plain form
1690 351 30 -170 51 103 40 549 300 -258 22 62 -191 11 371 -150 -54 103 -196 -71 205 -19 -276
1711 -276 239 -189 -276 277 144 -344 168 177 17 105 173 -105 353 481 -199 266 376 -163 -99 195 -176 -156
1733 -156 106 -245 -87 94 -161 -294 102 2 -202 243 46 -460 45 393 -197 -43 121 2 -8 325
1753 325 -237 -198 232 -110 -170 381 -177 -286 16 -154 -212 -68 149 -112 202 -67 -265 -214 173 -374 -133
1774 -133 102 -159 -164 392 103 -199 320 90 -168 145 58 -152 514 211 -75 122 92 -268 -16 1 -117 -85
1796 -85 107 -138 -425 64 -330 -389 92 -145 -157 172 11 -289 186 34 -249 160 -127 -168 10 167 -93
1817 -93 -19 263 218 -17 180 -19 -280 -23 -310 -208 -87 -200 -322 58 -139 -289 275 4 -110 49 285
1838 285 -68 138 146 68 -97 54 96 94 256 26 127 289 -195 -87 93 137 -31 27 396 -97 -122 304 147
$$ packed form
1690C51l21k00K21N2o3N09k49n58K80M0k53K02L60n21R6J57k99J25K76k24k57
1711b76N15m28q7N53j33m88N12Rj60Q8O8k78M58J28o80M65J10n39O4K94l71K0
1733a56K62l51J58J81k55j33L96j00k04M45j97n06N05L48n90J54J64j19j0L33
1753C25n62L9M30l42o0N51n58j09L02j70n8J44K17k61L14k69j98N1L87n47K41
1774a33K35k61nN56k89l02N19k30k58L13q7k10O66l03k86J97l0l60K52J7j18L2
1796h5J92k45k87M89l94n9M81k37j2L29j61l00M75j52k83M09k87m1J78J57k60
1817i3P4K82m5k35J97j99k61K57k87J02J21j13j22L80j97j50N64k71j14J59K36
1838B85l53K06Qp8j65J51M2kJ62k30J01J62m84J08J80M4j68N8L69m93k5M26j57
$$ plain form
1861 147 -194 57 -172 -209 34 -232 -125 161 -308 -185 -25 -19 0 94 59 250 191 178 -45 43 162 -210 201
1884 201 73 -90 192 76 19 -2 63 -184 -37 -305 -128 -105 -30 -150 -40 -172 -11 -100 64 83 120 -131 119
1907 119 28 27 -11 127 -147 46 170 -36 50 -45 -106 206 338 -65 108 -224 -155 -20 56 -179 -230 24 -69 -22
1931 -22 -97 -63 40 -20 -198 -228 -198 -29 142 7 130 84 14 160 -24 137 -8 239 -73 -46 112 139 43 -172
1955 -172 35 155 -63 27 173 -94 31 -102 -74 -212 -40 -164 -43 121 18 -51 261 -138 131 140 -232 64
1977 64 134 -33 35 116 10 170 0 -35 -122 -253 -39 -69 18 70 -276 -186 -74 16 -28 96 -42 -78 -124 -88 257
2002 257 -13 195 -110 22 78 -75 10 143 158 28 -71 349 175 -73 7 -110 32 -36 -214 -57 -119 -227
2024 -227 -350 -55 -194 87 134 183 -152 273 190 288 67 -14 258 12 -441 -91 3 65 133 174 196 27 86 -236
$$ packed form
1861A47l41K51k29l7K43k66J07K86m69J23J60OJ9R4l5J91n9j3k23Q8J19l72M11
1884B01j28j63K82j16n7k1O5k47J47k68J77K3P5j20J10j32J61q9J64J9L7k51K50
1907A19r1jl8J38k74J93J24k06Q6r5o1L12J32m03J73l32O9J35P6k35n1K54r3M7
1931b2p5L4J03o0j78l0L0J69J71j35J23m6p0J46j84J61j45K47l12K7J58K7r6k15
1955a72K07J20k18R0J46k67J25j33K8j38J72j24J21J64j03o9L12l99K69Rl72K96
1977F4P0j67O8Q1j06J60j70l5q7j31K14l0Q7N2l46R0J12R0m4J24j38l6m6L6L45
2002B57k70K08l05J32N6j53Q5J33J5j30r9M20j74k48Q0j17J42o8j78J57o2j08
2024b27j23K95j39K81M7M9l35M25q3R8k21q1K72k46m53L50R4O2O8M1K2j69N9l22
$$ plain form
2048 -236 -38 -48 -113 -194 -172 96 -15 -93 -5 -30 126 -78 -21 -93 31 -214 191 219 169 36 0 -131 -190 62
2072 62 27 168 -68 -309 -203 199 72 -129 -229 -198 -201 -66 104 -1 -192 -179 0 -72 123 -17 137 -174
2094 -174 162 -190 65 265 241 90 175 2 -36 72 29 14 -116 -4 23 135 332 -23 242 -183 -214 94
2116 94 -245 -55 -299 -120 -51 173 153 -105 -297 39 67 66 24 39 -158 -83 274 -54 336 -261 116 171 40
2139 40 -123 -211 108 -38 102 244 -168 -27 -9 69 -6 -304 56 60 30 173 -31 331 120 -101 78 111 -46
2162 -46 -112 168 -76 148 103 -8 -97 67 -329 180 -82 -184 -94 -148 -409 -162 -10 -10 -195 35 -84 -377 -128
2185 -128 23 44 -115 67 219 40 21 -19 -77 -103 296 -174 124 58 -71 42 -5 -214 116 5 66 -71 -9
2208 -9 5 -8 -25 -88 -102 -114 -107 151 -10 -74 21 -73 59 -27 196 236 183 19 42 179 38 170 -230 384 -38 -248
$$ packed form
2048b36J98j0o5q1K2K68j11p8Q8k5J56k04N7p2J24k45M05K8n0j33l6j31n9K52
2072F2l5J41k36k41J06M02j27k01j00L1lJ35J70j05j91J3J79p2J95j40J54l11
2094a74L36l52K55K00k4j51Q5j73l8J08m3j5j30J12K7J12J97l55K65m25l1L08
2116I4l39J90k44J79O9K24k0k58j92L36K8jm2J5j97P5L57l28L90n97L77N5j31
2139D0j63q8L19j46J40J42m12J41J8P8p5k98L60Ml0J43k04L62k11k21J79L3j57
2162d6o6K80k44K24m5j11q9J64l96N09k62j02R0n4k61K47J52%j85K30j19k93K49
2185a28J51K1j59J82J52j79j9m0n8k6L99m70K98o6j29J13m7k09L30j11O1j37O2
2208iJ4j3j7o3j4j2PK58j61o4R5r4J32q6K23M0n3j64K3J37j41J32m00O14m22k10
$$ plain form
2234 -248 137 176 -309 -78 -90 -230 -267 128 -178 -159 -200 -223 -167 -55 96 -11 -244 -4 -88 93 98 -235 46
2257 46 -55 61 -88 15 114 -99 139 97 55 28 31 87 -55 186 100 20 -119 -151 -49 111 95 -32 -93 84
2281 84 77 22 -132 -322 57 -117 176 86 33 -140 58 -82 -38 -51 -211 -141 187 -137 -353 -75 150 -264 145
2304 145 47 -43 178 87 -255 -26 -256 81 176 -15 -38 -85 292 3 -127 125 278 -128 12 -29 -121 114 42
2327 42 192 -291 92 -151 -21 -16 -33 -168 12 -133 -317 -165 144 32 -85 -254 -51 85 145 -144 254 118
2349 118 248 64 125 -258 -150 152 -20 -199 147 75 -171 -2 -126 11 -59 104 -179 332 176 -137 -81
2370 -81 81 26 -40 17 -229 -220 206 -98 36 52 58 23 -150 75 92 108 175 -104 31 94 -46 -126 103 -12 106
2395 106 128 -139 8 -198 -61 70 -59 43 108 -91 -84 -7 -44 -308 -41 -41 106 -42 -46 -126 -90 -29 40 118 96
$$ packed form
2234b48L85L9m85K31j2j40l7L95l06J9m1k3N6J12J51j07k33K40q4J81Nl33K81
2257D6j01J16j49J03R9k13K38m2m2k7LN6j42K41q6q0j39l2J02J60j6j27o1J77
2281H4pn5j54j90L79j74K93r0n3j73J98j40M4j3j60P0L28l24k16K78K25m14M09
2304A45r8r0K21r1l42K29k30L37R5j91k3m7L77k89j30K52J53m06J40m1r2K35p2
2327D2J50m83L83k43J30Nj7j35J80j45j84J52L09j12j17j69K03J36O0k89L98j36
2349A18J30j84O1l83J08L02j72j79L46p2k46J69j24J37p0J63k83N11j56l13N6
2370h1J62n5o6N7k46RM26l04J34J6Ol5j73K25J7J6O7k79J35O3j40q0K29j15J18
2395A06K2k67J47k06J37J31j29J02O5j99PP7l7k64K67%J47j48mq0L6O1O9P8k2
$$ plain form
2420 96 20 -53 -154 -5 -86 -68 62 -97 -78 90 -200 -162 217 -190 -49 -7 -208 -247 -105 122 36 -75 110
2443 110 52 158 154 -64 174 43 270 226 -16 64 66 167 96 140 48 143 90 -25 -32 81 160 29 -8 -75 -113 -167
2469 -167 -96 62 -6 -54 80 -12 78 -183 207 -41 42 94 81 46 64 -18 96 128 256 -98 138 -23 -32 106 -264
2494 -264 -123 -24 114 -108 6 -230 -170 23 -18 17 -19 -99 -135 90 115 -47 -24 108 156 -204 -10 209 71
2517 71 176 110 31 32 30 32 -147 -148 39 -77 -176 -57 -231 -114 -262 67 -189 -162 -121 13 -39 -29 -38 279 46 -39
2543 -39 32 -20 109 -192 55 215 -149 272 107 -119 -9 -141 -49 340 -127 75 16 -127 -104 184 64 146
2565 146 65 -78 -249 -70 123 110 150 -181 -48 20 -60 180 24 -142 118 47 174 -140 4 -130 -29 -28 93
2588 93 -186 82 -201 -338 -73 139 94 -155 138 -230 -83 -20 20 150 279 -92 160 7 155 82 15 132
$$ packed form
2420I6p6p3j01J49q1J8J30j59J9J68k90L8L79m07J41M2k01l9J42K27q6j11J85
2443A10n8J06mk18K38j31K27m4k42Q0KJ01p1M4r2R5n3j15pJ13P9j31l7o7l8n4
2469a67P1J58o8m8J34r2R0k61L90k48Q3N2j3l5J8q2J14L2J28l54K36j61rJ38l70
2494b64J41R9J38k22J14k36O0J93m1L5l6q0l6K25K5j62K3J32M8l60J94K19j38
2517G1J05o6p9JkKj79jJ87j16r9J19j74J17j48L29k56K7M1J34n2J0rL17k33q5
2543c9P1n2J29l01K47J60l64M21j65k26J10j32R2L89m67K02n9j43K3K88j20Q2
2565A46q1j43j71J79J93j3M0l31J33O8q0K40j56j66K60p1J27l14J44j34J01JJ21
2588I3k79K68k83j37K65K12m5k49K93l68J47O3M0J30J29l71K52j53J48p3o7J17
$$ plain form
2610 132 -65 -68 56 -8 130 397 -86 132 -51 21 -113 -13 -222 -215 -108 -50 -66 -142 -254 32 146 -12 -99
2633 -99 34 258 126 -45 125 118 405 150 182 171 -32 -126 -11 90 110 39 -121 -52 -86 90 -124 -172 -79 -168
2657 -168 -215 -17 -217 -64 250 -6 185 -14 324 -60 -124 285 127 -93 -75 212 195 -54 23 96 23 264
2679 264 274 92 -1 -10 -12 -66 -7 -51 -92 17 40 -5 158 -63 -159 8 220 -35 76 58 250 -87 47 37 35 -34
2705 -34 -61 258 40 -70 -24 -122 147 20 -11 -233 -155 -53 -15 -180 -27 -36 22 -26 132 0 205 294 -203 87
2729 87 25 68 -54 49 444 -70 -133 113 313 65 34 174 -75 161 -25 184 -31 -93 49 38 20 -107 -123
2752 -123 24 39 -170 -180 46 41 -36 179 200 1 239 89 87 325 206 49 -58 -159 59 -257 -28 213 -220
2775 -220 -170 122 -166 33 -258 -182 -72 -31 -238 -69 65 81 5 127 -206 -161 30 148 156 -132 -81 -173 38
$$ packed form
2610A32j97lJ24o4J38K67m83K18j83P2j34J00k09PJ07N8j6p6j12K86J14j58q7
2633i9J33K24j32j71J70pK87k55L2j1k03r4J15J01K0p1j60O9l4J76k14m8R3q9
2657a68m7J98k00J53L14k56J91j99L38l84o4M09j58k20J8K87j7k49P7P3p3K41
2679B64J0j82r3rkn4N9m4m1J09K3m5J63k21r6J67K12k55J11j8J92l37J34j0ko9
2705c4k7L19k18j10M6r8K69j27l1k22P8J02L8j65J53rN8m8J58j32K05Q9m97K90
2729H7o2M3j22J03L95n14o3K46K00k48l1J40k49K36j86K09k15o2J42j1j8j27j6
2752a23J47J5k09j0K26np7K15K1j99K38j50kK38j19j57j07j01K18l16K29K41m33
2775b20N0K92k88J99k91P6J10M1k07J69J34J6p6J22l33M5J91J18Qk88N1r2K11
$$ plain form
2798 38 -131 144 155 26 -110 -205 10 56 -14 48 -94 262 -8 51 15 -125 -119 54 -182 -232 208 159 114 13
2822 13 79 -160 43 22 28 109 -215 -24 -236 85 -75 -65 26 58 128 -304 23 161 -72 -249 49 -151 69
2845 69 75 -174 194 195 -80 -123 21 -104 81 40 -88 -55 -182 93 -14 -5 -10 244 20 -100 65 -208 -82 -39
2869 -39 182 -59 -50 -175 -191 -28 -60 -5 253 -156 -67 121 151 135 -91 -16 -56 -163 240 60 91 93 157 206 64
2894 64 11 5 51 -74 -70 -200 93 -166 77 -175 -25 -92 13 -8 -137 -167 -247 184 -101 -146 32 4 52 133 182
2919 182 -112 2 81 -13 -39 74 -207 74 167 10 112 -7 24 200 -118 108 -8 102 188 308 0 17
2941 17 44 -228 -167 147 195 108 111 175 -204 169 93 151 158 -80 65 -157 24 135 34 -30 154 -30 32 98 33
2966 33 -20 -96 191 -269 18 -79 -45 25 121 -118 11 -76 93 -226 -63 -6 -10 209 -122 -21 65 216 -77 -30
$$ packed form
2798C8j69K75J1j29j36r5K15M6p0O2j42L56k70N9l6j40OJ73k36n0M40m9m5j01
2822A3O6k39K03k1OQ1l24J91k12L21j60J0R1L2P0m32L27J38k33j77K98k00K20
2845F9Ok49L68Jk75m3J44j25J85m1j28L3j27K75j07RnK54k24j20J65k73J26M3
2869c9K21k41Rj25j6J63l2N5K58m09Q9J88L0j6k26P5m0j07M03j80L1KO4M9j42
2894F4n3oM6j25Mj30K93k59K43k52J50o7J05k1j29l0q0M31k85m5J78k8M8Q1M9
2919A82k94J14P9r4k6J13k81K81R3j57J02j19L1J76l18K26j16J10Q6J20l08J7
2941A7K7k72O1L14M8q7LO4l79L73p6N8Pk38J45k22J81J11j01o4J84j84O2O6o5
2966C3n3p6K87m60K87r7L4P0R6k39J29q7J69l19J63N7mK19l31J01Q6J51k93M7
$$ plain form
2990 -30 -80 -160 -236 169 55 -46 150 66 58 -35 -232 127 77 56 108 90 -48 -150 36 105 -76 234 -61 -226
3014 -226 137 152 -64 292 -46 -198 -56 41 -8 -131 -83 -171 -258 -21 -127 -75 17 -122 -77 31 77 -5 -33 126
3038 126 42 -101 35 -75 -8 -284 141 89 1 19 -90 -22 -78 -61 -294 129 -130 214 -150 -313 153 78 4
3061 4 44 56 86 -171 -14 81 78 239 -274 -166 -129 210 91 -18 -128 79 -115 -114 256 -219 77 -52 99 50
3085 50 212 -158 49 82 105 87 46 -18 -140 15 25 33 -210 184 94 -146 37 -212 166 -17 -107 75 -80 11
3109 11 -73 -84 142 -51 -7 -89 74 114 -156 -171 61 103 -25 -215 22 -134 -170 123 -119 -73 23 -249 62 178
3133 178 -46 -193 -218 -88 -68 -8 -283 212 -120 149 61 -281 90 -66 -145 -126 -98 184 107 42 -239 -43 -215
3156 -215 44 119 -135 -216 -43 148 -112 59 46 -101 -63 192 53 -97 -286 68 -32 -115 50 184 -225 -104
$$ packed form
2990c0n0q0p6M05j14j01J96q4qr3j97L59n0k1N2j8j38j02J86O9j81L10k95j65
3014b26L63J5k16L56l38j52J42R7m9j23M8q8q7K37j06N2R2j39M5J08M6q2k8J59
3038A26q4j43J36j10O7k76M25n2q8J8j09O8n6J7k33M23k59L44l64j63M66p5p4
3061DM0J2L0k57J57R5lJ61n13J08L7L39j19j09j10K07j94JL70m75K96j29J51m9
3085E0J62l70K07L3K3j8m1o4j22J55J0Qk43L94r0k40J83k49L78j83r0J82j55R1
3109A1q4j1K26j93M4q2J63M0k70j5K32M2j28j90K37j56l6K93k42M6R6k72L11J16
3133A78k24j47k5J30K0O0k75M95l32K69q8l42L71j56p9J9K8K82p7o5k81J96j72
3156b15K59P5k54q1J73J91k60J71j3j47L8K55j39j50j89L54j00q3J65J34m09J21
$$ plain form
3178 -104 76 -57 187 192 -37 136 -133 35 71 -157 -57 112 13 114 55 -137 -86 -7 -203 165 25 -1 218
3201 218 42 201 30 -62 153 -70 40 -51 -15 -108 -102 219 42 -84 -330 -16 -59 52 -50 18 -159 -38 -204
3224 -204 -101 237 -12 -189 111 27 2 -72 68 188 -84 -49 164 143 63 56 16 -102 31 81 159 -89 -125 120
3248 120 -45 141 -207 -261 -198 16 -27 14 53 -20 -140 -155 5 99 25 57 92 -3 303 -104 7 -92 107 -80
3272 -80 134 -99 -222 116 -172 13 -201 75 -271 8 -21 -75 184 -218 -19 -164 -8 108 131 -149 7
3293 7 117 266 -229 -38 -84 -40 30 28 72 -132 72 -58 -40 -19 -92 126 -62 18 -44 50 134 -51 -12 -32 -58 -71
3319 -71 280 -54 82 -136 -175 -163 7 99 -25 116 -16 -90 -25 -63 29 179 99 -67 -101 104 102 146 83 52 -37
3344 -37 160 -271 8 40 -159 -125 -197 -65 -2 138 43 148 86 -43 63 50 108 -164 -12 -127 89 -34 122
$$ packed form
3178a04J80j33K44Nk29J73k69J68L6k28J00J69r9J01n9j92N1P9j96L68j40k6K19
3201B18j76J59j71r2K15k23J10r1L6r3OL21j77j26k46L14m3J11j02O8j77J21j66
3224b04J03L38k49j77L00q4k5p4J40J20k72L5K13k1q0pm0j18J33N0P8k48l6K45
3248A20j65J86l48n4O3K14m3M1L9p3j20j5J60R4p4L2L5r5L06m07J11r9J99j87
3272h0K14k33j23L38k88J85k14K76l46K79k9n4K59m02J99j45J56J16K3k80J56
3293GJ10J49m95J91m6M4P0kM4k04K04j30J8K1p3K18j88Q0o2R4Q4j85L9k0k6j3
3319g1L51l34J36k18l9J2J70R2j24J41j32p4O5l8R2J50q0j66l4K05kM4o3l1q9
3344c7J97m31K79L2j99L4p2J32O3J40r5J05o2j29J06j3N8k72J52j15K16j23J56
$$ plain form
3367 122 -200 134 70 -41 82 -192 133 -57 -130 -5 -128 -42 82 -107 -16 55 -118 56 3 -326 -17 -100
3389 -100 -46 128 20 149 24 -93 -55 -34 167 69 -74 -202 -201 -174 -201 -98 74 -157 77 104 113 -163 36 -27
3413 -27 -284 157 14 18 -117 -65 -182 28 14 2 -79 49 -76 -167 -35 126 69 -125 -99 88 121 -140 49 53
3437 53 -86 -103 199 90 -53 -13 38 -148 -133 187 86 59 -120 -56 264 145 112 -86 -120 5 -59 -238 98
3460 98 41 -66 -195 144 99 -68 -183 -11 -187 -27 -33 232 36 135 48 -102 -92 27 -90 -112 -134 -190 112 -42
3484 -42 46 -103 90 48 -91 -13 -60 -27 178 163 -35 -28 -9 -44 105 -80 -52 5 -39 166 115 47 247 -81 -260
3509 -260 53 -40 119 -15 -79 198 -102 -54 -188 165 -153 68 229 37 -230 17 -65 11 70 -4 -2 -56 164
3532 164 -165 13 -105 116 -42 23 -74 -64 -84 -34 38 77 -8 -142 -50 69 62 102 120 106 -91 154 200 -111 -36
$$ packed form
3367A22l22L34o4j11J23k74L25j90p3J25j23Q6J24j89R1P1j73J74n3l29L09q3
3389a00N4J74j08J29j25j17L8K1K01r8j43j28JK7k7J03J72k31K34K7Rk76J99o3
3413b7k57M41j43Mj35N2j17K10j4j2q1J28j25r1J32J61n7j94K6J87L3k61J89M
3437E3j39j7L02j09j43M0N1j86J5L20j01k7j79O4L20j19l3j98l4J25o4j79L36
3460I8n7j07j29L39m5j67j15J72j76J60oK65j96R9q7j50J0J19j17k2k2n6L02j54
3484d2Q8j49J93m2j39P8m7L3K05j5j98PJ9l5J49j85K8N7m4K05n1o8K00l28j79
3509b60L13r3J59j34o4K77l00M8j34L53l18K21J61j92k67K47q2P6N9p4Kn4K20
3532A64l29J78j18K21j58O5r7J0k0N0P2L9q5j34R2J19pM0J8j4j97K45M6l11P5
$$ plain form
3557 -36 98 181 98 245 48 -177 -48 -117 -26 -135 8 -122 -190 -102 22 64 97 -198 -112 -33 -9 129 -29 193
3581 193 87 50 68 -194 254 285 72 -166 -65 174 -81 -73 11 -97 -199 -19 154 -92 -10 145 160 -139 66
3604 66 25 -54 64 124 73 -6 335 -155 -55 -42 -85 87 59 -88 286 53 26 -41 28 111 6 -253 16 111 -74
3629 -74 -28 -154 47 -237 48 92 68 -114 116 23 -42 74 -63 245 61 226 -73 119 -177 108 117 89 -158
3652 -158 -37 -12 168 -96 -142 -54 -46 96 -203 -74 59 79 -79 80 -262 -25 -97 -12 -60 -16 -21 155 226 -104
3676 -104 189 -29 37 -41 -100 61 -310 -23 -213 15 94 97 -98 -41 1 -62 4 -86 143 113 -60 32 369 123
3700 123 91 156 261 -4 202 146 -138 73 132 -31 -147 -53 197 226 -11 -27 -42 36 -79 112 9 -118 -43
3723 -43 -312 -129 -144 2 -217 -41 -114 -161 -266 -35 174 -64 45 -127 29 -8 -103 43 -4 3 178 -29 -27 129
$$ packed form
3557c6J34Q3q3J47j97k25J29o9R1j09J43j30o8Q8J24M2L3k95Q6P9K4J38j58K22
3581A93j06l7J8k62M48L1k13k38J01K39k55QQ4j08j02J80J73k46Q2J55J5k99K05
3604F6m1p9J18O0n1p9L41m90J00J3m3J72k8j47L74k33k7o7O9Q3j05k59K69R5j85
3629g4M6j26K01k84K85M4k4j82K30r3o5J16j37L08j84J65k99J92k96K85Rk8k47
3652a58J21K5J80k64m6Q8QJ42k99J29J33K0j58J59l42K37p2Q5m8M4nJ76P1l30
3676a04K93k18O6p8n9J61l71K87j90K28P9Lj95N7M2o3O6r0K29l0j73R2L37k46
3700A23l2O5J05k65K06n6k84K11N9j63j16R4K50K9k37j6j5P8j15J91j03j27P5
3723d3k69J83j5J46k19J76p3m7j05K31K09k38J09j72J56l7r5J46m7PJ75k07KJ56
$$ plain form
3747 129 -40 -94 139 -169 -126 112 -283 24 49 -50 -182 -8 73 64 24 -298 36 -239 99 -42 47 85 175 -154
3771 -154 -152 -163 -213 -227 37 -64 -66 -81 253 192 -98 83 73 -132 -51 148 -8 196 -300 167 -88 65 -336 71
3795 71 24 8 146 -142 190 -71 -95 146 -289 -144 -70 53 -9 -111 -146 -5 172 -8 136 -173 -113 -19 20
3818 20 -20 40 -334 -106 -18 61 -26 40 -204 161 179 36 169 -34 53 -176 49 191 -26 214 -55 30 -113
3841 -113 7 17 -36 -45 105 488 131 -70 -50 2 80 24 88 -10 0 156 -17 -203 94 -42 246 44 100 -153
3865 -153 0 307 78 -85 100 84 154 128 48 2 -99 26 119 386 1 296 -34 41 -201 -4 62 -37 -154
3888 -154 154 -8 -46 50 -27 -71 140 193 19 -62 -102 -198 89 -95 -133 -248 -159 114 -49 -72 -188 -41 226 260
3912 260 11 -57 288 67 -96 -118 96 3 -220 -5 133 223 -36 114 226 251 -94 -16 -52 -153 -188 -55 -16
$$ packed form
3747A29j69n4K33l08M3K38l95L07K5r9j32J74Q1rm0l22L34k75L38j41Q9L8R0l29
3771a54Kj1n0j4K64j01kj5L34o1k90J81j0k05Q1J99j56K04m96M67k55J53m01M07
3795G1m7j6J38k88L32k61k4K41m35J45P4J23o2j02l5J41J77j80J44l09O0R4L9
3818B0m0O0l74K28Q8P9q7O6k44L65J8j43J33k03Q7k29K25J42k17K40k69Q5j43
3841a13J20J0n3rJ50L83l57k01K0N2P8n6O4r8J0J56j73j86K97j36K88k02N6k53
3865a53J53L07k29j63J85j6P0k6q0m6j01J25R3K67l85K95l30P5k42J97O6r9j17
3888a54L08j62l8R6p7m4K11N3j74q1m0r6K87j84l8j15Q9K73j63k3j16J47K67L4
3912B60k49o8L45k21j63k2K14r3k23K15J38R0k59J50J12K5l45P8l6j01l5J33L9
$$ plain form
3935 -16 -90 -89 131 40 -23 205 -156 -81 205 -134 -6 -89 -290 13 -59 -14 -82 -4 180 -111 -21 127 81 -42 -322
3960 -322 -32 92 28 55 222 -119 322 31 77 -92 137 84 -157 -271 -78 98 175 243 43 -77 -131 219
3982 219 -160 65 -42 -167 -100 225 -127 28 68 60 288 21 178 -200 10 -106 262 29 -39 -189 -113 43
4004 43 -98 -191 198 92 -163 -30 -104 262 132 250 -252 -132 205 -5 100 45 8 -13 7 -374 148 -64
4026 -64 -167 166 -31 176 76 -124 19 -13 249 83 244 10 -73 176 55 -197 16 262 -32 66 152 -8
4048 -8 -119 -187 149 -61 83 69 117 -52 13 -292 66 -85 -68 -12 -121 80 329 50 55 -95 65 -149 74
4071 74 -227 20 -100 95 -116 -20 141 15 -115 -131 -204 286 64 -68 -89 198 -169 -54 4 -113 108 67
4093 67 44 -30 -68 -231 215 -22 -2 -80 137 51 -191 -227 -204 -208 -59 -63 42 -137 -67 -61 -273 68 90 31 38 -117 -15
$$ packed form
3935a6p4JK20r1o3K28l61P5K86l39J28q3k01L03p2M5o8P8J84k91R0J48m6j23k80
3960c22K90J24o4K7J67l41M41k91M6j69K29n3k41j14J93J76P7O8k00j20n4L50
3982B19l79K25j07j25O7L25l52J55M0qK28k67J57l78K10j16L68k33o8j50P6J56
4004D3j41r3L89j06k55J33p4L66j30J18n02J20L37k10J05n5l7k1K0l81N22k12
4026f4j03L33j97K07j00k00J43l2K62j66J61k34q3K49j21k52K13K46k94R8Q6j60
4048hj11o8L36k10J44j4M8j69O5l05L58j51J7N6j09K01K49k79Nj50J60k14K23
4071G4l01K47j20J95k11R6J61j26j30j6p3M90k22j32k1K87l67J15N8j17K21m1
4093F7k3p4l8j63M46k37K0p8K17q6k42l6K3mJ49mJ05j79P0Ok12L41K2n9Pj55J02
$$ plain form
4120 -15 -145 -117 -71 11 -136 38 194 -7 -29 -69 16 -153 12 125 122 92 -198 174 123 -67 -149 -3 -370 -3
4144 -3 4 -13 38 115 -16 140 194 8 -128 157 30 -209 -223 156 -243 -209 55 -415 -167 58 85 40 -113 21
4168 21 214 -215 -62 -127 63 -8 -58 -85 -36 -135 55 -91 -114 -284 -176 22 -120 53 -10 102 100 -168 76 119
4192 119 -49 -248 24 -441 -142 32 22 82 -46 -55 71 166 107 87 6 -222 197 -185 -4 -196 99 190 41
4215 41 -35 60 42 115 54 -69 -9 49 46 -155 -9 73 -83 -149 -49 7 -204 175 -211 149 -128 -68 5 -66 0 64
4241 64 109 -295 230 -117 -128 110 33 -45 -21 77 23 22 152 117 -16 61 -246 359 7 -104 69 -88 -12 -267
4265 -267 -92 -121 -158 244 131 102 -27 212 -67 24 295 192 46 138 -34 95 -135 -66 253 145 102 160 203
4288 203 27 133 32 94 -102 216 -14 128 200 -31 -188 -49 -27 78 31 150 -57 158 40 5 15 86
$$ packed form
4120a5j30K8M6Q2j47J74J56k01k2m0Q5j69J65J13ll0k90L72n1j90q2J46l67L67
4144cPj7N1P7j31J56N4j86j36K85j27k39j4L79l99L4K64m70K48K25K7m5j53J34
4168B1J93m29J53o5J90p1n0k7M9r9J90j46k3j70J08J98j42J73o3J12kk68K44M3
4192A19j68j99K72m65K99J74j0O0j28rJ26R5n9k0q1k28M19l82J81j92K95R1j49
4215D1p6R5j8P3o1j23O0N8lk01J46Q2j56o6J00N6k11L79l86L60k77O0P3p1O6O4
4241F4M5m04N25l47j1K38p7p8K4R8n4jJ30l5j33P7l07O05l52j11J73j57P6k55
4265b67J75k9l7M02j13k9j29K39k79R1K71j03j46R2j72J29k30O9L19j08m3N8M3
4288B03j76J06j01O2j96L18k30J42P2k31j57J39K2J05m7J19k07K15j18l5J0P1
$$ plain form
4310 86 -1 11 -188 -209 -132 10 77 55 97 3 32 -230 -115 35 171 -24 7 -50 -292 -82 18 -16 -155 -170 -55
4335 -55 19 -47 42 107 87 196 174 152 -46 22 18 14 205 170 55 203 81 -201 -6 -215 -25 65 -37 29 79 -45
4361 -45 47 -203 -132 105 206 -105 -189 81 -75 -175 -24 -65 -134 47 208 -27 -269 -118 136 139 123 37 -316
4384 -316 45 116 26 -234 112 59 -68 -10 -37 -75 -92 -187 121 -80 204 -32 186 87 -138 -66 -13 -58 -70 174
4408 174 -16 -307 -39 -190 -179 -120 104 -217 -201 123 -42 -91 -88 -8 143 -14 -120 29 99 -34 -252 -6 89
4431 89 -52 -33 -220 76 -59 -162 -25 -117 122 250 -210 -80 0 92 -135 46 37 31 -95 -40 100 -228 87
4454 87 -203 -90 -143 -106 106 128 -5 -82 -4 6 -198 51 234 49 216 93 55 -60 -148 144 172 -123 -269
4477 -269 -45 96 95 -115 -96 -28 62 -315 269 69 -30 31 84 32 -264 393 140 -4 187 111 78 96 -21 -60
$$ packed form
4310H6q7J2j99k1P7J42O7k2M2r4K9k62J15J50J36j95L1n7k42K10J00l4j39j5J15
4335e5P4o6Q9O5k0J09k2k2j98O8mmJ91l5j15J48j22k82J95k09J90R0j02O6N0j24
4361d5R2k50P1K37J01l11q4K70j56j00J51m1o9J81J61k35k42J51K54Lj6q6l53
4384c16L61P1r0k60L46n3j27N8k7l8j7r5L08k01K84k36K18r9k25P2N3m5j2K44
4408A74j90k91K68j51J1N9K24l21J6L24j65m9LQ0J51j57j06J49P0j33k18K46R5
4431H9j41J9j87K96j35j03J37r2K39J28m60J30Q0R2k27J81roj26N5J40l28L15
4454H7k90J13n3L7K12K2j33p7P8J0k04K49J83j85J67j23l8j15q8K92K8k95j46
4477b69K24J41jk10J9O8R0l77N84k00r9O1N3n2k96O57k53j44J91p6l3J8j17l9
$$ plain form
4501 -60 110 -97 176 74 51 278 62 118 -84 -286 -184 -38 -246 -32 18 -244 -20 101 -178 -5 22 84
4523 84 -63 -1 167 -122 196 -39 40 327 94 -102 -44 -17 59 76 188 -4 -134 136 179 -116 -98 13 -82
4546 -82 116 269 -10 165 -203 63 -149 2 -173 -10 -88 -156 65 -62 132 -107 211 -50 -69 -94 22 -65
4568 -65 -1 135 273 254 40 -59 -212 -72 14 54 -137 179 61 257 -130 -12 -48 -165 85 53 190 31 197
4591 197 -7 -84 -48 37 132 -7 57 260 -64 -34 -5 -22 183 -155 128 -186 20 -65 -37 84 -132 -66 -186 -167
4615 -167 55 -275 95 208 42 -96 -14 45 -203 195 223 56 -8 90 14 -191 2 -60 -187 -24 225 -47
4637 -47 -93 -39 30 83 125 -39 -104 -295 101 -150 76 156 -175 114 105 -21 128 -57 -5 37 -75 12 258 -49
4661 -49 70 96 20 -22 -4 -57 -142 173 46 -79 198 -66 139 -48 -196 -353 -130 41 54 58 50 50 156 -100 87
$$ packed form
4501f0J70k07K73j02k3K27k16N6k02k02J02J46k08K14N0k62K24J21k79J73K7O2
4523H4j47O2J68k89L18k35P9K87k33j96N8K7P6J7J12j92j30K70M3k95J8J11r5
4546h2J98J53k79J75l68K66k12J51j75J63p8o8K21j27J94k39L18k61j9k5J16q7
4568f5O4J36J38j9k14r9j53J40Q6M0j91L16j18J96l87J18l6j17K50l2J37j59J66
4591A97k04p7L6Q5R5j39O4K03l24L0K9j7K05l38K83l14K06q5K8J21k16O6j20J9
4615a67K22l30L70J13j66j38Q2N9k48L98K8j67o4R8p6k05J93o2j27J63K49k72
4637d7m6N4O9N3M2j64o5j91L96k51K26Q0l31K89rj26J49j85N2M2j12Q7K46l07
4661d9J19K6p6m2J8n3q5L15j27j25K77k64K05j87j48j57K23J71J3Mq%J06k56J87
$$ plain form
4686 87 66 -31 20 -31 230 -71 134 -79 158 -207 197 -244 -189 -65 -115 108 -182 45 -62 2 277 -171 -64
4709 -64 182 -65 -48 9 135 -77 -138 152 51 -65 42 164 -204 -169 157 177 -165 -104 223 210 14 -122 38
4732 38 12 -112 3 -61 -109 135 14 122 18 -71 -41 -147 208 -158 -35 32 108 65 81 -257 -104 115 62 166
4756 166 -218 -62 -54 -8 136 34 -193 77 15 -242 -148 1 -66 183 -166 164 -240 -63 -71 29 -114 110 -91
4779 -91 -112 -26 -49 -90 -143 4 -167 82 -71 -49 44 15 66 172 -46 125 12 107 108 133 -38 40 -32 62 207 -68
4805 -68 -160 -312 131 -106 40 -188 24 136 255 -211 -56 -167 17 -81 116 8 -109 -45 -20 83 -23 5
4827 5 -308 -33 271 28 -35 68 18 259 55 -75 -82 -154 39 -197 47 -28 -97 144 72 -54 7 27 -33 57 97
4852 97 -3 -64 -69 49 159 -40 70 205 -47 36 68 67 27 70 96 -73 158 38 -80 -13 128 124 205 76 -186
$$ packed form
4686H7k1r7N1n1K61l01K05k13K37l65M04m41N5J24n0K23k90K27j07O4K75m48J07
4709f4K46k47J7N7J26k12o1K90j01j16J07J22l68L5L26K0l42O1L27j3j96j36J60
4732C8k6j24J15o4m8K44j21J08j04q9L0j06L55l66J23O7P6m3J6l38J53K19n3J04
4756A66l84J56QM6J44j02k27K70o2k57R4J49o7K49l49L30m04J77qJ00j43K24k01
4779i1k1Q6k3m1n3J47j71K49j53K2R3k9N1J06k18J71j13R5JK5j71P8p2R4J45k75
4805f8r2j52M43k37J46k28K12J12J19m66J55j11J84r8J97j08j17O4K5J03j06K8
4827El13K75L04k43o3J03n0K41k04j30pp2J93k36K44p5o9K41p2j26O1K0o0R0M0
4852I7j00o1nJ18J10j99J10J35k52Q3L2jm0M3K6j69K31j20j18O7J41mQ1j29k62
$$ plain form
4877 -186 -11 72 39 -39 -82 165 229 -48 203 190 -178 55 -75 162 -36 84 39 148 -149 -457 6 -77 -7
4900 -7 55 16 -106 -203 38 93 86 77 194 -21 187 194 45 -148 -109 -155 -42 41 -84 25 125 15 232 -282 -222
4925 -222 1 -95 5 -246 134 85 125 120 -48 108 -211 -191 -62 122 194 -67 38 -35 0 -42 233 -175 192
4948 192 -230 -80 106 -113 -3 73 -121 123 152 -73 23 13 267 151 -257 -148 8 2 46 -78 113 -70
4970 -70 -226 251 -231 46 128 -8 2 105 -309 -124 -98 -194 173 -12 -112 202 107 44 -175 -107 232 -222 -226
4993 -226 -229 -33 -11 -42 105 143 149 -11 143 64 155 -122 -274 55 68 -41 162 10 -221 -85 -124 27 -42 -44 85
5018 85 -11 32 -97 -66 73 -161 -38 -13 -24 -122 -82 32 -32 68 -126 117 343 -133 197 -266 -59 225 39
5041 39 269 -155 24 22 -5 43 236 -62 -80 -165 52 178 173 -71 118 229 -53 -17 140 53 -28 22 -134 103
$$ packed form
4877a86J75Q3l3p8m3K47O4k77K51j3l68K33j30K37j98J20m5J09k97l08M63q3P0
4900gO2l9j22r7K41N5prJ17k15K08Pj49j93L9m6J13Q3j25J09J00j10K17n14O0
4925b22K23r6J00k51L80m9M0nj68J56l19K0J29J84P2k61J05p3L5m2K75m08L67
4948A92m22J50J86k19J10P6j94K44K9k25R6j0K54j16m08J09J56oM4j24J91j83
4970g0j56M77m82K77Q2j36J0J03m14J85K6r6L67j85j00L14r5o3k19O8L39m54m
4993b26lJ96K2l1J47L8Oj60J54p9R1k77j52L29J3j09K03j52k31J36l9J51o9kJ29
5018H5r6M3j29L1J39k34J23K5j1r8M0J14o4J00j94K43K26m76L30m63K07K84j86
5041C9K30m24J79kk7M8J93k98j8q5K17J26nk44J89J11k82L6J57q7q1N0j56K37
$$ plain form
5065 103 -61 -203 -26 174 61 10 59 94 -222 -353 89 48 -288 191 -29 -142 12 -146 96 5 181 -48
5087 -48 -106 183 -13 50 162 -87 -165 -262 -101 -241 -222 -224 3 189 129 164 -125 -2 78 11 129 -57 -55 -100 -51
5112 -51 105 31 -22 168 241 -59 159 35 49 -177 -28 83 93 33 81 -115 -144 -22 33 -10 -59 219 237 19
5136 19 -199 46 -283 -203 -313 -21 106 24 -96 42 -93 20 91 -130 93 60 125 -82 -153 -60 147 -114 -128
5159 -128 -125 75 80 23 266 -56 22 -197 215 -64 -288 -29 76 -47 -227 -234 -45 94 -260 34 -169 -155 140
5182 140 64 -171 -197 -167 -8 -74 -112 -27 -110 36 40 -50 -170 -182 -44 54 94 52 64 -66 195 10 -112 -60 45
5207 45 -156 -192 -143 -122 -102 37 108 40 44 191 109 257 197 261 110 -162 75 -163 244 -139 -4 -276 134 3
5231 3 -54 52 -22 13 -168 -57 -193 -341 -53 -95 -74 -3 -64 90 -164 -110 102 -108 4 128 -294 56 -96
$$ packed form
5065A03j64j42J77K00j13n1M9L5l16j31M42m1l36M79k20j13J54j58K42r1J76k29
5087d8n8K89j96O3J12k49p8r7J61j40J9kK27J86o0L5k89J23Q0o7J18j86Km5M9
5112e1J56p4n3J90P3l00K18j24J4k26J49J11J0o0M8j96k9J22N5m3m9K78J8k18
5136A9k18K45l29Q0j10K92J27q2j20J38j35J13P1k21K23l3O5k07p1R3K07k61j4
5159a28LK00Nn7K43l22P8k19M12k79k24K59J05j23j80pJ89J39l54K94k03J4K95
5182A40p6k35k6L0J59o6l8Q5q3J46Mr0j20j2J38R8M0m2J2j30K61j85j22N2J05
5207D5k01l6M9K1K0J39P1o8MJ47q2J48o0O4j51k72K37k38M07l83J35k72M10j31
5231Cn7J06p4L5j81J11j36j48K88m2K1P1o1J54k54N4K12k10J12J24m22L50j52
$$ plain form
5254 -96 13 192 -183 -37 104 152 136 -44 -76 -157 -217 -156 89 17 -67 250 -118 -55 143 100 -271 -26 -44 57
5278 57 37 -98 -94 177 28 -275 -120 122 -4 -49 -94 254 54 144 -84 -36 -60 167 -139 -197 -37 -17 327 101
5302 101 26 -44 18 37 134 -179 133 61 13 109 -80 99 -78 100 -17 148 -66 -332 27 181 485 80 2
5325 2 -68 -138 -135 145 -175 -51 -144 -82 3 147 -279 -113 134 -104 49 -234 83 24 66 -181 52 -44 -30 131
5349 131 200 67 -24 171 -43 -226 -145 64 107 -126 128 44 -71 -51 -184 -16 -86 168 26 -13 63 56 -195 3
5373 3 -23 138 -216 -22 7 71 -139 112 -44 -19 37 -56 136 -114 -54 218 -19 -268 18 -2 144 47 -51 98
5397 98 222 -110 -71 -269 -114 -75 151 -140 -78 30 38 -129 -59 36 267 65 -8 129 47 102 115 -14 116 1
5421 1 128 -55 -81 -144 207 -14 64 29 -150 -29 -12 2 -34 -10 5 -135 -92 -45 78 203 232 -30 4 15 -85
$$ packed form
5254i6J09J79l75J46J41M8j6j80l2q1o0O1K45p2q4L17l68O3J98m3l71K45j8J01
5278E7k0j35MK71j49l03J55K42j26m5m5L48k00R0k28M8k4K27l06n8J60K0L44k26
5302A01p5p0O2J9R7l13L12p2m8R6j89J79j77J78j17J65k14k66L59J54L04m05p8
5325Bp0p0LK80l20J24r3O2Q5J44m26J66K47k38J53k83L17n9M2k47K33r6J4J61
5349A31O9j33r1J95k14j83Q1K09M3k33K54q4j15K0j33J68p0K54j42l9P6pk51J98
5373Ck6J61l54J94K9O4k10K51j56K5N6r3J92k50O0K72k37k49K86k0J46r7r8J49
5397I8J24l32L9j98J55L9K26k91O2J08Qj67P0R5K31k02p3J37q2N5J3j29J30j15
5421AJ27j83k6o3L51k21P8l5j79J21J7J4l6K4J5j40M3M7J23J25K9k62L4J1j00
$$ plain form
5446 -85 83 -67 -38 -130 -115 -147 323 -112 324 -38 158 118 -26 -172 -180 215 259 162 -147 -8 76 80 35 -47 -86
5471 -86 -127 -67 -75 -51 -312 -195 41 129 -104 -73 -158 20 -87 68 -203 66 -2 -60 -12 -202 -81 -84 -124 -129 251 -26
5497 -26 -106 -373 -286 -257 48 8 -336 30 140 56 -117 51 -60 66 -13 -161 80 19 43 -1 64 0 -98 115
5521 115 -36 90 -157 189 200 -69 -4 -184 59 44 104 34 -244 -61 128 -102 131 -61 -49 -73 -5 -116 46
5544 46 53 47 75 49 -164 -72 -92 -236 21 -188 -23 16 -46 38 -31 39 83 18 -20 8 251 161 -136 90 161 -226 282
5571 282 -153 -68 -167 57 54 6 155 -120 -245 127 -303 -57 -113 75 150 -110 -73 -16 126 -169 2 -124 171
5594 171 174 -38 259 -130 -140 -37 8 17 49 45 138 -110 -126 246 -154 111 -117 -7 129 24 -43 75 -82 3
5618 3 177 -52 -318 -82 30 -10 260 72 117 -98 -160 -247 -315 34 42 -144 25 -120 84 -51 -151 17 -13
$$ packed form
5446h5J68j50K9r2J5l2M70m35M36l62J96m0j44j46qL95M4r7l09J39Q4Mm5q2l9
5471h6m1O0qK4k61J17K36Q8k33L1q5J78j07J55k71K69o8n8M8j90J21lm0nL80k77
5497b6q0k67Q7K9L05m0l44L66J10q4j73J68j11J26p9j48K41o1K4m4O5o4r8K13
5521A15j51J26k47L46J1k69O5j80K43j5O0p0k78J83J89k30K33j92J2k4O8j11J62
5544D6PoK8k6k13R2k0j44K57k09J65L9o2Q4o9P0M4o5l8K8K43r0k97K26P1l87N08
5571B82m35Q5r9K24lm8J49k75j25L72m30K46n6J88P5k60L7N7J42k95J71j26K95
5594A71Lk12K97l89j0J03M5RL2mR3k48j6L72m00K65k28J10J36j05o7J18j57Q5
5618CJ74k29k66K36J12m0K70j88M5k15o2q7o8L49Qj86J69j45K04j35j00J68l0
$$ plain form
5641 -13 111 93 28 69 -152 164 242 72 -98 -195 228 -122 -50 133 -200 -160 -115 54 103 78 230 106 -3 -89
5665 -89 -150 127 -60 -58 114 65 161 295 146 -147 -40 82 -59 -146 -191 -15 -16 124 94 -41 39 -183 39 -85
5689 -85 244 23 188 -169 -117 57 -19 -14 -129 -31 -94 304 141 30 -24 27 58 -120 0 117 73 44 -233 -113
5713 -113 -124 -35 14 -203 -10 105 -79 20 -85 -354 -18 19 34 -18 231 -38 7 -78 -101 -291 59 -25 -67 -28
5737 -28 -73 17 -66 -135 -87 -13 -326 99 -36 -72 -56 -136 -88 -124 173 -1 145 -146 72 132 -219 228 -71 -179
5761 -179 88 75 -15 -12 40 118 218 -63 141 14 53 11 -86 -54 -70 78 240 118 65 -12 57 97 -13 -162 25
5786 25 -81 -262 -4 -7 -108 182 9 131 274 -114 240 120 -10 276 106 15 64 30 318 92 -242 50
5808 50 25 -161 172 -127 254 -77 -100 -114 -93 -35 195 -42 5 53 59 -226 -4 68 -257 94 -218 120 317 90
$$ packed form
5641a3J24j8o5M1k21L16P8j70j70r7M23l50P2J83l33M0M5J69M9k5J52j24j09q6
5665h9o1K77j87KJ72m9R6J34j49k93J07J22j41q7m5J76jJ40l0j35Q0k22K22j24
5689h5L29k21J65l57N2J74p6Nj15R8o3L98j63j11n4N1L1j78J20J17m4k9k77J20
5713a13j1Q9M9k17J93J15j84R9j05k69L36L7J5n2K49k69M5q5k3j90L50q4m2L9
5737b8m5R0q3o9M8P4l13M25j35l6J6q0M8l6K97j74J46k91K18O0l51M47k99j08
5761a79K67j3r0LN2P8J00k81K04j27L9m2r7L2j6J48J62j22n3p7O9M0j10j49J87
5786B5j06j81K58lj01K90j73J22J43l88L54j20j30K86j70r1M9l4K88k26l34K92
5808E0k5j86L33k99L81l31k3j4K1N8K30k37M7M8Ok85K22P2l25L51l12L38J97k27
$$ plain form
5832 90 160 -158 -220 16 116 -50 81 -32 -46 -6 138 196 158 207 -40 -173 80 -111 79 38 -106 49 176
5855 176 136 -29 269 -19 276 128 60 -198 -143 124 73 10 -140 9 -40 2 -95 -59 -72 -152 -73 -75 257 -186 233
5880 233 62 -120 64 106 -123 -159 130 148 -227 316 183 271 24 -82 10 21 101 46 -215 119 198 77 -138
5903 -138 -51 13 -36 -47 13 -332 -198 -34 43 246 -31 81 314 41 -23 37 -120 -340 116 274 -234 207 -58
5926 -58 36 -88 27 -175 179 88 113 148 -119 -213 3 -56 -161 232 -186 -147 -61 4 7 74 -121 57 26 241 85
5951 85 241 145 104 -37 -129 -35 139 -56 171 44 78 -215 180 87 137 13 144 45 322 -157 -108 133 46 280
5975 280 224 118 -126 64 -134 -86 1 -234 -111 127 71 -10 -91 57 -198 73 301 -77 -87 -90 -221 -32 12
5998 12 -13 -151 277 264 227 -21 15 36 142 24 77 78 -258 176 86 -151 31 -65 109 174 -80 224 107 -33
$$ packed form
5832I0P0l18o2K36J00j66J31j13j4M0J44N8l8M9k47j33K53j91J90m1j44J55J27
5855A76m0j65K98k88K95j48o8k58N5K67n1o3j50J49m9M2r7L6j3q0P9kL32m43M19
5880B33j71j82J84M2k29l6K89J8l75N43j33Q8k47j06R2J1Q0n5k61L34P9j21k15
5903a38Q7O4m9j1O0l45J34J64P7K03k77J12K33k73o4O0j57k20M56J58n08M41k65
5926e8R4j24J15k02L54r1K5L5k67r4K16n9j05L93m18L9Q6O5LO7j95J78l1K15j56
5951H5J56r6m1j41r2R4J74j95K27j27L4k93L95r3N0j24J31r9K77m79M9K41q7K34
5975B80n6j06k44J90j98M8Q7k35J23K38n6q1q1J48k55K71K28l78j0lj31J89M4
5998A2k5j38M28j3l7k48L6K1J06j18N3Jl36M34r0k37J82r6J74O5k54L04j17j40
$$ plain form
6022 -33 79 -37 0 104 7 -51 -46 243 114 -89 269 175 317 -159 64 -31 -141 77 56 -177 47 -207 262
6045 262 123 -90 105 76 -504 203 136 262 -161 165 61 13 62 -233 -13 -160 -72 -97 -9 -95 68 121 169
6068 169 -35 21 -145 -152 54 -48 -48 119 32 -91 6 -242 -15 3 52 175 82 71 196 232 230 -4 170 52 -51
6093 -51 -32 164 -53 -71 -173 127 69 158 -38 -35 37 191 118 -284 -121 -85 -272 -252 23 -65 377 -59 -140 53
6117 53 118 -103 -192 -63 107 51 332 64 137 48 58 133 13 -78 122 121 52 -195 -45 228 -349 -136 -83 51
6141 51 35 137 -46 30 41 28 390 -118 31 2 -49 52 69 21 -224 67 51 -250 210 -285 117 91 -13 131
6165 131 150 25 -284 86 -66 -23 -242 87 -116 -141 34 49 237 31 -17 14 -93 -75 -77 353 1 53 -185
$$ packed form
6022c3J12j16L7J04r7n8NK89j29k03L58r4J42m76K23r5j10K18k1k33K24k54M69
6045B62j39k13J95k9n80P07o7J26m23L26j04m8M9k95K20j47Q8k5Q8q6J63N3M8
6068A69k04N6j66pK06j02%J67q7j23R7k48K27J8M9J23r3j1J25L6kk34J74j18j03
6093e1J9J96k17j8j02L00n8Q9j96LP2J54p3m02J63L6j87K0K75q8M42m36q1J93
6117E3O5k21q9J29J70n6K81k68P3q9J0P5j20r1K00jo9k47J50K73n77K13N3J34
6141E1j6J02j83P6J1j3L62n08J49k9n1J01J7m8k45K91j6l01M60m95M02k6j04J44
6165A31J9j25l09L70j52M3k19L29k03k5J75J5J88k06m8L1j07J8kM30l52N2k38
$$ [...]
8191a06
##END NTUPLES=NMR FID
##END=
