##TITLE=1H_SR46
 CDCl3,8 sc, 
 12.03.2021
##JCAMPDX= 6.0         $$ Bruker NMR JCAMP-DX V2.0
##DATA TYPE= NMR FID
##DATA CLASS= NTUPLES
##ORIGIN= UXNMR, Bruker Analytische Messtechnik GmbH
##OWNER= root
$$ XWIN-NMR		Version 3.5
$$ Fri Mar 12 12:44:48 2021 Russian Standard Time (UT+4h)  she@DPX200
##.OBSERVE FREQUENCY= 200.131506
##.OBSERVE NUCLEUS= ^1H
##.DELAY= (6, 6)
##.ACQUISITION MODE= SIMULTANEOUS
##.ACQUISITION SCHEME= undefined
##.AVERAGES= 8
##.DIGITISER RES= 18
##SPECTROMETER/DATA SYSTEM= spect
##.PULSE SEQUENCE= zg30
##.SOLVENT NAME= CDCl3
##.SHIFT REFERENCE= (INTERNAL, CDCl3, 0, 15.7039)
##AUDIT TRAIL= $$ (NUMBER, WHEN, WHO, WHERE, WHAT)
$$ ##TITLE= Audit trail, XWIN-NMR		Version 3.5
$$ ##JCAMPDX= 5.01
$$ ##ORIGIN= Bruker BioSpin GmbH
$$ ##OWNER= she
$$ F:/spectra/data/she/nmr/H-F/1/audita.txt
$$ ##AUDIT TRAIL=  $$ (NUMBER, WHEN, WHO, WHERE, WHAT)
(   1,<2021-03-12 12:43:26.84 +0400>,<she>,<DPX200>,
      <created by zg, POWCHK disabled, PULCHK disabled
       configuration hash MD5:
       00 E9 B6 7A A2 85 ED C7 34 08 36 98 17 FE 4E 26
       data hash MD5: 16K
       51 8A 00 0B 7F A1 7C 7F 6F BA AE A9 FB FF 5C 56>)
$$ ##END=
$$ 
$$ hash MD5
$$ 12 B1 DB 56 6B 1F B6 C6 BD 70 58 88 55 86 2C CC
##$RELAX= 
##$RELAX= 
##$RELAX= 
##$RELAX= 
##$RELAX= 
##$RELAX= 
$$ Bruker specific parameters
$$ --------------------------
##$DU= <F:/spectra>
##$EXPNO= 1
##$NAME= <H-F>
##$PROCNO= 1
##$TYPE= <nmr>
##$USER= <she>
##$AMP= (0..31)
100 100 100 100 100 100 100 100 100 100 100 100 100 100 100 100 100 100 
100 100 100 100 100 100 100 100 100 100 100 100 100 100 
##$AQSEQ= 0
##$AQ_mod= 1
##$AUNM= <au_zg>
##$AUTOPOS= <>
##$BF1= 200.13
##$BF2= 200.13
##$BF3= 200.13
##$BF4= 200.13
##$BF5= 200.13
##$BF6= 200.13
##$BF7= 200.13
##$BF8= 200.13
##$BYTORDA= 1
##$CFDGTYP= 0
##$CFRGTYP= 5
##$CHEMSTR= <none>
##$CNST= (0..31)
1 1 145 1 1 1 1 1 1 1 1 1 1 1 1 1 1 1 1 1 1 1 1 1 1 1 1 1 1 1 1 1 
##$CPDPRG= <>
##$CPDPRG1= <>
##$CPDPRG2= <>
##$CPDPRG3= <>
##$CPDPRG4= <mlev>
##$CPDPRG5= <mlev>
##$CPDPRG6= <mlev>
##$CPDPRG7= <mlev>
##$CPDPRG8= <mlev>
##$CPDPRGB= <>
##$CPDPRGT= <>
##$D= (0..31)
0 1.2 0 0 0 0 0 0 0 0.06 0 0.03 0 0 0 0 0.0002 0 0 0 0 0 0 0 0 0 0 0 0 
0 0 0 
##$DATE= 1615538606
##$DBL= (0..7)
120 120 120 120 120 120 120 120 
##$DBP= (0..7)
150 150 150 150 150 150 150 150 
##$DBP07= 0
##$DBPNAM0= <>
##$DBPNAM1= <>
##$DBPNAM2= <>
##$DBPNAM3= <>
##$DBPNAM4= <>
##$DBPNAM5= <>
##$DBPNAM6= <>
##$DBPNAM7= <>
##$DBPOAL= (0..7)
0.5 0.5 0.5 0.5 0.5 0.5 0.5 0.5 
##$DBPOFFS= (0..7)
0 0 0 0 0 0 0 0 
##$DE= 6
##$DECBNUC= <off>
##$DECIM= 32
##$DECNUC= <off>
##$DECSTAT= 4
##$DIGMOD= 1
##$DIGTYP= 9
##$DL= (0..7)
0 120 120 120 120 120 120 120 
##$DP= (0..7)
150 150 150 150 150 150 150 150 
##$DP07= 0
##$DPNAME0= <>
##$DPNAME1= <>
##$DPNAME2= <>
##$DPNAME3= <>
##$DPNAME4= <>
##$DPNAME5= <>
##$DPNAME6= <>
##$DPNAME7= <>
##$DPOAL= (0..7)
0.5 0.5 0.5 0.5 0.5 0.5 0.5 0.5 
##$DPOFFS= (0..7)
0 0 0 0 0 0 0 0 
##$DQDMODE= 0
##$DR= 18
##$DS= 0
##$DSLIST= <SSSSSSSSSSSSSSS>
$$ [...]
##$SUBNAM2= <"">
##$SUBNAM3= <"">
##$SUBNAM4= <"">
##$SUBNAM5= <"">
##$SUBNAM6= <"">
##$SUBNAM7= <"">
##$SUBNAM8= <"">
##$SUBNAM9= <"">
##$SW= 16.9725357007746
##$SWIBOX= (0..15)
0 0 2 0 0 0 0 0 0 0 0 0 0 0 0 0 
##$SW_h= 3396.73913043478
##$TD= 16384
##$TD0= 1
##$TE= 0
##$TE2= 300
##$TE3= 300
##$TEG= 300
##$TL= (0..7)
0 120 120 120 120 120 120 120 
##$TP= (0..7)
150 150 150 150 150 150 150 150 
##$TP07= 0
##$TPNAME0= <>
##$TPNAME1= <>
##$TPNAME2= <>
##$TPNAME3= <>
##$TPNAME4= <>
##$TPNAME5= <>
##$TPNAME6= <>
##$TPNAME7= <>
##$TPOAL= (0..7)
0.5 0.5 0.5 0.5 0.5 0.5 0.5 0.5 
##$TPOFFS= (0..7)
0 0 0 0 0 0 0 0 
##$TUNHIN= 0
##$TUNHOUT= 0
##$TUNXOUT= 0
##$USERA1= <user>
##$USERA2= <user>
##$USERA3= <user>
##$USERA4= <user>
##$USERA5= <user>
##$V9= 5
##$VALIST= <valist>
##$VCLIST= <CCCCCCCCCCCCCCC>
##$VD= 0
##$VDLIST= <DDDDDDDDDDDDDDD>
##$VPLIST= <PPPPPPPPPPPPPPP>
##$VTLIST= <TTTTTTTTTTTTTTT>
##$WBST= 1024
##$WBSW= 4
##$XGAIN= (0..3)
0 0 0 0 
##$XL= 0
##$YL= 0
##$YMAX_a= 183459
##$YMIN_a= -235854
##$ZGOPTNS= <>
##$ZL1= 120
##$ZL2= 120
##$ZL3= 120
##$ZL4= 120
##$ABSF1= 10
##$ABSF2= 0
##$ABSG= 5
##$ABSL= 3
##$ALPHA= 0
##$AQORDER= 0
##$ASSFAC= 0
##$ASSFACI= 0
##$ASSFACX= 0
##$ASSWID= 0
##$AUNMP= <proc_1d>
##$AZFE= 0.1
##$AZFW= 0.1
##$BCFW= 1
##$BC_mod= 2
##$BYTORDP= 1
##$COROFFS= 0
##$CY= 11.3945322036743
##$DATMOD= 1
##$DC= 2
##$DFILT= <>
##$DTYPP= 0
##$F1P= 15.9154993809931
##$F2P= -4.1035820241983
##$FCOR= 0.5
##$FTSIZE= 0
##$FT_mod= 4
##$GAMMA= 1
##$GB= 0.15
##$INTBC= 1
##$INTSCL= 1
##$ISEN= 128
##$LB= 0.24
##$LEV0= 0
##$LPBIN= 0
##$MAXI= 10000
##$MC2= 0
##$MEAN= 0
##$ME_mod= 0
##$MI= 1.114404
##$NCOEF= 0
##$NC_proc= 0
##$NLEV= 6
##$NOISF1= 3.799351
##$NOISF2= 2.8
##$NSP= 1
##$NTH_PI= 0
##$NZP= 0
##$OFFSET= 15.70392
##$PC= 1
##$PHC0= -11122.24
##$PHC1= 15.80094
##$PH_mod= 1
##$PKNL= yes
##$PPARMOD= 0
##$PSCAL= 0
##$PSIGN= 0
##$REVERSE= no
##$SF= 200.130013532006
##$SI= 16384
##$SIGF1= 3
##$SIGF2= 2
##$SINO= 400
##$SIOLD= 16384
##$SREGLST= <1H.CDCl3>
##$SSB= 0
##$STSI= 0
##$STSR= 0
##$SW_p= 3612.71676300578
##$SYMM= 0
##$S_DEV= 0
##$TDeff= 0
##$TDoff= 0
##$TI= <>
##$TILT= no
##$TM1= 0
##$TM2= 0
##$TOPLEV= 0
##$USERP1= <user>
##$USERP2= <user>
##$USERP3= <user>
##$USERP4= <user>
##$USERP5= <user>
##$WDW= 1
##$XDIM= 8192
##$YMAX_p= 0
##$YMIN_p= 0
$$ End of Bruker specific parameters
$$ ---------------------------------
##NTUPLES= NMR FID
##VAR_NAME=  TIME,          FID/REAL,        FID/IMAG
##SYMBOL=    X,             R,               I
##VAR_TYPE=  INDEPENDENT,   DEPENDENT,       DEPENDENT
##VAR_FORM=  AFFN,          ASDF,            ASDF
##VAR_DIM=   8192,          8192,            8192
##UNITS=     SECONDS,       ARBITRARY UNITS, ARBITRARY UNITS
##FACTOR=    0.0002944,     1,               1
##FIRST=     0,             0,               0
##LAST=      2.4114304,     0,               0
##MIN=       0,             -235854,         0
##MAX=       2.4114304,     183459,          0
$$ Real data points
##PAGE= N=1
##DATA TABLE= (X++(R..R)), XYDATA
0@%%%%%%%%%%%Qj6J6j6K4l2L9m7N6o4P2q8J04j23J47j70J94k24K57k94L35l80
33b02M30m85N46o11O83p64Q51r46J050j162J285j422J572j732J907k101K314k548
51a335K806l094L415l773M179m643N175n796O531p416Q503r877J1672j4112J7632
66I867k3141L2921n4968J78961j6022l63472M19313k04397p8383K44990k37596
77i1927Q1531R6929j51116Q8684k7352K0133j6020k6114Q3116r3133N3899K7364
89D5994j27623J40860m6096p5852J13811o9638J2181L6699n3657L6810j8325J2918
101H082p806k3282M9859m1071J3466P657l5488N8237n4145O352M6297n9228N5946
114B4876l5819j4438P9013r9161L8136L6378q1638Q3454l6318l2327P8071n7225
$$ y = [0, 0, 0, 0, 0, 0, 0, 0, 0, 0, 0, 0, 8, -8, 8, -8, 16, -16, 23, -24, 32, -32, 40, -48, 56, -67, 80, -90, 104, -120, 137, -157, 178, -202, 228, -257, 289, -322, 361, -403, 448, -498, 552, -610, 675, -747, 825, -907, 1000, -1101, 1213, -1335, 1471, -1623, 1792, -1981, 2198, -2445, 2730, -3066, 3465, -3951, 4552, -5325, 6347, -7765, 9867, -13274, 19647, -35321, 143640, 127618, -235854, 183459, -20938, -99321, 145669, -91927, -10396, 86533, -64583, 24101, -3251, 16882, 862, -25252, 57864, -35269, 18630, 45994, -81629, 59231, 13135, -62717, 51094, -18544, -6363, 30336, -23321, 13489, -4836, 8082, 276, -23006, 26853, -14218, -752, 6905, -28583, 29654, -24491, -18139, 28158, -31070, 24876, -10943, -25381, 53632, -45529, -7393, 28985, -52653, 30801, -5517, -37844, 40227, -16998]
126a6998P542J6484j5990K1281l3002L1791q979j8042M6192o5905L7319L1334
138C3027q2140P2622j2560l8097O6820n4675R289L0046m1638K6141j6201J0592
150C226J0984l4384M4303k6483p084L9384n5181L5861J1740m7756M7718k0855
162A473j0035K7870l4515J9386M8r658J8498k3243K1992l778k1652K9418k5494
175i690N547J5487k9448K6672n635j3442K0395j9511J1648P2j5312K2451j4448
188e214K139R522j9814J6538n407r909J5893j0438N204L509o648Q241p917K298
202b003J247p196J0573o260j52Q282r077O356j748n185R016o949K860N072p033
217b197M974n96m233L101j225p6J065L308j768p03N352p669K031M367j0167P931
$$ y = [-16998, -9456, 7028, -8962, 12319, -20683, 11108, 2129, -15913, 30279, -35626, 1693, 33027, -49113, 23509, 10949, -27148, 39672, -15003, -5714, 24332, -17306, 8835, -7366, 3226, 14210, -20174, 24129, -2354, -9438, 29946, -25235, 10626, 22366, -25390, 22328, 1473, -8562, 19308, -15207, 4179, 4227, -5431, 13067, -10176, 11816, 8038, -13614, 15804, -9690, -4143, 11344, -18104, 8568, 2933, -10509, 9886, -9625, 2023, 2095, -13217, 9234, -5214, -3075, 6447, -13367, 3171, -2236, -12145, 3748, -6690, -1486, 2023, -4625, 3616, -4301, -2003, -756, -7952, 2621, -3639, -3791, 4491, -4586, 1770, 22, -5163, 3853, -3096, -236, 4836, -2197, 2777, 2181, -2052, 1049, -176, -252, 813, 4121, 2353, 1650, 7002, -667, 1364, 5731, -4436, 3495]
233C495K416r533R730j911o531O884k821l069M583j086j475K744j062l095K028
248A297j294l004M090q23j394L789k300r96Q13j976m42N26j74J12J347k10j089
265a728Q88k680J319P17l348N008j273k300N839p210J922N134j0318P440K650
280B060q065R024k623m320O389n273O99K244j701L465l173L089Q76n783P032n013
296a073j707J0873j1876L346J0469j5013P106M401j2707J0761n56q473J1211l938
310B824l017N139n967K487J250n190N349j106r33L286n411M031q7o939O963k240
326D39l285P736o758m43O514p497P21L388k721K111j005q4J318j968j20j658J249
343b063J327l073K667Q50q44O82j839Q01j34m44J111k121M041j022m342O240l588
$$ y = [3495, 5911, -3622, 6108, 4197, -2334, 4550, 1729, -1340, 3243, 2157, 682, 3426, 2364, -731, 1297, 3, -3001, 1089, 266, -1128, 2661, 361, -635, 178, -1798, -2240, -1714, -1888, -1776, -429, -639, -1728, -840, -3520, -2201, -1484, -4832, 176, -1097, -3397, 2442, -4768, -2846, 2288, -8030, -590, 2060, -6005, 3019, 396, -3924, 2465, -2808, -2109, 135, -1566, 1899, -1274, 1815, 2691, -3092, 3940, -1073, -2780, 8093, -3783, -437, 10032, -4981, 2125, 6526, -6181, 4580, 4024, -4449, 6762, 2824, -193, 4946, -1021, 1466, 2716, -2474, 2875, 1769, 836, 4122, -1289, 2742, 2655, -4284, 2679, 439, -2846, 4890, -1868, -2311, 4203, -3294, -2573, 815, -1906, 205, -800, -884, 434, -1534, -1654, -3312, -2063, -736, -3809, -1142, -292, -1136, -454, -2293, -1492, -1626, -2070, -959, -3080, 961, -61, -4403, 1837, -1751]
360a751j737O163n984L621M129p863N406L33n745N677l322r22N683l951J236K623
376C596l524K503j406k147M475l267o7L993m656K759P33n939O478j548l834P277
392E426n333J084M245r078N952p72n647Q008n848J719N486r913Q042j916o578
407e123R755q349J907O322j0359P537j593m991P765q066L590L794p225P738l816
422a114j819N036p470M639p67l066O321n732L864J928o170O683m336J21M632p040
438d290N947j421k818N221n572L323L62l400O704n363L289K205p483P879m602
453a9k136O229o901N746p46l887Q136q118L218L596r201Q729l965j821O146p870
469b864N299j147m942Q561p317K827L789p302P456m857j403N848r104O394o07
$$ y = [-1751, -3488, 2675, -3309, 312, 4441, -3422, 1984, 2317, -3428, 2249, -1073, -1995, 3688, -263, 973, 3596, 72, 2575, 1169, -978, 3497, 230, 163, 4156, -500, 2259, 2992, -2947, 3531, 1983, -1851, 5426, 93, 1177, 5422, -3656, 2296, 1524, -4123, 3885, -1963, -244, 5242, -4671, 3371, 1455, -5123, 4632, -3717, -1810, 4512, -5847, 1690, 97, -4894, 2871, -5195, -1605, 2189, -5036, 2702, -1114, -2933, 2103, -5367, -728, -1495, -4561, 1760, -3972, -108, 1820, -4350, 2333, -2003, -1882, 2750, -4290, 1657, 236, -2582, 2639, -2933, 390, 752, -2648, 4056, -1307, 1982, 4187, -3296, 4583, -19, -2155, 4074, -2827, 2919, 2173, -1714, 6422, -1696, 1522, 5118, -4083, 4646, 681, -1140, 5006, -2864, 2435, 1288, -3654, 4907, -2410, 417, 4206, -3096, 4360, -497, -1900, 3948, -5156, 1238, 631]
484F31n455Q439n707J216K591n626N960m602M14N233p875N437p32m548O037n033
500c620K262J508m233O654m088J63L486n860M300k353j026M349n184M695P1m266
516c142O222m907J684K322m879N819l163n49M506o656M404j79m044O271m253J726
532A182K681n042N001k863j975M190m532K777J3k117M272m060J395J732m200L953
548B407j973r16L174m033K563n68k940L575k507K96J999j862J289m00n52K2j334
565a760J521j866P68J582k705K507l72k145K556j474O5R73q41P03p68P84q49o41
583a962K106k250J046K227l148K772J53k919L143k008j65J816j519J089J18j71
599C28N46m02K62q1J19P75j124J005N1j135P45p59j36Q19k15K30K87K73q88N06
$$ y = [631, -4824, 3615, -2092, -876, 1715, -3911, 2049, -2553, -2139, 3094, -4781, 656, -76, -4624, 1413, -3620, -1358, 150, -4083, 2571, -1517, -1354, 2132, -3728, 572, -1781, -2807, 1542, -3642, 1053, 1124, -3142, 3080, -1827, -143, 2179, -2700, 3119, -44, -593, 3913, -2743, 1661, 1482, -2562, 3709, -544, 1182, 3863, -1179, 3822, 959, -1016, 3174, -1358, 1419, 1432, -685, 3587, -473, 922, 2654, -1546, 2407, 434, -482, 2692, -1341, 1222, 654, -2286, 1289, -1218, -922, 1077, -785, 504, 104, -448, -426, -1760, -239, -2105, -1337, 245, -2460, 47, -325, -2470, 86, -1388, -1323, -350, -1191, -488, -1256, -472, -1321, -1962, 144, -2106, -1060, 1167, -1981, 791, 944, -1975, 1168, -840, -1005, 811, -708, 381, 499, 328, 874, 472, 734, 653, 772, 1547, 423, 1428, 1479, 344, 1089, 330, 194, 1013, 798, 1028, 1315, 1588, 700, 1206]
619A206P9j630J301m61o42J609j468L62J100k422J600m46j171K086j961M47J094
636F83j797J018o97n18J129r98P03L18p48J287j339k66O46r13O79n48P68m4q90
655a527J264q69J7Q79j407J668j38j067J799j491L15L53j053J584p01R16M48j890
673i00K563j010j830L099k200N09J742k627K298j89j647K122j933J283L28j629
689b1K021j148o5O54k263K293k53k341K932j050k16R59j695J387j029p30J288
706G23j382R55K20j307R75o68J57K42j306J440l33r01N56lL76j058l07J168j185
725a638J334J22j521K035n22r95K70K26N15j516N74J875j428K76J4j13J205j591
743h78L56J366j297Q30p71j48J629j601N68L20p0J556k306R62J602k414R49L05
$$ y = [1206, 1285, -345, 956, 495, -147, 1462, -6, 356, 1456, -966, 634, 188, -983, 1103, -858, -411, 683, -1114, -96, -793, -1311, -182, -1180, -477, -159, -907, 380, -959, -1225, -579, -1492, -813, -1361, -593, -637, -1527, -263, -1132, -1115, -236, -1643, 25, -113, -1180, 619, -872, -557, -204, -1257, 327, -374, 542, 990, -900, 1663, 653, -1177, 1922, -278, 231, 1973, -654, 1644, 1455, -192, 1930, -3, 1280, 1608, -21, 2000, 852, 787, 1441, -822, 1471, 1218, -1123, 1809, 759, 543, 1502, -193, 1194, 165, -565, 723, -659, 296, 516, -791, 184, -484, -327, -85, -1391, 49, -284, -1185, -629, -632, -256, -1314, -1621, -453, -1638, -304, -182, -1703, 332, -190, -1185, -915, -689, -174, -1690, -1116, 759, -669, -393, -379, -492, 713, -878, -522, 844, -453, 377, -394, -542, 1087, -514, 54, 374, 304, 1860, -446, 516, 2118, -296, 653, 958]
761I58r67J107m78m2O48o28M45o16N5K92j25K00n25L43N96j484K40K60l22N38
781D95p13J56Q16q33m17P5P46q63q10J257o3j98J63j180J808m01j808J656kj280
801a396J265r55K31R35j409m26J738j68j124R41P55j357P68Np91J035l79m84J081
820B65m18j34O71r2k18K08L7J50kL34k85l47O01m24j37N03k42l4R64n45n49J001
842A307p38m14M46k40o7N98o11J21N03n24l36K71O34r44K24N50j040J31j2l35
862d76N02k66p12R31J29q23M39N6r93M68L44r14R59J94j287J093J92j176Q96K22
882b22m84K53k1PK3P2n18M33Q25j378R46N66j594J620J04j371J400n55o53J055
902E08k39K00M3j64K29k93P7K82n8j28K25J76m27k5J62k5k3m7J76p8k61P48n18
$$ y = [958, -9, 1098, 620, 578, 1226, 598, 1043, 427, 482, 774, 649, 849, 324, 667, 1263, -221, 19, 279, -43, 495, -218, -62, 754, -79, -496, -421, 325, -538, -1348, -91, -154, -352, -189, -1369, 439, 38, -1770, -114, -116, -1396, -131, -1086, -855, 80, -1329, -1755, -17, -185, -1309, -368, 387, -970, -202, -197, -988, 47, -332, -816, 265, -153, -287, 384, 292, 74, 282, 319, 469, 467, 801, 516, 169, 770, 346, 209, 712, 470, 436, 1400, 855, 306, 1307, 569, 155, 601, 361, 294, 892, 281, 402, 905, 381, 45, 316, 950, 6, 230, 780, -260, -129, -141, -476, 26, -240, -952, -21, 108, -715, -276, -220, -1213, -745, -401, -1315, -356, -162, -1449, -356, -164, -1340, -444, -222, -706, -453, -474, -467, -444, -372, -890, -457, 368, -1010, -64, 502, -1092, 528, 632, -739, 661, 106, -547, 508, 269, 469, 512, 348, 577, 284, 361, 643, 585, 457, 682, 858, 431, 406, 568, 543, 520, 473, 649, 571, 310, 1058, 540]
925E40m35P40r13L25J06n63P35o36J29N82j035M87j28k94N65o32M0N89j360R67
945a91l85n16R38n75J29N15p19O97r59L07N42j092J075m73p8Q89j163R38l3o89
965h43R24o38L74R28j395Q95j92o25J051q85K77R28j017P86l03m44R11q69K86
984A49O78r24M26Nr6P50q66J72O90m53J56j96J50K20n98r4J41r8L17o90N80J67
1006E86l90J6m85P12k89n83L44j44J44P1m88L15q8n10O15k62J39K77p28M78J24
1027a46m92L4j97L73j08j35L95l12K63K11p75R06k41m73Q15k92O0K87o91P18j00
1048A00k92M08n14P16j27o44R09m08L19j79o80J333k33o50O84k76N03n63m94R72
1068H84l06j22J12l87P61m97p1K42m59M49j99l49P70p57OJ61n96Q55q72Q7N69
$$ y = [540, 105, 845, -68, 257, 363, -200, 535, -101, 28, 610, -425, 62, -66, -360, 205, -427, -387, 202, -1158, -191, -576, -1092, -154, -729, -600, -85, -804, -107, -1066, -759, -217, -1309, -234, -707, -785, 104, -1059, -121, -154, -843, 81, -557, -183, 745, -650, 245, 53, -572, 479, -406, -129, 799, -218, 568, 265, -179, 732, -137, 149, 827, -97, 329, 334, 238, 988, 122, 294, 984, 531, 687, 491, 641, 861, 263, 169, 310, 212, 529, -161, 419, 586, 196, 212, -273, 439, 150, -433, -89, -233, -89, -18, -506, -191, -279, -789, -174, -436, -297, -20, -748, -270, -146, -638, -604, -801, -428, -536, -671, -276, -588, -325, -114, -889, 17, -224, -697, 118, -174, -114, 173, -518, 200, 100, -192, 216, -298, 418, 291, -353, 556, 148, 467, 288, -392, 941, 708, 58, 742, 466, 969, 406, -88, 884, 578, 456, 568, 181, 942, 445, 374, 616, 157, 606, 407, 58, 828, 71, 77, 238, -358, 497, -375, -288, 281]
1089B81m11L61l39n87J012r34J35M23o85Q57o33l90R50p34K44j49J31P15j052
1108h05N37K14q93Q39o27O2Q09q58P05J09p22J076j024L59N79j118J114l41k43
1127b28Q24o08J19N10p85R86q15p1P68p28Q01o21J43N97j001N22N16j084J029
1146H74k44n75P90r62M94P3n67O24k79k41M75n99L01R0n07M60j36k27K95k93r6
1167b50j36O9L0j79K29r4j05M67p71P21m25l30R99q40N9N65p55N89k73R7Q0l68
1189f21Q70l00q16J228p75j13Q01r88O06K34o25Q92n22J60O17q38O95o49J80L94
1209D30l51J11M31r16J188n66k64O13m40L78l38J3K41o14N97l3o53R69p92M14
1229D18L6o64P22l17l73P64j063P33J2p51Q31n96k17O08o74P00j31m68O99q29
$$ y = [281, -130, 231, -108, -695, 317, -617, -482, -59, -744, 113, -520, -910, 40, -694, -450, -599, -468, 247, -805, -268, -54, -947, -108, -735, -673, 136, -722, -17, 92, -630, 446, -578, -219, 360, -758, 356, 15, -228, 596, -12, 107, 617, -168, 818, 3, -68, 700, -28, 773, 152, 295, 892, -109, 413, 929, -155, 874, 630, 55, 845, -117, 377, 450, -117, 507, 228, -13, 462, -137, 164, 254, -253, 207, 71, -156, 139, -154, -250, -386, -317, -287, -466, -237, -331, -436, 31, -740, -19, -444, -774, 225, -615, -556, 9, -746, -157, -430, -333, -253, -621, 249, -51, -867, 361, -414, -527, 274, -714, -108, 126, -499, 393, -129, 31, 648, -190, 505, -144, 36, 430, 79, 190, 621, -295, 893, 327, 63, 676, 236, 614, 276, 289, 530, -84, 513, 480, -173, 796, 4, 418, 454, -210, 512, 195, -178, 586, -477, 256, 268, -483, 348, -248, -465, 143, -531, 169, 38, -430, 269, -560]
1249e60L97K40r83J130r13K10P43j053Q63j31p26R52p78M80L00r02Q71n94j78
1268f32O41o21N78J29k89N61q43N22L56p98O92l01k33N12p47O95N0k54N30n73
1288b5M01J56m90P01n86J78N15q40M92j65J3L55o19K65o9k87M82m20J89J71o16
1309a99P15l96l69N83o85M76P4o73M60j89K38P2m74M04l08l07P20l58l9K50k93
1330b98l2J06m43J074j087K29J02L5K31J58o14M94j50n6n3o9L25r5Q5K10j77j46
1352a71K41j5J33l09J49N9j43L6K03m5K60q2j21J1J05O1j12J47L6l04L20k0o0
1375C79j49o7J77k25rqK69j69k33M91l09m46L21Q2l09J60Q8j00j14M3J01J13m24
1398c38J84Q4k18n5M7p5K62l15L13j91k38M38q7%K1k49n4L81m42L56j54M2L05
$$ y = [-560, -163, 77, -906, 224, -689, -479, 264, -789, 74, -57, -783, 169, -609, -129, 171, -731, 140, -454, -632, 9, -612, -34, 95, -194, 367, -476, 46, 402, -396, 296, -5, -238, 274, -473, 222, 272, 18, 548, -25, 376, 532, 42, 743, 157, 335, 850, 10, 502, 337, 350, 705, 86, 351, 282, -5, 477, 57, 246, 417, -199, 516, 120, -249, 334, -351, 125, 199, -474, -14, -203, 35, 107, -367, 37, -271, -578, 142, -216, -255, -5, -298, -330, -224, -667, 407, -680, -451, -349, -314, -83, 75, -539, -45, -195, -251, -304, -373, -48, -143, -58, 152, -25, -171, 70, 55, 188, -121, 28, 87, -56, -20, 183, 138, 398, 316, 195, 206, 311, 372, 260, 407, 443, 139, 459, 439, 379, 230, 163, 340, 115, 106, 98, 367, 198, -35, 456, 147, -299, 22, 104, -205, -45, 43, -57, -171, -128, -27, 86, -338, -154, -70, -288, -343, -296, -371, -109, -424, -111, -302, -540, -102, -189, -189, -168, -417, -471, -90, -532, -176, -330, -288, 17]
1421A7k90N4K86j70J89k03J8J77j03M5K6J43K15j82q2K57j63k08K29P0p9p9K71
1444D38m9k94K87k66n9L54m04K28k16P7L51m93K75O3k37K14n01J62J73m27M90
1465A66k55j25M87m41j31M58m69L75j26j54J7j43R5j51J13K51j96J49K81n96J04
1486b91k1k28N55n30K67L7j55K76j93K36J26l50L92m42L19Qj06M27j02M2j38k44
1508a15R6K63p3J61k26J38O2l80L43j77r3L24m48M10J98l67K38K7l52J07k4r7
1530A5J34p4J59k8l76L68n7q2j23q4J78j04r6J78k44q8J34j27L14j16k64L48l32
1553c67K35o7J38O8l18MK6J00O5j04j22N79n93L1M7n0L68r4M4j01j03L83j78j21
1577a30K14j86L15m5n9J96l29j06N46o50M88K01n37N75k37J2p7k49M28j99K41
$$ y = [17, -273, -219, 67, -103, 86, -117, -99, 78, -25, 20, 46, 189, 404, 222, 140, 397, 234, 26, 255, 325, 246, 167, 438, 389, 95, 382, 116, 57, 411, 7, 235, 19, 96, 447, -46, 229, 292, 55, 269, -232, -70, 103, -324, 166, -89, -214, 273, -168, -299, 159, -310, 65, -61, -215, -198, -341, -246, -397, -284, -33, -229, -80, 201, -395, -291, -312, -540, 15, -515, -248, -211, -366, -90, -283, -47, 79, -271, 121, -321, -2, 6, -100, 327, 225, 267, 129, -115, -19, 244, 171, 332, 106, 244, 306, -74, 269, 92, -1, 323, -125, 285, 483, 116, 354, 381, 29, 136, 112, 15, 149, 75, 234, 206, -170, 198, 141, 59, -64, -148, 30, -74, -170, 8, -236, -324, -190, -317, -3, -119, -383, -35, -367, -132, -199, -61, 7, -311, -307, -281, -181, -116, -220, -342, 237, -356, -325, -278, -328, 40, -54, -10, -111, -214, 169, -9, -130, 84, -102, 213, 168, 109, 305, -24, -130, 416, -234, 254, 455, -82, 493, 256, 268, 191, -58, 370, 171, 412]
1598D12J45q96N97N9m20M88k82PP05r40O40j84n33O24n71J24j11j80Q33j073M80
1619g6M13p28N06j66m7J40l05J74J30n79Q02o71O3M35o09R62p07K2O78r42J54
1640c51M71p15Q24o19J70M94r54J235p85j05Q68p06L36J52m13L65k11J42J89p17
1660c30J006n39l21P35o05K93j13l62P91o82L3N59p87P76l35l7O82o12K36K7o12
1681a97M71k38n7M73q39N42P1n48O89p10O47k97m26Q10n90p9M86p09P37m35j43
1702c42P73j114N53K04p05Q77p82J62N68n96N50m28K9M62o70L41L23m82O12n67
1722b32J39K59q10J030l31l70Q32q48K80L34o47O12k50j02L83p11P75J4m92N72
1742D37m50K47L6l18M76l46j84M48p49Q04j99k79L44j30M0M06o22K99k73N3L27
$$ y = [412, 557, -339, 258, 317, -103, 385, 103, 110, 815, -125, 515, 331, -202, 422, -149, -25, -136, -316, 517, -556, -76, 337, -391, 115, -51, -98, 42, -263, -89, 41, -538, 264, -407, -344, 91, -518, 444, -263, -241, 437, -505, -351, 120, -595, 229, -390, -220, 274, -680, 555, -230, -335, 533, -173, 163, 315, -98, 267, 56, 198, 387, -330, 676, 137, -184, 551, -54, 239, 126, -236, 555, -127, -94, 465, -322, 454, 119, 82, 764, 152, 388, 415, -197, 274, 36, -21, 452, -387, 155, 226, -322, 367, -343, 304, 7, -419, 391, -199, -278, 208, -501, 236, -199, -342, 431, -683, -130, 74, -631, 246, -536, -374, 194, -402, 148, -280, -251, 211, -459, -118, 205, -277, 335, -232, -93, 166, -644, 386, 55, -315, 517, -331, -51, 283, -364, 248, -2, -104, 279, -432, 343, 357, -135, 437, -13, 234, 270, -48, 428, 82, -102, 346, -403, 401, 202, -77, 267, 137, 177, 583, -39, 260, -13, 40, 367]
1763C67m55K75J0k15L65m90L37k18j59L18j62k26K60l17J93n6j01L11k86l6K27
1784e8k92N63m82j11L3j77O35k08j15L60q9j12K59m24M70j11k32L87o37M11rO4
1806A25j21k39N36m3k53O18o70K21L72q29L08nL2J55j34J49L2l65J93L62o01N18
1828C61l19J1J0J7J37k55J10O9J7K6K8k39K31l52R9j12j61O10n04J40J4j91L10
1851E7r1j70K83l20K56l0Q6k04J92k49J63k6r1J61l5k51J17L08N3l88L09k17k5
1874a12M82o07K37J04l1J07k97K31o4rj10k1J40R6m7Q7J82l07K40k74K1J0J39
1897A97j81J28j74J95j07L2q4J5J01o6p1O7P4k14K86j3j10n0l3r7K73k27K69k33
1921b3j27J70l48K30mk7J58l05l9M31l06j2K43J5o1m6j69L94j20m18L01q2K40
$$ y = [367, -88, 187, 197, -18, 347, -143, 194, -24, -183, 135, -27, -253, 7, -310, -117, -173, -274, 37, -249, -285, -58, -350, 213, -269, -380, -347, -524, 111, -97, -212, 148, 59, -53, 206, -218, 252, 141, -91, 296, -341, 70, 61, 125, 4, -235, 301, 258, 5, 623, -47, 174, 546, -283, 25, 20, 52, 207, 73, 222, 254, -111, 82, 444, -157, 361, 42, 53, 63, 80, 217, -38, 72, 141, 158, 184, 212, -27, 204, -148, -49, -161, -322, 288, -216, -76, -62, -253, 57, -34, -204, 79, -241, 15, -15, 71, -133, 59, -190, -27, -53, -144, 17, -18, -269, -152, 156, 209, -179, 130, -87, -112, 370, -237, 0, 104, 73, 180, -117, 114, 50, 41, -69, -90, 50, 146, 99, 186, 368, 61, 301, 27, 48, 58, 197, 16, 144, -30, 165, 58, 90, 6, 21, 122, 56, -15, 52, 126, -88, 198, 185, 75, 25, -8, -105, 168, -59, 210, -23, -150, 20, -328, -98, -102, -129, 29, -276, -315, 116, -190, -202, 41, 56, -5, -51, -220, 174, 54, -364, -63, -145, 95]
1944I5J0k15m6R4L3j82J40R3qj9K38j04j63J8k57N12l43L34j54j01L06p4j38K22
1968B91k01J75n9l17J78q0J40O7k38lJ02J02m9l91K16P2O4O2k61K65K54n54K64
1991I9k48j2J96L5m6k07L44j65k90J07J60l95J20J56J53l32K0L15l2l27Q6K19
2013d4J17P9l57L82j35J5j98j30L28j37m5M5m8K16q9p4K36j58J01qj11K23k33
2036b5J99k1m2K03j04j45P4L4J32o0k64L0J16q7R6k20K33j92KL36r3l97M58n01
2060b38N09l18l3K37m73K85J99l42L05j99k19L36l62L06k37K0L09k65K88l26l27
2081e45M27j91K77K0j27J75j67M0J30k92K62j78J4K62l43J66N1j60L89m09J58
2102d1J98k86K29k94K61L13r7k58O0r1K64k18K26l3j9Q7n6k94K42k32M16l76K20
$$ y = [95, 105, -110, -156, -62, -29, -211, -71, 22, 14, -5, 233, 129, -34, -16, -273, 239, -104, 230, 76, -25, 281, 207, 69, 291, 90, 265, 206, -111, 67, -13, 127, 194, -44, -47, 55, 157, 108, -283, -67, 5, 69, 131, -130, 135, 389, -165, 99, -149, -161, 35, 70, 24, -183, 161, -4, -294, -187, -27, -422, -302, -146, 7, -325, -305, 10, -22, -349, -263, -44, 73, 152, -205, 177, 42, 57, -141, -271, 57, -80, -125, -80, -128, 88, -1, -75, 161, 3, 104, 96, -15, 208, -25, 174, 153, 111, 314, 210, 65, 139, 173, 305, 245, -19, 11, 127, 40, 136, -84, 149, -43, -41, 295, 202, -195, 263, -238, 271, -47, -80, 157, -316, -31, 168, -174, 131, -68, -287, 49, -313, -7, -244, -224, 85, -180, 108, -218, -545, -118, -309, -32, -12, -139, 36, -131, -91, 39, -253, 9, -169, -155, 107, -236, -70, -19, -179, 210, -199, -41, 157, -129, 100, -194, 67, 380, 283, 25, 85, -6, 258, 40, 266, 233, 214, 301, 245, -49, 193, -39, 377, 1, 221]
2125B21m5j45R4K34n18K29k43J5K22k36J99Ok75O58m11qJ60l81L73p8m8P7l45
2148b45L60j55l56L43J71j67k5q2J03n0j98N24m68K75k13j61K34N5R7j83m3L31
2170A47l51P2R1j83J55K9k25N05l05J15K29k04pl1J54k6j77K77k51M4K45m31j29
2193b57M34j01Rq4o7L19j95M4k0L2J68m34J52N1j37K02j75P8J07j77K28j91k33
2216b47J99j65K25k12rK85l46J61Q3k94N73n85K54Mj02R7J51J4j98J36j44M35
2238C15o04L95o61L62L33k58J8p0J7Q9k19K13j04PJ69l2L1J33p6K34r5j38J70
2261B29l26MK30j64J87m03J07J57j36K45J20k07m0K0lJ22Nk91P5K34N5l02J86
2284A04j97J06J35j83R0k19L71k51n9J89j06L7%j0J20J38n23K20k8j49J83j80
$$ y = [221, 176, 31, 125, 359, -159, 70, -173, -158, 64, -172, 27, 33, -242, 416, 5, -3, 157, -224, 149, 71, 23, 100, -245, 115, -40, -396, -53, 118, -49, -74, -156, -53, -103, -301, 223, -245, 30, -183, -344, -110, -55, 42, -141, -184, 147, -204, -132, -41, -224, -69, -40, -265, 240, -65, 50, 279, 75, 68, 37, 191, 165, -12, 265, 14, 58, 303, -128, -257, 177, 76, 85, 1, -66, 253, 58, 102, 82, 114, 282, -152, 0, 51, -86, 116, -59, 19, 126, -51, 177, -14, -247, -48, -213, 12, -200, -209, 76, -270, -109, -26, -320, 253, -332, -78, -74, -176, -79, 72, 86, -112, 24, -120, 315, -289, 106, -555, -193, 140, -118, -100, -170, -153, -64, -283, -70, -174, -167, 2, -30, 1, 134, 58, 292, 197, 59, 229, -97, -93, 137, -27, 160, -243, -136, 21, -115, 130, 250, 43, 3, 23, 20, 142, 147, -144, -69, 165, 220, -82, 104, -93, 13, 148, -35, 55, -164, 207, -44, -103, 86, -20, 17, 17, 7, 127, 265, -258, -38, -66, -215, -32, -212]
2306b12K61r2j49K39l08J96j49o8L81m52L14m0J36j37n6Q6j73J67J55j82k9k7
2328a39Q4K90k91J3Q1k5k27L64j50J27P7j35k75K05J00j09R0on6P0j4J40k66K08
2352A56l74L52j45M4K8J39j71K18k16K53j03Mj09j86K59j06o0Q4q8P1j88n1J59
2375c0N7l6k08J83l2J35k95K0N9P6j4j71M4J63K4k94K62m6j27J15M4j40Q9J81
2399E9J03k38K06k51J3L9J89j11R5M7k5k85J36q2K01n6p2n3L10L7j91M8m8k15
2423a44K91j42m0R5j82M28j43P6m9k42K16l42K24Q4q1p8NK41k37j26J26M3q8J16
2447E1j52J66J18j87J53m70R8L05k19J51j64L7Q0m4K07k36J4k0J95k43K09J29
2469A78k45q1l9J88K81k12J50k85N2N1mJ31l22L05k5j81J52j30J80k12K61j57
$$ y = [-212, 49, -43, -192, 47, -261, -65, -214, -282, 99, -353, -39, -79, 57, -80, -136, -50, -223, -56, 99, -83, -112, -139, -55, 235, -56, -43, 38, 13, -214, 150, 0, 127, 204, 69, -206, -1, 99, -10, 80, 74, 18, 88, 74, 214, -52, 156, -218, 134, -11, 33, 61, 200, 29, 247, 31, 284, 181, 185, 76, -110, 149, 43, -17, 67, -21, 50, -138, -189, -30, 27, -9, -217, -34, -66, 69, -226, -206, -147, -71, -85, -256, -212, -49, -25, -319, -57, -103, -230, -115, -71, -211, -122, 59, 162, -76, 130, -121, -108, -69, 120, 9, 104, 151, 126, -159, -23, -105, 96, 40, -32, -85, 225, 262, 71, 119, 71, -144, 147, 5, -35, 60, -122, 306, 163, 239, 190, -52, 164, -178, 46, 130, 49, -29, -24, 217, -20, -146, -20, 23, -65, 51, -101, 65, 183, -4, 149, -321, -223, 82, -137, 14, -150, -113, -33, -77, 130, -106, -92, -112, 83, -160, 49, 178, -67, -148, -187, 1, 282, 70, 220, -65, -13, 38, 34, 165, -157, 148, 123, -58, 94, -36, 144, -68, 193, 36]
2491C6R1J1j91K69l10K96n8N8j87K41Q0l69j0J59j45lp3L64r5l48K44j03k40M65
2515A82q4RJ20l30K20j52K44k73J4j8j89L34J6k46O0K8N1O9O9k06P5k7j14j00
2539b48J20L25k35j04J13r7j43L81k51K2Q5Q9K4O5j29k6Q1p9Q0k2J72j99L68l81
2563A1K78k56n5K28j86k8r4M3p5K21K24k06J44l39J22k6N8j38J50j16m6R9R6l07
2587a98N8j1K27j13j22J07k3J3n3K08O6k11j79K76k27L07k99k8J62MP1j1l5M2
2611C1p8L9mN3j44K30k82K03j20n5kP1J46k39K03j93K57n8K3q2L94l49J87l91
2635a60J55k1J27r6J11j57K75l89P3J91j89J74L0l46K72k99n6M60k48K04j91K40
2657A60j35J2P7j62L7l2K25k69L47p00L95p1J59j85J88N5L2j11p4j3j29J75j33
$$ y = [36, 127, 138, -53, 216, -94, 202, 144, 202, 15, 256, 336, -33, -43, 116, -29, -32, -105, 259, 164, -184, 60, -43, -283, 182, 98, 107, 227, -103, 117, -35, 209, -64, -50, -68, -257, 77, 93, -153, -93, -65, -14, 55, 124, -82, -7, -34, -148, -248, -128, 197, -38, -142, -29, -126, -269, 112, -139, -117, -32, 57, 81, 146, 17, -9, 72, -7, 73, 51, 223, 24, 392, 11, 289, 33, -22, 206, 20, -8, -102, -59, -134, 87, 311, 105, 249, -90, 32, 6, 64, -74, 76, -40, -86, 13, 109, -198, -140, -151, 76, -37, -159, -52, -75, -62, -115, 93, 159, -52, -231, 45, -182, 125, -174, -202, -40, -36, 35, 24, -11, 31, -47, -8, -12, 41, -103, 127, -155, 48, -72, -127, -129, -58, 88, -151, 52, -141, 116, 58, 81, -1, 393, 44, 231, -160, -5, -26, 101, 5, 116, -41, 234, -155, -82, 109, -80, 94, 124, -222, 50, -249, -305, 155, -93, 111, -80, 160, 25, 37, 114, -48, -11, -43, 182, -87, 260, -440, -45, -116, 43, -142, 46, 101, 133, 22, -52, -65, -194, -19, -152]
2680a52Q7n4p4L25l30L8o0o7J59l8L0K61l69M28k52k82L13O0l6j49K03Q9j07K43
2704B66l41J86J4k23K46q5k8r0L27k88P6J08K6k09L1J94n3j68J68j3L1j20j82
2727a27K40k57J9K17n7j73J56k59%l1K48P3j33J93j37r7K49k12Q4k09M38j44k65
2750a84M07j18k62L71l69J91l17k73N73j69K27j7j36j42J23P4Q7Kl34K65m2j46
2772a89K81j14m0j66M33m1l3o8k02L35q6j31k9J33l08L25Pl04L52K0J7j34o4N3
2796D7J86l38K13N3L1R2m05K41l3K5J73j96K8l71L07j39o7L7J81p2k39K86q0j18
2820a58J46J42m48L11Q3Q6k24J03p7j76M62l49J95j82K7l2K3P0r9J17l5P4j61
2843a02K67j76k4O0j66J21m7K06J4k47K34k11K62k31K07m0j08j63M01j34m0rm0
$$ y = [-152, -65, -119, -193, 132, -198, -160, -220, -287, -128, -166, -136, 125, -244, 184, -68, -350, -37, 23, -13, -162, 41, 130, 23, 266, -75, 111, 125, -98, 148, 63, 35, -55, 272, -16, 60, 168, 194, -15, 16, 210, 157, -11, 157, 144, 175, 55, -127, 113, -144, -125, 92, 35, -138, 18, -241, -241, -272, -24, 49, -84, 109, -28, -125, 124, -88, -4, -213, 225, 81, -184, 223, 105, -157, 214, -155, 36, -281, -554, 19, -150, 77, 60, -76, -218, -95, -21, 66, 68, -266, -1, -43, -189, 92, -22, -62, -228, 205, 164, 131, 63, -139, 196, 110, -21, -50, 83, -225, 100, 107, -197, 155, 175, 192, 58, -6, 47, 233, -105, 108, 161, 192, 284, -121, 120, 87, 112, 285, 89, 117, -254, 53, -86, -153, -116, 65, -7, -246, 40, -40, -158, -12, 130, -318, -7, 76, 162, -62, 41, -36, -212, 250, -99, 96, -86, -59, -91, -68, 2, -97, 20, -15, 59, -102, 165, -11, -35, 25, -141, -20, -67, 139, 153, -94, 140, -71, 191, -40, 167, 127, 19, -144, 257, 123, 83, 74, 34]
2866C4k4K09m4j51J42j65P2m1k51J96J62m8P7J4J59k32K3j6k56J79k76L35j61
2889f3L32m47K16J25j49l2k8K16o0k00j1kj6o6p2J85j84J02J45P8j25L23m34J93
2913B6k21R1K52j16j02l9J04j24J23Q3j46K05k46N8K61j14K0o9j53K81j80N1k03
2936a58O8mJ4L03k29l6k6J50k12J08J71k9q2L1j79J88J28j12K5j72n7J64j97J29
2960a4J63j06p9n9J3j15J00J33j36O9M1n1P5Pj77P1L1j87J7K8K20l7l9J13K9k52
2986a42R6O9K2l6J50j58K45k84K93m47J20J33m1j18R5N7J9l28J75L22l66J33J09
3009A18j36j98L23j24O6j54J94j57K01j07J32k0j9l34J98KL8M4J37j53nj3O0o2
3033C1O4o6r6N3j0Q1N7m6q5l8M2m0j69K31K2l06L20o1q5Q7j52J56p9J41j99J98
$$ y = [34, 10, 219, 175, 24, 166, 1, 73, 32, -219, -23, 139, 91, 168, 182, 341, 109, 132, 116, -140, 39, -237, 98, -63, 269, -178, 38, 163, 14, -18, -46, 170, 110, -90, -101, -103, -119, -185, -257, -72, -256, -154, -9, 69, -56, 267, -167, 26, -195, -104, 148, 32, -70, -109, -5, -129, -6, 77, -69, 136, -110, -52, 209, 95, 115, 46, -107, 174, -6, 45, -158, -90, -94, -80, 223, -6, -42, -68, 82, -130, -22, 149, 120, 38, 69, -110, 78, 206, 94, 119, -53, -110, 54, -143, -14, 149, 43, -36, -95, -82, -197, -97, 36, -100, -31, 10, -41, 34, 41, -136, -65, -34, -221, -204, -176, 44, 7, -32, 81, 110, -142, -46, 23, 45, 9, 159, 1, 246, -38, 255, -192, -72, 61, 20, -98, -3, 54, 73, -255, -80, 242, -124, 9, 118, -18, -216, 107, -17, 49, -105, 89, -68, 133, 26, 158, 138, 119, -215, -17, -15, 23, 67, 204, 51, 46, 33, 93, 31, 95, 29, -67, -14, -24, 57, 114, 68, -17, -55, -13, -53, -222, 9, 31, -275, 45, -16, -101, -14, -166, -10, -89, 52, -147, 51]
3059E1k79L22j18J49j68j49K67l2j72K13J59j98K7o9J79J2j55K02j35pj48q9O4
3082g4N9J30j72l0J11J45k19M2Q8N6k3k87L16J33o4k34LJ34R1r6O6j36l8LN7M4
3108A05j81K63k74j64mL01k80J40J89mj1l91L90j6j05p8l1N0K4J37j12j58J52
3131e8j0j1k52J71J05j28K91p4R5k26J77p8Q0k25J68J38l14k0J09l8l2J04q0K23
3155A15q2L9O7l2R5k24o7J97j25j29K93r0R8j29O4j23K8K8l2L16m03J84k7M8m11
3180c02L55J30l8j03k82L60k26R9O4J7k01K43k11J17m5pk18K28J08r0k05K17j51
3203a41k7O4J10Q7j10o8Q7j29l8K51m14M19l58K22J44k90K88j47j36J82Mr9J59
3226F0l4j18N8l1N3J86j9J6j93R5n3J71l71J52k6j16R1N3L11k71j30K50Qo0O6
$$ y = [51, -228, 94, -24, 125, -43, -192, 75, 43, -129, 84, 243, 45, 72, 3, 182, 194, 39, 241, 106, 99, -49, -138, -74, -15, 115, -57, -87, 24, 169, -50, -8, 80, 136, 113, -174, 142, 275, 211, -23, -20, 114, 205, 109, 175, 39, 1, 4, 61, 105, -76, 187, -87, -251, -255, 46, -234, -94, 95, 91, 80, -311, 79, 63, -42, -120, -151, -101, -77, 60, -52, -210, -58, -68, -79, -331, -160, -55, -183, 108, 34, 129, -97, 80, 2, 82, -143, 25, 163, -151, -171, -62, -100, -132, -28, -108, 115, 33, 72, 139, 107, 202, -22, -89, 108, -17, -146, 147, 57, 155, 26, 90, -33, -5, 23, -9, 307, -96, 88, 61, 109, -302, 53, 183, 145, 42, -240, 120, -106, -7, 57, 74, -127, 116, -95, 22, -23, -30, -248, -20, 88, -2, -207, 10, -141, -168, -104, 6, 93, -17, -85, 2, -127, -165, 86, -328, 91, -267, -45, 99, -191, 97, -50, -186, -4, 0, -99, 60, 26, -92, -34, -65, -12, 174, 155, 171, -22, 73, 20, 191, -180, -28, -54, -170, -79, -26, 285, 14, -116, 134, 142, 82, 148]
3251A48J49l93K23k09p8L61j61j07k28L7L06m8r7j1n1L62l94l5K75kJ76l44rJ68
3275C8J06J80k59J27Mk40j43K31O7N3o2p6j6k02Q8J14o1Lj33J8J55k0k9J86k8
3300A01j90K26m18K99r1k3l9L10j75O0k66K27o4j3j00K06j4L4Q0q5r9J01j06m5
3324h4O8K8K28j57j77K60j37K2K2l03M22k69p2K23O7k91K98k74L2J10J19j06l3
3347dL13l89K18j74k9o6M6r2m4K19J76k40n9K14j15J57k17r8K16j54K3P5P9N7
3371A12j86K23j89n9K21O6j42Kq3K25l00J52Q8j39r9J94r2J37j06o6L01J60k10
3394B10l3j00%M1j01pj14J78l17M79k74j62L29k73K39P4k0k67K5K43j07j24j44
3417b25K32K47l06L37m45n2J07%j0N1J10L4M4r4l62M79r7j62j17J81k07L33k58
$$ y = [148, 297, -96, 127, -82, -160, 201, 40, -67, -295, -258, 48, 0, -97, -108, -159, 203, -191, -226, 49, 47, 223, -121, -130, 38, 144, 324, 65, 192, 196, -44, -187, 44, 111, 164, 102, 26, 10, -192, -104, 10, -51, -48, -181, -163, -8, -28, -57, 129, 101, -89, 137, -281, 18, -73, -96, -135, 175, 0, 60, -206, 21, -43, -56, -156, 50, 36, 70, 150, 65, -34, 67, -39, -84, -16, 12, 240, 83, -94, 166, 29, 51, 73, -230, 192, -77, -149, 74, 141, -150, 148, -126, -94, 16, 135, 29, -4, 309, -80, 138, -36, -65, -131, -85, -177, -221, -2, 174, -66, -125, 89, -26, 131, -86, -184, 32, -122, -99, -24, 55, 112, -74, 149, -40, -99, 122, 188, 46, 48, -35, 190, -110, 42, 130, -9, -108, 86, -6, 131, 25, -41, 260, 420, 210, 177, 77, 77, 118, 17, 10, -104, 74, -243, 236, -38, -200, 129, -144, 95, 169, 149, -118, -93, 150, 43, -81, -225, 7, 254, -52, 285, -160, -212, -105, -105, -115, -64, 46, 80, 124, 30, -332, 147, 50, -112, -229, -48, -255, 78, -180]
3440a80k8L21K8k22l0O8pR3j77L77n36J57j84N66k69J03L7o3n5L9j02j66K53j23
3464a00m2Q9R3L8J89j32N6n1j43J23j16L6K42n01K67J24j1R1j14l15J53q8J42
3487C0O5r9J28k2K72m61K78j25l03K49J16m51L26j32J34j70Q7P7k31L15r1j3K8
3510GR7n1j17O4j1q7%k45K52K49k11n4R9k4j11J65k26J33j1o3K13j03j07K59j12
3535EJ39k33K88p1j27K03l12K84L2p9K5k19J14P1j05J12k84K91l9r3NJ89p3lk01
3560h1K24k29J87j45N6K54j64m00J53N9K0J9J3j90K01rJ73l04J77j25m7J76k48
3583b30O7J2J15j27K04k27J58P4r8j42K04J24r0N8J44k52J20j51qN8M4j21L34
3606B70K4o68K54J61J52l30L50j96l6j51J97j65J9J71j79M2N9J25r8K67m6r2q1
$$ y = [-180, -208, 113, 141, -81, -111, -43, -50, 43, -134, 243, -293, -136, -320, 246, -23, 80, 117, 54, -1, 38, -64, -230, 23, -100, -142, -53, 40, 78, 267, 135, 191, 140, -3, 120, 4, 40, 282, -219, 48, 172, 161, 252, 138, -177, -24, -112, 30, 95, -4, 124, 102, 374, -87, 191, 66, -237, 12, 128, -323, 3, -129, 5, -165, -78, -1, -232, 83, -8, -21, 7, 104, 53, -64, 0, -11, -98, -98, -343, -91, 158, -53, -107, -8, -32, -143, 22, -204, -71, -82, -145, 68, -35, -142, 117, 5, 144, -89, 199, 128, 1, 204, -108, 176, 208, 129, 154, -65, 49, 120, 15, 127, -157, 134, 95, 2, 7, 196, 123, 120, -81, 143, -86, 101, -44, 12, 266, 102, -298, -145, -86, -66, -47, -34, -224, -23, -32, 141, -163, 14, -111, -158, 18, -230, -163, -151, -36, -163, 41, -186, -28, 46, -52, -194, 10, 134, 44, 102, 246, -6, 114, -37, -45, 13, 57, -64, 270, 294, -374, -120, 41, 193, -137, 213, 17, -19, -170, 27, -138, -119, 52, -127, -85, -26, 99, 1, 268, 222, 130, 49]
3629D9J19r7J13j54o4p3K32j6j60J09j58l1K15j9j65N0l8J02J03l89K34l2J69
3652I9j06K42k29k24J16K38k03L17l36J68o2R4o5j08j21J02k8J72o1M5M4j46K22
3675A70n23M33m0J74j87M9nk31K04j75J48R5q9K8o3j50K88j45O0J78l32K83k09
3698c9l2N4K9q4L13kk29o9k6j9J32Q5m9J80k55j68K06o1J22J2j94K59k29L12m53
3723b05J41j38k6Q9j4M2K2j81M89j91l1k43P5K64r3j8j63J76q2L18m52K78O2q4
3747C5n5K25k82m3J37KP1Q2j74P2J17j68k5J16q6l7J62K0l22J28K23j62k1n0k0
3772e5L8q0K01p4m4J70n8J6n6J02n7M0j21J39k43J5n8J41R4l0k60K17l8J05j91
3797h7J43N6j83P5q1J03j16k8k3J04j56J47l4O9k91J64K02j20L9j5M6L9p3op7
$$ y = [49, 168, 71, 184, 30, -34, -107, 125, 109, -51, 58, -100, -131, 84, 65, -100, -50, -88, 14, 117, -272, -38, -70, 99, -7, 235, 6, -218, -102, 136, -67, 250, -86, 82, 20, 114, 49, -59, -180, -78, -106, 66, 5, 50, 94, -52, 170, -353, 80, 40, 214, 27, 76, 71, -160, 44, -131, 17, 112, 23, 51, -12, -162, 126, -19, 41, 219, -113, 170, -39, -71, -17, 12, -72, 241, 239, 10, -59, -85, -104, 28, 113, 64, 244, -11, -179, 27, -34, 88, 100, -94, 165, -64, 248, -205, -64, -202, -228, -139, -153, -111, -89, -270, 219, 28, -3, -246, -171, 93, 0, -18, -181, -5, -87, 231, -221, 57, 119, 35, -20, 205, -77, -120, 17, 19, 90, 172, -2, 70, 187, 19, -6, 110, 24, -13, 149, 169, -153, -25, 198, 36, 15, -35, -55, -17, -97, 104, 30, -14, 156, 98, 114, 58, 160, 103, 143, 22, 161, -82, -67, -125, 16, 110, 80, -180, 37, -1, 104, -87, 56, 112, -71, 4, -77, 26, -90, -118, -141, -37, -193, -46, -80, -11, -302, -138, 64, -56, -17, -32, 14, 53, -20, -26, -103]
3822a03j40J77K29j6N0m7k28J03K02k09J42k87J75j28O6NK0L78n09O4K23j28j30
3845i1Q1J36p9j18J81L1j98k1L3r7L78m5J10m08j9K10j07L45m92K58j43l0Q3K75
3869B73j75m6Q4k28Q6K11k70R9jJ2M7M8l64L07k00k4K6J1J26q4J76l14K2L17j70
3894c1L7j51J45J34j82N6P3j85J06N2n6k3n0J4K51j1p4j83J40j23L37j49j14r4
3918h1k58M30p8J02O3j72pn3Q8oJ82k68J79j31l8J98r0P8j26m2j54PL51l13K3
3943a16J80J31k53J26n9Qk7l4o5J09j47N07n08J10J96k32J1r5P9J74j26j02J23
3966a0j37J44J29J23k57j19K21k0l39L35j06k44K25J41m8j5J94k63M2j12K14p6
3988B2k31R7l6K40j18q8J29m3K08J4j74p1Q7q3j49K20l04K48k1J07O7l62K29K41
$$ y = [-103, -243, -66, 163, 147, 197, 150, -78, 25, 227, 18, 160, -127, 48, -80, -14, -9, 11, 389, -120, -56, 167, 39, -91, -10, 126, 47, -71, 110, 141, -57, -78, -45, -142, 236, 191, 301, -107, -126, 84, -23, 322, -170, 88, -55, -85, -2, 273, 98, 52, 136, -92, -6, 205, -65, 34, 33, 45, 92, 140, -224, 83, -117, -141, -115, -104, 22, -62, 114, -200, -178, 139, -31, 6, -145, 0, 134, -48, 8, 81, -104, 2, 54, -2, -25, -75, -61, 190, 179, 105, -78, 62, -61, 276, 127, 13, -81, -339, 91, 13, 115, 178, 6, -1, -54, 34, 28, 210, -58, 121, -10, -48, 150, 60, 138, 12, -30, -184, -177, 174, -139, -116, 64, 195, -58, 68, 9, 17, -10, -44, -109, 0, -147, 360, -148, -38, 158, -74, -63, -158, -79, 95, -31, -133, -10, -147, -3, 126, 249, -8, -127, 94, 74, -265, 70, -36, -280, -55, 86, 38, 23, 217, -46, -4, -116, 98, 22, -209, -112, -148, 92, -26, -114, 15, -28, 180, 194, 20, -51, 36, -47, -196, 24, -280, -32, -53, 54, 121, -241, -12, 229]
4012B29j31k20K1P3K16L2k51m00M28J15R9k77p2K46k88L55j40l4j8Pj2n3P5jq
4037ij3Jj0j69L66j2k72j37N76l16k27M98l64J86r4j81J50j35L14m4j43L52k91
4060B6P3K0j34K48j50j56rJ57j82K98j82o6Q9J09j97K22j52O5k37J06K7%J01k5
4084E1j97l1L16j86J10j81R5o6Q6j45K02M6l90K53qJ75m7p6l1J27j09q2M03m17
4108a02l5Q0k22J17L63n20L56o3J83k27J0N1J07r3j28M3J20j49K29k22J10K7p0
4131c5L7J33K3k37R2o3J20o9J78r4n2m3K5j72K08M7j55L00p0j16k18j1J78P9j42
4156e7N1o5J18N1l65L57j30k2J28m3j20O2J16Qk49J93j96M9K11p3j01m9O7J2J47
4181A00k01kK25n1k41k7K74M7l36P4K28k98L14j56M3M7o0M0r7J9J72m3P1o4j51
$$ y = [229, 98, -122, -101, -28, 188, 220, -31, -431, -3, 112, 211, -66, -138, 108, -180, 175, 35, 1, -17, -10, -22, -75, 0, -1, -9, -22, -21, -31, -200, 166, 154, -118, -255, 321, 5, -222, 276, -88, 98, 4, -177, -27, -162, 152, 108, -35, 317, 26, 99, 119, -15, 233, 83, -73, -82, 75, -107, 191, 9, -57, 32, 141, -56, 166, 14, 79, -158, -52, -25, -25, 76, 51, -146, -177, 139, -47, 63, -118, -23, -89, -3, -148, 54, 100, -290, -37, -45, 130, 83, 7, -24, 103, -6, -88, 315, -102, -137, -57, -279, -162, 201, -319, 37, -26, 157, -70, -60, -9, 98, 5, -123, -80, 40, -109, 120, -102, 8, 35, -35, 2, 135, 158, -79, 13, -50, 70, 1, 179, 85, 33, -10, 15, -157, 51, 98, -57, 243, 173, 57, -161, -172, 6, 85, -57, -6, -71, 47, 98, -267, 90, -40, -62, 66, 23, -97, -35, 81, 89, -160, 33, -163, -114, 97, 24, -77, -126, -59, -47, 100, -101, -103, 122, 71, -170, -197, 77, 124, -212, -138, 90, -208, 106, -50, -7, 40, -20, 20, -77, -58, 114, 71, 142, 78, -73]
4206g3K20j55J2L1j0Q5N1j49J78k86K28l2J65l31j15K27j90J47j3J96j54j94j40
4229c02J67K45J24l14R0o8R6J57K52m63p7J80q9L6k02J23K37j71l4j32J33K14
4251B02l74K6K34m3n3k5j16J55K7k10J06M7J7j06J42O0j87k9J11j92K55R1R3k19
4275A2K2l2NmJ08k72L2M7K30k71J47J85l87m1L14k11J95l1j84L05j9k12j12J86
4299A2j82L0J44K15j44p7J08l0j01j40K6J35P2J05m3j59m9k3q9K50p4k8K5r5J06
4324fJ5j30n9k1K14n8j17q0J76Q2j74J6K55k29K46q2J20k05j17j62L18l7K4k84
4348b95M40j00O4m1Nl01J18Qj08J19o1J67K0k7J53R0j88j62J93j51j19J85J31
4371A40p9m2o8J53o7n8J28l66N39j73K43l84K38q0j80J22o9r7P0Q5j62O2j8m9
$$ y = [-73, 147, -8, 4, 35, 25, 110, 161, 12, 190, -96, 132, 100, 265, -66, -181, 46, -144, 3, -10, 186, 32, -162, -302, -135, 110, 234, -80, 10, -58, 38, 195, 447, -16, -93, 87, -2, 34, -168, -45, 192, 21, -13, -145, -12, 202, -172, -146, 88, 45, -8, -33, -149, 6, 33, -177, -71, -24, -7, -113, 29, 89, -98, -127, -16, -208, 47, 138, 231, 12, 34, 2, 7, 3, 111, -161, -129, -82, 148, -123, 24, 209, -178, -219, 95, -116, 79, 48, -136, 169, 150, -62, -174, 12, -170, -140, 4, 219, 75, -2, 106, 76, -25, -165, -139, -4, 68, 173, 130, -29, -78, -101, -190, 60, -14, -42, -17, -112, -6, 9, -121, -180, -201, 13, -45, -162, -242, -66, 16, -158, -142, 113, -116, 130, 48, 168, -37, -154, -316, 2, -35, -11, -295, 145, 45, 109, 68, 73, -228, -110, -102, -210, -91, -152, 15, 35, 8, 161, 251, 63, -99, 94, -57, -176, 9, 140, 61, 19, -49, 104, 37, -21, 107, -259, 280, 107, 350, -34, 204, 124, -56, 66, -3, -100, -30, 55, -107, -45, -63, -112]
4395a12L54l02P6j65J76L9j87J47lJ73j1j15r1m0r9J46j5J65r2k5l21J78N71l43
4419A04J44k78R7L7j65r5J21n6J44j50R8k12L06m7l64K18m1J27O6n4LJ7J5O5j54
4444e4R1j02j17L3P1R1R5n4k54N8K43j59J8K31j97J53k58K59j49L1k18j0Q3J09
4468fR5k87K93o9N3k50K83k38J01n5J74j9K3p5m3Q4M2n36M66q8J24j88l3K25p0
4493Fj08mK48j10P7j57m7p8J16J95J4j04k26K73O1m5J11k65M9L6J04l44K13n3
4517c8P2Q2k73K20nM3j13j87J56J33j85M07l15l61N37k33O7j5r2J09r0Pk02J77
4541i9N8r4R0K6K3j30K78k02O9k08R6ll2ko9K50R9p8qk40l6Q7Q2J5j02J77O4k16
4569a05j42L39o5nk45K73J13k02P3j05J10k07J39o7K11k54J89Qj03J84p9Kj25
$$ y = [-112, 242, -60, 16, -149, 27, 66, -121, 26, 23, 196, 185, 70, -21, -61, -160, -14, -29, 136, 44, 19, -302, -124, 447, 104, 248, -30, 67, 104, -61, -156, -35, -91, 53, -97, 1, -211, 95, 48, -316, -98, -139, -12, 54, 0, 3, 20, 35, 100, -54, 37, -65, -182, -149, -78, 13, 108, 54, -200, -142, 101, -58, -40, 191, -6, 147, -111, 148, -1, 30, -188, -198, -115, -6, 89, -198, 95, 26, 79, -171, 112, -126, -25, -80, 94, 75, 98, 23, -20, 64, 106, -430, 36, -52, 72, -116, -149, 76, 6, -102, -106, 142, 32, 109, -48, -95, -173, -57, 138, 152, 48, -178, 95, 156, 111, 222, -43, 6, 42, 146, -198, 15, -38, 34, 116, -157, 63, 58, 101, -12, -199, -43, 90, -95, 312, -3, -364, 173, -60, 7, -8, -100, 9, -81, -74, -276, -99, -41, -135, -45, -19, 4, -126, 152, -50, 19, -189, -93, -96, -128, -130, -199, 51, 150, 72, 64, -176, -212, -125, -43, -28, -130, 47, 111, -105, -247, 92, 27, 22, -223, 50, 163, -39, 34, -71, 39, -168, -29, -96, 115, -139, 50, 58, -45, 139, 60, 62, -63]
4592f3p2R9p9L15j39Q9k30oJ67j08J09J0n7j00L8j41K07j41L5N4%J5K07k99J27
4617C7J35o4j33J3K5j09r6J97n8N6M4j05j2K09r1k22L30j24r1L37k60o7J60J87
4641B98k98p2j3J78Q4L4o8m7j57K0j63J41l9J68j24J75k86J44j2R4j46L00j93
4664A8L4q8K14l42M50l31J07j93Q6j65K31k7L30l86l5K3Q3J30k51O2N0j0nj9p2
4689a06O5n1J55j04LL9pK04j34j83K09k40L31r2l8k7l01L49R5k03r5J89o7j11
4713a20j32K76K3j96Q8m7N9k00M01k86K6J15j65K75j13m0L7q8oQJ23k50J24L12
4737B24j44o3R5J81o6j10j40P0J9J30j65m3K64k34q9L81l26J28Q9m43K81K30l27
4760e8J54k7m3j09P7j54M59j70k84j05j96N46o1j08K08p1O9n2L8r0K25j54jj75
$$ y = [-63, -135, -36, -115, 200, 61, 150, -80, -86, 81, -27, 82, 92, 35, -65, -27, -168, 39, -102, -67, -13, -13, 2, 209, -90, 37, 172, 108, -25, -12, 13, -96, -192, 5, -53, 3, 47, -58, -70, 139, 48, -174, 156, 32, -59, 278, 18, -49, 111, 298, 0, -72, -85, 93, 177, 211, 143, 96, -61, -41, -204, -63, -102, 66, -58, 117, -169, -25, -37, 57, -89, 211, 18, 52, -36, 178, -164, 286, -45, 62, -131, -45, -210, 21, -6, 324, -62, -97, -74, 9, 139, -112, -50, 0, -10, -15, -34, -106, -41, -92, 63, -41, -38, 1, -6, 198, 64, -119, 90, -150, 181, 89, 51, 24, -277, 72, 167, -36, -131, 58, -9, -120, -252, 24, 47, -149, -61, -108, -49, -249, 152, -134, -108, 7, -158, 117, 4, -36, 1, -87, -93, -85, 38, -212, -88, 224, 80, 17, 112, 293, 227, 117, -23, 47, 66, 196, 31, -12, 252, 18, -71, 310, -16, 112, 201, -242, 39, 269, -58, 96, 69, 26, -83, -6, -160, 299, 129, -155, -260, -456, 90, 29, -79, 129, 58, 127, 75, 113, 23, 248, 94, 93, -82]
4784h2l4J30L4j38J90J07j64qr4M7K1k17K84lj04L7j00Nq6K46j4J4L5L3r3p4O3
4811C5K46l77K59k2J8j56K9K28l45p1K43j65J39k56J88j27K34p0K48m45o9J97
4833c9j5l9j46J84m2L05j39M01n12P6q5J02r1K7j29J12K35k73Q2o6K20k1j54r8
4857a05L46k31R3j50J41n7l1n8J3K44j5k76J44j9j90L18j63p0K06j33j87K33l6
4880A7j45j8J85j20J04R9j24o2R6l8p6j30L16k42M03j07k42J99l52J44K76m12
4902b29K00K1K01l59J81m8K08M2j67jK5j49J73l9k95J86J79m08Q9N2J27l5K31
4925A85j72m2m3l2J23k9j06J25J26j47o3N2j02J41q8J80j42k25N5J38j42K00J91
4948A83j91K01j4j35k12L55j22J38k06K7k49K25j3j50J02j09J63M4l3J18j54J31
$$ y = [-82, -116, 14, 48, -90, 100, 207, 43, 35, -59, -12, 9, -208, 76, 73, -31, 6, -94, -89, -175, 71, 57, 71, 106, 139, 46, -28, 35, 281, -96, 163, 141, 159, 3, 32, 260, -85, -156, 87, -78, 61, -195, -7, -134, 100, 30, 278, -167, -236, -39, -54, -93, -239, -55, -97, 208, 69, 470, -42, 34, -51, 51, -40, -13, -142, -30, 205, -68, 14, -52, 168, 147, -7, -105, 241, 10, 103, -47, 94, 37, 6, -52, -39, 205, 190, -86, 58, 39, -151, 167, 4, -66, 140, 7, -180, 53, 17, -128, -146, 39, -81, 23, 122, -2, -64, 32, -6, -82, -212, 104, -138, 265, 158, -84, 115, -237, -93, 183, -229, -29, -8, 193, -166, 15, -33, 175, 217, 50, 49, 74, -75, 98, 59, -236, -50, 129, -279, -190, -138, -11, -46, 185, 13, -29, -72, -104, 19, -10, -116, 9, 135, -12, -75, -23, -125, 16, -72, 108, -34, -259, -204, -66, -208, -8, 183, -8, 193, 179, 44, -168, 187, 65, 203, -3, 24, -225, 0, -13, -163, -61, -170, -7, 37, 4, 122, -32, 99]
4970I9m1j0j0Nq8P2J19k91P5P3J03p7J6J68k40J64k66J39O8j98K01k2Qk15K49
4995A01m1J18j97J32k41J27J29l66pJ37l1L24l24K10j14L42m94j15K54P1nj14
5017a04n1J85q7rJ34l73R0M81k82j93L3O6J76k22J00qK28k29R6j42LJ08K5j08
5041h3l1L65m58R9o1K35r1K66j18j21o8N7j64L90j86j77R3J79j36J89k02J16j72
5064g9K33%j49Ok45M32j73j43j96K84k09K57O5j87K14L7j72j16L8J79l0j51J31
5087B6o8K27j47j62j3P4O1j88K72k62J20M2M2k58J72K96k40L6J46l53K09j28J43
5110D7j96j09K89lj3M5Pn3KM8j5p4jL3j73Q2j15P2R0j1J71l0j48J20j79L27k62
5137d9P3l04J58L42l98M5J45p8P9K0j8J59j72n1M7K10k29j31J11J23k62J16N4
$$ y = [99, 58, 48, 38, 43, -45, 27, 146, -145, -70, 3, 106, 29, 45, 213, -27, 137, -129, 10, 78, -120, 81, 59, 67, -148, 101, 60, 178, -19, 113, -128, -1, 128, -238, -245, -108, -139, 185, -139, 71, -43, 299, -195, -310, -56, 15, 10, -104, -155, 30, -57, -66, 68, -305, -215, 266, -16, -209, -176, -110, 66, -156, -56, -64, 164, -65, 31, -111, -108, 0, 25, -83, -114, 251, -207, -108, -169, 66, -25, 241, 123, 2, -66, -9, -173, 217, 31, -146, -53, 126, -10, 179, -23, 93, -79, 154, 154, 5, 11, -234, 198, 25, -118, -314, -30, -239, 18, 83, -104, 110, 147, -25, -141, -103, 76, 46, -105, 26, -42, 185, 38, -124, -137, -63, -2, -190, 82, -180, -60, -18, 24, -234, -62, 234, -6, 30, 176, -177, 32, -96, 47, -149, -258, 31, 28, 15, 60, 67, 14, 16, 64, 49, -25, -26, 7, -166, -84, -199, -127, -37, -48, 123, 93, -55, 65, -114, 213, -49, 24, -280, -122, 220, -178, -133, 12, -66, 13, 33, 15, 174, 2, -49, -2, 208, -21, -152, -41, 82, -180, -64, -10]
5160a0o4j17N2N7N4m0K27k92PK8K01n2j37j52L87j20J13k29J76k3l17N80l46J6
5184aJ5m7o9K21k23J60k11j58N64l02L9q3K9J17j50j9P5j04J36Q9k6j09m6m4K50
5209A03m12L33R3m4n1j07J21J08K3k33j37K61J28J9k56j61J18n6J11P9Q7j89K6
5232c6k7J87j52r6k1J63N1j61J74p1k77J17K55l73L38K2j48K7o1K06k12J27P0
5255A02q4J29j90j06K08rj44K85k4p3Nr7Q2j52K43p6j40J31j38K20m3l06M8Q4
5279d5P5q6J48J72j44k43P0L51j03k95J59P5kk30J40J2MQ2P2j68r3K73m15P4Q9
5304b8M0r9kJ78k67L45l76M08J9j48j56Q7P6j90J30p5m7j7J20k6P7o8J37m2k41
5329a65R6M0P3j04j6J46j07o0J46k38J86o4J67j6ok30L5K55j54J26l02L06p5J06
$$ y = [-10, -74, -191, -139, -82, -28, -68, 159, -133, -126, -98, 103, 51, -86, -238, 149, 29, 142, -87, 89, 66, -251, 329, -17, -1, 14, -33, -102, 119, -104, 56, -155, -313, 251, -51, -12, -95, -66, 51, -99, -118, -43, -147, -11, 78, 52, -57, -103, -147, 103, -309, 24, 117, 73, 22, -85, 36, 144, 167, -66, -203, 58, 186, 205, -51, -212, -94, -150, -39, 40, 127, -62, -36, -63, 124, -28, -124, -145, 18, 69, -92, 82, 11, -266, -149, 106, -267, 71, 93, -55, -28, -89, 117, -95, 32, 102, 18, 147, -43, -149, 59, 50, -94, 191, 167, 94, 99, 2, 84, -68, 175, 99, -41, 90, -48, 172, 129, -177, -129, -45, 30, -56, 92, 264, 120, -123, -53, 298, 195, -100, 59, 134, 132, -98, 42, 54, 58, 140, 212, 44, -49, 224, -191, -117, -28, 12, -87, -89, 89, -178, 167, -209, 199, 218, 70, -86, 1, 77, -113, 17, -58, -105, -122, -2, -28, 49, -19, 118, 76, -165, -69, -29, 44, -60, -76, 70, -37, -97, 49, -189, -3, -67, 100, 84, 78, -152, -117, 138, -16, 110, -192, 114, 39, 145]
5353A45m29K20J41j57R8p4N8P5j82R6L6k09P8J52j90L0J23j7m0k07J8J71L14m41
5377a91J21J64Rl09J87j24R7L46n07J53n9L29n6m3O7k88k25L83n3j54K2K39Q9
5400A97j99k27M38k37j2J0O5j78J29J93r2L9n6K66j96k20K10l2l20K80L6l0j35
5423g1oJ27l9P7K00k83J30j03Pj41L04j08p1J92k83R3q4k6R1M0j55N6j49L0K07
5448C5j77J4K03m2m4Q0j05N7R0k16J60nj24J36k46L24j83j47J73O2q4P9q4J34
5472I0k67J74K1j24K26l38L30j83J30n7O1J52l06J45J17m4j36j70L9j10R7J02
5494e1J82j89N5k7j71J55M9K6r2L68k10LJ6K23l94K11M0l12%K32j55o1Q6l5Q0
5519B9M1j94K08K08m07K70m30J42J16O5m0J75o9m27K44J14J54j98N8j68PM0N3
$$ y = [145, -284, -64, 77, -80, 18, -56, 2, 77, -105, -9, 27, -182, -104, 48, -142, -112, 11, -6, -46, -253, -235, -64, 250, -191, -70, 94, 103, -206, -19, -143, -46, 300, -207, -54, -113, 216, 160, 117, 184, -104, -329, 54, 1, -153, -131, 108, 197, -2, -229, 209, -28, -40, -30, 35, -143, -14, 179, 87, 126, 70, 336, 140, -80, 130, 98, -222, 58, 94, 64, -71, -77, 50, 11, 88, 288, 5, 135, 32, 39, -102, 202, 94, 23, 215, -68, 25, -59, -85, 6, 46, -109, -53, -202, -172, 35, -142, -128, 75, 33, -11, 69, -36, 21, 111, -105, 55, 50, -74, 62, -184, 140, -43, -190, -17, 45, -39, 40, -44, 90, -177, -3, 18, -106, 120, -218, 112, -71, 59, 2, 63, 215, -91, 54, 171, 127, -9, -179, -140, -250, -153, -51, 131, -58, -3, -30, -201, -46, 3, 29, -63, 305, 95, 98, 114, 337, -57, 154, 194, -118, -118, 114, -41, -102, -16, -51, 29, 70, -124, 84, 292, -115, 155, -275, -133, -17, 48, 8, 183, 114, -313, -69, 45, 199, 1, 59, -109, -102, -62, -9]
5542ik1j87K68q9L48j70q6O6q8j47j98J38Q3P2K73k78J62Nk74pJ39p2m8L33m18
5567b05K43k5K8j54MJ11O7p1M1m4K35k70J55l3j08J88m13L62j1j87J44L5q5j32
5591a25K85j73m6J03j71L33k59K81m01K34k80J82Q7Q0Oj35k07M50k42J8l2J22
5613A10k1jM6m96N16l72K33Mk78M1P1j6L0L03K9j80J76M7j24j84M40l66j49K15
5637G4k70K70j53Q4p6p5K2J60j09L2K33r1k77j6J67m3J49j00K5k1J31j66n8l3
5661a41J60L1k84M25k91M3l5K08q5j08L6j34L4K17J03k35N5J0J68j22k11J47j93
5684b02K98j25j59J58P5p6J76j28J02j38m4Q6R0p7j32J65l4J0L1R8k05K66j56
5707G9j92P0N8J36r3k25J03l0L0J0k8L3j0j78L23N3k72K40j19lR6j20l3RJ19j55
$$ y = [-9, -30, -217, 51, -38, 310, 140, 54, 120, 32, -115, -313, -175, -92, -20, 253, -25, 137, 142, -132, -139, 0, -72, -120, 213, -205, 38, 13, 41, -113, -109, 2, 69, -2, 39, -5, 230, -40, 115, 82, -26, 162, -251, 111, 100, -87, 57, 92, 7, -125, 160, -13, -59, 44, -127, 206, -53, 228, -173, 61, -219, -37, 50, 130, 136, 1, -206, 244, 2, 20, -12, 110, 89, 88, 134, -362, 154, -218, 15, 19, -259, -218, -147, -163, -133, 170, 199, 19, 195, 242, 118, -66, 374, 8, -141, 74, -196, 74, -79, 5, -71, -146, -124, 36, -73, -41, 192, 101, -176, -192, -25, -68, 81, -19, 6, -15, 116, -50, -108, -141, 19, 50, -234, 191, -100, -57, -92, 116, 31, -77, -41, -175, -141, 76, 179, -56, -1, 9, 177, 55, -156, -9, -202, 96, -29, -188, -30, 45, -31, 145, 17, 119, -19, -63, 23, 113, 36, -96, 69, 35, 45, 76, 174, -31, 235, 79, -113, -43, 15, 151, 58, -167, -64, -94, -64, -54, -82, -49, -59, -237, 86, 139, -133, 107, -12, -15, 81, -39, -72, -63, 56, -99]
5733i9j02L98j80O7j2O6o1m42L15J41j43J05j59K23L0k5m4j9j17J54l8NL9J4k34
5758a18j13J17j81N4J57J95j47J38l2j18n5R4M9o0m6k5R8q4Q0L2k5J30j29N4k76
5783b11Q8J80j48l0J67J27k28Pj9J09j01K45n9j05l4n3j3n0J21q0m1L25o2J78
5807C13l38k21J14J42J23l2j16N2O0j85J39k25M7M01j64l55K41j61J07J9J01J7
5829G9m2j5Kk18J11N3l0L10k47J64j24j40J05J0k55K16qR0n2r4M6r7R4J69k34
5854a07J15l8r8J03j81J95j5l0K16N5j74k08L36k86J88o2J12k14J34Q4O8j92J55
5877A56j23O6k39J50L51l63J69o8k60M6K62k37m5PL24j5k37R1L08k64L7J2r0J1
5901D9j33J52j21K44k1l91L46k57n6J10R6n5l3k7J55k99L47p6o7L7jO5j60K4J07
$$ y = [-99, -201, 197, 17, 84, 72, 138, 77, -365, -50, 91, -52, 53, -106, 117, 147, 122, 78, 59, -58, 96, 58, 63, 102, 116, -118, -231, -114, -295, -241, -84, 111, -36, 102, 70, -48, -103, -9, 40, -20, -66, -91, 7, -77, 3, 35, 10, 140, 11, 65, -211, -123, 57, -91, -121, 46, 173, -55, -48, -67, 42, -59, 186, 127, 22, -12, -65, -78, -128, -7, -87, -128, 197, 135, 313, -25, -246, -132, 10, 133, 101, -15, 37, 97, -88, 51, -174, -127, 274, 110, -245, -4, -165, -58, -39, 62, 79, 37, 22, 24, -194, -83, -30, -60, 250, 3, 167, 43, -97, 8, 18, -237, -21, -29, 61, 9, -85, -39, -136, -42, 127, -107, 8, -30, -128, -25, -206, -11, -26, -56, 160, 215, 41, -167, 169, -117, 71, 9, 121, -93, 41, 125, 193, 1, 156, 33, 99, -140, 10, 361, -2, 167, 99, -161, -115, 147, -90, -135, -128, 196, 181, -56, 35, 343, 79, 116, 128, 38, 49, -84, 68, -53, 191, 170, -221, 125, -132, -188, -78, 18, -37, -70, -97, 58, -241, 106, 30, -37, 0, -1, 64, -96, -72, 35]
5926C5K12j94J1O8q9pM5j53P9n6k4J50k06K59k12M2j21O7k8K66j13j8L39l16Q2
5951A18k77K28Q9j86K3p2o0L75k32j68J52j5r5J66j61kJ81k62K14J17k14K03k03
5974h1L00p5N3L0n0N8j06J24l36P9J12Mp6J58k11j41K23j3n0k35K52J68j26l44
5998b83L11l5Q3J68m24J8J58J12j43j3R3k89K23n1m6J0K22l14M4j18L21p3q6k
6022a14K07k24j41J49m7K24j94L9J64j05p1k09L63j39N5QJ60L9r2o2k00K92L9
6045A41k05J84k09K4K10j12o1P2j11J55n9K02j67k7K32k26ll7j04j97J57J08K26
6068A93j14m0j8j36m2K14j34j58J2L23q5j41K58k88J92M7j05J00J2j25L13M1l80
6091f1P3j52K28j28K09lm7r7j44K20j05j85L12M8j15k03K57o1o6O1M1j29j41L00
$$ y = [35, 247, 53, 64, 132, 43, 36, 81, -72, 7, -49, -73, 77, -129, 130, -82, -40, -161, -94, -122, 144, 31, 13, 352, 36, 118, -159, 69, 158, -28, -5, -77, -137, 238, 6, -162, -10, -25, -120, 46, -115, -117, 64, -198, 16, 133, -81, 122, -81, 219, 144, 197, 227, 177, 235, 129, 253, -83, -4, 108, 112, 36, 194, -17, -158, 65, 52, 2, -233, 19, 187, 61, -283, 28, -7, 76, 244, -180, -162, -4, 108, -35, -48, 45, -244, -21, -72, -118, -108, 114, -200, -156, -274, 47, -26, -112, -114, 93, -131, -272, -123, -170, 54, -140, -101, 63, -42, -113, -322, 41, -98, -43, -35, 125, 164, 72, 10, -190, 102, 141, -64, 120, -89, -65, 145, 33, -28, 44, -67, 88, 29, 231, 64, 37, 269, 43, 40, 3, -101, -298, -141, -33, 193, 79, 39, 21, -115, -157, 57, -77, -235, -223, 100, 15, -126, 132, -156, 36, 83, -22, 78, 90, -35, 278, 319, -61, 12, -140, 88, -40, 169, 166, 119, 22, -122, 98, -7, -192, 120, 168, 53, -150, 107, 46, -20, 41, 82, -47, -188, 112]
6115A12j02Q1j37K66k15l55K34Q1K98l97J10J57j87m3J45p3J11%k02J92K3rjl0
6139E9q0o9P4M4j11K2n3J47j79J45K49l70J19j47nK68p9Oo4J13j36M6j08K11k1
6164H1k50K25j51J55o3l2j01J52Kj15J50M3r3R1j31Q8k34K75j6j16L4P0R6j68
6188hj8J11q0J9J10k68P3J49k06j0M6j31K1M61m18J12N3r9%L31j83lq5J8J39k08
6214g4Q0J17J53k44rm2j57J27J20j26J6M1j19J71j3N1M3o7N2p7j1j12P7Mj94L1
6240a62K92j73P2KJ56j43n2j6n5P2j98K11%Q0j34j06j1O6k6pl4J66k36K01J59
6265A24o7J69k53J84k22jQ7j05J23k24L27j70N5J89j62P4k45K04q4j38O0O5P8
6288F8l4L6r2R8J13r7N3j72J18l07J78j01j13L95Rq3j46j12q5M74k8j75K1L8J66
$$ y = [112, 10, 91, -46, 220, 5, -350, -116, -35, 263, -134, -24, 133, -54, -97, 48, -25, 86, 86, -116, 76, 99, 90, 89, 59, -21, -90, -16, 28, -83, -61, -114, 33, -146, -1, 248, -122, -3, -150, -155, 113, 34, 40, -24, 89, -47, -1, -109, 102, 81, -169, 56, -95, 60, -3, -35, -136, 16, 18, -97, 53, 96, 3, 94, -37, 51, -183, 92, 76, -40, -6, 64, 160, -8, -26, 85, 5, 24, 134, -134, -61, 88, -118, -128, -82, -213, -192, 269, -149, -37, 16, -83, -83, 248, 65, 62, -23, -5, 134, -74, 6, 123, 276, 32, 23, -19, -176, -49, 71, -55, -39, 2, -117, 54, 41, 92, 135, 68, 120, 43, 32, -80, -3, 1, -193, -162, 130, -43, 29, 31, 187, 44, -8, -24, -79, -7, -205, 6, 6, 86, -48, -154, -165, -99, -125, -132, -166, 0, -236, -35, 124, 57, 226, -27, 157, -65, -66, 21, -84, 39, -185, 142, -28, 27, 216, 54, 128, -117, 87, 3, -135, -75, -10, 68, 34, 70, -22, 76, 189, 92, 145, -27, 91, -216, -38, -139, -252, 143, 152, 69, -77, -189, -274, 200, 172, -3, 18, 56, 222]
6313B22k54K8R8j09o8nL65l04m1k1J46j05J20j11k30J57K74Q4j94j16J41L4m39
6336c28L56QJ29k7k92J67q6Q4J13k35K42j47O5J69j53k32L34j21K2k15P4J77J71
6359B75l83j01K81K0J29k72o5r0J28N7k1K89j67r1q4J37J44m8r3j93K65k51J59
6382B5qoO5m5Kk12K73l33J84Jj53L16J8k40J44l3o9j8m7P9j28J62K3j97J88l5
6408d4Q1j7K46l98K55k42J82j19n6J9J21RO0j15P4j11j00J96K98k48k0K8k63O
6432a58K69j83K6j70J43O9K04k41j67K68o0J10j25K27k49%J10j18P1j44J83pL
6455F1J69m74J8K00Rr2J35j01j15J67m3q2J87r0J07k33j93M88k55J28J92l79K20
6478B4o4Q5k48L44K6k57J48o6j25Q9J07Q9k93L54k48L02m84Q4J25J08l6k09L27
$$ y = [222, -32, -4, 94, -15, -83, -88, 277, -27, -68, -89, 57, -48, 72, -39, -269, -112, 162, 246, 52, -64, 77, 111, -328, 28, 36, 165, 138, -154, 13, -73, 11, 124, -111, 131, -16, 49, 218, 65, -167, 167, 46, 68, -147, -73, 104, 275, -108, -209, 72, 92, 221, -51, -116, -206, -78, -21, -42, 247, 80, -11, -95, 42, 186, 138, 45, -148, 117, -134, 25, 17, 11, 76, 31, 33, -179, 94, -239, -55, -54, -207, 109, 127, -113, 31, -2, -71, -89, -136, -57, -185, -23, 0, -197, -9, -44, 37, 20, 266, -132, 123, -119, 63, -56, -112, -93, 28, 37, 97, -18, 56, -55, -155, 41, 339, 91, 71, 99, -164, -158, 111, -72, -46, -216, -73, -4, 200, -41, -208, 60, 0, 110, -15, 212, -37, -37, 73, -45, 26, -118, 65, 58, 61, 230, -244, -226, -26, -17, -109, 26, -75, -190, -23, -66, -148, 39, -51, 56, -177, -370, 118, -137, -9, 183, -196, 24, -40, 45, -203, 141, 167, -90, 58, -8, -133, -44, 63, 152, -141, 213, -35, 267, -217, -133, -8, 100, 64, -145, 182]
6501A82k21J31p5k17l9L05O4p7k4j73K68j24P6j33Q3M1r8l0M5l2K17j61J08J8
6525A34Q4q7j50q5j4N3J37j30nJ33Kj18n2L38l53m3J09J29j02j54K60P3j05K3
6549G7r4J59m9K8k61O1R2Mk59K95j16K6J59j70m3J07r4R0O7j74J81j54J23l2k0
6574Cj46k1L28m4j36rL38m64J61l9k08R5J89J8j20P1N1%k96K39j03J24j61Q8J29
6599H7N9N3r4K04j65k47K17q3Q1J06k91J31o0l72L99N0k6j36N7kN3j4J41q9k07
6624a48L26j45r3L3N5o7l2nL9Q7p3r1K97k52l1n8J73j96L54L2j25n8N0j40J19
6649E1j25m2P8N9m5N9j76L31j81oN4l42K86k5j75J78Q7l4q8J91O4k94r4L23j79
6674d5j63K68k4j72J75r8j03K69k8l22K13L01k21Q5l61K17j72L23k4k93o1J66
$$ y = [182, -39, 92, 17, -200, -239, 66, 130, 53, 29, -144, 124, 0, 76, -57, 26, 67, -31, -61, -16, -48, 169, 8, 116, 134, 218, 131, -19, -104, -118, -65, 72, -58, -63, 70, 72, -46, -98, 240, -113, -156, -47, 82, -20, -174, 86, 159, 54, 77, -17, 142, 93, 121, -140, -79, 13, 17, -242, 53, -63, -37, 122, -48, -91, 16, -78, 12, 79, -95, 86, -68, 55, 23, 3, -143, -164, 164, 120, -16, -25, 313, -151, 10, -29, -237, -142, 47, 65, -55, 16, 67, 67, -229, 10, -93, 31, -130, -42, 87, 146, 199, 105, 309, 144, -103, 114, 31, 112, 218, -73, 58, -2, -374, 25, 75, 49, -87, -30, -32, 21, 7, 148, 59, -148, 178, 33, -60, -27, 28, -39, -71, -76, -37, 50, -23, -114, 183, -69, -100, -158, 15, -181, 173, 205, 80, 22, 72, -68, 51, -74, -116, -38, 21, -24, 35, -141, 190, 9, 3, 57, -285, 1, -24, -199, -21, 66, 32, -56, 135, 199, -95, -189, 134, -45, -208, 60, 36, -136, 39, -59, -162, 107, 79, -243, -30, 271, 50, 135, -226, -9, -181, 142, 118, -175, -236, -70]
6696g0j7J19p9r1R4R2j42K26j29k40J63J20J9l40K5J45P6l4N6n6O1J6K1q7p7L49
6722B20J37n86J41K23J02q3j44n5R5J49l24K08j39L9QK70k91l6l9O6K35j21p4
6745Al1O0k3J95l4k73P5L2n2L4J34j75J10P3j67Q0Q3k58n3J41J56o5k13J14L57
6770C01l95K93j31l9p0K5J52j90k13L70j73l3J08j19j43L56q5j86L58l92L06j49
6792d9J07j1o2L19m29R1J03l23L41j54k8K59k7q0k00P9J5M9j8K00j7r9Rk72L67
6817A70k63O9J80r1m1j17o3J02J0K2P6k39K98p7q8J68j23m4n9j7r1K47K05k34
6841@Q6O8r2Mj85J31L6No4R4l1O1k19J34j2m5J09M3k98M10k63r8K03j02K45k70
6867e0M6PP8K80l24k81J67qK28k02K67k54j1M9q3J89n7J5J91j28r4N2j36K2K37
$$ y = [-70, -87, 32, -47, -138, -44, 48, -94, 132, 3, -237, -74, 46, 65, -275, -250, -105, -29, -63, -7, -63, -2, 14, 35, -52, -129, 220, 357, -229, -88, 135, 237, 154, 10, -45, 50, 199, -125, 83, -56, -17, -9, 261, -30, -66, -105, -39, 196, 75, 1, -30, 30, 7, 202, 168, -105, -30, 2, -50, -16, 118, -57, 53, 126, -41, 39, 122, -136, -189, -48, 108, 43, -170, -56, 301, -94, 199, 68, 29, -41, -16, 136, -54, -267, 103, -70, -103, 5, -114, -257, 99, 14, -172, 186, -206, 100, -49, 58, 47, -15, 304, -125, -34, 69, -254, 87, -67, -95, 164, 137, 57, -143, -64, -49, 0, -18, 182, 165, 66, 75, -197, 170, -93, -24, 156, 65, 24, -93, -156, -54, -44, -22, 54, -185, 113, 36, -52, 116, -7, -51, -110, -127, -218, 29, 234, 0, 86, 154, 62, 66, -119, 12, 48, 53, -11, 83, 52, 113, -106, 28, 16, -29, 80, 123, -175, 235, -28, -126, 77, -25, 220, -50, -4, 3, 81, 361, 37, -244, -77, -85, 143, -59, 208, -46, -57, -8, -91, 98, 41, 56, 247, 119, 25, 77, -59, -37, 200]
6892B00l42J88k07K16K61k19Q0j08J37j39k4l11M67k24M9Rj33L07m58L21n9P6
6914H7k21q2K52o8n2K20j63j63o7J80J21O3j72O1R9k03J72j03J65r1j60J5r9K52
6938D3k79K12j66P9R4r1J10l1j5K32k03n1m3K73m16J46L24k4j79o6L05l15Q1l8
6962a8o1LK38l92J09J30Jpj8j14J95K8p0j28J51j83K04r6M5J81j08J7O0j88J32
6987A11k43J87j04j42L25j45k0M3Nk7P0P7k84j29N91m16N9m8J80m70M28k57N35
7010C26k18j12N3l5j3J20j13J90l49k9J29j19J9M6QK1J97j03j11J3K25krq1o9
7035a6J35j13J1p8J47k10K2J5j64M31k80R7Q1k86K34l26K60L8j83L65l30J49n1
7058e2l2J63j09k4kK08j06j74J87M2j27K2n0r8J39J51j76J04N6RN2l72J48o4K46
$$ y = [200, -142, 46, -161, 55, 316, 97, 177, 69, 206, 67, 43, -268, 199, -25, 24, 33, -100, 207, -251, 70, 11, 87, -134, -216, 36, -32, -84, 136, -27, -190, -257, -77, 44, 107, -65, -4, 95, -108, 64, -39, 126, 35, -125, -110, -209, 43, -236, -24, -190, -111, -17, -108, 2, -29, -44, 188, -15, -66, -109, 164, -252, -106, 218, 194, 15, -51, 254, -61, 20, -18, -79, -76, 162, -230, -121, 9, 10, 3, -15, -129, 66, 94, 24, -104, 47, -136, 68, -28, 17, 198, 90, 107, 167, -21, 111, -132, 55, -49, -191, 134, -11, -31, 12, 17, -10, 60, 137, -147, -276, 315, -101, -42, -90, 90, -380, 48, -209, 326, 108, -4, 49, 14, 1, 121, 8, 198, -151, -180, -51, -170, -151, -105, -97, -76, 121, 18, -93, -80, 145, 143, 134, 53, -16, 119, 6, 17, -61, 86, -124, -102, -87, -251, 180, -100, -3, 78, -208, 26, -300, -40, -2, -185, 180, -150, -1, -52, -84, 79, -30, -54, -56, 152, 46, -128, 59, 101, -26, -4, -54, -152, -13, 138, -38, 66, 122, 131, 183, -189, -41, -105, 141]
7083A41j41m8Q9l4K37l23J56j4o3j42Q4P1o0j34L49r8j86J42p3J83k35N4j4K07
7107A48l12N4J40j64K69j67Q4j01L6m7M4j12Q2J52R1j09p4j21j58L19m0J38j24
7130B8k49K10Q3j96R9J4m6J83o4O1K86k48j25r8L3p8J89O0j43J32k02L4k8J1p4
7155a28j3R1oQ3J09k42J39N6k20K40M6k0j87J39nm4j20n4J94m5N1j49O6J1j29
7180a37j23L32j7l39K83J02k34J4K50k46mO1J08J54k71J96m7j29J56J32j88k40
7202a87L10k30K47j41N4J14l16K42j49K99k45j99Q5K50k70K52n3j42j41J41l1
7223a10J55J05j76R6j87K06n0N6k28J95rj82K44o9j18J92j23j10P7P3j8j39K32
7246A12l35J65J0R3Q3l17J06J60j90M00k34q4N4kN9k11J87M5j77J18Q0k40L68
$$ y = [141, 0, -48, 41, 7, 244, -79, 77, 63, 0, -142, -58, 13, -47, -181, 168, 70, -116, 26, -47, 136, -99, -45, -59, 148, -164, -110, 30, -134, 135, -32, 52, -49, -13, -60, -16, -128, -46, 106, 197, 88, 14, -107, -265, 54, 14, 152, 28, -221, -11, 72, -124, -25, -11, -57, 126, 62, 123, 409, 161, 36, -62, -29, -107, 82, 142, -1, 131, -71, -37, -65, -54, -128, -141, -50, -56, 27, 136, -106, 33, 89, -131, 109, 155, 135, -52, 87, 82, 38, -82, -136, 58, 13, 64, -85, -19, -8, -137, -260, 72, 55, -284, -1, 101, -133, -119, 131, -115, -119, -58, 50, 204, -67, 129, 82, -47, 109, 241, 53, -187, 123, -107, 140, -1, 53, 167, -149, 93, -56, 243, -2, -201, -116, 134, -136, 116, 63, -79, -220, -79, -110, 45, 150, -26, 70, -117, 89, 39, 95, -133, 62, 53, -129, 115, 46, -72, 120, -3, -113, -36, 37, 19, -120, 112, -223, -58, -48, 45, 128, -189, -83, 77, -113, 287, 53, -31, 23, 21, 80, -131, 56, 101, -76, 42, 122, -118, 250]
7269B50n00K31K0r2q3J61kj26J43m8j7qN7p5L10j39n2K8j52J88l19L23K5j94R9
7294B8r5L08k67j45L6L4L54k04k25qJ96J41j35J22j74L73n41K1L43j4n4k13J79
7317F0j15J43Kp7r5J45o6p5j66K36j2r3J77K9j04K35j21O8n40M23j98O7qj02L3
7342a54K49j46o0J73RM3j47O4K4K8j31j58J73J38l02L72j20K25j74N7k73m4J38
7365a6J23n5q9MJ0K02k33L4o4KNJ43k1p9M2l9J4J44j19k34Q0J02R1qk5K2j79J63
7393B0J09J1jj09J48k29J46R9m39M73k27j28K12q4q1o9R9j01OJ83J06j38j11M83
7417C78m55JJ93o2l56J69L25k34N4M8k13O6L6j06R6q7J03K14o5j10M9K4K25l57
7441f4M9L14k70K2j3p7k7P7q4J29m2j73J68k95M26j47j03J96j10Q3j51K12qj20
$$ y = [250, -250, -19, 1, -91, -174, -13, -15, -141, 2, -46, -63, -71, -14, -89, 221, 82, 30, 58, -94, 94, -225, 98, 123, -71, 28, -67, 241, -26, -171, -135, -101, 253, 49, -176, -184, 12, 153, 18, 140, -34, 339, -202, -181, 162, 148, 94, -119, 60, -55, 88, 90, 13, -82, 63, -3, -78, -244, -8, -20, -113, 64, 93, -11, 224, 103, 171, -369, 54, -144, -77, -85, -187, -154, 95, -51, -111, 62, 71, 114, -33, 31, 55, 83, -48, -206, -33, 105, -197, 175, 55, 280, 106, 163, -110, -154, -16, 107, 52, -37, -33, -23, 179, -54, -20, -84, -82, -77, 66, 45, -34, 8, -31, -17, 127, 8, -226, -146, -44, 47, 39, 14, 36, -143, 20, 129, 140, 139, 30, 178, -51, 95, 194, -245, 228, 1, -127, 85, 1, -80, -149, -50, -151, -145, 38, 144, 6, -105, 378, -77, -76, 117, 55, -301, -132, 193, -41, 13, 61, -152, -86, -50, -156, -60, -147, -44, 170, 105, -5, 44, 68, 293, -64, -15, 299, 29, 51, 38, -39, -66, 11, -73, 56, 14, -159, 9, -286, 140, -7, -110, 86, -24, 59, -92, 120, 112, -8]
7465hj53K36k01K43N6j31q6%K15l29N14l81l5k7J54K3L9K1j64n0O4q0m8J77L07
7490C56m12Q5J6J7j32Q8j85L41l00K77k32M5Q5k39K8R2%J6q4N4L9j64J74j3qK90
7516B34m02J68N9j48Q2J0J00np4N6j72n2J24Q7L3R0m22K81J11p6r8N7M9k4k18
7541a50P1l6j39J84K11j35j89K06r4J1J28qj52L17l67J45Mr0J23q7M3ro6K96j93
7566B4j4J54j58J35l69K88j09M8o8L55l17L4j11J30k4J13N5l47K93k47qJ21j58
7589a80K42Q8j97J11k32J61J53l68N7L55j13j01J24j20j59K80p2o4J5J18q7rm
7612bK00l21J44J07k78L22m90L65J3Nq6p6q2J38q1J16Q7p0J39l1p4k8j4J1M2j16
7638f0J58q3jJ05q0n1j62Q3J66k38K70j82J56k88L41j65k53J48N3N5K80j67j57
$$ y = [-8, -161, 75, -126, 117, 173, 42, -44, -44, 171, -158, 356, -25, -60, -87, 67, 90, 129, 150, -14, -64, 0, -80, -128, 49, 356, -56, 29, 45, 62, -70, 18, -167, 174, -126, 151, -81, -36, 49, -190, -162, -70, -70, -54, -138, -84, -45, -209, -35, -48, -56, 234, -168, 0, 59, -89, -7, 3, 103, 98, 24, 80, -92, -144, -20, 67, 100, 190, -232, 49, 160, 84, -14, 43, 92, 68, -150, -79, -115, -254, -70, 141, 6, -183, 23, -71, -60, 68, 60, -92, 225, -142, 3, 7, -83, 40, -47, -4, -13, -79, 217, 24, 10, 164, 6, 141, -228, 60, -49, -1, -69, 286, -31, 3, -108, 22, -2, 111, 166, -181, 112, -135, -143, -22, -180, 62, 150, -47, 64, -168, -7, 146, -222, -165, 190, 77, -24, 100, -20, -179, 101, 29, -35, -20, 98, 11, 2, -2, 198, -123, 21, 128, -150, 172, -318, 47, 60, 65, -21, -97, -179, -41, -122, -6, 81, 11, 150, 119, 45, 17, 3, 14, 56, -60, 98, 15, 14, 119, 39, -12, -174, -91, 75, -163, 107, -75, 81, -207, 134, -31, -284, -136, -83, -28, 252, 85, -72]
7661g2k9K1L15l23J65j04L6Q4j47Q8J22j25r1or1j8K02N3j09j81L13j02M8O4j6
7686I7M3j47K32k26P7j90L17k29k38J50j11L43l19J64p7l7J49J5k6k28L67J17
7708B43r0k66K26j59L2J8L1j17k13K57m2J40N1l91L65Nk2PP0j64P9j3J87p0j62
7733Bk03N8M6R4j76N3j5P6J86O0j72j48K58j74j7M0o0L68l14MR3n1Jk42K35l83
7759c81M02J47r5q5o4L67q7j41J24l32M43l36M1k2R9k43K43j2k22K9K06l6m4k38
7783b37M28k17J69k78K05j14j5J22k42M6p5J89jm6K51j48R6k15J95K7j59j09O4
7806f4K61l32R5q1M6Q1j20K56N1l33m7p7J83j1K50j03k25Q8J18j09R4J25r4k3
7830B9n0J68p1j27M6j33K31q3K16j20j93L83k81j91K1L27m8r8k3K5k7p3J45O1
$$ y = [-72, -101, -80, 235, -88, 77, -27, 9, 93, -54, 34, 156, 31, -60, -66, -157, -175, 27, 80, -29, -210, 103, 1, 49, 113, 97, 140, -7, 225, -1, 76, -114, 203, -26, -264, -114, -225, 118, -201, -37, -114, -151, -2, 13, -13, -241, 126, 243, 153, -113, 113, -46, -14, 4, 35, -82, -295, -38, -80, 60, 111, -280, 85, 90, 68, 75, 145, -19, 60, 47, 234, 164, 2, -201, -143, -97, -3, -179, -126, -141, -65, 121, 181, 9, -139, 119, -55, -72, -32, -92, 276, -38, -34, 59, 8, 9, -233, 2, -381, 21, 168, 73, -12, -76, 291, 204, 63, 187, -145, 298, -38, 3, -19, 80, -163, 80, 68, -154, -125, 81, 45, 1, -237, 191, -26, 143, -135, 70, -44, -59, 63, -179, -133, -208, -19, -20, -66, 185, 37, 133, -82, 113, 140, -19, -128, -64, 197, -135, -40, -121, -75, 6, -114, 142, 193, -140, -187, -264, -81, -92, 158, 55, -170, -82, 36, -73, 21, 146, 52, 29, -21, 147, 76, -51, -5, -138, 93, 10, 226, 106, -87, 296, 15, -176, -155, 172, 124, 26, 3, 28, 1, -72, 73, 134]
7854A34l78L94j73r1R7r3J29J09l6l36N15k13j12Q2J94k89q7J47j0j5N1j07n2
7877a40K01k58L08j98J10r4O2o1j58K95l06K39J60p2M3j84J51j60Q1k51K25J65
7899A58l24K09j06nJ67k57J23K59k0j24r0Nj82N1J98j14m5N9J3M9J26j9k27R0
7923fj46M7K24j7K1j4o9m9NJ44k09L0K8m8j45K45L06j71j11n8j00J95j82k10L82
7948I2k6l18K10J40M9j78J49k26M3K61k38J74O2K7q3j64q0k0J17l7K2n8mp4K61
7973A01K6m4Jj27j92J5L26q7k56L47r0j6K74k34R5k43K20j04j12K21j95J21j19
7996g2J55j18L14m14J89j3j57Rq6L58l00J57n9lJ30l7j30L6j76K63q2j79J86k3
8020e2j18J82j41J93m7k13N82n93J54J82j14J73j76J91j18j90J00j48J42j60L39
$$ y = [134, -244, 150, -23, -114, -17, -110, 19, 128, 92, -244, 271, 58, -54, 28, 222, -67, -154, -7, -17, -32, 19, -88, -140, 61, -197, 111, -87, 23, -71, -9, -70, -228, 67, -239, 0, 160, 88, 131, -53, 98, -62, 19, -232, -7, 158, -166, 43, -63, -68, 99, -158, -35, 224, 204, 80, -10, -5, -187, -136, 62, -52, -97, -38, -25, 24, 150, 131, -96, -6, -152, -105, 119, 102, 123, 109, 40, -9, -4, 140, -69, -39, -11, -59, -204, 41, 347, 176, 65, 7, -93, 102, -80, -290, 92, 66, -252, -42, 98, 147, -31, 118, -108, -65, 196, -42, 132, 194, 221, 138, -26, -106, -126, -9, -46, -24, -82, -86, -160, 101, 127, 83, 84, -43, -235, -220, 106, 19, -237, 110, 20, 4, 278, 44, 139, -104, 116, 12, -100, 121, -74, 47, -72, 83, -35, 279, -135, 54, 41, -116, -107, -193, 165, -135, 22, -37, -40, 90, 53, -77, -41, -217, 46, -36, -215, -29, -52, -170, 12, -129, 64, 17, -196, 386, -207, -53, 129, 15, 188, 12, 203, 85, -105, -5, -153, -11, -171, 168]
8041A68j45Qn6j34J63j09R4n1J18q6N6K07l62J51L3l47K87nq9j32J73K17j67n5
8065f3j4J93J31k67j32L42r3j48J38J37q5j04j55P4q4K16R6l87L46M4r2j71K18
8088A40O6j60k26J32J67n2k96J64J13m0j89K61krp0R3k94K74r0M1K02p7j64j09
8112a25K58j62J04q3j9K1k11L55j16j73Q4N6J22nN6k43N2K13j51m6J59n19L30
8135d3o1q8J81n6Oj38J69O6k9J39k62r5J33L3j76rK86m1n6J84o9m2k18L29j36
8160Go4J86r6L7m3k15j25M25k89K72k12K78Mk92J23q2J72k8o0m5K14O7k54R0J04
8185A74l81L38pj6j11J12
$$ y = [168, 23, 31, -25, -159, 4, -105, -11, -62, 56, -30, 26, 233, -129, 22, 55, -292, -5, -10, -99, -231, -58, 159, -8, -63, -77, 116, 247, -20, -152, 190, 97, -51, 87, 224, 139, 35, -120, -46, -130, 86, 182, -205, 141, 185, 93, -78, 140, 206, 46, -180, -48, 119, 67, -229, -65, 48, 8, -181, 80, 78, 69, -1, 92, -202, 72, -18, 23, 225, 148, -16, -125, 133, -29, 75, -8, -27, -6, -217, 138, 22, -151, -67, -11, 111, 106, 162, -81, -29, 184, 33, -13, 146, -373, -43, -104, -192, -11, -67, -61, -199, -30, 36, 7, 146, -116, -211, -78, -45, -221, -230, 56, 15, -41, 143, 74, 32, -186, 143, 7, -57, 129, 33, 70, 27, -188, -313, 112, -177, 95, -117, 161, 165, -127, -4, -86, 86, 58, -2, -47, 167, 234, -20, 70, 174, -207, 131, 124, 108, -3, 109]
8191A09
$$ Imaginary data points
##PAGE= N=2
##DATA TABLE= (X++(I..I)), XYDATA
0@%%%%%%%%%%%Qj6J6j6K4l2L9m7N6p2Q6j00J18j36J60j90K20k54K91l33L82m36
33b32M95n61O35p17Q04r00J008j124J252j392J544j712J896k094K309k548K809
50A472l092L405l752M134m558N034n568O174o867P665q603R722j1081J2773j4945
65h087J7850k1964K8317l9904R8402k75213K39632J03023l43633L30860j50835
76b1552o7527K03177j59304K4774O3900o0220L9038o4024P5621m3331k5641R2766
88E7677j19660O6703N5434j45939J13456j3580n6576P5663n2929J4716J8550k3386
100i871J8588l8248L9084j1703k4397M3739l9727L6789o433m2416P0829n2445
112a6211Q729K4492n7498Q2573n0738k9943R0992q7541L4899L0070p7834Q1966
$$ y = [0, 0, 0, 0, 0, 0, 0, 0, 0, 0, 0, 0, 8, -8, 8, -8, 16, -16, 23, -24, 32, -40, 46, -54, 64, -72, 88, -102, 118, -136, 155, -178, 204, -232, 263, -298, 337, -380, 424, -476, 532, -592, 660, -732, 812, -900, 996, -1098, 1211, -1337, 1472, -1620, 1785, -1967, 2167, -2391, 2643, -2925, 3249, -3618, 4047, -4556, 5166, -5915, 6858, -8087, 9763, -12201, 16116, -23788, 74614, -200599, 39033, 142056, -201577, 129283, -21552, -89079, 114098, -45206, -20432, 43468, -16752, 22286, -41738, 33883, -9448, -35089, 57677, -61983, 4720, 60154, -85785, 27671, 14091, -42485, 33178, -19751, -5035, 13515, -9871, 8717, -29531, 9553, -2150, -26547, 17192, -22535, 14254, 7821, -34595, 36234, -16211, -7482, 17010, -40488, 42085, -8653, -38596, 52396, -35145, -246, 29824, -48010, 33956]
124C3956k2015l7040N0884k9396J3477j6250M16K4190m0256M4215k5083j4127
136a7029O8291q0250K5589M3376p6164N9339j4246l5083N9366m1890N281J2052
148H632j8997K7109l3690K2900J1173l8231M7255l3593o585M4203n8497K7234
160a087J5752l7902L8878k0608l576K1907k5651J6702j1571Q98J8190l0281K4535
173F186l872j9122K9102k6995Q161J6636k6284K2281n892n615J4735k2248J4565
186A638l99j4022J9905j5045O584J0626j9126J4695l032p218J0502q849O461M57
200C177m509P231q930N250J51p605J1750n786P71O572q935P022l136n662P734
215E095o377J546N211n464L515K1k133j23O42q73k310N633l204k602P526r106
$$ y = [33956, 11941, -25099, 25785, -3611, 9866, -6384, -5968, 18222, -22034, 22181, -2902, -17029, 51262, -28988, -3399, 39977, -36187, 23152, 8906, -26177, 33189, -8701, -3420, 8632, -10365, 16744, -16946, 5954, 17127, -21104, 26151, -7442, -14027, 30176, -28321, -1087, 14665, -23237, 15641, -4967, -8543, 13364, -12287, 4415, -7156, -6258, 11932, -18349, 6186, 2314, -16808, 12294, -14701, -6540, 10096, -16188, 6093, 201, -5414, 9321, -12927, 1638, 1239, -12783, 7122, -7923, -1339, 9287, -9839, 4856, 1824, -5394, 5108, -3741, 2720, 3177, -1332, 5899, -3031, 2219, 2370, -5235, 6515, 729, 1500, 8072, -863, 6159, 3023, -2639, 5095, -1282, 264, 5475, 11, 3526, 3547, 1414, 1291, 1933, 1060, -1250, 4383, 1179, -1423, 6103, -3003]
231c003K76P707j1343N493N448r097O439R82o880L669l06m122K276J434k381K671
247g37J358m214K412ll812L435J21j828K704o20q46M72j020m14Q95O29RK078n86
266C3n29J660l605J413J801m437N988j250k571Q084q084M4P701j0382M856M363
282E085q019P740j283m311M358l255J445j073r6M612n479L895P72p496R585o356
298A24n727J4522j0570j128J2408j3211L630O521j2769P028K402q041P137k120
312B06j715M327o347K163J846m242M144k327L68M317p550L319K224p179O300j237
328a383m561R229m325l175N829l682o58J176j231K326k95m28M96j78J720k846
344a986L18K891j935J296J2J54Q38j976R30j557J577J992m552N170J176n512N829
$$ y = [-3003, -2727, 4980, -6363, -870, 4578, -4519, 1920, 2902, -3978, -309, -615, -4737, -2461, -1027, -3408, -737, 621, -3593, -1181, -1184, -4996, -1561, -1440, -3268, -564, -1184, -2030, -1558, -2578, -2992, -2097, -1468, -1459, 619, 33, -496, 1164, -2441, -1028, 773, -3664, 2324, 1074, -1497, 6587, -1497, -1453, 6248, -4134, 722, 5085, -2934, 4806, 3523, -788, 3570, 315, 1760, 687, 591, 5203, -276, 3619, 4391, -3105, 6480, 124, -5603, 8919, -1651, -2779, 9629, -3582, 48, 6569, -6200, 828, 3230, -4811, 2326, 206, -1509, 2818, -3529, -1366, 480, -3762, 382, -1945, -1577, 2740, -4810, -1491, 733, -6446, -146, -1383, -5944, 3285, -1040, -4215, 1614, -2068, -2726, -1550, -2781, -455, -750, -1178, -682, -860, 860, -1986, -1668, 1223, -712, 584, 596, 750, 1588, -388, 542, -1015, 562, 2554, -1998, 3172, 4348, -1164, 4665]
361D665l846k082O863p306J553N834o998L638R24n103N246k213k445N182k903
376A009M04J350l847K869j394l518M471k030n76M642n372K915K139p645N465r66
392h4m410P318o063P98N612q919N909o20m873Q967p972K523O176j0629P795k164
408f36o069J0208q617K195O242q661P927k470l620P647p999K979L035o412P277
423C026m108j52M546o576N506k033j459O305o612M125Q45n612O112n111P36L892
439C430n754O172k230j350M735o176M492j947l037O565p337M080J973p093P239
454C762m653k03M889p462P405k649l660Q000r146L169K615p770P655m104L0N562
470C440q013O793k010m889P963p779L386K322o502P901n563l66N911q529O350
$$ y = [4665, 819, -1263, 5600, -1706, -153, 5681, -1317, 2321, 3245, -1858, 3388, 1175, -1270, 3912, 1009, 1413, 2763, -1084, 1785, 391, -3127, 1344, -686, -1262, 3380, -1992, 923, 3062, -4583, 882, -84, -4494, 2824, -3239, -2441, 3171, -5748, 161, -459, -5332, 3635, -4337, -1814, 4362, -6267, 1528, -636, -6705, 3503, -5114, -2919, 3323, -5338, 2589, 119, -3501, 4146, -3853, -874, 2161, -4251, 3026, -1082, -1234, 3312, -3264, 2242, 209, -1250, 5055, -1557, 2568, 3413, -2199, 3913, -1198, -462, 3430, -2324, 3848, 1618, 268, 5003, -1173, 3319, 1372, -1665, 4900, -2437, 1643, 3616, -3477, 3762, -891, -1094, 3795, -3667, 3738, 1089, -2571, 5429, -3717, -548, 2067, -5703, 1952, -2152, -2122, 3440, -4573, 2220, 210, -4679, 3284, -4495, -1109, 1213, -5289, 2612, -2951, -3317, 2594, -5935, 415]
485D15o1m220P214n739K640N56n021O596n642Q00N407o577N531r04k745N387o088
502b451L817K13m245O056l846P61K197m698N251l531J91M597n713M665l76l903
518a015N164n388K126J305m908O720m324L00M705o612M399j125l307N362m890
533a488J779J913n006M776k722j023L281m054L663r03j957M385m714J392J124
548D46l996L626k247J12K975l837L075m12k278L076k234L18R48r30O14o42P93
565e93n99r87K644k354J209K009k284K129o04j532J548j122J81L21R1O75j027
582b95K179q24j377K724k807R66K162l407K585o0k554K570j341o84J977j081P35
599A468j41k0J1p77K99q72J76N80p80P60l0p07P24m07o61M5j00N0P2P43j718P08
$$ y = [415, 354, -3866, 3348, -2391, 249, 805, -4216, 2380, -3262, -2462, 2945, -3632, 1899, 995, -1750, 3637, -2451, 1366, 1579, -2666, 3390, -456, 305, 2502, -2196, 3055, -476, -285, 4312, -1401, 3264, 2888, -1015, 4149, -1239, 887, 2192, -2716, 4004, -320, -20, 4685, -1927, 2472, 1347, -1960, 3402, -1488, 291, 2204, -2802, 1974, -748, -1771, 1510, -2544, 1119, 216, -1741, 2644, -2070, -678, 446, -3550, 76, -2171, -2059, 916, -2921, 154, -258, -2536, 540, -1694, -1376, -428, -1358, -744, -1386, -593, -1192, -2179, 465, -1889, -680, 1329, -955, 1174, 570, -962, 586, -536, -355, -34, 57, 732, -295, 1884, 1060, -317, 2407, -400, 566, 2728, -679, 1906, 1846, -708, 1862, 521, -163, 1814, 733, 1468, 1327, 1307, 1318, 541, 840, -32, 144, 724, -56, 704, 674, -33, 691, 284, -377, -332, -432, -382, -310, 433, -1285, -577]
621e77L95j611J420o72n06K100j344lQ07j964J463l69j353K212j519O37Q18j249
639a315J167p57r4R06r54J194j69q42J321r42J83k07L19P07p19Q80J36p96J069
658A087j152L39Q01j539J602l68n17J741j450L94K93r55J363j807J152J257l096
675h55K317o51j515K479k432P74J927k635J669m94q10J589k533J031M37j484K094
692I08k160J197J355l368K032M56k239J701r72N33L40j422J086o12k69J412j599
709a621R24N07o45P69j359Q78L17j498O55O34J50K77q45J252q53j29R91j684J715
728D35O06j817R02M05J64j041j65K108q49p97J297p45J021r66r02J939j434K81
746D42O29p49J520j254m53Q46r51J090r08m35K045j945oJ490j739O09qp53R45
$$ y = [-577, -182, -1793, -373, -1045, -1551, 549, -795, -798, 9, -1955, -492, -861, -2214, -2, -1521, -884, -66, -1315, -148, -905, -999, -93, -1047, 147, -22, -864, 457, -485, -302, -509, -190, 517, -202, 678, 814, 18, 1087, -65, 274, 1075, -464, 1138, 770, 253, 1994, 544, 938, 1231, 276, 1639, -168, 984, 2241, -855, 1462, 811, -704, 1775, -657, 117, 2044, -591, 1078, 584, -226, 1363, -1170, -139, 298, -1186, 908, -1252, -55, 1300, -2068, -36, 420, -1819, -118, -1090, -557, -217, -1639, -553, -1165, -1434, -22, -1621, -697, -190, -835, -66, -1425, -547, -230, -1728, -1073, -439, -289, -12, -857, 395, -458, -587, 404, -1280, 435, 1041, -776, 126, 531, 695, -346, -511, 1597, 748, -49, 1248, 503, 1524, 558, -344, 1595, 161, 442, 1071, 322, 1842, 588, 135, 981, 30, 1120, 212, -223, 1822, -123, -129, 1361, -378, 231, 223, -530, 415]
765D15l66J16J62q11M64m96j95j12j21J030q00k61J159q58J2j83l41J154o10o56
785a298N42O25m14j069J062M21q13N60n59J132N69k372J237J036j708R25K66l86
803b44J164j030k70J214k21q70P23N98r68K76O55p87N95O2q74J022j49p09J179
822A366n69n9n0k34N5k71n7M27n76N52P7k35K06n72l25O65k8q21J106m52r36O99
844c2j30o16O23n20J80P13m18m16J16M85j078K75O04o29N3M92n80N85J12p69O21
865c29J66o24L11O59q28J6N88o55m1J197j131N02J120j160M90L98o56J44Q5l80
885a28L72M21l94k76J137r44J65R61j673Q46R46j784J176m7j110J383l59l97L77
904F72j91O5R9m72K53k56o2NQ5m3j98M28j74l66J10m9J14n75L89K9n23L96k13
$$ y = [415, 49, 165, 327, -484, -20, -516, -711, -823, -944, 86, -714, -975, 184, -674, -662, -845, -1186, -32, -642, -1298, -756, -131, -545, -1614, -552, -131, -944, -384, -943, 189, 758, -1614, -377, 659, -1049, -124, 142, -244, 920, -110, -380, 834, 613, -257, 466, 1064, 96, 372, 1027, 240, 835, 897, 23, 1045, 896, 187, 1366, 797, 738, 688, 454, 509, 238, 181, 608, 32, 584, 661, 426, 632, 60, -265, 400, 372, -449, 657, 205, -731, -32, -162, -778, -155, -675, -495, 218, -200, -616, -500, -15, -1093, -818, -214, -843, -790, -298, -878, -293, -181, -950, -329, -163, -787, -476, 183, -645, -629, -41, -696, -737, 460, -671, -169, 951, -209, 281, 679, 23, 167, 252, -128, 244, 665, 271, -5, 1132, 188, 353, 1314, -359, 487, 1433, -351, 825, 778, -332, 1051, 692, 295, 672, 481, 546, 645, 173, 426, 170, 108, 113, 198, 155, -43, 385, 211, -155, -45, -94, 20, -555, -166, -137, -660, -264, -477]
927d77l29N07n99L03R8n71R73o88K41L76q37O39j69m70J049r44M41N05o67Q66
947B47m93l55Q81p60O27n9k22P68j006K96N18n86Q61n43m9J045j253O48J22p86
967i9J123r11Q4R34j041Q09l64o00J372j164J85N12r46N86k00o67J252q57J36
986A44K13k77L58l12l14N48k90m80J05j32K66j48n9Q2J44j41k86J29L79k76P4
1007b73k90K90j94m46K44K25J94k4m67N46J25l65N1K64q0K7o88O90M45o73J53
1028b46K74K81j76l92N26J71o6J75q83N71M29o35L95j43J74L71q70N87M28p31
1048B40M85m98N7M61r21M96M22p79M94n94N38L91q95M38k34O5L25j152P47Q0q14
1069f48Q64l52L24K65j059O27q1k91J81r06Q93j67l46N45m83L26p7k89P39m86
$$ y = [-477, -806, -299, -898, -595, -497, -1068, -95, -783, -542, -166, -1003, -364, -533, -1003, 46, -898, -457, 48, -619, 247, -246, -601, 280, -480, 147, 88, -134, 634, -372, -76, 442, -144, 717, 174, 125, 1170, -83, 565, 687, -99, 1024, 113, 197, 1131, 90, 899, 535, -65, 1307, 143, 328, 840, -106, 480, 280, -387, 865, 8, 144, 357, 80, 438, 126, -188, 360, 70, -410, -305, -437, -171, -319, -378, -296, -152, -293, -579, -450, -71, -347, -273, -563, -273, -467, -913, -669, -444, -250, -274, -741, -195, -70, -435, -384, -120, -200, -173, -861, -171, 274, -399, -246, 28, 309, 133, -259, 267, 438, 372, 547, -336, 235, 664, 29, 424, 281, 455, 826, -44, 543, 971, 240, 725, 227, 284, 745, -176, 320, 742, -37, 457, -137, 401, 792, -103, 335, 101, 166, 491, -661, 86, 166, -648, 216, -136, 188, 453, -606, 21, -60, -351, -170, -1076, -183, -350, -696, -151, -634, -308, -385, -674, 65, -421]
1089d21k49M51p37J048m50o76J143q09N72K69o10P32j14m63K77j51L52k96l47
1108d79R32o47N32r5l93J205j038K70O52q57O65j45o28P44n25J41K89p52R92l57
1128E06n60J019q84L05R0o49P89m57j97M37o83R28q28k59J135j034O5M22o36O67
1148A76l80l68Q89q24R3L21l67K51l26J15K70n09M74n2m80L10k43L7K79k3J71
1169a86l62N86k25n58R11n64q1O69o12L94O9n76R88o66L70J52m44N69n00L30M40
1190G04j253J155j63r59J153m00j96P29r23P72P6p97J008q45K32K22n33N33n59
1209d4J7O03o22K12J60o75N82n22K71L5l19P65q95J72M76r56P47J51p46O17p51
1230g22N45J71p94R06o38m37J126q68N66k49m26J097j011K34O34r87R58l96l95
$$ y = [-421, -670, -219, -956, 92, -358, -1034, 109, -700, -128, 141, -469, 263, 149, -314, -37, -188, 164, -132, -479, 453, -194, 338, 243, -150, 1055, 17, 287, 939, 82, 747, 602, -26, 718, 193, 334, 623, -129, 863, 506, -54, 965, 81, 386, 476, -173, 616, 159, -38, 399, -284, 644, -184, -443, 692, -342, -277, 145, -491, 176, -204, -572, 317, -507, -414, -93, -460, -209, -535, -420, -150, -659, -185, -237, -717, -407, -650, -613, -334, -357, -186, -548, 38, -187, -745, 166, -398, -479, 190, -422, -28, 41, -535, 453, -213, 157, 309, -135, 434, -66, 264, 704, -549, 606, 443, -516, 637, 237, 41, 770, -153, 619, 695, -102, 906, 61, 293, 515, -18, 515, -44, -27, 576, -46, 166, 326, -349, 233, -289, -18, 17, -302, 463, -432, -260, 216, -740, 7, 158, -588, 29, -722, -177, -6, -800, 106, -532, -969, 157, -711, -145, -394, -820, 277, -734, -500, 134, -853, 105, -291, -686]
1249f86J160j269P56O0n14J021j002K82O40p86M93j05j90M39n51M85K90p31R83
1268G75l85j94L54o19P35l72k35O31n68M52p9o34P07k69j89M99p19M17j85l7L16
1289D01m34K95J8m72O10m98K61J0o01O70o04q9M82l62J82P8m97M70m64K79K84
1310A9o70L47J10m78P55o62L74j99p4L55k12j02N98o12M79p2l09M35l26P5j02
1331b71j21P41m29r2N16o43K07M00o31N00K45l20K90l02K84l17L77k3p8O3j87
1352B09J69l8l36J82J47j42l9J30p2J83l75K09j66J76K38l81j66K15p1j81J58
1373D9k30p6K46m1%j42k16L84k36l35O66k82j11J41J04m75L14J28k15R3o6L0J17
1396a53j57K38Rm68K42Q9o1K57M3lj64O8M29l57p2L55m68K64J23o3q6J48j01J30
$$ y = [-686, 474, -795, -39, 21, -493, 528, -474, -192, 448, -338, 155, 50, -140, 299, -252, 233, 523, -208, 775, 390, 196, 550, -69, 666, 294, 59, 690, 122, 574, 495, -139, 568, 299, 110, 609, -110, 307, 122, 85, 401, -33, 262, 280, -192, 418, -80, 181, 191, -410, 260, -344, -433, 49, -313, -131, -53, -550, -80, -544, -265, 19, -651, -304, -194, -672, 83, -579, -205, -404, -478, -123, -335, -437, 161, -451, 28, -44, -353, 82, -244, -169, -271, -392, 349, -80, -172, 344, -299, -92, 308, -323, 177, 422, 102, 392, 90, 374, 57, 434, 411, 333, 396, 209, 378, 340, 4, 186, 333, 191, 152, 282, 210, 393, 18, 227, 61, 237, 475, 94, -72, 143, 72, -109, 49, -181, -257, -11, -52, -52, -194, -410, -26, -262, -597, 69, -213, -324, -183, -79, -554, -240, -112, -327, -234, -300, -270, -153, -310, -72, -63, -531, -289, -200, -261, -4, 39, 36, -128, -60, 369, 12, -60, 295, -173, 91, 214, 151, 65, 213, 112, 242]
1420B42l4r3K66k28P3J06k25J10K0n3lRP2j63R4M3o7K1m5L2j02J67l67K48k87
1445a64L16k49M5J93j56R6l32J6J69j32k27L09k06K58K9k76J07k41L1L46l56L14
1467a10n2k73O28q51N54J28k03kk0N7K99l01J83J91l49L68k11k30J84k51M55l
1489A91l97L68J55r1p3J9N6m4j75J36m2J28J12k12L15m77M32l09j30O26p15M13
1511B86p2nn4k29J39J19l51M95o7j01m4k25j25L76l78J42R3j53J67o3r1Jj48K53
1535c5l7l35L39k68K59J42l05n4M9j0L5P3j03L60l18O4R9j95J87l46M82j34L2
1558a9K25j94j7L71m91L88j70j2K65r3j38j00j47K52O6J66N9k12Q4o9j23M44o80
1581a45M55j06n35Q91o97K85K94o10L81J05l87K77k73R4L43p66O92l14j87N38
$$ y = [242, 208, 115, 381, 153, 226, 332, 107, 217, 237, 184, 181, 190, 262, 99, 193, 236, 169, 190, 145, 177, 75, 242, -125, 123, -164, 152, -97, -52, 141, -15, 81, -251, -235, -66, -198, -425, -116, -322, -64, -35, -311, -204, -445, -414, -68, -424, -110, -162, -435, 193, -658, -104, 24, -179, -181, -201, -144, 155, -146, 37, 228, -121, 247, 36, -194, -10, -261, 194, 191, -206, 162, 317, 226, 153, 172, 228, 184, 9, 145, 103, 231, 343, 131, 446, -31, 401, 92, -38, 588, -127, 286, 214, 209, 155, -74, 65, 184, -167, 328, 261, 160, 116, -109, -234, 142, -236, -94, -1, -154, 13, -50, -141, -140, -288, -35, -72, -407, -68, -336, -77, 65, -240, -294, -245, -255, -220, -147, -250, 110, -208, -144, -45, -240, -53, -399, 83, -51, -19, 206, 12, -5, 366, -125, 263, 93, 81, 346, 253, 115, 15, -132, 120, 186, 352, 411, 199, 283, 214, 91, 535, -145, 310, 204, -331, 560, -137, 148, 442, -168, 213, 318, -69, 208, -65, 29, 372, -394, 298, -16, -203, 335]
1601C35r33P92k12m20O45o10L00L31o64M20j72l1L47n95L97j02l71O53m80K32
1621a38J69m33N50n04j26P51n89K70L18o30N39l35L68j00n84R33p23J24L95m44
1641a89L80M6n87Q44p69L36L72p49P81j00l08N90p90M13J42m15N32l19J76k0q02
1662d36J055n56n07J197r73M37L7o80Q75q08K69M05p70P34n36r1Q45j141N32R8
1682a4o80J166p74j5M57p71O56m78J27O20p25O01r5p02Q90p72K18O31q45P45l99
1703a59L5M09p67N79k6o24Q84n16J16O80r86P55m54k38R89p63N72P1n49N19o42
1724a15L53K22o62P71l37l65R45r19L65J10o20M53k77J40K80o98P00o32O5O80
1744D59o16K67o9n76P47m75J76L48q32R45n01k81N88m59J01J83m47M89k89j65
$$ y = [335, -598, 194, -18, -438, 207, -403, -103, 228, -436, -16, -188, -219, 128, -467, -70, -172, -543, 110, -370, -138, 31, -402, 148, -356, -482, 269, -320, -50, 268, -362, 177, -158, 210, 110, -474, 459, -264, -140, 255, -189, 191, 237, -350, 494, -275, 61, 433, -316, 465, 365, 57, 647, -143, 270, 412, -3, 529, 210, 386, 366, -436, 619, 63, -444, 753, -220, 217, 254, -426, 449, -359, -90, 315, -455, 279, -257, -348, 497, -644, -112, -14, -694, 472, -302, -317, 140, -631, 25, -453, -326, 294, -431, 170, 75, -627, 263, -509, -291, 340, -505, 240, -159, -124, 285, -482, 97, 71, -553, 331, -185, -69, 611, -375, 380, -74, -312, 677, -86, 486, 557, 8, 527, -115, 238, 460, -202, 569, 232, -133, 812, -107, 258, 368, -252, 201, -76, 64, 344, -354, 346, -286, -221, 459, -157, 110, 41, -535, 212, -263, -87, 261, -571, 374, -127, -408, 180, -279, -178, 5, -442, 47, -242, -407]
1764d07N18m02K63j24k64M68l24K69k2n06N44j25R9J48n44M96j83k01K09r5K28
1785D5J61k59L83m72J75K92m90L35L2j15K47m89L61J4k02M94n42J21J20k17M30
1806D24p6l76L03l91K36M9k19M40k95q5K09l06J05K54l32L55m28J03J70m10N47
1827B77j78p3j42k29J62J7r1K51l26K33J25r0r6r8J69J36p7n8J3k75K48J40k79
1850b41J59j24J57L2k1K28k56K49m01L99qo00N34j31O6L3j01o0J99k33L22l76
1872a74L85r6j72M0J45k49L97lj51o5j32L23m49L48N1j76K60J31n34Q1Rk9J84
1895A24m42K79J55k25L8N8P1k25j10J38n5J14k3K0m5P3L7l59L71k7nQ6j87j59
1919b98K80o5Q4j22K54k58q6R1l8J57j60P6m6J19J61q9j62K27k55o4R9K58j80
$$ y = [-407, 111, -291, -28, -152, -416, 52, -272, -3, -25, -531, 13, -112, -13, 135, -409, 87, -96, -297, -88, -183, 45, 206, -53, 330, -142, 33, 325, -165, 170, 202, 87, 334, -155, 206, 220, 18, 512, -30, 91, 211, -6, 424, 348, -28, 275, -116, 120, 169, -50, 390, 95, 10, 219, -87, 18, 272, -60, 295, -133, -30, 140, -270, 277, 99, 26, -116, -345, -183, -166, -257, -6, -332, -99, 26, -64, -160, -258, -89, 47, -30, -88, -75, -350, -102, 38, -241, -82, -206, -49, -17, -38, 190, -66, 183, -218, 181, 173, -427, 107, -24, 42, 75, -26, -86, 113, -120, 202, -174, 211, 115, -57, -17, 128, -121, 276, 273, 122, 57, -75, 248, -201, 147, 198, 22, 282, 413, -121, -40, -31, -60, 124, -318, -39, 116, -109, -71, -13, 58, -167, -277, -139, -194, -80, -103, -83, -128, -55, -18, -377, -6, -33, -38, 48, -139, -298, -18, -83, 1, -121, 133, -125, -211, -120, -158, -1, -161, -85, -131, -12, 149, 60, -102, 125, -130, -194, -95, 163, -17]
1942a7N7J2j15K31Rk40M15k55J68k5j71J05l6j24J64J10j47k48J35k6P0K38p6
1965B34M7j11j49oN7k93K94K07k28l44J10J41J66k76K32k76j19L79l53K52j19
1986a55n4J24k20J45J33j19O8q3Q0J6l92L70L2q9m6R6j00K0K2K63r1J6J12k34
2010h6K93j17k19J49J01j2o4j68J45J56j14J18j42M83n26J19J03k0k2o1r5K15
2032B36j72O5J37j33J44j39k89M65l34J44R9m70K35k65K52L8k74L30j65j56K08
2053d4p2J73p3k64L11k11k35L97k14K30j98J25J21l26L83l33r7L33l34L54O0l24
2075b38L53k60J50Nj79J69R6q2K75m90K14J67m39M17j07M8K44m13M57l58N2J69
2097B50m70L47o5j44K16j15N3L15m03J46K5q3l6n4M95l18l40L95k35L0L35p15
$$ y = [-17, 40, 52, -63, 168, 177, -63, 352, 97, 265, 240, 69, 174, 138, 14, 178, 288, 141, -107, 28, 2, 72, 310, 234, 281, 170, 21, 15, 72, -221, 73, 280, 52, -292, -182, -41, 125, -151, 81, -195, -314, 65, -288, -36, -155, -209, -85, -305, -160, -27, -146, -78, -161, -81, -65, -457, -87, -55, -144, -190, -94, -194, -174, -152, 111, 20, 36, 148, -86, 207, 90, -129, 20, 121, 109, 45, -123, 22, 178, 64, 182, 40, 523, -3, 116, 219, 199, 177, 116, 21, 236, 64, 129, 266, 133, 277, 138, -151, 314, -20, 124, 223, -247, -12, -277, -25, 13, -261, 69, -96, -252, -44, -116, 57, -16, -280, 31, -180, -415, -18, -232, -2, -200, -75, 46, -280, 103, -230, -327, 6, -328, 26, 86, -238, 115, -145, 5, 10, -169, 0, 96, 14, 289, -201, 13, 180, -259, 158, 51, 99, 343, -70, 387, 29, 81, 250, -220, 127, 62, -82, 134, 19, 72, 387, -16, 130, 155, 72, 36, -18, 477, 159, -181, 214, -21, 9, 344, -371]
2119c71N67j77j65K77k13p7L83k95K86n70P7L00j67K76j2k26j6q4N0K1j91L60
2141C3n8j96P9l4K23l12K92J5l05K91j75J05O8k93K4K63j83L82j62j43L19l17
2163h4N3Q9k77N12l31r9K14j66R5l8J02K65m52J00k17P8J74k78N20l38l41P59
2185C40k17P1k6k90K56k89J55K22k71r7J08j25J09m1J83J67k20R5q8r2K61l29
2207a18K73k7j42j28j1K16j33j19J34J02l00K86l24K89J81l71P3PLR5j27K08k49
2230a82O7K0N7J87k51O9R7P1J9N0m17M96l20J68jj23M4M1Q8q1N8j83P0R2j25K39
2256B50k13Q3N4m4k9M0rk10o4L27j87N7k8r4J73k70J26m6p9K74K1J97m46J4L56
2281B53n12J00J48r3N9j21j65K95k11K40k54J66K57k48P7pj31J67l7N7k15r9K95
$$ y = [-371, 196, 19, -146, 131, -82, -159, 224, -71, 215, -355, -278, 22, -145, 131, 119, -107, -123, -207, -157, -136, -327, 33, -25, -221, -142, -176, 47, -265, 27, 42, -263, 28, -147, -42, 26, -267, -243, 20, -163, 219, 57, -86, 233, -84, -31, 58, -219, 293, -38, -137, 77, -89, 6, -32, 70, 335, -117, -17, -234, -156, 18, -260, 260, -78, -419, 340, 123, 194, 168, -122, 134, -155, 0, 222, -49, -146, -38, -163, -54, -95, 88, 255, 35, 130, 42, -50, 211, -118, 155, 128, -14, -142, -153, 63, -70, -189, -55, 47, -253, 33, -291, -2, 179, -192, -119, -112, -109, -14, -141, 67, -182, -115, -95, -38, 149, -102, -33, 64, 135, 154, 204, -213, 283, -37, 131, 130, 7, 51, 92, 180, 99, 157, -26, 44, 136, 11, 250, 37, 120, 174, 130, 101, 141, 132, -78, -142, 185, -2, 55, 27, -67, 106, -164, -38, -84, -163, 111, 132, 329, -117, -103, 253, -259, -159, -11, -104, -45, -166, -331, -36, -247, -7, -261, -95, 162, -86, -9, -16, -147, 20, -17, 40, -175, -274, 21]
2304B1l4J34l7k7j52L47l45J62j37M17j94l35K90q6J28k1k04K71k18P7L7N1n7
2327H8J03j40J94l10K34j07P6k8k18N2P6L6J41j90N3K07j94pn6j95K44k07J57
2350Io3k49K14l0r5Q1p7J94J67l40K53k74Q8J09J23P2l61NL43j45J51k29j67L08
2374H7k18J54R6k2l9j05L9J29k27L7P3N0n1l40L02J14m9J00n6j14J39j41J16J
2398G5l09M21k36J52J04N8l49J42J34j41m8J36K8k47J73q3J16k49K48n7k33N7
2420a08J93j72J46j86K23j02jn7K21k49N2j57N6J70n6j5k35L10j18M1m5k52J52
2443a89K36k20o6K92j16O6MJ23J88l81J4L5k81L08q0R5q5oP2qJ40j27J28j88J4
2468c2M7l6K07j80Q8j19K81r8p2o8O6J55K4q0L4k35J47M6j17K3N9P3k77L4R5j11
$$ y = [21, -13, 121, 84, 57, -95, 252, -93, 69, -68, 349, 155, -180, 110, 24, 152, 131, -73, 198, -20, 57, 94, 145, 88, 191, 51, 245, -65, 169, 62, 138, 110, -108, -56, 20, 56, 197, 7, 60, 267, 73, 66, 10, -185, 59, -148, 9, -54, -303, -89, -119, -214, -133, -210, -16, 151, -189, 64, -210, -122, -13, 110, 182, -179, -174, 169, 24, 175, -54, -221, 87, -131, 23, 119, 97, 58, -47, -8, 121, -106, -69, 4, 54, 3, -337, -35, 79, 30, 130, 74, -40, 99, -42, 74, 75, -234, 187, -49, 103, 207, 265, -84, 58, 192, 51, 3, 139, 167, -80, 93, 10, 126, -123, 125, 68, -165, -108, 85, -87, 59, -127, 96, -6, -7, -64, 157, -92, -40, -197, -141, 29, -27, -42, -277, 33, -85, -44, -89, -341, -189, 47, -173, -239, 53, -63, 3, 7, 130, 318, -63, -49, -14, -295, 13, -67, 28, -57, -63, 9, 1, 141, 14, 142, -46, -32, 15, -21, 186, 6, 94, -25, 256, 158, 86, 18, 84, 239, 263, 183, 217, -18, 129, 175, 58, 81, 140, 213, -64, -30, 65, -46]
2494d6J11k60K21K6J78l99K38k55K65j04J03j55m2j12K84j08j96L53j83k7J81
2515G3j44j38L21k03J49k96J8J49J35L0n5j15n6KK30j80P3l4l9J08N5J8k3j55
2539g7K15k53J95k23K39m9n1K1J51j79j5J43k6j29m3K31J47k52j9L43m57L51k13
2562E0M3j56j55K24q6L90m71n9K24j30j35K62K7J93j52m9n0p4O0O9m4K46j76o0
2586iJ64l56RJ75K98k65r3r3J66l6J80k48J33p3Jl96M41JJ46j81R2j64J60l27
2610b75M36k28K62J04l13J77p3P0j97K6k6L0l0K58o7O1j60k20K71J33j89K61k50
2633F1J11O0k80p5J68r7qM3K77k43j50M11m61L05j33r4K08k52K5M9P7R2j52nP7
2658A4R8j38K69l65K6o1L11k41J7O6r2n3J72l12Q7J63k31K69k46K20R0Q6Rj15
$$ y = [-46, 65, -195, 26, 52, 230, -169, 69, -186, 79, -25, 78, -77, -119, -231, 53, -55, -251, 102, -81, -108, 73, -71, -209, 112, -91, 58, -238, -220, -71, 64, 94, 39, -76, -132, -130, 100, -80, -7, -41, -80, 28, 83, 101, 78, -77, 138, -115, 80, -143, 96, 47, -4, 17, 168, -11, -26, 117, 91, -38, -81, 150, 297, 45, 26, 369, -88, 263, 50, 93, -63, -218, 6, -80, 310, -161, -220, 4, -126, -261, 1, 28, 221, 69, 20, -30, -104, -44, 25, -19, 227, 51, -9, 155, -201, -192, -17, 281, 16, -77, -170, -4, -40, 140, -108, 25, -48, -47, -443, -2, -1, 145, -36, 56, -108, 52, -275, 161, -67, 195, 299, -14, 163, 90, 160, -37, -11, -37, -7, -37, 221, 154, 215, 55, -165, 106, 239, 50, 311, 61, 172, 232, -48, -123, 45, -52, -60, -17, 260, 17, -133, 278, -183, 122, -11, -105, 103, -149, -124, -75, 2, 94, -58, -63, 14, 112, -26, 243, -122, -96, -157, 154, -87, -70, -4, -96, -149, 23, -289, -202, -39, -270, -1, -247, -27, 63, 149, 158, 43]
2682D3j34K77q4m1k33m1M01k35K94j06m5Q2k90K72l33J34K59r1p3m1J44j76N5
2705C8n2L9r3J4M4J82p8k32L97k61J87L6k6k2N5j05k64K14k06p8L52k37jO4o1
2730i4j54J83J28m90L48k7j01R1J48n3o4J80j34p3r0K48l4K4k11J20j37K95l5
2753F8m17K30J35J53l05P1l1k5J18j23L09N3l5o1M0j57m2N0J43j49j30K02J01
2776A98j59R2PN5k16N1M5j4K13l53J44K1r1J95l80K61J26q0K6k22l6N4J79j62
2800d6P7j39K8m0j01j1L40j30J9oj80K26m8j92k9P9J00M6j40K31o2N0j89J19P7
2825G9K1j16j08M4J05r3k58N03j81j24K70K1n6q8K4k06J33n2K21k63K83k9kq6
2849D2P2p5J05k31J06j06J76n0J19nK2J92l98O8J26l41j1K68p2Q7n2L0j61J26
$$ y = [43, -91, 186, 102, 61, -172, -213, 188, -47, 247, 141, 96, 178, -112, 160, -173, -39, 220, 129, 56, 15, 159, -17, 38, -14, 25, -68, -54, -10, 172, 94, -138, 259, -2, 185, 221, 195, 173, 228, 123, -141, 73, -133, -211, 141, -96, -97, -33, -94, -248, -65, 63, -427, -79, -106, -207, -116, 32, -21, -85, 95, -39, -112, -202, 46, 12, 36, -175, -55, -192, 103, 68, -349, -119, 16, 169, -136, -65, -96, -121, -3, -126, 183, 236, 201, 140, 180, 23, -19, 31, 174, 25, -105, 97, 198, 39, 131, 138, 193, -23, 28, 73, 59, 272, -81, 63, 84, -7, 188, -192, 69, 195, 115, 141, -81, -117, -63, 116, -46, 31, -108, -80, -120, -221, -232, 108, -22, -3, -9, -189, 37, -11, -203, -232, -153, -53, -7, -147, 84, 22, 72, -117, 2, 79, 100, -16, -124, -80, 25, -68, -326, 177, -4, -128, 142, 163, 107, 19, 43, -163, -30, -82, 139, -124, 159, 130, 128, 42, 114, 39, 144, -87, 19, -87, 89, 39, 158, 153, 175, 367, -31, 37, 163, -178, -189, 79, 7, 94, 42, 72, -89, 37]
2873C7J25k53J69k16RK6J89p0oj44K04J9J7r5k95R4M2J27o1P1J3q5j30K57q8L0
2899a4J41j30M6O6o6M5k37J10J55k53K40j67o7J11J19j83J16J14j82K55Oqj93
2922B4K0L02l57J4J65l03J55K62k99J70l13M41l04M2J68n5J64l68J23R1j13P1
2944A00k05l1P2J29o1j69r1K08J0M2q1J46k20L28k24K17k69o1K67j50J81l58J60
2967f0O5p2j07O2O8p5P5kl0p4Q5L15l31J04k4K1J1rK38m21K61j73K42l20L24k24
2993e1K64M1m44k6M64k42K66l51L8K7R2m0J09P7j84J56m8j29L55p3l58M3p5P7
3017a2J85j99j08p9J11K54j02k26K82K9o0r1j21LL5Q2J60k75k6j87L82Jj55RJ48
3042D0J07j68j61K0j89L00Q9p9j44K91k02oK32j83J76j66Q2l32N6L24J3j38K83
$$ y = [37, 162, -91, 78, -138, -129, -103, 86, 16, 10, -134, 70, 89, 106, 11, -284, -190, -148, -21, -82, -11, 2, -83, -213, 44, -44, -14, 127, -3, 43, 109, 43, 88, -149, -39, 116, -137, 103, -64, -131, -20, 99, -84, 32, 146, -36, 219, 225, 217, 24, 44, 346, -11, 3, 168, -135, 20, 282, -17, 153, -160, 281, -23, 19, 187, 132, 296, -72, 51, 142, 29, 100, -105, -136, -64, 65, 4, -165, -256, -48, -38, 4, -77, 69, -151, 177, -47, 170, -99, -160, 107, -43, 138, -220, -60, 5, -67, -174, -112, -44, -119, -44, -46, -76, -150, -65, 250, -81, 23, -1, 20, 31, 22, 260, -161, 100, -73, 169, -151, 173, -51, 213, 254, -190, -216, 248, 6, 272, -79, -41, -14, 78, 38, 147, 224, 40, 196, 148, 19, 374, 301, -57, -14, -89, -12, 173, -26, -134, -213, -102, 152, 50, -176, 106, 135, 75, -16, -137, -134, -99, -17, 143, -132, -158, -345, 37, 38, -117, -108, 40, 147, -21, -182, -162, -351, -51, 38, -41, -185, 106, -96, -102, 130, -53, 123, -43, 39, -293, -237, 87, 100, -38, 245]
3065B45k18j02N3J40j84J23m7j2J77j97p4k5J18J6P5Qr0J61L4j46O6j29K40j28
3089A04j61m3L05k49J97m1k39j16K68J4Q4j50k09M87k85nJ6J35j50p6J14j88K47
3112E9J9k06J36Pp8PJ05l29J0J08K29j68j31M03j27k65M04j02K8k68Q2nL09K6
3136B53j20k7j86K12k01j31M87j38lj03j51K7k65M22R8j30n6M3r6K73n2j00p3
3159a7L2J20K1J66j49Qk9l61K10j70j7K3J92l06J40J83k56K27j37K32Kk92K14
3182C6K7j99J86k58K50k50L09l94J96J56j16K5J3q7J13j24J80k33K96K4p2J14
3204A92k67j37J41k5J20j06J23O7j25R2j71K07j16J25k97N2J85l2L9pl3K8K89
3227C44l05j51Q3J57p6q9L0J16rJ16o9j42M8J22j4j47q5L25l44Nn6K37k10K36
$$ y = [245, 27, -75, -22, 118, -66, 57, 10, -2, 175, -22, -96, -121, -3, 13, 88, 96, 6, 167, 201, 55, 121, -8, 232, 104, -57, -100, 205, -44, 153, 112, -127, -243, 25, 39, 123, -27, -236, 251, -34, -39, -23, 112, -38, -114, 0, -188, 59, 78, -128, 8, 15, -63, -56, 49, -280, -270, -162, 67, -101, -232, 171, 44, -221, 183, 81, 109, -159, -77, -82, 227, 253, 133, 106, -80, 132, -69, -200, 287, 149, 146, 43, -108, -81, -346, 76, 174, 44, -12, 31, -65, 208, 156, 56, -17, 15, 135, 156, 322, 173, 181, 152, -209, 1, -169, -186, -163, 29, -277, -137, 46, -210, 17, -120, 112, 114, -178, 36, 63, -136, 50, -208, 42, -208, 101, -293, -97, 59, -57, -32, -19, -106, 7, -117, 63, -170, 126, 150, 78, 192, -75, -212, -71, -96, 24, -82, 41, 108, -17, 75, -96, 111, -5, 120, -177, -125, 60, 28, 67, 60, 27, 55, 344, 39, -112, -29, 128, 52, -37, -7, 109, 100, 216, 147, 5, 53, 175, 161, 14, -71, 254, -90, -85, -141, 96, -114, 122]
3251A22o2J44j39M0j16j06J29M1r8j26K31j16Q0j17j25L31p3j11P5J05k4k95K66
3274E6r3n4J57o5J19j5o0j26P0rL02k31j58M9n0R2j08k9K54j85K75m8j08J87j89
3299C3J27Oj68K11J18k49k14L40J3j36O2k80N8J62j09J90n4O2M8j29J4j23J93
3322A75k13M8Q2j2j50J42j76k5Q7mJ29k01J26Q4k37o2J34m5K56k3j29J02k11K21
3346I8j94j25J51J15k11J85O1j39K2K3m7K14l49K40k39J01l1K05j95J72l45M47
3368A59L8j26qp5R6k67J39j06oJ85r3k04N04o1r7l1j5p5R7j26J76J14j02l51J0
3393b25P6K49k27J18J69r4l27L95Lk1M0k91K60k14K03j01k5j01J27k38K16p1k7
3416a06J85k0j29o9M7J91k43O0M4L34k49k29L49q8r4n2Q8K10j8n4l64K01R9J56
$$ y = [122, 60, 204, 65, 105, -11, -117, 12, 53, -45, -171, 60, -56, 24, -93, -218, 113, 40, -71, 4, 109, 85, -210, 56, -37, -91, 66, 1, 120, 105, 45, -81, -11, -20, 282, 51, -107, -58, -108, -16, -124, -153, 101, -84, 191, 143, 35, 222, 33, 160, 166, -2, 209, 327, 78, -136, 204, 217, 81, 143, -137, -79, 83, -26, 164, 110, 172, 220, 91, 105, -18, 175, -38, 10, 92, 80, -70, 72, -104, -129, -42, -46, 83, -118, 8, 92, -145, -207, -73, -118, 138, 115, -14, 88, -123, 98, -96, -221, -70, 45, -166, 19, 80, -59, -37, -14, -61, 153, -196, 44, -195, -94, -125, 80, -115, 57, -288, 159, 197, 71, 63, -12, 84, -183, -44, -150, -156, 29, -64, -268, 236, 175, 78, 47, 32, -43, 54, -72, 104, 218, 116, -235, -225, -149, 100, -127, -9, 160, 66, -261, 134, 137, 116, 156, -135, 125, -89, 114, 13, -12, -113, 14, -224, -8, -79, -106, 79, 59, -70, -139, -92, 99, -144, -84, -40, 294, 45, -184, 165, 77, -17, -69, 19, 229, 211, 157, -207, -6, 93, 249]
3440B49k19K0j54P1J92q8K3k2J43j32q%K0M6L8j13j89J15o8K7K18k52K78o0R8
3465B33l66J80k55L08j44l9J2j41L33q6N4k06O6p1M8Kj35O1L10p6p0j77N7J1R0
3490an9J3J39j78J27j51J05l3J7o2L5q2J18J19o0p5k14L54l54L19m8P8j9p1J4
3515C1n8M0q8Q0l4R5j56M3r9R1R2qL8J61k26J09m1j36J60L6P3j85J63J25k03k06
3541a03m6O7k1P7r8K26j44J88O2l18K18n5l1p5k70M02r5r2J88Kk83J18q4M04l26
3566h9KK38N2r8j56J44k59L05q7p1JJ02j81J69j46M9j42K07j51J46O4j06P3j73
3590a07j58J68J63K8l03J98QQ6j24O4k12M02j98k07M41j65k74N8K42r3K04k28
3612gN1k9M4k64K85k19L95j34k7k20K13j67p8P1L80l65J15J4j49%N8j7P0k0K1
$$ y = [249, 30, 50, -104, -33, 159, 71, 94, 72, 215, 83, 75, 75, 95, 141, 179, 66, -123, -8, -76, -49, 169, -83, 195, 135, 233, -133, 47, -208, 100, -44, -83, -71, -212, 121, 35, 89, -117, -51, -122, -74, -72, -207, -146, 164, 88, 18, -159, -102, -91, -1, -60, -47, 92, -86, 41, -110, -5, -38, -21, -83, -48, -130, -12, 107, 47, -28, -242, 112, -242, 77, 29, 107, 88, 17, 31, -27, 13, -75, 5, -29, 66, -90, -47, -146, -55, 37, 29, 67, 228, 2, 111, 70, -66, 94, 130, 203, 18, 181, 306, 103, -103, -149, -82, -103, -26, -124, 102, -42, 146, 208, -110, 108, 53, 22, -53, -323, 79, -16, -108, 80, 82, -201, -83, -167, 237, -89, -87, 151, 203, 105, -51, 93, -166, 139, 52, -19, -18, 84, -97, 72, -74, -25, -167, 40, -111, 35, 99, -7, 66, -107, -265, -97, 66, 94, -209, -11, -3, 83, -41, 23, -189, 213, 15, -192, 249, 84, -190, -132, 110, 17, 221, -7, 44, 15, 59, -205, 80, -139, 256, 122, 95, -125, 88, -79, -157, -86, 294, -71, 44, 58, -91, -91, -33, -50, 20, 0, 21]
3637B1P3k97J10o6Q5J25n9j61k1J68r1L49l51N1K50l00%J07L9M5k48J18P7o1Q3
3662D6l5k06K74m0j08r0J43k5Pl7q9K05P8l56J91K5j65q9K74Q4O5j74j46M07l84
3687a45L93K6j34k11K45j63M28n78J86K79l37lj92K13J41J75m19J05N4j28mJ05
3709C6k07k6J37o1J77n3J5j26K5J23m1m9pQ9k11J94j33o0J06R9j22l4L74k91Q4
3734C8J56k80J63L4j13M3j88Q0l1K47k30j54O5K34O3M0l46K17K64j69l4N6k3P3
3758B05r8j09J44k10K2Kk9m0J1K27j15K6R9J12m4j38qk60J89j41K03k09K34Lk9
3783D7o2J19K1j86L8r6J60j28l2O2J69l19K20J1r3J75Qm0r2K5O2K5k35M24j41
3808A42r7j84L5K11oOr4j89J43P1j77K45j33QK62k13j3M4l0K15k3j86o3k32R5
$$ y = [21, 94, -203, -93, -159, -74, 51, -8, -169, -190, -22, -113, 236, -115, -64, 186, -114, -114, -7, 32, 77, -171, -53, 24, -37, 46, 11, -195, 79, 39, -69, -159, -16, -41, -34, -71, -160, 45, 123, -233, -42, -17, -182, -271, 3, 87, 152, -22, -168, 239, -145, 248, 274, 140, -71, 174, 11, 439, -139, 47, 326, -11, -14, -206, 7, 148, 323, -96, 9, 63, -65, -69, 36, -171, -197, -60, -121, 56, 3, 18, -108, -83, 40, -1, -50, -57, 32, -179, 15, -118, -178, -72, 27, -95, -129, 245, -46, 38, 194, -86, 77, 111, -2, 41, -147, -67, -98, 149, -81, -235, -170, 64, 127, 167, -179, 38, 302, 133, 99, 155, 132, 205, 107, -2, 142, -68, -46, -44, -73, -113, -102, 125, 10, 36, 135, 247, 203, 65, 57, -203, -14, -155, 48, -161, 73, 76, 47, -15, 104, 125, -61, -23, -119, 41, -87, -119, -57, 112, -207, 13, 24, -69, 106, 114, 74, -18, 7, 69, 94, -141, 283, 142, 45, -139, -104, 107, 101, 107, 13, -176, -33, 38, -139, 106, -27, -19, 243, 30, 17, 61, 31, 246, 223, 37, -26, -258, -163]
3833a63J99j12J37K2P0o6k61K03R7j42P9j17Q3p6N0j68nN2J6j8j3J56j56j9R1
3858f1K78k88j71J31N7L1Q0p0k04J62j62K24l2m7k6J07j90J15J40l87K62o0j64
3881b75L20j50K53l46K26R5k61J91j10Q9j59M25j87O8j75K8j98K5k5K84j19J79
3903A78j90OJ28k62J98J69j60j52j85M59n9l67J18o4pK27j45J28k56K35P1k50
3925a80J22K2J82j18k97K98r9R2l13K51K6n0K88l21K56l20Q7K48k23J14j2j48
3947i5O2rq1J42j06J87k22J62j78J33m7N2J39k94K16m6J46j81K9r0P4J5l4J4m5
3972e7j7M4K01r5Jk72L37j56j1K10j47J48M3l1j87o2J20K1j47J32J39k50J23r3
3996frkO0j0L4j27M6J43j84K0n7q0J93Lj76R4L9j3K72k83o6K19k92J53j8J28k37
$$ y = [-163, 36, -76, 61, 83, 153, 87, -174, 29, 126, -16, 63, -54, 29, -47, 3, -165, -170, -118, -102, -120, -133, 23, -133, -152, -61, 217, -71, -242, -111, -54, -23, 57, -13, -217, -55, -217, 7, -25, -72, -98, 9, -181, -66, 74, -313, -51, -111, -275, 45, -105, 148, -198, 28, 123, -138, 53, -57, 32, -127, 298, 111, 179, 4, 32, -166, -141, -166, 118, -1, 178, -12, -6, 122, -140, 58, 227, 67, -85, -270, 189, 130, -237, -119, -183, -190, 37, -108, 20, -236, -1, 70, -180, -58, -36, 146, 28, -269, 29, -70, 22, -291, -40, -14, -64, 224, -97, 159, -161, -74, 174, -49, 65, 53, -95, -33, -42, -123, 19, -87, 100, -122, 40, -138, -5, -52, 0, 139, -155, 61, 15, 161, -20, 9, -81, -7, 8, -26, -12, -57, -74, -30, 171, 76, 77, -195, 142, -14, -25, 185, 38, 186, 229, 198, 11, -51, 69, 90, -57, 75, 214, -36, 87, -6, -15, -17, 43, 33, 67, -60, -14, 129, -55, -35, -92, -172, 21, 24, -152, -58, -19, -32, 240, -43, -109, 110, -182, -29, -47, 81, -156]
4023a56J54J92j42l12J66J22L0k04L83l67PR1P3j4j05K77P8j19j24j29Q4j80K11
4046A6k05K50l8k56L27k1p2q8%L52k12K6k6j50l7J61n1J57J62j73N5j29p2J5Q
4071aJ09K3j38K58n8k80J46q8Q6r3j31K33Pn5n2J36k72P3k93K25J25J45o9pN2
$$ y = [-156, -2, 190, 48, -264, -98, 24, 54, -150, 233, -134, -127, -36, 37, 23, -82, 195, 273, 154, 30, -99, -15, -195, 16, -189, 61, 23, -233, 94, 73, 1, -87, -87, 265, 53, 79, 53, -97, -134, 27, -24, 133, 295, 122, 177, 48, -24, -9, -1, 108, 131, -7, 251, 193, -87, 59, -29, 57, -36, -167, 66, 73, 18, -34, 102, -170, -97, -390, -165, -40, 105, 36, 29, 81]
$$ [...]
8191a73
##END NTUPLES=NMR FID
##END=
